##TITLE=1H ikalashn
DE-78_TFA2
18.12.2024
##JCAMPDX= 6.0         $$ Bruker NMR JCAMP-DX V2.0
##DATA TYPE= NMR FID
##DATA CLASS= NTUPLES
##ORIGIN= UXNMR, Bruker Analytische Messtechnik GmbH
##OWNER= root
$$ TOPSPIN		Version 1.3
$$ 2024-12-18 16:09:45.781 +0400  Irina@DPX200
$$ Compression mode = diff/dup
##.OBSERVE FREQUENCY= 200.131300845
##.OBSERVE NUCLEUS= ^1H
##.DELAY= (6, 6)
##.ACQUISITION MODE= SIMULTANEOUS
##.ACQUISITION SCHEME= undefined
##.AVERAGES= 64
##.DIGITISER RES= 18
##SPECTROMETER/DATA SYSTEM= spect
##.PULSE SEQUENCE= zg
##.SOLVENT NAME= DMSO
##.SHIFT REFERENCE= INTERNAL, DMSO, 1, 17.49637
##AUDIT TRAIL= $$ (NUMBER, WHEN, WHO, WHERE, WHAT)
$$ ##TITLE= Audit trail, TOPSPIN		Version 1.3
$$ ##JCAMPDX= 5.01
$$ ##ORIGIN= Bruker BioSpin GmbH
$$ ##OWNER= Irina
$$ $$ F:/spectra/data/iren/nmr/1H/4/audita.txt
$$ ##AUDIT TRAIL=  $$ (NUMBER, WHEN, WHO, WHERE, VERSION, WHAT)
(   1,<2024-12-18 16:08:28.593 +0400>,<Irina>,<DPX200>,<TOPSPIN 1.3>,
      <created by zg
	started at 2024-12-18 16:04:15.765 +0400,
	POWCHK disabled, PULCHK disabled
       configuration hash MD5:
       BE 6D 3F 07 2A EA 11 49 91 17 2B D3 AF B3 58 0D
       data hash MD5: 16K
       B6 3D E5 3C BC 77 61 E3 DE 6D 23 B9 19 A2 65 A7>)
$$ ##END=
$$ 
$$ $$ hash MD5
$$ $$ 32 35 B6 81 06 FE 5C FA 71 7F 3A 7E 8D 63 2B A4
##$RELAX= 
##$RELAX= 
##$RELAX= 
##$RELAX= 
##$RELAX= 
##$RELAX= 
##$RELAX= 
##$RELAX= 
##$RELAX= 
$$ Bruker specific parameters
$$ --------------------------
##$DU= <F:/spectra>
##$EXPNO= 4
##$NAME= <1H>
##$PROCNO= 1
##$TYPE= <nmr>
##$USER= <iren>
##$AMP= (0..31)
100 100 100 100 100 100 100 100 100 100 100 100 100 100 100 100 100 100 
100 100 100 100 100 100 100 100 100 100 100 100 100 100 
##$ANAVPT= -1
##$AQSEQ= 0
##$AQ_mod= 1
##$AUNM= <au_zg>
##$AUTOPOS= <>
##$BF1= 200.13
##$BF2= 200.13
##$BF3= 200.13
##$BF4= 200.13
##$BF5= 200.13
##$BF6= 200.13
##$BF7= 200.13
##$BF8= 200.13
##$BYTORDA= 1
##$CFDGTYP= 0
##$CFRGTYP= 5
##$CHEMSTR= <none>
##$CNST= (0..63)
1 1 145 1 1 1 1 1 1 1 1 1 1 1 1 1 1 1 1 1 1 1 1 1 1 1 1 1 1 1 1 1 1 1 
1 1 1 1 1 1 1 1 1 1 1 1 1 1 1 1 1 1 1 1 1 1 1 1 1 1 1 1 1 1 
##$CPDPRG= <>
##$CPDPRG1= <>
##$CPDPRG2= <>
##$CPDPRG3= <>
##$CPDPRG4= <mlev>
##$CPDPRG5= <mlev>
##$CPDPRG6= <mlev>
##$CPDPRG7= <mlev>
##$CPDPRG8= <mlev>
##$CPDPRGB= <>
##$CPDPRGT= <>
##$D= (0..63)
0 2 0 0 0 0 0 0 0 0.06 0 0.03 0 0 0 0 0.0002 0 0 0 0 0 0 0 0 0 0 0 0 0 
0 0 0 0 0 0 0 0 0 0 0 0 0 0 0 0 0 0 0 0 0 0 0 0 0 0 0 0 0 0 0 0 0 0 
##$DATE= 1734523707
##$DBL= (0..7)
120 120 120 120 120 120 120 120 
##$DBP= (0..7)
150 150 150 150 150 150 150 150 
##$DBP07= 0
##$DBPNAM0= <>
##$DBPNAM1= <>
##$DBPNAM2= <>
##$DBPNAM3= <>
##$DBPNAM4= <>
##$DBPNAM5= <>
##$DBPNAM6= <>
##$DBPNAM7= <>
##$DBPOAL= (0..7)
0.5 0.5 0.5 0.5 0.5 0.5 0.5 0.5 
##$DBPOFFS= (0..7)
0 0 0 0 0 0 0 0 
##$DE= 6
##$DECBNUC= <off>
##$DECIM= 32
##$DECNUC= <off>
##$DECSTAT= 4
##$DIGMOD= 1
##$DIGTYP= 9
##$DL= (0..7)
0 120 120 120 120 120 120 120 
##$DP= (0..7)
150 150 150 150 150 150 150 150 
##$DP07= 0
##$DPNAME0= <>
$$ [...]
##$SW= 21.9926040160658
##$SWIBOX= (0..15)
0 0 2 0 0 0 0 0 0 0 0 0 0 0 0 0 
##$SW_h= 4401.40845070422
##$TD= 16384
##$TD0= 1
##$TE= 300
##$TE2= 300
##$TE3= 300
##$TEG= 300
##$TL= (0..7)
0 120 120 120 120 120 120 120 
##$TP= (0..7)
150 150 150 150 150 150 150 150 
##$TP07= 0
##$TPNAME0= <>
##$TPNAME1= <>
##$TPNAME2= <>
##$TPNAME3= <>
##$TPNAME4= <>
##$TPNAME5= <>
##$TPNAME6= <>
##$TPNAME7= <>
##$TPOAL= (0..7)
0.5 0.5 0.5 0.5 0.5 0.5 0.5 0.5 
##$TPOFFS= (0..7)
0 0 0 0 0 0 0 0 
##$TUNHIN= 0
##$TUNHOUT= 0
##$TUNXOUT= 0
##$USERA1= <user>
##$USERA2= <user>
##$USERA3= <user>
##$USERA4= <user>
##$USERA5= <user>
##$V9= 5
##$VALIST= <valist>
##$VCLIST= <CCCCCCCCCCCCCCC>
##$VD= 0
##$VDLIST= <DDDDDDDDDDDDDDD>
##$VPLIST= <PPPPPPPPPPPPPPP>
##$VTLIST= <TTTTTTTTTTTTTTT>
##$WBST= 1024
##$WBSW= 25
##$XGAIN= (0..3)
0 0 0 0 
##$XL= 0
##$YL= 0
##$YMAX_a= 1152399
##$YMIN_a= -1203604
##$ZGOPTNS= <>
##$ZL1= 120
##$ZL2= 120
##$ZL3= 120
##$ZL4= 120
##$ABSF1= 10
##$ABSF2= 0
##$ABSG= 5
##$ABSL= 3
##$ALPHA= 0
##$AQORDER= 0
##$ASSFAC= 0
##$ASSFACI= 0
##$ASSFACX= 0
##$ASSWID= 0
##$AUNMP= <proc_1d>
##$AXLEFT= 0
##$AXRIGHT= 0
##$AXTYPE= 0
##$AXUNIT= <>
##$AZFE= 0.1
##$AZFW= 0.1
##$BCFW= 1
##$BC_mod= 2
##$BYTORDP= 1
##$COROFFS= 0
##$CY= 7568.61572265625
##$DATMOD= 1
##$DC= 2
##$DFILT= <>
##$DTYPP= 0
##$F1P= 17.9538593292236
##$F2P= -4.03888763876832
##$FCOR= 0.5
##$FTSIZE= 32768
##$FT_mod= 4
##$GAMMA= 1
##$GB= 1
##$INTBC= 1
##$INTSCL= 1
##$ISEN= 128
##$LB= 0.02
##$LEV0= 0
##$LPBIN= 0
##$MAXI= 945.577
##$MC2= 0
##$MEAN= 0
##$ME_mod= 0
##$MI= -402.1523
##$NCOEF= 0
##$NC_proc= 0
##$NLEV= 6
##$NOISF1= 8.587773
##$NOISF2= 6.764455
##$NSP= 1
##$NTH_PI= 0
##$NZP= 0
##$OFFSET= 17.49637
##$PC= 1
##$PHC0= 90.06046
##$PHC1= 18.46595
##$PH_mod= 0
##$PKNL= yes
##$PPARMOD= 0
##$PPDIAG= 0
##$PPIPTYP= 0
##$PPMPNUM= 100
##$PPRESOL= 1
##$PSCAL= 0
##$PSIGN= 0
##$REVERSE= no
##$SF= 200.13
##$SI= 32768
##$SIGF1= 18.5376
##$SIGF2= -6.396296
##$SINO= 400
##$SIOLD= 32768
##$SREGLST= <1H.CDCl3>
##$SSB= 3
##$STSI= 0
##$STSR= 0
##$SW_p= 4401.40845070422
##$SYMM= 0
##$S_DEV= 0
##$TDeff= 0
##$TDoff= 0
##$TI= <>
##$TILT= no
##$TM1= 0
##$TM2= 0
##$TOPLEV= 0
##$USERP1= <user>
##$USERP2= <user>
##$USERP3= <user>
##$USERP4= <user>
##$USERP5= <user>
##$WDW= 1
##$XDIM= 8192
##$YMAX_p= 0
##$YMIN_p= 0
$$ End of Bruker specific parameters
$$ ---------------------------------
##NTUPLES= NMR FID
##VAR_NAME=  TIME,          FID/REAL,        FID/IMAG
##SYMBOL=    X,             R,               I
##VAR_TYPE=  INDEPENDENT,   DEPENDENT,       DEPENDENT
##VAR_FORM=  AFFN,          ASDF,            ASDF
##VAR_DIM=   8192,          8192,            8192
##UNITS=     SECONDS,       ARBITRARY UNITS, ARBITRARY UNITS
##FACTOR=    0.0002272,     1,               1
##FIRST=     0,             0,               0
##LAST=      1.8609952,     19,              157
##MIN=       0,             -1203604,        -1203604
##MAX=       1.8609952,     1152399,         1152399
$$ Real data points
##PAGE= N=1
##DATA TABLE= (X++(R..R)), XYDATA
0@%%%%%%%%%%%%%%%%%%%%M0r9J23j28J28j28J28j74K33k51K63l10L62l97M55n15
36b70N77o42P15q03Q93r89J097j216J342j481J637j808J996k200K418k664K936
53A538l238L581l964M396m900N486o171O996q012R292j0950J3218j6507K1682
67A2447l1068N3017j80254K721Q16228k28015j116395p6786R67819p6377r68277
78h24940Q9521R79648N2332n39080K82890M43327o03493n04830P86901P36177
88H98453n56021m96514O04233L48159p65809m81394M82460J24599o68011q7140
98e96985P74250K02227p16181l10593N08047K80844l14110j21999L30810J98111
108B34421j09992l0713Q4602p4703j56258K9018J81292J38637L962j51453j83876
$$ y = [0, 0, 0, 0, 0, 0, 0, 0, 0, 0, 0, 0, 0, 0, 0, 0, 0, 0, 0, 0, 0, 40, -59, 64, -64, 64, -64, 64, -110, 123, -128, 135, -175, 187, -210, 245, -270, 307, -335, 380, -423, 470, -519, 578, -638, 704, -777, 860, -948, 1048, -1152, 1266, -1398, 1538, -1700, 1881, -2083, 2313, -2587, 2899, -3272, 3724, -4288, 5004, -5946, 7272, -9235, 12447, -18621, 34396, -145858, -143137, 673091, 445076, -671319, -748105, 219714, 143337, -824940, -735419, 244229, 296561, -242519, 40371, 483698, -119795, -624625, 162276, 898453, 342432, -154082, 450151, 798310, 32501, -448893, 33567, 158166, -509845, -596985, 177265, 379492, -336689, -647282, -139235, 141609, -172501, -294500, 36310, 234421, 124429, 93716, 178318, 103615, -52643, -23625, 157667, 296304, 300266, 148813, -35063]
119c5063K8687J58741j11403l40795m1912K92735P9610k00934j6195J33804j30795
130a83520j65191K87326L64366j93163l54980K31293M78677r2873m68314n5259
140a51638L24926P7122k07608n0644R5900p5205j53265N8153J29502r5773j79808
151b28338M3616J79482L1830j04881m8745L4820L5422M0482P3250N8381j0819
162A04500n0675k362Q7909O7332j05088j90069o266J88987O5974j83063j51883
173a74704P1028J06348l7021o7228J7311J7311k2567M8308J12319M52j26132m0855
185i5430J21301R6285m8633o9344J5463L2870P77J9498K0002o5733r8905J6662
197e5187J10820K2305j15372r8460L5211R6124K3559o7512n7339L2324Q3162M0993
$$ y = [-35063, -6376, 152365, 40962, -299833, -341745, -49010, 30600, -170334, -186529, -52725, -183520, -348711, -61385, 302981, 109818, -245162, -13869, 464808, 371935, -96379, -151638, 173288, 250410, 42802, -7842, 88058, 12853, -140412, -82259, 47243, -48530, -228338, -184722, -5240, 26590, -78291, -127036, -92216, -56794, -16312, 56938, 115319, 104500, 53825, 51463, 139372, 206704, 101616, -88453, -94719, 94268, 160242, -22821, -174704, -103676, 2672, -34349, -101577, -84266, -66955, -89522, -41214, 71105, 71557, -54575, -95430, 25871, 122156, 73523, 4179, 19642, 52512, 53289, 72787, 92789, 27056, -71849, -55187, 55633, 77938, -37434, -135894, -100683, -4559, 19000, -48512, -105851, -73527, 9635, 50628]
209E0628j7836k3322k842R718K1043K7489j410m0584l1415J4619L1005J176l1510
222F759l7162k4094Q907M6669L5043l9110p8511k494R3967O1802o1597r1096J0439
235g0478R1463N3211l2159o0772j9712M2358O1692J1184n5471n3797J3578N3952
247C5049J8034l9764m8739j0741K4966K5224K675j8112k4396q822K2775M2004
259B0153J2444l7496l8703J7333N7710K6090l7128m8887K753M6442K9467j7126
271C3052l7846j6976J5198K8358J1243k4611l8162o335K7935K1031j2331k1820
283b1264o813M963J3174K2969J2000k3408l3786R352N0233K4614l8722n1937P221
296c1404N7199L0843l0404m7941o504L7120L3234q831m4177l2255J3866L8224
$$ y = [50628, 32792, 9470, 6628, 16346, 37389, 64878, 63468, 22884, -8531, 6088, 37093, 38269, 6759, -30403, -54497, -45590, 1079, 36122, -2988, -81499, -83993, 9974, 71776, 10179, -80917, -70478, 20985, 74196, 42037, -18735, -38447, 3911, 65603, 76787, 21316, -32481, -18903, 35049, 53083, 13319, -35420, -46161, -21195, 4029, 6704, -11408, -35804, -44626, -21851, 20153, 32597, -4899, -43602, -26269, 31441, 57531, 20403, -28484, -25731, 20711, 50178, 33052, -4794, -21770, -6572, 21786, 33029, 8418, -29744, -36079, -8144, 12887, 556, -21264, -28077, -23114, -9940, 13029, 25029, 1621, -32165, -22813, 27420, 52034, 13312, -38625, -31404, 25795, 56638, 26234, -21707, -28211, 8909, 42143, 33312, -10865, -43120, -29254, 8970]
308H970Q757l4444l2482R871L5513J8282j1566j3597O624J3123O330M715N403
321B5499r955k3186n840K2331J8256j7062l2297m221K6486K3711o128k4966j5859
334b3231P176K0854J0716j6641k9590q498K4736K7562l444k3672m392K2620K3913
347B8109M870p693j0538q189J842J0963L553k0937l0918m322K7579K0322j7644
360c003l0124J204L2406K3706r794k3621r069J3463J9726L547j7880j9354L911
373a4882K3493J4565r724j5543K527J5504O321q348q331l351p935r145J477Q372
387e000m865j7459o320J8311K2909K089j5729o642J5659K1456O144j4312j8774
400b533l343J6542J3907r956k6255j0280J6528J8596l912j8765q882Q352J0905
$$ y = [8970, 17727, -16717, -49199, -39328, -3815, 14467, 2901, -10696, -4072, 9051, 15381, 20096, 25499, 15544, -7642, -13482, 8849, 27105, 10043, -22254, -26475, 11, 23722, 17594, -7372, -23231, -16055, 4799, 15515, -1126, -30716, -39214, -14478, 13084, 9640, -14032, -18424, 4196, 28109, 32979, 25286, 14748, 6559, 8401, 19364, 22917, 1980, -28938, -33260, -5681, 14641, -3003, -33127, -31923, 483, 24189, 14395, -9226, -18295, -4832, 14894, 18441, 561, -18793, -14882, 8611, 23176, 13452, -2091, 436, 15940, 22261, 13913, 5582, 2231, -5704, -14849, -13372, -5000, -9865, -27324, -33644, -15333, 7576, 9665, -6064, -12706, 2953, 24409, 30553, 16241, -2533, -5876, 10666, 24573, 14617, -11638, -21918, -5390, 13206, 9294, -9471, -18353, -10001, 904]
413I04J867n779p551m908L217J1765P927o744j1762K410J7701J1841n149j2526
427C213k589Q492P420j410j0505j2217k725P919N216p164j3260l010J0779P231
441b610k541m462L806M376J557L082P248K710p878n948P007J1071k257j4330p991
456g160O116R109M4r686j0150j843R719J0190m895j6474o742J4290J6954k999
470F473j5870l157J4071J2141k380o745q57K748Q50K067J259n075r149k474P133
485A035L997q091q727J115N403K097j497J07j665k785M086J0715L140q961o698
500f729R428J1471j211r269j921N216J688l774j062n07p339p625L527Q621k430
515a916j2632k636J1764R795l065o268K047O892L794K466q51o612o851N283J0600
$$ y = [904, 2771, -3008, -10559, -15467, -12250, -485, 7442, 698, -11064, -8654, 9047, 20888, 15739, 3213, 624, 9116, 16536, 15126, 4621, -7596, -10321, -2402, 2814, -4350, -17610, -20620, -9841, -2610, -5151, -9613, -5807, -1431, 126, 3208, 10456, 13166, 5288, -660, 6347, 17418, 15161, 831, -7160, -1044, 8065, 8109, -1577, -11727, -13570, -3851, 6339, 1444, -15030, -21772, -7482, 9472, 6473, -9397, -12554, 1517, 13658, 11278, 4533, 3676, 6424, 7274, 9341, 10600, 5525, -3624, -6098, 1035, 5032, -3059, -11786, -10671, -5268, -3171, -4668, -4561, -6226, -9011, -4925, 5790, 8930, -31, -6729, 2699, 14170, 12959, 3690, 1769, 6985, 8673, 4899, 3837, 3330, -4009, -11634, -8107, 514, -1916, -14548, -17184, -5420, 4375, 1310, -4958, -2911, 3981, 7775, 10241, 9390, 2778, -4073, 1210, 11810]
530A1810p64j4452o870J1553J0781q096j3111J76R044J475o376q52M005j414n692
545h783K728P031l67o206K702J0314L292n261j199L738r42n868J537O248l794
560E170j1713l198R981K478j1664p896P657J1289j159n560J941M862k213k359
574b384O047N185n863n722O221R264m643j3776k483R549L747n948l255L916J135
589I90l609j54L281l127o997K538J0822K332j1031n045Q534P550m797m952O810
604C145Q185k689n436J720L834n780q840J997O831j892p680j850M616n4l506K399
620e000N782J88k454M971P093l543j0720j427R213L820p684n221N559N338m128
635A787m772J269K783j627l32M608J521p557n823L348N085l141n856L660Q557
$$ y = [11810, 11046, -3406, -10276, 1277, 12058, 3962, -9149, -8973, 71, 1546, -4830, -5682, -1677, -3091, -8783, -6055, 976, 609, -5597, -2895, 7419, 10711, 5450, 4251, 7989, 7047, 1179, 2716, 8964, 5170, -6543, -9741, 240, 2718, -8946, -16842, -9185, 2104, 945, -4615, -2674, 2188, -25, -2384, 3663, 8848, 2985, -2737, 3484, 12748, 8105, -5671, -8154, 1395, 5142, -806, -4061, -145, 990, -2619, -2773, 508, -2619, -9616, -7078, 3744, 6076, -4955, -10000, -1466, 6084, 1287, -3665, 3145, 11330, 8641, 3205, 4925, 8759, 2979, -5861, -3864, 2967, 1075, -6605, -8455, -3839, -3893, -7399, -5000, 782, 970, -1484, 3487, 10580, 7037, -3683, -5110, 4103, 7923, 239, -4982, 577, 5915, 1787, -2985, -1716, 1067, -560, -892, 3716, 5237, -2320, -8143, -4795, 290, -2851, -8707, -5047, 3510]
650C510J477m277P6L157r15l131L000M024j779o216%M632k265q192j508P080L478
667B151m007j717N139K066n711l385M230M311l005l468M070M426k824m987R55
682a756L122q73o89L507K388m150m818L310L193m406o722K020P994J322o128j949
698d635M615J981l857j313L975J986k328m7L754P55n247k921L711L131l054l369
714b863L045L358l005l951J487L046k151l181K724M797j657m421M78M295o15m037
730b651P90M626Q51l872m90L473L77m316j834M433K658m105k915K611K470k702
746e96k857J551K221p90q19K074J916l673k254K856L244j655l605J491M958l65
762C697n304p16L471J614k549j620K338O86k588j284J460L37k091k71K806J560
$$ y = [3510, 4987, 710, 786, 3943, 3028, -103, 2897, 6921, 5142, -1074, -1074, 3558, 1293, -6899, -8407, -1327, 2151, -1856, -3573, 1566, 3632, -2079, -5464, -1234, 3077, 72, -3396, 674, 5100, 2276, -2711, -1756, 1366, 493, -196, 3311, 5699, 1549, -3269, 41, 3234, -1172, -7894, -5874, 2120, 3442, -2686, -4635, -20, 1961, -1896, -3209, 766, 2752, 424, 377, 4131, 4886, -361, -3282, 429, 3560, 506, -2863, 182, 3540, 535, -3416, -1929, 1117, -1034, -4215, -1491, 3306, 1649, -2772, -2294, 2001, 1386, -2651, -1861, 2765, 3616, -256, -746, 2727, 3104, -1212, -3046, 1387, 4045, -60, -2975, -364, 2106, -596, -3453, -1902, 319, -471, -1290, 784, 2700, -973, -3227, -371, 2873, 1218, -2387, -896, 4062, 3697, -1607, -2323, 1148, 2762, 213, -1407, 931, 1617, -971, -2255, -795, -458, -2549, -2820, -14, 1546]
778A546j230j644J703J354j789j442J742K807j715k253Q68J773q04l054N01K496
794H59Q44j865K22J327l85k084j072J547O52j828m56K639J115j647j060J253J408
811A469j48m25M96J52o81n7j05r55j531k48J908P93j392j363J200K219l25k541
829a534K5K368O31j357j414Q26Q97m48n40P33O21j03J45N42j65j018N30j61p2
848E06j594n0O43N34j149q74J038J274m93o46O54R77n3m51L06Q30p64k98k01N65
868G54o39o66j00J03M74o98o0P10K93m79l73O07J66n66M66N50n91o19p4Q42P23
889H23p95q35J103J818q14j123M8J160J9j065p06Q9k05J51p40M49q38M47N61Q00
909C47j97m46Q96J129m01j055N69K70M8j464l16N88K50j63n81J49P86K0l27P0
$$ y = [1546, 316, -1328, 375, 1729, -60, -1502, 240, 3047, 1332, -921, -53, 1720, 916, -2138, -1637, 859, 1703, -162, 60, 1387, 1002, -1082, -2154, -607, 45, -1783, -2239, 400, 1515, -132, -1192, 61, 1469, 1321, 896, 1392, 1544, 863, 806, 701, -254, -1785, -2033, -125, 668, -724, -2087, -887, 1332, 1007, -1534, -1509, 859, 1490, 133, -1281, -455, 442, -6, -546, 187, 808, 705, 850, 1392, 1227, 209, 739, 578, 506, -1088, -1138, -495, 39, -1110, -1984, -946, 328, -165, -811, -157, 820, 767, 316, 622, 1452, 688, 390, 189, 754, 115, -551, -651, -548, -74, -772, -832, -122, 171, -308, -681, -74, 92, -474, -8, 542, -49, -668, -742, 100, 823, 28, -807, 296, 2114, 1300, 177, 225, 1385, 1404, 339, -367, -278, -483, -332, -1072, -623, -1461, -1014, -453, 347, 150, -296, 600, 1729, 1328, 273, 842, 1112, 1160, -304, -620, -32, 218, 55, -526, -377, 409, 429, 102, 172]
929A72m52Q2Jk45K57j157K69O39J66J77l00L82O29M65l00J72Q3l61p30L30j79
950A00o09n49K47K83J88q59N1J152N48n56l32M42L12k28P2k22JL69L0N7j87j37
972A73m70J188n3p99n81M96M88p04p95J30Q02N3o19j49Q49K15k45J19j16P14j18
993E78k37K17m41J70L65L66l85r87n3R76m02r62j38O67J99m58k73J93L70R7P8
1014f0P0nK01j37M77M6k90l3M17K62l25m19k6k4J60p36r8L76k73p1j50K80mn30
1038h92R51M5J34k21k34J280k12o13p7K84J27k02p53N1O41J78j76l43k32n4N05
1059A87m48L4m15K02l68Q62m31l93R11Q61k47n90MO97Q7l16n88p3m3J64p85k83
1081i71L72L05mJ17j6k59P8P47p6k29k82P80k64l04m20J89P74l76L6k64O90m67
$$ y = [172, -280, -198, -197, -442, -185, -1342, -1073, -434, -268, -91, -391, -9, 620, 1085, 785, 957, 1040, 679, -51, 279, 100, -509, -1058, -811, -528, -340, -1199, -1148, 4, 552, -4, -336, 106, 418, 190, 262, 40, 41, 410, 440, 497, 310, 173, -297, 891, 838, 39, -542, -46, 442, -262, -1057, -927, -125, -72, -691, -840, 9, 224, -21, 98, -18, 696, 578, 341, 558, 117, 287, 652, 1018, 633, -354, -407, 569, 167, -795, -933, -266, -67, -525, -798, -605, -235, -138, -60, 10, 5, 206, 69, 546, 592, 302, 269, 686, 948, 623, 204, 178, 154, 314, -422, -520, -144, -417, -488, -638, -358, -362, -892, 59, 104, 238, 17, -217, 1063, 851, 238, 161, 445, 572, 370, -383, -332, 309, 487, 311, -32, -264, -318, 187, -261, -227, -642, -440, -808, 54, -377, -770, 141, 1002, 755, 165, 169, 866, 953, 637, 49, -24, -67, 97, -688, -971, -599, -294, -298, -181, -197, -456, -378, 369, 293, 64, -218, 562, 298, -6, -426, -237, 537, 161, 197, -67, 623, 156]
1103A56o27J032l63k48n32J79P03n22n61j55P07K24q4J73r3L78P3m05O27j65k46
1124B51k6K62k14j93k83M11l73k85o89J342J81o15o51P89L90J1m72r9K36M15n5
1145C33K12o22P3K8J94J32l66j24L00M55l47o32n67J401k81o22o05J106k8k45
1165b05n4J67L15n36N74O4N31m20m09K26M39m22o29J54M21l44p43N70K63k20n07
1186g65P18N49m99o83P38K94n17m20M78N37L3r34J72M93N46m64o32N29M92p02
1206c7o74M76K64m87o8o3L78j26J76O23k40m60k18P73O30p07l66N8P97k33r02
1227d06J48K02O42m08k79M55j20m96L12q4J10l18l96J94M42k54l76P46L17l32
1247I9k43L27K93j44o25L95J47q2l82l34P28J65n37k64L11L13p76K96O55Ko47
$$ y = [156, -471, 561, 198, -50, -582, -403, 300, -222, -783, -938, -231, -7, -91, 82, -11, 367, 440, 35, 662, 497, 251, 225, 487, 273, 80, -203, 208, -165, -450, -1139, 203, 384, -231, -882, -93, 297, 308, -164, -263, -27, 388, 333, 545, -77, -4, 24, 218, 350, -16, -140, 160, 615, 268, -364, -931, 470, 189, -433, -1038, 68, 40, -205, -259, -92, 223, -313, 261, 325, 856, 436, 27, 253, 692, 270, -359, -205, 216, -128, -871, -301, -38, -258, -765, -47, 502, 3, -680, 58, 352, -165, -585, -107, 430, 463, -471, -299, 194, 740, 276, -356, 173, 665, -37, -711, -235, 29, -458, -526, -589, -211, -337, -161, 462, 222, -238, -456, 317, 947, 240, -126, -68, 729, 496, -406, -258, -56, 586, 178, -101, 354, 234, -262, 50, -34, 76, -242, -638, -444, -2, -256, -632, 114, 431, 99, -144, 183, 476, 332, -293, 102, 249, 167, -215, -549, 179, 344, -193, -457, -146, 167, -609, -313, 342, 344, -303]
1268c03k65O39M29n38j87m5N36L15l40n34M56l21m0M32J35m68o9j2M37l41l90
1289d74Q0N57j86j73O6m2N23m5l63j26M13j81l60M34p9J82l15P2M55o39o8M89
1311B20J72p06J24r3P15n21j91n0K68N75l07q55N63K08j89J11k06K69k46L76j90
1332D7K30l08j14K96k5l31o8L00J37o7k9j93L31k4J15m87K59m19j56K50K93L70
1354D07n42R1J79j54J4j87L64p2ol43J49K85m03m20O83k41J46j6J28l44J97L70
1376B85k9J04l22p3P5L48o11O01k77M8m62K90o8j03N08J04l61m72K12j3K34J02
1398A20k43J18M3J89m40M9j14O53n80L64O6J27l18J80n69L42R9k16j52L74l83
1419b91K81K17k76l48J21K12Q9J56k51K9Q5j73o5M3L64k16k75J88K62o3j00M27
$$ y = [-303, -568, 71, 500, -38, -225, -270, 266, 581, 241, -293, 163, -158, -198, 234, 369, -99, -168, -180, 257, -84, -474, -394, 163, -23, -196, -130, -172, 351, 306, -57, -183, 230, 49, -311, 123, 44, 226, -89, -17, 438, -201, -269, 220, 392, -314, -190, -283, 432, -89, -280, -330, -62, 513, 206, -649, -86, 122, -67, 44, -162, 107, -139, 237, 47, 277, -31, -145, 151, 126, -205, -273, 27, 164, 97, 68, -125, 206, 182, 297, -190, 69, -350, -506, -256, 37, 407, -135, -44, 135, -19, -5, -192, 172, 100, 94, -249, -100, 185, -218, -638, 45, -196, -50, -66, 62, -282, -85, 285, 256, 360, 38, -35, 40, 388, -223, 378, 101, 149, -313, -23, -91, -194, 314, 418, 57, -415, -203, -216, 18, 120, -123, -5, 38, 227, -213, -164, -278, 375, -205, 159, 225, 352, 34, 214, -355, -13, 86, -130, -282, 92, -291, -10, 207, -69, -417, -296, -84, 5, 161, -90, -61, 24, -149, -214, -171, 193, -23, -298, -110, 152, 89, -11, 416]
1441D16j90L3o90K53N96j35l27L6n32K50k73N76r6J55k68L57P3j06j96Q1M3L03
1463C59j09k67j19N24n0o9n97M24L54n7j801J924p57r4J00N12J8k08k65K57J12
1484A91O3J87K57j187N05N86n45R3N07l83j83M26o69m64O50O7m77K58j83J468
1504A167k487J488p68J181K30j189K99m49P23l37P13o81K25j29j04o7j03l16J541
1523I37q29o65P37m60n24Q44M0j086Q34O12j64j372J090J197j362J086r40j84
1541b09J999j142o14O52j970J338n39J31R06q52M14o68q05J893n29L93p09O56
1559C45n01j51P46o87O16n78O91m30O8Nl25Q83o88M47m83L60j38K8k45J06l96
1580c27L91R8O52j272kP17l00O4Q5n5m7o1K4n49P87m90K35k60l08O85q75M15J84
$$ y = [416, 226, 259, -431, -178, 418, 283, -44, -8, -540, -290, -563, 13, -83, 72, -196, 161, 234, 128, -68, 13, 56, 359, 250, -17, -136, 388, 338, 269, -328, 96, 450, 393, -1408, 516, -241, -335, -235, 277, 295, 87, -178, 79, 191, 254, 441, 698, -489, 16, 602, 57, 150, 657, 274, 91, 517, -152, -616, 34, 101, -376, -118, -301, 1167, -1320, 168, -600, 581, 811, -378, -79, -528, 195, -142, 571, -110, 115, -14, -118, -185, -288, -604, 937, 108, -557, 180, -280, -804, 40, 80, -1006, -172, 440, 276, -1096, -6, 1191, -171, 915, -25, -209, 1790, 648, 34, 686, -1284, 54, -485, -354, 552, -300, 114, -554, -1359, 534, 5, 398, -311, 345, -156, -307, 439, -248, 368, -210, 481, 51, 119, 124, -201, 682, -6, 441, -42, 318, 180, 208, -37, 69, -327, 64, 162, 814, -458, -460, 257, -43, 21, 106, 51, 4, -57, -33, -582, 205, -285, -50, -310, -618, 67, -808, -393, -209]
1603b09r2l29M49O45p39J214j088N37n62O4J153r33j018M34O83k09M72J49o91
1622g0P40j326N62k11Q54j268l18R07m47l06J014n56N02M37r26k10M66M79j031
1641g08R50k78l59Q80q36q09N16k85J481j278N54Q15p53k02Q6J795k998L93J765
1660G29j025k9j69P41J3p53J016k58J75n0j1p34O98r8m01m29J079r59N1O65p3
1681A78Q88n40q66Q84j10P0m26j70J425k246n31J169j009K216l17q24R7j85m6
1700c43m10Q42R5l2p7J03J55j25qk09N3j33Q0K19m01N44l99J05L41l62k06rN10
1723C33n23L16m01L03M18o80K75O3j14K88j16k82J59k71K73J17k50k4K34k85J77
1744A0n09L55j4L74j15k90L3P8j01J37K05J86l00j11K39k36l15J82Qk10J38K02
$$ y = [-209, -301, -630, -181, 464, -275, 939, -149, 388, -174, -110, 1043, 110, -908, -474, 209, 0, 472, 621, -70, 670, -656, -94, -305, 549, -719, -1037, -130, -577, -883, 131, -425, 77, 514, -412, -622, -156, 323, -708, 242, -36, -395, 485, -351, -1160, -644, -929, 552, -726, -172, 643, -110, -312, -226, 1569, -1429, -1036, 729, -296, -325, -494, 247, 260, -493, 523, 265, 440, 390, 379, -355, 343, 245, -156, -585, 494, -465, -414, 251, 178, 1066, 526, -340, 544, 434, 504, 78, -92, 1333, -913, -1444, -275, -1284, 932, 615, -209, -112, -297, -343, -753, 89, 184, 152, 75, 178, 333, 208, 200, -9, 44, -89, -9, 210, -191, 353, -46, 59, 400, 38, -168, -177, 333, -190, 126, -275, 28, 446, -234, 41, 104, -10, 278, 162, -120, 39, -232, 41, 158, -92, -116, 118, -167, 10, -499, -144, -158, 216, 101, -189, -156, -78, -179, -42, 163, 349, 49, -62, 177, -59, -374, -192, -184, -394, -256, -54]
1766e4J74k75L57N00q95M00l45L66o5J28n01O21J28o09J58k53L62j92k1j91J50
1787e7O0l78M1M75j64k60K2M18j29Q8J4k73L65o70N55K1m12M90p4k60M12o7k3
1810A94r2j83L93k67n5j14J20M4J82j14k12k07K11K45j88j44K95J57m30pK27l61
1832c06M62j55k54o7M61P2n02L84j53K57p26P15j01M6j26k10J13M4K08q7N0j41
1854a6k56L98kl76L52j43M6J22K17n42K88n0j1N1k67L99o85N52Q9k41J73k01M82
1877C79o33K24RK21j08k7l8j71K16J57k19k8N9k23j06N58k9n1j61Lj62K3M25m17
1901i9K51j97L03k24J05r4O4j28o17P90k86k1J31M18m04j51J37k3j05O1M1j95
1923b43J3M09J43q4l29J85k12L48l2k59p1K50l67O55m48K72l28J70J62m13K37
$$ y = [-54, 120, -155, 202, 702, -193, 207, -138, 228, 163, 291, -210, 411, 539, -70, 88, -165, 197, 5, -16, -207, -57, 3, -375, -334, 141, -23, -283, -261, 157, 28, 116, 130, -143, 222, -448, 107, 128, -284, 206, 132, -128, 284, 217, 194, 102, -81, 312, 45, -10, -124, -4, 40, 222, 108, -104, -311, -100, 145, -43, -187, 108, 265, -165, -172, 55, -306, 156, 1, -253, -320, 141, 213, -289, 95, -58, 199, -527, 188, 87, 133, 7, -203, -90, -46, 162, 75, 125, -16, -272, 126, 124, -252, 100, -43, 3, 125, 342, -200, 88, 38, 27, 78, -189, 210, -475, 77, 166, -75, 98, -103, 379, -254, -30, -21, 200, 92, 65, 27, -144, 72, 229, 10, -18, 41, -182, -288, 270, 241, 190, 29, 32, -130, -107, 318, -99, 152, -45, 258, 34, 139, 45, 109, -19, -636, 154, -132, -153, -22, 396, -8, -159, -22, -45, -150, -89, -48, -243, -230, 179, 322, 238, -91, 94, -118, 230, 198, -61, -132, 118, -249, 406, -42, 230, -98, 72, 234, -179, 58]
1944E8j48K1j12L30r4N9l30J61J49j91m3P7M36l45R8J42m1j04J28m64J57n8J26
1967A2k18L64l37K95k39K80J70k72M7J94k33k48K24k99L10j05J04N1k1j90J39
1988B8j63J26M47n88J77j02J66m5j72J30N6P9j49J24o4qk15K56K7l03K27j97K64
2011A01j04K79k75K52k85j69P9L66n01L70k50J20O0J24k8k40KK08k53K67K09j16
2033B16l8m53M38n0Pk17K78l99M6N40k08K16m05k64M95r5l49K16j14K60K72n25
2055a33J85L14q38N97r6j60J54J21j03J14o1mj47q8K0j19M66j30j36k3J22R8l29
2078a76O52m54J1K81n20L30k4j29j72l2RQ4L08k2k71M56m58M05n68L5N21l3m27
2101a94l22L54J01L25m4l58J52r6j47K04J23j43k33j52L59O7o6J44j6j9L0L9k16
$$ y = [58, -90, -69, -181, 149, 55, 114, -216, -55, 94, -97, -140, -63, 373, 28, 126, 268, 227, 123, 251, -213, -56, -114, 12, -206, 158, -179, 116, -123, 157, 327, 55, 102, 296, 63, -185, 39, -260, 50, -55, 49, 100, 79, -111, 28, -135, -9, 438, -150, 27, -75, 91, 46, -126, 4, 60, 139, -10, 114, 50, 42, -173, 83, 110, -193, 34, -163, 101, -3, 276, 1, 253, -32, -201, -122, 244, -257, 113, -137, -17, 43, 167, 139, -101, -99, 109, -144, 123, 332, 216, 178, -275, 163, 113, 120, -97, 181, -218, -172, 368, 160, 376, -29, -293, 202, 107, -242, -26, -140, 120, 392, -133, 52, 366, -472, 125, 29, -131, 23, 144, 41, 155, 94, 90, -57, -145, -125, -244, 222, 92, -44, -67, 55, 153, -176, 476, 22, 33, 314, -206, 124, 100, -29, -201, -233, -224, -140, 168, 146, -125, 331, -127, 278, -290, -255, 266, 233, -194, -516, -162, -61, 264, 220, -138, 14, -82, -229, -25, 98, -45, -278, -430, -71, -4, -70, 74, 58, 39, 69, 108, -108]
2124a08L68m45O41o74M81l34QQ5q9Q9Q3j46J71k72K85L51m71k17K88k30N2K60
2146A76k39R3L59o28J87J51k32L67n24M13J02m70K10K34n7m56K23N92l18j48R3
2167A28l9j67O0L36p70M36J92p9k4Lo5J25k75j8L46j72K36l02n8j47L69k06N3
2190c8J25k57J56M6J59k71p5M51n79M91k72jJ52p7L51n33L14R7k49l45M4L63k63
2213b11k93J225p20L70o13l09P64n78K53L10k10K29J5m24L42L32q19Q98K81o37
2233B05j27m42N84l19j98O59m60M91m14L85o58Nq9K7J64N43k89k18j7M66n95J99
2255i8O4M29n61J73k96J98L96n40L62p0J73j62l68p3J59M28j53j68L80O9k54N6
2277A44lK21k85K3J78l88k37K98l4j36L74P6k79j17QM4P2m3L58j44k32M68m01
$$ y = [-108, 260, -185, 456, -218, 263, -71, -63, 22, -67, 22, 105, -41, 130, -142, 143, 494, 23, -194, 94, -136, -84, 176, -63, 30, 389, -239, -52, 99, -133, 234, -290, 123, 225, -245, -35, 199, 142, -314, -91, 501, 183, 35, 128, 89, -78, -18, 318, -452, -16, 176, 97, 73, 76, 11, 136, -139, -157, 189, 17, 253, -49, -107, -254, 115, -91, -38, 87, -170, -14, 32, 191, -80, -155, 296, -283, 208, -64, -65, 87, 10, 361, -172, 142, 239, -10, -355, -311, 52, -211, -504, 721, 1, 371, -242, -551, 213, -365, -112, 198, -12, 217, 232, -192, 150, 482, -337, 561, 842, 205, 78, -364, 220, -99, -297, 362, -98, 393, -21, 364, -294, -289, -378, -351, -187, 356, 67, -151, -168, 298, -297, -98, -34, 395, -166, 7, -289, -91, 305, -235, 127, 57, 230, 68, -300, -373, -214, 214, 61, -107, 273, 342, 88, 144, 141, 362, 77, 100, 278, -110, -347, -49, -83, -219, 155, 231, -48, -165, -157, -113, -41, -84, 274, 130, -102, 366, -35]
2300c5Po9J86l16L94l88K35k94K45K42n65M44m6m54L07K00j69K77l38L35p4l11
2322a87m2J56k00L34l90N88l91K23Q7j08%ol30J74K96k19j47K62J07n07K64K17
2344A81J7l64L19k69J62J85ol35J91m90M81r1J13r3K71k72J12r5r3K18k85j43
2366b86K03K2K27Q1n05J86J63k24M87k62N9n2k25J50P0j01n0Q1O6r7o1K22l69
2389b15Q4N6J74J47L4m32j93N8M05q9r4m3J73K2m7O8P9L4l74K21l89L24J55j29
2413B9k40J39q8L73j28j06R3J94l97k54j8M34j89J78r0l92M39L02m93L91j18Q6
2435A45L0N6j93k98P1RP6J6l5L58l03K42k04j73K00J13k93K44J29j70J71m05N2
2458a62ooP5j8p4K68M2l84L22n6N9k18L58j50o0j33M47m81p1J72q8l45P63n44
$$ y = [-35, -28, -97, 89, -227, 167, -221, 14, -280, -35, 207, -358, 86, 40, -414, -107, 93, -76, 201, -137, 198, 124, -187, -229, -73, -273, 61, -329, 259, -132, 91, 178, 70, 70, 64, -266, -92, 204, -15, -162, 100, 207, -300, -36, 181, 198, -166, 153, -116, 46, 231, 225, -110, 81, -409, 72, -19, 94, 1, 272, 0, 112, 17, -76, 142, -143, -286, -83, -61, 166, 247, -258, -72, 91, -133, 354, 92, 151, 99, -126, 24, 94, -7, -57, 24, 90, -7, -68, 154, -215, -131, -75, 99, 246, 280, -152, -345, -287, 118, 29, -65, -108, 65, 87, 40, 108, 187, 221, -153, 68, -321, 3, 158, 29, -211, -72, -160, 213, 85, -21, 72, 266, -131, -385, -403, 31, -158, 20, -70, -462, -23, 279, -214, 177, 59, 145, 175, 231, 38, -260, -189, -180, -104, -88, -123, 235, -68, 174, -30, -203, -3, 110, -183, 61, 190, 20, 191, -214, -162, -168, -174, -99, -117, -191, 77, 119, -265, 57, 1, 60, -158, 200, 50, -10, -143, 304, -177, -248, -76, -164, -509, 254, -290]
2482b90O55n73K21J01o1K68o48M83k75j52J39L13j00k43%L39l86M01p0n3J02j35
2504C6K56k35j24L33k38n3k67J33L2M45l69J61k11L07m18M17N7o2j5o0j60r8q2
2527b15M5K88P0N8k18n9j2j22K60j58J15J53j56j99J76L27l78J36k58L15j06O3
2549A25p1J53k39J37j56k09J35p9k40N30l84K77M44o62N17l54J27J27k03K22n28
2570c31L89J89k52J80N3k71l96L02L87m71q8M15N5Q8m12J53J96l95O81o46K06
2591C2mk97J84j0J79k00O0J81N0k36J2K02J92k12j35J2j5k9J11j74L48k59K31
2614B23j48k12P0j76N42n00K49j36k63P2J31Q9P9k79N67l01L19J02n79n3M13l51
2636a42J1L1K02p5j37L27o8n6K50j99o7O0n2k97J66K17j82q5N05m99nK18k84k9
$$ y = [-290, 365, -208, 13, 114, 53, 321, -327, 156, -119, -271, -132, 181, 81, -162, -162, 177, -209, 192, 122, 69, 171, 36, 292, 57, -67, 266, 28, -25, -292, -159, -127, 318, -51, 110, -101, 206, -212, 205, 262, 200, 185, 125, -35, -133, -215, -170, 118, 188, 246, 28, -31, -43, -165, 95, -63, 52, 205, 49, -150, 26, 353, -25, 111, -147, 168, 62, 125, 54, 207, -32, 105, -51, -260, -125, -204, -444, 86, -298, -21, 423, -239, 278, -76, 51, 178, -25, 197, -331, 58, 247, -5, 175, 228, -43, -439, -137, 250, -221, -309, 106, 161, 249, -163, -10, 186, -209, 472, -174, 32, 28, -269, -85, -95, 84, -116, -56, 125, 175, -61, -49, 153, 345, 133, -2, 10, -5, -34, 77, -97, 251, -8, 223, 75, -137, -67, -243, 299, -201, 48, -88, -351, -279, -148, -59, 20, -259, 308, 7, 326, 428, -151, -204, 209, -142, -131, -100, 102, 27, -110, 217, 149, 93, 343, 144, 77, 137, 85, -212, -46, 171, -11, -96, 409, -90, -95, 123, -161, -190]
2660a90K57p7nK89j13j04L0k61m1N93j8l91K09J8k32l12M70j28K02P6j57J75P9
2683C69n56N18m91n14J611q37M99k02K78n3n23K64k04k93j38j51N64k07K5OJ44
2704A09O2k39K42k33J22m98P58k64K25k73L5j5K15q3n95L43K2p7J58l39M35m3
2726F7l93K66L74m40P3N9m03N97m95J09K76M3k20J57n2j42J54m1n1R1K75k04m2
2749E8L8J38l63j20M78j67L2p9jk81N29m48L91K0r0j13oK89k67j65RK61l52L83
2773A74j78L30k15Lk07M8k20K33J57J32m03RJ15L87m68J77k84M13j26l29M42j
2795A89K55o40J58k22K92J35l98L69k68N30l72p0J08M3K22l26L7q3R2j21P8k91
2817b83J10J00n2R7J0j18j49M72k92r2r0L88N6j24Q4l66K85n7L52m09N03j91j42
$$ y = [-190, 67, -10, -15, 274, 161, 57, 87, -174, -215, 378, 360, -31, 178, 196, -36, -348, 122, -6, 196, 272, 115, 290, 369, -187, 331, -160, -674, 937, 100, 599, 397, 675, 622, 99, 363, 159, -134, -272, -423, 141, -66, -41, -35, 109, 171, -68, 174, -59, 63, -435, 323, 59, 284, 11, 46, 31, 246, 163, -432, -89, -67, -144, 14, -325, 110, 67, -326, -60, 314, -126, -53, 6, -397, 200, -295, -186, 90, 133, -87, 70, 18, -124, 30, -11, -62, 29, 304, 100, 58, 96, 234, -129, -249, 229, 62, 94, 15, 14, -267, 262, -186, 205, 225, 135, 22, 16, 305, 38, -127, -118, 143, -209, 174, -4, 326, 111, 114, -93, -45, -265, -32, 125, 257, -146, -137, -22, 365, -103, 74, -210, 203, 77, -252, 190, 189, 444, -196, -38, -260, 32, 167, -231, 138, -130, 400, 28, -42, 66, 109, 331, 5, 42, -41, 51, -70, 8, -283, -173, -73, -125, -28, -18, -136, -285, 187, -105, -197, -287, 101, 157, 33, 117, -249, 36, -21, 331, -78, 425, 234, 92]
2840I2L40m82J35o6K32lm73r6N12l8k14q2K99j00O9j31k67J26J7JJ26O2k78M47
2864B28l08N5M0N6Q1kQ9J64l02l85O34o46K63P5j88L58k88l35Q10m16j83J14p0
2887a56M23q1m71N02k41k7r0K97j72K6k4K29k01M4p0j58L61m18N44l73K81k6o6
2910A33n4J86k3j47J34j7l36M13p10M17J22J6j78P9j71J53k01Q0L09j83N2l2j73
2933a31r4j72O6J70J14j96K69L3p0j23K68j52p3K07j04J60k56M4k24K93O6n0n89
2956e44P12j49j24M31q86P43Q1j96l08j09N79l07J56m48K11ML05m13J37K38j56
2977d3K56o4j28j58r6l27K44Q4K24j95N23m57K79j61r4j34J27j13L34P5l22M57
2999C11k03k99J80p1m54M64j58L79j07j86j4N7J41m5K48j35k84k13O36j44o2j35
$$ y = [92, 432, -50, 85, 19, 251, 248, -225, -321, 191, 153, -61, -143, 156, 56, 125, -6, -273, -147, -130, -129, -3, 59, -219, 228, -80, -25, 15, 71, 152, 150, 239, 403, 101, -284, 350, -296, -33, 42, -146, 212, -76, -411, 399, -17, -200, -86, -156, 267, 186, -285, 217, -24, -51, -141, 156, -16, 10, -14, 215, 14, 58, -12, -170, 191, -227, 317, -56, 225, 199, 133, 79, 265, 242, 95, 229, 212, -124, 289, -421, -4, 118, 134, -44, 35, -136, 17, -184, -104, 205, 22, 74, 42, -131, -225, -397, -331, -161, -47, -243, 26, 59, -11, -134, 134, -18, -91, 116, 12, 172, -84, -40, -264, 29, 95, 45, -544, 168, 19, -105, 326, -560, 183, 264, 68, -240, -349, 230, -77, 79, -369, -158, -154, 151, -262, -125, 113, -43, 213, 149, 21, -137, -233, -560, -316, -232, -8, -203, 320, -137, 142, -19, -113, -247, -120, -233, 101, 176, -146, 311, 108, -191, -11, -82, -536, -72, -230, 149, 42, -144, -158, -101, 40, -5, 243, 108, -176, -389, 247, 103, 41, -94]
3021i4j05K7m8M15k85M7l2J33l89M74j83K04M1k2j89K22l78Q0q2L40j39R2J86
3044C15l53K1N3Qk53M45j13k36L79j75J78m20k16O69k27K02k41J82k61n2L76j37
3066A44N3L8j25k46J1M4N7j14r8K40J22q9K7P4l82K55Q6NJ83m13j18K40kj63K65
3091I4j40m68L71L04M8j76j95L55j77j16j48L67k3k67P2J37j46j39J52J73J91
3112B69j62n14L91P6J23m11J69J47j28p3Kj28Q4J56k0ll94O88k88j05m3L07p43
3135f00O95O4o8J83k28L13Kk00m82M88p8M95m75j37K52J27n54M72l46J53K08k21
3157F3J64J21k41J56n22N83M4k95j41L5J60J30J64n40J83l13J35J59j78K98j11
3178E4n7J32M85n72n5K67p9k67L05m36K62P6k94J1M27n1m66L28K61l61M31o14
$$ y = [-94, -199, -172, -220, 195, -90, -43, -75, 58, -331, 143, -40, 164, 205, 183, -6, 216, -162, -82, -164, 176, 37, 129, 315, -38, -17, 36, 44, -209, 236, 123, -113, 266, 91, 269, -151, -367, 302, 75, 277, 36, 218, -43, -95, 281, 144, 197, 235, 110, -136, -125, -81, -24, -138, -236, 4, 126, 37, 64, 138, -244, 11, 97, 102, 285, -128, -246, -6, -8, -171, 94, -46, -514, -143, 161, 209, 33, -162, 193, 16, -100, -248, 119, 96, -171, -99, 38, -108, -247, -95, 78, 269, 107, -407, -16, 60, 183, -228, -59, 88, -40, -113, -111, -239, -155, 1, -19, -22, -416, 272, -16, -121, -164, 143, -600, 95, 159, 91, 274, 46, 359, 361, 161, -321, 167, 89, 584, 109, -28, 224, 351, -203, 269, -77, 76, 284, 63, 227, 348, 107, 263, -259, 324, 368, 73, -68, -33, 127, 257, 421, -119, 64, -249, -114, 45, -133, 165, 54, -3, 129, 614, 42, -13, 254, 175, -92, 213, -223, 39, 115, -179, -168, 259, 208, -258, 70, 331, -30, 401, -213]
3200b13J90K16j25l1J92m89M13q9J2j12Q9Q8m24K58q7M09k0J24m03J6K71l68L1
3223e2J45m73M42k45K5K55k11K4K80j35j55r8J20j06p8K28q4j11m9N92l61k21
3245b68J53K11k03K06oJ23k57j19k20N06m78J93P2L89n12M37p0n9j96M79k53m22
3267b94M33j62l09L96l61K60O1J59K6j79k28N11l87J14K79l35J90m24L15k70K87
3288H2j58O5k23L0K07J11J07J33l13J4k67j08O41l88J86j40k45M82K06l59r5M30
3310C98m1m2l71J35m27K22J0j8J92J05l23q1N12k25p0l08N09n00J45k7k8N06j16
3333A57j96K98k26K75j57l47r1N64m40j91L94k25K7J04j59N51q2k65n13O59j20
3354A7k17M80p6l85J36K39j88j40K37j32K33l01K45J10n59M08l27qK33j86j5L42
$$ y = [-213, -23, 193, 68, 37, 229, -260, 153, 64, 76, -36, 53, 141, -283, -25, -112, 297, 277, 401, -2, 14, 285, -83, -52, 93, -380, 62, -183, -158, 97, -114, -90, 190, 55, -100, -198, -78, -184, -262, -34, -118, -229, -278, 314, -47, -268, -115, 96, -107, 99, 93, 216, -41, -160, -380, 126, -352, -159, -87, 302, -210, 227, 157, 98, -98, 381, 128, -294, 139, -23, -332, 64, -297, -37, 24, 183, 209, 30, -198, 313, -74, 40, 319, -16, 174, -250, 65, -205, 82, -76, -11, -234, -204, 3, 114, 221, 354, 41, 55, -212, -320, 321, -67, 119, -21, -266, 216, 422, 63, -32, 398, 357, 315, -56, 79, -348, -126, -116, -134, 58, 163, -160, -241, 271, 46, -24, -332, 177, -323, -178, -205, -233, 273, 157, -39, 259, 33, 308, 151, -196, -287, 277, -163, -354, 40, -185, -158, -54, -213, 338, 256, -9, -522, 137, 17, -200, 280, 204, -181, -45, 194, 6, -134, 103, -29, 204, -97, 148, 258, -301, 107, -220, -228, 5, -181, -196, 146]
3376A46R4j48j2K6J46J75n13L03l27J39p4l9O3l6J3k05L10j58K16p4K16m12M08
3399B57n71Q33o52K34K37p8j26J93l58k45J62j43L64jj78K25n32K77K71l26N17
3420C60l12L6o4k25L57mj27j99K06J57k87J56k52L15Q8m67L15Q9k43K52l93K63
3442B1k91N91j53j51l33M34J40j15P2k16j03m6j04J82L54k26j56M76j89j77k47
3463b37N69n08L46J28k31j89r7J81j32R7l61M07K05J55j77l81pK18J02k2J36m41
3485b39R2J8L52r1o4K91m28J92J84k83l46M81n3J40l63K31kl27L08j70J04j96
3507a69j23M02j05J92k23K43j49j35J96n6r9q4k71K77P3j44J57q5K13J2k2j86
3529h6j5J5JJ58q5j43M81k90k39k4Q7M38l22j47k71K51K33p0P9N4j45J48J53m18
$$ y = [146, 240, 92, 80, 106, 252, 427, -86, 217, -110, 29, -45, -84, -21, -57, -44, -249, 61, -97, 119, 45, 261, -151, 257, -314, 519, -133, 101, 338, 260, 134, 327, -31, -276, -114, -257, 107, 106, -72, 153, -379, -102, 169, -157, 360, 48, 84, 20, -205, 152, 148, 21, -178, 28, 185, -102, 54, -198, 117, 205, -262, 53, 142, -101, 151, -242, 21, -270, 321, 168, 17, -316, 118, 258, 143, 215, -1, -104, -150, -254, -72, 282, 56, -100, 376, 187, 10, -237, 332, -176, 170, 298, 67, -122, -219, -38, -170, -73, -434, -27, 178, 333, 156, -225, -232, -14, 88, 66, 202, -239, -147, -129, 223, 132, 68, 359, -69, 123, 307, 24, -322, 159, 106, 246, -117, 114, 112, -215, 93, -77, 27, -169, -292, 110, 5, 197, -26, 217, 68, -67, 129, 73, -26, -110, -381, -104, -31, -175, -18, -103, 110, 122, 100, -86, -101, -86, -85, 73, -12, -155, 326, 36, -203, -227, -140, 298, -24, -171, -442, -191, 42, -28, 51, 105, -40, 108, 261, -157]
3553a57J67L1J02j34k54K82j63Q0J32k37J82j31l76M23J54q9K30J15k08l08m8
3574b07K45m99M84P5r0k12L65j78J17l3k81J80P0m52J80L05J79n61L18O3o3j95
3596a90P6K01K06l76r1O78l10l83L90n21O94q8l31Q8k11K38j25j15L00P1l56L
3618a52K71L95m77J54m97J1K80Lo5K41k18J89P43q26k8P4Q4j13n2l18L61k56M57
3641B61n05K4N21j29m66O58n53N41m46J92k18k11L3N81n09J16M9k7j57J297j288
3662b36M43r8r9m52J289o89L46n55p54P04k61M70m8q4l3K74j44m1J37K9n91M35
3684D2p5rJ69k82m6L38k69M75j18j42J0j43k89M30j50K45k95K94m79M79m87M29
3706A27j80p4J49j71O9k82M28kk01K62M34r15J326m13n74K46O85p70r22J414o26
$$ y = [-157, 10, 41, 143, 9, -245, 37, -126, -46, 86, -151, 31, -100, -476, -53, 101, 12, 242, 357, 149, -159, -207, 38, -461, 23, 98, 8, -204, 161, -17, 100, 67, -214, -34, 36, -416, -236, 69, 248, -313, 5, 68, 5, -190, -114, 87, 293, -83, -174, 504, 194, -189, 201, -320, 374, 286, -45, 43, -168, 70, -55, -170, 130, 201, -155, -152, 119, 514, 37, 191, -306, -295, -15, -12, -77, 164, -54, 135, 878, 52, 24, 98, 182, 69, 17, -301, 60, -196, 261, -244, -220, 301, 172, -294, 364, -189, 352, -94, 98, -120, -331, -298, 283, -226, -110, -61, -88, -245, 1052, -236, 207, 109, 10, -442, 847, 158, 504, -51, -805, -101, -362, 108, 60, -24, -57, 217, 73, 32, 169, 198, -393, 42, -33, -42, 127, -155, -201, 137, -132, 343, 225, 83, 93, -50, -339, 91, -59, 186, -109, 185, -294, 185, -302, 127, -53, -127, 22, -149, -80, -362, 66, 64, -137, 125, 559, -356, 970, 557, -17, 229, 914, 144, -778, 636, 10]
3727A0K43o24J07M19l24N30l41k04o22L88R83K27j266l50R08O69K72k226Q40R12
3747E51o50k65P8O08m52O0R50p00o03j80L77P04j491J100j37K86K25j68J66m80
3767b1j48l68N76k20K10k58J74j43O61j034Q95n63p98P03O28K8l83k7Q80p80O66
3788F78l49M65q49n4J144k159J225J43o04P5Q79j025N35l68O77m98N17k38Om22
3808b22P26j56j222L44J336k66n05R7m99K39p36J274n10K11n63R29o57M50l53
3827h3M32k86m32O67m42J32l76O80j14J76R3j11q46N68o3N12p65P40n03J94l78
3848b05J09k02N67j82J14o47N61K74L1p81J31L37K50J2j48n97P81r49J334l00
3868D90j661L72P76m5m20P5p13R57K82M2J08m86j28j81J061m73k5p72N80M55l32
$$ y = [10, 253, -371, -264, 155, -169, 361, 20, -184, -806, -418, 565, 792, -474, -824, 84, 753, 1025, -1201, -361, 551, -99, -364, -286, 322, -130, -70, 880, 180, -423, -603, -226, 478, -1013, 87, -50, 236, 461, 293, 459, -21, -169, -537, 39, -181, 29, -229, -55, -198, 463, -571, 324, -239, -1037, -334, 294, 322, -61, -88, 792, 12, 678, 329, 794, -55, -109, 1035, -1124, 101, 244, -360, -285, 594, -431, 104, -264, 413, -85, 432, 194, 200, -222, 504, 348, -874, -530, 806, 540, 35, 132, -367, -128, -864, 410, -100, 111, -452, 477, -180, 270, -83, 349, 63, -369, 298, -144, -12, -388, 292, 178, 354, 447, 336, -510, 58, -5, 507, -258, 482, -21, 173, -205, -96, -298, 269, 87, 201, -446, 115, 389, 420, -361, -230, 107, 357, 369, 221, -376, 405, -544, 790, 490, -1171, -799, -23, -68, -488, -413, -1126, -169, 113, 155, 263, -223, -351, -532, 529, 56, 31, -741, -161, 294, -38]
3889c8K37R1J89l45j78J49k87N45k83o1p4R5k23K03K36j32q7k06M31m98L53j6
3911A01k16K87J5j46J7P5k81J95n9J24m38K25K43k79L34n5l49k32M14Q7k81J72
3933d7j63R5K10n46K55M93l73j39j11L95m6P4j06O5k76K7J11K42l6q2j44Q1P9
3956E8j79m6L10R6K03j86m86m6M1L06k85N02k59k45K01k41K82l55K43M4R3J78
3978B29k06r5J42j06l10K26J99j77K76l10M64nj35j07J14l93J17k71L6K01K8J82
4000I9O0j19l68M32j31n2j01J07L07j59k35J04O5j2j73j73L77k22K29j51n7K63
4022I0l89L43r0K07K66l64k45p3M87Po07M76l58K55O5p9O8O14k22m19n8K86k50
4045A0j74J12j59M01k64j96J10l26K51l7L84l58L66j33p6J38j44L53l27j7P2J45
$$ y = [-38, 199, 290, 479, 134, -44, 105, -182, 363, 80, 19, -55, 40, -183, 20, 256, 124, 37, -169, 262, -236, 117, 101, -115, 172, 187, 41, 58, 133, -148, 47, -12, 112, -326, -101, 142, -137, 197, 142, -207, -439, -25, 62, -219, -47, -210, -115, 95, -451, -196, 297, -76, -215, -326, 69, 23, 97, -9, 56, -220, -193, -82, 160, 124, 42, -102, -21, 58, -121, -167, 143, 239, 442, 256, -230, -276, -235, 71, -214, 288, 29, -216, -15, -256, 26, -329, -86, -42, 51, 229, 23, -72, 70, -36, -346, -120, 79, -98, 178, -132, 332, 327, 192, 85, 199, -194, -77, -348, -312, -111, -83, 99, 159, 40, -328, 104, -27, -79, -180, -73, 234, 75, -160, -56, 9, -3, -176, -349, 28, -194, 35, -116, -173, 90, -299, 44, -46, 161, 427, 63, -182, -255, 232, 239, -368, 108, -250, 5, 70, -9, 59, 673, 451, 32, -26, 260, 10, -164, -52, -211, 190, -74, -270, -160, -486, -235, -272, 112, -246, 120, -13, -89, 49, -95, 258, -69, -86, -14, 131]
4067A31j36L9N5k36L22K24j76j28N1o7J80l40J22l49J61N09j54k58J65m4K4L00
4089C95j18m51L46j70Lj38K37q2j21p2L94l29M20k52r0Q0J90l96J60k7K51n6j79
4112eQ2k79r4j64L84M47n72K50K2Nr2J1r5l6J90n3J96k60k34K56Q3M6P9r2k08
4137a33L1R1n4J16k32O05o29J01K2L9J72L3q6k32L49m39K96p4j27L86m01l12L56
4160a22O5J41M0n5P6J99k54n4L84l66pQ8Q7m64K62K1r4K53r8j1P6J45j88l29n2
4185b57N86m26L18j44p2J14l15P97m81j64P8R4jq3K06r6J18L8l75Qq3J04J18o0
4209B2k41J34o2K44j25l16J37P8J03K57m81O7oN46n08L37j13l13J06J65j79J90
4231D2j23P7O2J79J9m58L43R3o0j20j61n5K24l55m9R4j62L37oj18K22j78K57k64
$$ y = [131, -5, 34, 89, -147, 175, 399, 223, 95, 146, 79, 259, -81, 41, -308, -147, 362, 208, -50, 115, 71, 95, 395, 277, -174, 172, 2, 5, -133, 104, 22, -99, -171, 223, -106, 314, 62, -28, 52, 242, -154, 6, -21, 230, 174, -5, 77, -202, -296, -460, -76, 371, -201, 49, 71, 76, -16, -5, -100, -136, 54, 1, 197, -63, -297, -41, 42, 88, 167, 75, -133, -102, -11, -65, 51, -181, 424, -205, -104, -82, -43, 129, 162, 76, -156, 193, -246, 50, -24, -151, 235, -166, -478, -122, -57, 84, 124, 69, 145, 344, 90, 36, 420, 54, 47, 135, 222, -242, 20, 41, -53, 200, 102, 91, 167, 312, 124, -205, -257, 329, -97, 221, 77, 5, 119, -196, 601, 120, -44, 34, 128, 127, 44, 250, 154, 272, 310, -65, -57, -140, -36, 82, 22, -219, -85, -147, 97, -28, -344, -207, -129, -26, 231, -250, -183, -189, 357, -151, 186, 73, -240, -134, 31, -148, 42, -81, -4, 58, 237, 256, -202, 141, 234, 174, 54, -107, -162, 62, -293, -342, -248, -410, -73, -79, -197, 25, -153, 104, -160]
4255a60m5K24J62K7m01K97k64L67o64N97M2L0p04O97l4p84L81R03k26p79j33K90
4277a77K47k10K83k40k09M13K88j90m34L36k15N5K95j78o8L3j55K19O6k32q1K14
4299F0J52m14J00o2m2Q3L56k52Q7k85M99j62MJ48j95j45n95P74m24K21J09M69
4321D86m83J33l33k0L06J00l44M2J16m5k3K90J46k69Jo75R28p5n00K86P1l19K00
4344A9k21P53m71K50j57O1r27P01l7m83M09j52N75q00N46K47j55O09p38n73j85
4365g29Q58k19O7j98L36o31M33K0q4K03J1J6k58J29J57K71k48k05l7o1K17l1r2
4388g5P7L39j66oP2l63J53k66l14O81j42K34j46k26L06l9j55J29n7k78N20m77
4410a99L05k14K15k74q4OM12l07l2K21K43j79l24j7P9j68M21k09O5j32J19P6L0
$$ y = [-160, -205, 19, 181, 208, -193, 104, -160, 207, -457, 140, 182, 212, -492, 205, 171, -613, -232, 671, 445, -334, -467, -177, 70, -140, 143, -97, -306, 107, 395, 205, -229, 107, -108, -53, 242, 64, -4, 29, -126, 93, 159, -73, -154, 60, 212, -202, -102, -164, -206, -123, 233, -19, 68, -217, 282, 120, 124, 272, 77, -68, -663, 111, -313, -92, 17, 486, 3, 136, -197, -217, 89, 189, -155, -113, 3, -42, -65, 225, 371, 102, 103, -572, 356, 281, -219, 67, 138, -181, 19, -202, 551, 80, 330, 173, 234, -693, 8, -29, -512, -103, -255, 320, -480, 66, 313, 158, 767, 29, -544, -729, 129, -90, -23, -221, 115, -516, -83, -63, -147, 56, 67, 83, -175, -46, 111, 382, 134, -71, -108, -169, 48, 17, -75, 2, 341, 175, 169, 241, -122, 31, -235, -549, 132, -10, 224, 78, -148, 158, 119, -36, 93, 36, -242, 278, -199, 106, -108, 107, -167, -251, -245, 167, -140, -172, 49, 292, 113, -211, -228, -149, -317, 104, -105, -40, -172, -53, 23, 53]
4433E3l11J58K68m18K04p4J16q3K64n14K53L6J40r6J98j09l50L94k6k20J16M1
4455D0k5r6J62j85L50j54k20K41J08l45K12k25J17j54O0m7L43l09J98L60o91O68
4477D08p03R5K38j29L39J67n17N36l52m37L74L10k25J7l7k5J6J93k36j52L4j7
4499a03M16k19j38J40j53J48J47n54L36R3j43j51J03N17j61k47k03J49K57k19
4519A5k61k47N98m27J21k4J48j19nJ4P2K22l2m17R8p7J59J19q9K76K04n70O42
4542D20k90l21Q7m5j06K38j28J06j75p6L39j32j21k35L94P3l7J06j8q4r2n6j75
4565c28L11P3Nn9J57m53N69O7n98K54L28j69m55n1M68l65J65l4K07j77j14K40
4587D1m48K22j9K02j23J45j72L3K20k78k00N93k17j9j07k00k03Q95q14P05o86
$$ y = [53, -258, -100, 168, -250, -46, -120, -4, -87, 177, -337, -84, -48, 92, -4, 194, 85, -265, 129, 103, -117, -1, 40, 15, -81, 81, -104, 246, 92, -128, 113, 221, -124, 88, -137, -20, -174, -114, -161, 182, -127, 71, 431, -260, 408, -295, -200, 38, -91, 248, 415, -102, 434, 82, -355, 19, 329, 104, 121, 84, 59, 75, 268, 32, -120, -86, -103, 313, 94, -44, 96, -57, 91, 238, -316, 20, 113, -30, -181, -78, 439, 278, 31, -172, -23, 234, 15, -246, -493, 105, -322, -201, -225, -77, -196, -201, -187, -115, 107, 75, -342, -244, -321, -162, -43, -132, 144, 348, -222, 420, 130, -191, -104, -149, -255, -17, -145, -39, -214, -290, 49, -83, -204, -439, -45, 28, -9, 97, 79, -5, -97, -153, -328, -17, 56, 61, 2, 159, -294, 275, 342, -256, -2, 326, 157, -298, -349, 119, -246, -81, -115, 92, -85, -199, 41, -407, -185, -204, -2, -125, 20, -152, -119, 101, -177, -377, 216, -1, -20, -127, -327, -530, 365, -449, 256, -430]
4608d30N26K16j64P69j133O92j064L60Q86r03N36n08L19l60N61k81M31l58m8k69
4628b22P26o92L48k39L54n6m15L87r6Q42j175k57L67j63N01J44j070N94N62n52
4648a12J59L78P6m71l39R53l33m93J56Pk33L65m08M39p7K8m17M72l90r3K94K23
4670A84k1j60Mj47J22O1j21P9K3M6l02O4K21k25j3L09j63j26KK53J54K92p31j29
4694c24N62j15l36J90N5K2k38K46j5j04R4j84K6r5l0O16o70P9L29j65R7L11m49
4717i8M36n60J51K21k88J86k74K80l2l87J37M25o16M01k98M42k27N17k94r1q0
4738d9k88L91k7j70j88M09N3l01J61o2J57M5j20O28l66n01K13R5k5m10L96J83
4760B24m15L7R8j68J27qM09m02M73m51O02r51K09M33m22p7n07Q16m16P71o35M57
$$ y = [-430, 96, 312, 148, 917, -216, 476, -588, -228, 658, -245, 291, -217, 102, -258, 303, 22, 453, 95, 47, -222, 504, -188, 160, -79, 275, 219, -196, 191, 95, 937, -238, -495, -128, -291, 210, 354, -716, -122, 440, -112, 47, 425, 501, 30, -309, 644, 311, -182, -26, -19, -252, 113, -295, 144, 67, 95, -322, 150, -240, -333, -39, 184, 163, 3, 7, -140, -18, 43, -78, 1, 24, 70, -232, -168, 53, -172, -185, 124, -39, -165, -163, 90, 244, 536, -195, -324, 238, 123, -213, -23, 32, 54, -184, 62, 47, -57, 37, -147, -121, -216, -246, 370, -300, -221, 108, -57, 40, 351, -98, 338, -222, -71, 150, -138, 48, -226, 54, 22, -365, -228, 197, -419, -18, -316, 126, -101, 416, 122, 31, -49, -337, 54, 27, -143, -331, 78, 131, -170, -9, -71, 86, 131, 11, 639, 273, -228, -15, 80, 55, -355, 41, 224, -191, -154, -56, -224, -97, -105, 304, -98, 375, -76, 526, -425, -216, 217, -205, -282, -789, 27, -389, 382, -253, 204]
4782B04l4j60j22N94o8m09l24K82k70P9mPO03j57k68J45j43l34P37l71j71Q5k52
4805c51L10N8r1K50J8j11j87j93L80j73j76J16J49K78l88K21k21K93j35K00n28
4826b81L42k13K41R5q4L18m78J94m3j11J99k51O1j34L15r9N59m15j36J40k00k8
4848iL2k33Q1J02K42J69j89M75q05K08R2l43J20k35N16k22K25j9m98K12j37M8
4870a68L98l47l9K44l55L50P2o3j22J14O7Q4k83LO1o5J13J32k72j19L30j9j38
4893b2k8j00N40n04R2R1J00k11K31j01j37k54K26L2pL7j25o7j28L60o2k02N69
4916C30j18l08m6M45p99K25L19n6m18M06K08j94K61m76K24J23K46j83K3P6j09
4937A79K23o77P72k13n20O64k11N0n99L34k9L71o04J49j48M14n5j9l5j27L08l6
$$ y = [204, 170, 10, -112, 482, 414, 5, -319, -37, -307, -228, -232, -225, 378, 221, -47, 98, -45, -379, 358, -13, -184, -99, -351, -41, 17, -74, 176, 194, 83, -104, -297, 83, -90, -266, -150, -1, 277, -111, 110, -111, 182, 47, 247, -281, 61, -152, 89, 184, 100, 418, -60, 134, 91, -20, 179, -72, -11, -145, 170, 71, 630, 215, 79, 219, 19, -9, 23, -210, -129, -27, 215, 384, 195, 670, -135, 73, 165, -178, -58, -293, 223, 1, 226, 207, -291, -79, -216, -168, 230, -117, -156, 88, -267, 83, 155, 92, -30, 84, 151, 235, -48, -45, 16, -49, 64, 196, -76, -195, 135, 116, -22, -50, -150, 390, -114, -22, 69, 169, -42, 189, 88, -49, -303, -77, -45, -52, -15, -140, -207, -335, 25, -37, -239, 330, 212, -96, -142, 303, -496, -271, 48, -8, -426, -20, 188, -6, 255, -221, 3, 126, 372, 189, 212, 288, 179, 402, -275, 497, 284, -236, 428, 217, 267, -332, 2, -27, 344, -260, -111, -259, 155, 100, 81, 46, -81, 227, 191]
4959A91n28K20L68m67L94j68kK43l84P6q4J28R4Km7K10j5n11K01J59L6j89Q6R9
4983A12n02L74j23J92L7k62l5N9L89l88p3J71J22j56m3m2J42J10K8j32rK81k74
5006b2n3J14j74N0m8J4rK07M5n78J53N90n3k22k97L6J67K72l25p9Q0j7K58p0K96
5031C35l83k79j04M33j35qN06q6N0k42k92L05K95l01j6m5JJ46j80J98m2m2n3J81
5055B42r7L68n47l17j83M06L06j99L63k93K04m31l8M73j77k32J31r9q8K50K9j47
5077g6J16n8N7J87m98J65j17K44k78R4M42N7k38m63L54K37j74O0jk89J48j5j72
5100b18m8j3K41O6j9JQ5J45k62j79N28j88k61L4r5J61P0K56j47j30l7k00M12K9
5124B31k48J25j6l9k49L3M19j22l85M75l10j64OQ2L58n30P05p82N91K2k53M11
$$ y = [191, -337, -117, 251, -216, 178, 10, 8, 251, -133, -57, -141, -13, 81, 83, 36, 246, 231, -280, -79, 80, 116, -73, 13, 112, -390, -16, -139, 53, 90, -172, -207, -148, 241, -147, -220, -49, 73, -83, -126, -168, -26, 84, 112, -20, -29, 252, -22, -75, 39, -135, -85, -133, -119, -128, 79, 124, -454, -301, 289, 236, 14, -283, -247, -80, 192, -133, -212, -132, -149, 109, 39, 335, -48, -327, -431, 2, -133, -141, 365, 279, 329, 87, -205, 100, 395, 94, 78, 33, 34, 180, 0, 198, 156, 114, 61, 242, 145, 513, -34, -351, -534, -128, 178, -21, 342, 49, 253, -178, -216, 257, 80, -152, -21, -120, -208, 42, 71, -76, 40, -18, 39, 226, -272, -107, -224, 20, -258, -164, 278, 335, 97, -366, -12, 225, 51, 111, 110, -179, -31, -46, -218, -266, -279, -38, 28, 9, 10, 95, 240, -22, -201, 327, 139, -122, -88, -183, -22, 48, 304, 157, 27, -10, -210, 202, 231, -17, 108, 92, 53, -196, -163, 256, 134, -251, 224, -86, -250, -244, -162, 196, -334, 371, -411, 180, 202, -51, 360]
5146C60m17lJ47j19M00m17r2R3N2n6pR2j70K93j97Jk02O2j1L71j49j79K79k79
5170a48J42J00j86j18m5o06P12K21l96N60j14l4k49J16K29l04J29K79j76L83n52
5191e7J21k59k8J63j50J02K02m27O70l40J57p25R07K65r76M87k68J53K33k57J59
5212A32r2r9p3j06K38Q5L63n95J91Nr0O3J8n18O91n71J80Q1J72j48j25J52n2L
5236i5K52j87P1n90N71k39L77k12j17M79n13K75N0k31j55O18j03l08k66j1L87
5257E3o0k15L08l10M12l07K3M37m57q2M8j08K42j0K67k18Lk21k2k83N33k5p3M43
5281C78m80K14K9q1O5J79l36k3k17R8K41P7l51O28q3J07m18m6k37l0N71Pn39N25
5305B78n60M32n26N23o4j35j29M22l97K26l62L23J11l51L30j95M02k23j48l6k06
$$ y = [360, -57, -60, 87, -32, 368, -49, -141, -48, 4, -52, -59, 33, -137, 156, -41, -40, -242, -180, -191, 180, 31, -148, 131, -148, -6, 94, -92, -210, -255, -861, -149, 72, -324, 236, 122, 88, -161, -45, 184, -120, 9, 288, 112, 495, -57, 64, -195, -223, -60, -210, -108, 94, -333, 337, -3, 154, -571, 336, 601, -375, 112, -156, -3, 230, -27, 132, 40, -59, -132, -238, 0, 85, 448, -147, 44, 49, -41, 22, 40, -478, 213, -358, -178, -97, 75, -73, -198, -46, -98, -95, 157, -30, 41, -549, 22, -217, 160, -52, -169, 310, -203, 72, 122, -109, -264, 354, 251, -57, -323, -334, 53, -7, -222, 86, -224, 188, -119, -96, 341, -116, -198, -150, -258, -16, -26, 241, 23, 26, -195, -217, -500, 33, 8, -65, 378, -102, 112, 141, 60, 125, 304, -32, -55, -272, -174, 67, 144, -207, 421, 338, 445, 27, -19, -256, -286, 285, 292, -247, 278, -282, 150, -376, 147, 83, -52, -181, 241, -156, 70, -292, 31, 142, -209, 121, -74, 328, 105, -43, -79, -285]
5326b85N07l81J12j24k80L08j64N14l56J67lL17m68k60K45K64k0k9l50L89j25
5347b2o6J66M6j1k38M1K07r2n0r5K37J08k00O6K5k70M21l35l5J95j99K46k50p9
5371a84Q7J93m29N52m50N04m36j61L93K10j92k76J28L2q9J69j13p9M92l64L0l4
5393a7K36l0J67k31j80p9M8K10j23L69k45n08O45o30P28m54J00o6j43K28M59m43
5415D1J39k39j7j8l27N86l89J93J04L2m4Q2k22J12M6j72qM10m29L22l82L31L00
5438D51n03K98j12j28O8K30j34J43j8m36J16p4K12k70o1N7K89l53M49k81L88k93
5460C8NJ8Q3l44N23m99j66N68j70K7l1K22q0L9n76M16n8K67k02N9lpk81K71k17
5485i8K34l61K11j48j11K75l8k64K14K34j49J22j8j76k04K07K59j78J98K28o68
$$ y = [-285, 222, -159, -47, -171, -451, -143, -307, 207, -149, 18, 15, 332, -136, -396, -151, 113, 93, 64, -286, 103, -22, -88, 78, 124, 113, -125, -84, 123, 31, -19, -114, 123, 231, 31, 97, 122, -148, 273, -62, -97, 98, -101, 145, -105, -184, -97, 96, -333, 219, -231, 273, -163, -324, 69, 279, 87, -189, -61, -29, -118, 51, -62, -141, 351, -13, 17, -17, 219, 189, 356, 125, -55, -134, -86, 124, 1, 370, 125, -383, 262, -368, 360, -94, 6, -60, -203, 25, 484, 41, 180, -59, -76, -94, -421, 165, -224, -31, 73, 105, 61, 143, -79, 33, 79, -93, -101, 309, -120, 202, -180, 151, 451, -52, 246, 134, 6, 74, 304, 170, 313, 295, -141, -25, -99, 113, -157, -218, -161, 128, -225, 224, -57, 331, 38, 43, 61, 144, -200, 323, -176, -342, 226, 56, 83, 52, 274, 194, 233, -343, 73, 15, 282, 80, 139, 136, 129, -152, 119, -98, 136, -225, -14, -162, -273, 2, -36, -300, -86, 148, -1, 121, 103, -73, -277, -70, 189, 11, 209, 437, -231]
5506b31M30k46k61K02K25k67J35Q4K7R3n09K26k4N5Q8K6k75J83j95K74r9l8M2
5529e5l54N38k13J03J88R6m72J19k63L54rk78N45o8l32O8km5J98K9j6r7k20J34
5553e2k9Q6Q2j73J30Jj38k03L62j26J77J93k24k52K16j02O7J31M6Ll30j74N12
5576B03j92Rl74N84l53K40J16L9j90o4J28J98m1j33j43K54j6j15k98J52k22J9
5598a99L87m54L27M11j36J38p43L74k79k8L6p1P6j71J70J83k11k20J0O29p5n8
5620I6l09r4L43P9M1k86k50K15J95k53L85k44K42m46K85k33j23N00P2k5j1p3k85
5643a79L68p1k31N8J57k78L43J7l05L02j79L3q3R2l6j39L27p2j89J14J00K7k70
5666i4J63K49j63k26L18l88K85O1o47K40K26n9j47L09j48p4m34N41J6j51J78J61
$$ y = [-231, 199, -47, -308, -106, 119, -148, -13, 71, 98, 191, -318, -92, -116, -61, 27, 53, -222, -39, -234, 40, -59, -97, -55, -409, 129, -84, 19, 207, 303, -169, -50, -313, 41, 32, -246, 299, 231, -101, -33, -35, -80, 118, 147, 131, 34, -186, -52, -81, 5, 87, -86, 44, 45, -93, -296, 66, -60, 117, 310, 86, -166, 50, -52, 15, 146, 192, 195, -135, -309, 203, 11, 20, -354, 230, -123, 117, 233, 272, 82, 18, 146, 344, 303, 170, 27, 281, 265, 150, -148, 4, -218, -199, 188, -266, 61, 472, 336, 474, -269, 105, -174, -202, -166, -237, -161, -332, -162, 21, -190, -410, -400, 229, 154, 96, -213, -307, 36, 115, 156, -130, -380, -165, 30, -223, 162, -82, 160, -286, -1, -234, -357, 143, 215, 190, 179, 106, -179, 189, 118, -113, -55, 102, -176, 167, 184, -121, 181, 2, 35, -48, 44, 8, -131, 196, 124, -65, 49, 149, 176, -94, 69, 318, 155, -71, 247, -141, 144, 205, -442, -202, 24, -35, -182, 127, -21, -95, -529, 12, 28, -123, 55, 216]
5688B16j78J97l68J07l5L06J16K21n93k2J54J04q33O26N6J34j0K65k05m22J39
5709b5J14O2M3o0J43j71J64k61J91j26k8k54J18k12M40j63OJ53j62J22j09l26
5731c41O81k18p1j35j05M81l86K53O4l35l8K80j9L37j69P2k54m89j55M96j17K37
5753F9Q5k33J58J94k5k21L30m90N89k05qL5j19n3n4qkK30j40j8rl05O3K98j38
5778B3j57M8J03O2M1m3k3k04K05r6J62K9J78q3l95L37m26J58l26Q90k45j77o5
5801dK33P38p86j94N87J008j179n33o42M93k63k52R28l82k47L83k38O96m63K99
5821A82n48K58J13O2j16j11l2J19J3P6j60q8J25N5P6Q9J57k41m28n6O85m31k8
5844b29P02J6n47R2J13J99J23j80l66l84L48k08P39j306Q10k68M52N24o94R0L20
$$ y = [216, 38, 235, -133, -26, -61, 245, 361, 582, -11, -33, 121, 225, -608, 18, 74, 208, 198, 463, 258, -164, -25, 89, 151, 194, 134, 277, 106, 270, 9, 200, 74, 46, -208, -90, -302, 138, -25, -19, 134, -28, 94, -15, -341, 340, 122, 51, -84, -189, 292, -94, 159, 223, -112, -150, 130, 111, 448, 279, 351, 97, -392, -547, -51, -168, 69, 154, -79, 79, 273, 248, 27, 357, -133, 456, 251, 243, 278, 159, 106, 52, 44, 42, 272, 132, 114, 105, -200, -137, 161, 23, -134, -86, 17, 79, 120, 77, 54, -150, 55, -41, 121, 150, 328, 245, -150, 187, -239, -81, -407, 483, 238, 61, -4, 229, 967, 181, -13, 574, 1582, 403, -130, -772, -279, -542, -794, 134, -248, -495, -112, -350, 346, -117, 182, -366, -108, 5, 67, -49, -160, -192, -73, -60, 16, -144, -232, -107, -52, 24, 113, 270, 29, -399, -455, 230, -201, -229, 473, 489, -58, 34, 147, 346, 469, 289, -77, -461, -113, -321, 418, -888, -78, -346, 106, 630, -64, 26, 346]
5865C46lj93M6k10m80K21N24n21M13l40L06j45L14m22M80m03L04l52Ln9M01m2
5887A88j35k06j66O18M4o57K83K81j8j46J47p03M03K53K74k75m60K53K11k40K52
5908B01l94R1n1K42r9k71O56l23L5k0r5k13L02Q5r1j99K61L2j55J14o30O57j98
5931f3O1j68K19j52K32l3j35N9L33m41L49K97J28j035j53M62m69P43j45m90O99
5952B98m35L23N19m90J0p19K46K2K22k62J91L12o44K68M43m38K53n9L37q1m66
5973a50r4L81K5j58Q9r1l09O01k82J97l72l5M8K35O2j95l9J34N4l80O09n21K91
5996A00n4k91R9p1M94j96k6J2n13L98L1l18O8K56j24L35p2o6j55R1r2K8j23L68
6020A79k18J41k52j9L47l01N71m63n15L11K44J09m56K97J1k66L26Q4J46K02l34
$$ y = [346, 343, 150, 196, -14, -494, -273, 251, -270, 143, -197, 109, -36, 278, -144, 336, -67, 237, -115, -112, -171, 230, 188, 53, -153, -319, 299, 343, -314, -31, 250, 232, 86, 233, -470, -67, 186, 460, 185, -275, -22, 189, -51, 201, -193, -102, -153, 89, -10, -281, 375, 52, 87, 67, -28, -241, 61, 146, 55, -144, 117, 149, -6, 108, -522, 135, -63, -2, -170, 49, -103, 129, 96, -39, 20, 353, -88, 261, 558, 686, -349, -502, -40, -509, 234, 89, -401, 298, -137, 186, 705, 215, 225, -494, -248, -226, -4, -266, -75, 237, -407, -139, 304, -134, 119, 60, 397, 316, -150, -244, 137, 162, 4, 93, 2, -307, 294, 12, 209, -163, -198, -150, 85, 147, -48, -87, 47, 101, -279, 330, -191, 100, 46, -245, -146, -217, 277, 81, 55, 67, -446, -48, -17, -335, -267, -11, -135, 200, 128, 62, -93, -2, -94, -66, -189, 179, -39, 102, -150, -169, 178, -123, 448, -15, -530, -219, 25, 134, -322, -25, -14, -280, 46, 130, 276, 478, 144]
6041A44k70M79m57K96L6J00l59J62N0K6k58Q3L67k64j09K4p8j1J37l02K43l82
6063c43J63K14j45L38m44J80J82q3jm32K01J88j57%K1N7J78J77n91J95P1R2j68
6086a07p1K08J9M6m84L87k80J71O21l32k23J43k31O69p30N04l87K16j33K31j33
6107A04n4J5l8m98O11J3K36n25K69l44J76O5OL4jn8j37j55n4Q2O7O8o6P1J61l
6133D5n6L5J70m28j68L90j96K49L83n88j27K70l5j46J0J55L17j11l05L21k72J05
6155A8pj66L17k2k27k1J48j19L15l42Q8l6j8k54L00j89J30R1K35k58K80k49L82
6178C96j47l44p9J45N2l24P04l66jn2K03j48o4j94P9kK14o3j36K11m4Q7P1m19
6202b21L82k27l28L37k80M60j08P7j50J41o6n23N17Kn3J01j50j6J90K38l70K50
$$ y = [144, -126, 353, -104, 192, 228, 328, -31, 131, 181, 207, -51, 32, 399, 135, 26, 50, -28, -39, 98, -204, 39, -343, -180, 34, -111, 227, -217, -37, 145, 62, 61, -371, -170, 18, -139, -139, -118, -61, 117, 294, -297, -102, -31, 61, -107, -178, 30, 49, 95, -389, -2, -282, -111, 510, 178, -45, 98, -133, 536, -194, 310, -77, 139, 6, 237, 104, 50, 65, 27, -471, 140, 153, 389, -136, 133, -211, -35, 30, 36, 70, 69, 11, -126, -281, -335, -253, -186, -118, -184, -113, 48, 45, -11, 24, 194, -234, -402, -12, -208, 41, 424, -164, -291, -21, -56, -202, -192, -37, 280, 169, -136, 185, -87, 18, 11, -155, 162, 140, -87, -108, 40, -79, 236, -106, -18, -54, -72, -326, -26, -215, -85, 6, 241, -17, 263, 14, 396, 249, -95, -174, -29, 23, -301, 403, 37, 36, -16, 187, 39, -25, -219, -140, -142, 72, 9, -127, 84, 40, 127, 198, -221, 161, -66, -394, -57, -337, 123, 15, 92, -58, 83, 17, -506, 11, 13, -40, 61, -89, -105, 85, 323, -47, 203]
6224B03J20ko39N85n67N45l76K18k23K16O8Q8j94K06k88J20k67O5K10O4M8Q8j55
6247A33l26L57k6k45K29l65O0N20n07O0k5l5m8J16J09J41k56K94l00N37n41N6
6269f2K97j14j80K13k84K20m8M5J66m35O6L95j69l25L68m6l13K08j04j21M1R7
6291h5j73L42N3l93K10J16j77m1M3j67L26j07J30O4K7m55L84r4l50M29J62n85
6313c41K4N22j55J5l9J16J37l37j07K65n1j51p8j0p4J92l06K89J47m01M13R0j36
6336B4J23K35k93k26r6N55Km42k1L3J07k40J44L61k75k92K68ko3k1R4j26j77M33
6360A05l13M23M1m76J16j11M16j25J3j75L0l7m6O3K1K59l86K78k3p5j22K71k23
6383g6K75n4M1m16K07JP2j31K01o4o2N6l34L72j96K26j11K13o9j16j42J87k08
$$ y = [203, 323, 321, -318, 267, -300, 245, -131, 87, -136, 80, 148, 236, 42, 248, -40, 80, -187, -122, 88, 152, 200, 288, 133, -193, 164, 138, -107, 122, -243, -183, 337, -170, -110, -135, -170, -218, -102, 7, 148, -108, 186, -114, 423, -118, -62, 235, 121, -59, 154, -130, 90, 42, 87, 253, -182, -116, 279, 110, -215, 153, 107, -206, 2, -102, -223, -182, -85, -258, 84, 137, -256, -46, 70, -107, -148, -105, -272, 54, -53, 77, 141, 168, -287, 97, 3, -347, 82, 244, -341, -317, 205, 50, 65, 26, 142, 279, -58, -165, 100, 49, -102, -180, -190, -264, -72, -378, -89, 58, -343, 70, 160, 24, 147, 382, 89, -137, -233, 322, 324, -118, -139, -106, 1, -239, -95, 266, -9, -301, -33, -35, -98, -119, -25, -151, -328, 105, -208, 215, 256, -220, -104, -215, 201, 76, 89, -86, -56, -93, -139, -76, -55, 204, -182, 96, 73, -2, -124, 147, -76, 199, 145, 186, -230, -23, -22, 50, -81, 120, 56, -6, 50, -284, 88, -108, 118, 7, 220, 151, 35, -107, 80, -128]
6406a28k61L51K56k17J40m6K43j23m23L91l16l2rL15l7k67L69m39N11m76L22o7
6428E7j86K50k12J28QJ38k24J58k9q0J48k99L10M5m13k5L94p09L62j96L73j89
6450a91L17l2j94j05k31N26J46l52J56j76N26k70K11o82M20J59o21L05K39j64
6470a3j58L09k65K81l04M73l23j42j99M89r5K29k93K04J94m09J63j03j95L06N2
6491B01m58L21L0m24K01P1J48j96J73l03J08N53n46K87J61k46j57m7R8j09K23
6512H9j49j27K44j05p4J38K39k66K40n2k59K46o3k56L64j36Q3j77k01J76K71m85
6534b60j71K48Q4J15O0m54R5L21j0L2k32L56k47K04m22L18k32K03M8j85J92Q0
6556A43r7o5q7N11k73j96J03N5J05k81J96j50J78j82k9M6j31J95J7r3J57l83L92
$$ y = [-128, -389, -38, 218, 1, 141, 95, 338, 215, -208, 183, -133, -165, -174, 141, 104, -163, 206, -233, 278, -198, 124, 57, -129, 121, -91, 37, 45, 183, -41, 117, 88, 8, 156, -143, 167, 212, -201, -226, 168, -541, -179, -375, -2, -191, 126, 94, -100, -205, -436, 90, 236, -116, 40, -136, 390, 120, 331, -351, 69, 228, -393, -88, 151, -13, -171, 138, -127, 154, -150, 323, 0, -142, -341, 148, 53, 282, -11, 193, 387, -22, 141, 38, -157, 149, 201, -257, 64, 94, -330, -129, -58, 90, -106, 67, -236, -128, 425, -121, 166, 327, 81, -76, -123, -25, -134, 89, -60, -187, 57, -48, -122, 16, 255, -11, 229, 177, -82, 164, 101, -155, 209, 73, 156, -21, -222, -46, 225, -260, -431, -183, -99, 16, 76, -378, -283, 38, 28, 60, -172, 184, -63, 141, -281, 37, -195, 8, 56, -129, 63, 143, 46, -19, -106, 405, 132, -64, 39, 94, 199, -82, 114, -36, 142, -40, -69, -23, -154, 41, 58, -35, 122, -261, 131]
6579A31j33j05o0M23m3j6J0l95P6L01N3k22j51M78m16k76L28k8K96J72n76n6J77
6602c2or9r3N67k65l56O36p86M99k47K60N9k81R3K19k10J97m79M45p2l52M26n2
6625G1o9k30L58j20P9L4R9J76n83L49R0J26l78j73J65J97m26K98m8J11j09M64
6647D81l25J98p27L94j23l2n2K27j2k24L18j73J59O2K51m53p4n1L26k65k5kK92
6670A70j35j36O2Lr5J94K25k08j45O8j50P2NQ6j94K51L3j57L2L25o22N60m99M47
6694A92j00J81k03K95m25K71n08L46JL51o28K30k08K44o3j13K95n8q3j88L81j46
6716F4j13L15l53M5M4k67J13J76J89l97q1N06l78L67k00J45L5l43K45l37M12P6
6738B63k5l09l09K88J03J52r2O7J13k03L7N92m18j1k34l81O84N9n70P6M53j53
$$ y = [131, -2, -107, -167, 256, 213, 197, 207, -188, -112, 189, 242, 20, -131, 347, -69, -345, -17, -45, 251, 423, -153, -209, -32, -38, -137, -230, 337, 72, -284, 352, -434, 65, -182, 78, 137, -144, -51, 168, -42, 155, -324, 121, 49, -303, 123, 71, 2, -228, 130, 10, 89, 123, 222, 398, -185, 164, 254, 380, 2, -171, -6, 191, -235, 63, 15, 126, 17, 481, 156, 354, -373, 21, -102, -134, -186, 41, 29, -195, 123, -50, 109, 171, 422, -31, -105, -156, 170, -95, -120, -122, 170, 35, -101, -39, -36, -131, 63, 288, 80, -65, 3, -147, -75, -70, 16, -178, 73, 106, -51, -19, 306, -316, 244, -255, 192, 92, 273, 70, 365, -60, 211, -297, 49, 50, 401, -227, 3, -205, 39, -24, -137, 158, 100, 17, -171, 210, 64, -49, 266, -87, -42, 2, -265, -152, 24, 213, -184, -265, 241, -137, 230, 30, 175, 210, -133, 112, -225, 187, 263, 238, -71, -380, -92, 11, 163, 71, 138, 251, 48, 85, 677, 259, 248, 14, -367, 317, 376, -194, -118, 335, 182]
6760A82k6k99L61k80J47J5k49p4J55j28K37O3j00J09M95m53J7q7J31j29m01M16
6782A02k39l3K58JK67n23K08J73m58L75l65L21j30n0m35M85k3m51M68J5n1M30
6804C45l82j83L07j30J52l06K52p1J95n9l01M35K28o97j26J07L60Kj29k30nK92
6826E6j11Q9q7O49p68Q7K83k79J23J06q7k69L29O0k24j04L11j72j41M17m00J60
6848B8Q6J11j2l57K47M4j48R9k48M40l81M52l75j3L3l6l25N00oj66J02jn6K48
6872B66l41j69K39k03L73K53m77L19j60m58M69oj64lJ28m91M15Q1J99l25J42J41
6894B28j30l36N41k14p5J58k39m4J9L0k48L34p0L06l12j52K69L67l45j57j3L1
6916e2l11O05k8l47l04L33M5n3j85K58J14J17m17R0M02j76J4L08l82j49l2p2J53
$$ y = [182, 156, -143, 218, -62, 85, 100, -149, -223, -68, -196, 41, 104, 4, 113, 608, 155, 172, 85, 216, 87, -314, 102, -137, -170, 88, 89, 356, -167, 41, 214, -244, 131, -234, 87, -43, -93, -528, -43, -66, -517, -49, -34, -85, 345, -37, -220, 87, -43, 109, -197, 55, -16, 179, 120, -181, 254, 482, -215, -341, -234, 126, 128, -1, -231, -236, 56, -55, 34, -53, 596, -172, -85, 198, -81, 42, 148, 61, -208, 121, 181, -43, -147, 164, -8, -149, 268, -132, 28, 114, 225, 213, -144, 103, 147, -1, 98, -150, 290, -91, 361, -14, -27, 6, -30, -355, 145, 139, -27, 75, 74, 18, 266, -75, -244, -5, -208, 165, 418, -59, 260, 100, -358, 111, 105, -59, -62, 66, -425, -10, 71, 270, -55, 87, 228, 98, -238, 303, 89, 14, 172, -67, -111, -92, -62, -310, 24, -46, 260, -52, -204, 65, 432, 87, -70, -83, -52, -363, 242, 214, -133, -437, -104, -59, -112, -297, -39, 75, 192, -225, -135, 267, 91, 105, 413, 31, -118, -150, -222, -69]
6939f9M7j00L75%l10j27K66l21M14j89j9m3K73k94N4J33m94L63k34P1k4R4M23
6962B89m27L81m11j85L32N5J33j94l16J72J49j41M2l70K72O4K8j06J49K26j80
6983c8L6Q6K71o5p39N46n23K31J93k32N4L2J80j71J88p9l0J48J26l74K67n8M57
7006E06o06J16j33L00l04j70M44k85j17N1m4M02l3k90J86J89l65N08m29q3R9J66
7028A08l01J6M60n9k05O4j75j96J76K6j88M88k91L0M67r5m64L29l12R9M2q1J63
7051A01K11r1o9q7j77K58k66M22j91K15m60J46j25j78J33N5L86N8L3l77K71l85
7073a17R6n4j00o6O98j76j49j74K23q5K44k46p6O5j46R4j0K04l81L20n91K92K27
7096I2l83m6M49j84J80O9Ok67j6J21M46n79N55n64p5J72j8J80l62K71j26j07N00
$$ y = [-69, -22, -122, 253, 253, -57, -184, 82, -239, 175, -14, -33, -76, 197, -97, -43, 90, -404, -41, -275, -204, -228, -134, 289, -138, 243, -168, -353, -21, 34, 167, -27, -343, -171, -22, -163, -121, -491, -219, -155, -127, -233, -84, 142, -38, -2, 84, 355, 290, -449, 97, -426, -195, -2, -234, -180, -148, 32, -139, 49, -30, -60, 88, 214, -160, 107, 49, 506, -100, 16, -117, 183, -121, -291, 153, -132, -249, -198, -242, 160, 127, -163, 23, 212, -153, 355, -74, -157, -58, 108, -193, -177, 283, 224, 19, 83, -92, -288, -112, -86, -274, 214, -77, -47, 420, 325, -139, 190, -122, -23, 19, -62, 101, 312, 221, 152, 65, -112, 146, -120, 302, 111, 326, -134, 12, -113, -291, -158, -103, 283, 341, 374, -3, 268, -117, -21, -75, -175, -241, 457, 281, 132, -42, 181, 96, 340, 94, 18, 83, -63, 31, 21, 225, -156, 164, -427, -135, 92, -291, -337, 112, -72, 108, 177, 183, -84, -100, 21, 467, -112, 443, -121, -196, -24, -42, 138, -224, 47, -79, -186, 314]
7119C14o37J14L59k32o1K7M8K17k70q3n3K55J98l21L35n55M79l08r6P0L30K83
7141D13l60on5p8J61J2l2n8m24O44k29p0J70Q8k33o0n3K21j67k75N52r1k35J78
7165A3K77l01LL12m12L55k65k45K37O9k8L02m69L34l39L68j92K57k92p6L75k64
7187A9J69k75K14J3J07n53L62r2L1O13m40j4m05K52R1j30J43q8K55k05Q9l46N85
7210C95n92L51k10j04k23N6O57l63j48J84K78j88j08k80K92K5n15J48O09n14J87
7231f3J74l63J9L17J92M8o00M50%k67J10j68J80R9m58K09K33k07o1P8Jj3M22R3
7255D25m50M08n01P6k68K24K27Pj28k07J40Q7j40P7j22K24J49k43k85N70l73M24
7277C21o39K24k7M64n73n6M77j73m6K29o4k81J31j03K16l42K99J14k60O1k70K81
$$ y = [314, -323, -209, 150, -82, -143, -116, -68, 149, -121, -204, -257, -2, 196, -125, 210, -345, 134, -174, -270, -200, 130, 413, 53, 47, -8, -86, 75, 87, 55, -3, -427, 217, -12, -82, 88, 176, -57, -117, -170, 51, -116, -391, 161, 70, -165, 13, 290, -11, -8, 304, -108, 247, -18, -263, -26, 43, 15, 317, -152, 182, -157, 211, 19, 276, -16, -92, 283, 19, 188, -87, 127, 140, 247, -306, 56, -36, -5, 608, 168, 154, -251, 1, 92, -38, 105, 17, 272, 67, 156, -190, 395, -197, 154, -56, -160, -383, -327, 330, -33, -181, 3, 281, 93, -15, -295, -3, 22, -493, -345, 264, -250, -63, 111, -252, -233, 84, 276, 324, -276, 174, 174, -93, 17, -151, 29, 128, -330, -121, 112, -95, -156, -78, -77, -90, 332, 425, -25, 383, -118, -42, -310, -86, 141, 148, 20, -187, -47, 40, -100, -23, -145, 79, 228, -15, -300, 270, -103, 321, -318, -94, -121, 343, -230, -286, 191, 18, -28, 201, 137, -144, -13, -116, 100, -242, 57, 171, -89, -28, -298, -17]
7299a7K27j44k55K04l72M69k12M73l95j65P9K58j03J05J0%L56n27j67N64p54M40
7321G4j87Q1J69l16L5J07J54J42j87P8J50l44K11Kj8n27L03L60l70J64l85K22
7343h2O2j99M1J48p5J44L6l50K76L14k81J5mj47o1J85k82K90j74J09K23m2j84
7366c8q4R7J32j77k01K8m5N07k85J5J1J44j31O2J8J63J80m51l32J54K7K30L78
7389D02l72l44L31j88L37k94L92o5j51P2l43R0P9N63q15KK66m5P4M5J3j96r1L44
7413A06k76jM6j00K4J20L7J42L6k37r8j0K32k02K29o8j52J32k3j92O42l55J38
7436A70L7q0j87M09l17k81L55J07p8k4R0j06n5n7J77j11k19K11q7J24M2k33j41
7459b54k5N74l63J57m4m6J47k56P1q3J45m6n2j00K45q5J19l38J61m44P27j28j46
$$ y = [-17, 210, 66, -189, 15, -357, 112, -100, 373, -22, -187, -108, 150, 47, 152, 162, 162, 518, -9, -176, 388, -366, 74, -113, -32, 137, -179, -144, -37, 117, 259, 72, 150, 300, -44, 167, 169, 151, -376, -73, 287, -83, 81, -304, -82, -20, -219, -178, -30, -105, 39, 75, -275, 1, 315, 34, 49, 45, -102, -163, 22, -260, 30, -144, -35, 188, 146, -38, -122, -25, 107, -70, -271, -243, -288, 219, -66, -51, -40, 104, -27, 35, 53, 216, 396, -55, -387, -233, -206, 24, 402, 30, -314, 17, -171, 166, -128, 264, 199, 48, 120, -223, -133, -54, 509, -306, -304, -38, -83, -9, 36, 49, -147, -238, 106, -170, -171, -125, -225, -201, -81, -44, 98, 134, -103, -201, -211, 21, -181, 48, -20, -172, -40, -63, -255, 387, 32, 170, 207, 127, -60, 349, 32, -249, 106, 213, 135, 111, 201, 95, 40, -17, 160, 49, -170, 41, -46, 78, 120, -113, -254, -279, 295, -68, 89, 45, -1, 146, -110, -39, -122, 23, -23, -75, -175, 70, -15, 104, -234, -73, -517, 210, 82, -64]
7482f4k3Q3J3pj35j68J43Q4L1K35j16K24l26K11J34m11J68k2J82j22j71NJ26m09
7506c35M11k06J13R6j95K7k19K24R5l7j18M12m68J94J28q2j23j28J55K30l94L39
7528A19n66K25K01l2P9j40K73j84K44K36l76L3j48J63j55Q5k14L68l50j87J32
7549a94L0l83M30j50N19J53n08L57l65j56K50k75l7N01K35m60K3P9M3j79K86m83
7571b84K40j96K77L4l1j13R9l31L77k16P1m13M42J40K85m64j41R5K75j36k70L83
7593A23m21L62l05M46k80K10k83L06r5K7m6M7l74J51O2m4K77l81L82q5j47L3N4
7616A9K79m13J50K1J36k51rm7r9L46m65Q35n81p3J22K66mL3k48K80l48o5jK96
7640A79j67j95K72k84R2J2l2J26P4j34pJ85j72K32k03m8o9J99L82m01k0n5O5R3
$$ y = [-64, -87, -4, 9, 2, -133, -301, -158, -74, -43, 192, 76, 300, -26, 185, 319, -92, 76, 54, 236, 114, -57, -52, 74, -335, 76, -130, -17, 79, -116, -89, -308, -84, 11, -26, -144, 268, -200, -6, 122, 40, -83, -211, -56, 174, -220, 119, -447, -222, -21, -53, 26, -114, 159, -25, 219, 455, 79, 112, -36, 127, -28, 57, -157, 211, -139, -326, -194, -164, -547, -117, -267, 252, 405, -103, 254, -111, -267, -17, -292, -329, 172, 407, -53, -30, 49, 92, -87, 199, -284, -44, -240, 37, 71, 40, -73, 26, -305, 72, -144, -73, -486, -44, 96, 381, -83, -224, -129, 146, 10, -260, 123, -298, 64, -241, 205, -75, 135, -148, 158, 63, 90, 44, 91, -283, -132, -70, -114, 163, -218, 164, 79, -68, -35, 19, 298, -115, 35, 56, 192, -59, -68, -115, -214, 132, -333, 502, -79, -152, -30, 236, 232, 265, 17, 297, -51, -116, -117, 179, 12, -183, 89, -195, -103, -91, -123, 3, 77, -57, -64, 121, -51, 181, -22, -70, -139, 60, 442, 41, 21, -34, 31, 124]
7664A24k27J39J14l03L27l6n4k59K62R5q9k04j51M26l74O07m13o5M26m20j10K73
7686H8k92K46J93j18l98P0K40j71j74J12M0j33M55j69K11k7p3j54J00k16Nm1J45
7709f1J6n2j73L2J97k10L06j53r4O4L14j66j40m0L68P1j16k28K65j33J03l05K77
7732A42q1j09J58j58M6k94Q17o66q4P65p44M16m32M13k64q3J08j04M26k36r9J01
7754C8j29R9m9J75l06j50K21L11k14j36J70j66r9J91l23P73k85j76L90l63Pj09
7776a30L39l48NK71l64M39j50k14K59J56l37Q9m2M64o54J68J13l62J69M20j12
7797A79J31l9j35k18m9L84k68J60j76j97L90J1j28l06L09m7J93m27J76N10n50
7818i7K13O0J32m62l4K02JP5j26k10K61j47K0k2L7j49J73J79Q4m51N06l88Q3j51
$$ y = [124, -103, 36, 150, -153, 174, 138, 84, -175, 87, 182, 93, -111, -262, 164, -210, 397, -16, -81, 345, -75, -185, 88, -204, 42, 235, 117, -281, -211, 29, -142, -316, -204, -164, -297, 158, -11, 200, 173, 100, -54, 46, -170, -165, -206, -61, -45, -97, -270, -238, -41, -251, 55, -98, -192, -128, 186, 20, -120, -160, 208, 279, 163, -65, 200, 67, 170, -135, 142, 61, -48, 110, -48, -2, -296, 521, -145, -229, 536, -208, 208, -224, 189, -75, -158, -50, -154, 272, 36, -63, 38, -91, 8, -41, 134, -172, -322, -101, 210, -4, -140, 30, -136, -235, -44, -367, 406, 121, -55, 335, -28, -21, -130, 209, -139, -134, 137, -227, 212, 62, -152, 107, 263, -74, 15, -27, 437, -217, -49, 64, -298, -129, 291, 179, 310, 271, 136, -82, -131, 253, -15, 145, -31, -228, 162, 173, 45, -261, 48, 1, 194, -233, -57, 453, -97, 116, 176, 308, -154, -188, 14, 15, 90, -36, -246, 15, -132, -112, -134, -97, -246, -73, 106, 190, -261, 245, -143, -60, -211]
7842b11K64N4J66l83j54K72K51k39R6o04Q27l82k68J08lJ50Q9j17K58J14l69L54
7864B73m47M86o46O45m17J86J84j23k72R7j50P06l67L2k39J11N5j5j56Q7m14M68
7886H4k38J0L6o8M80k78j19K57lk24j91J49L36L0m62M01Q1l17J36k40p6K50J02
7909A36L2k92N10k90k92L28J2j21J69j09K2m2n7N7lJ04k23l8j70L09K03j71J42
7932B16J06m00L85p2J1l51p2J34L1l6lk08N30Q5k57r6K73l02j75K03j46K23k02
7955a23o2L11j11j59Q1L21o63J86J44J95j89J98n0j18J53r8J71q3m8j13j34M41
7977B50m15P5k45J52L99n71L06K10k09l05L44K45k65K49k78J98j03k74J73O8K02
7998B06k69j51K85o2N0P1q5J20l39L01j24qJ80k29j15J10J06k07O9L57k42l52
$$ y = [-211, 53, 107, 273, -110, -264, 8, 259, 20, 116, -488, 339, -43, -311, -203, -206, -56, 33, -84, 174, 288, -81, 273, -174, 312, -334, 311, -106, 80, 264, 141, -131, -34, -184, 522, 155, 187, -52, 59, 114, 99, -57, 30, -384, 84, -154, -144, -108, -176, 304, 26, -93, 164, 161, -63, -254, -105, 231, 261, -201, 200, 281, -36, 100, -140, -216, 34, 136, 168, -124, 386, 96, -196, 132, 144, 23, 192, 83, 105, 63, 6, 63, 60, 164, -59, -97, -267, 42, 245, 74, 216, 322, -78, 307, 235, 246, -105, -177, -43, -12, -48, -51, -259, 271, 356, 99, 3, 276, -26, -201, 2, -144, 79, -123, -185, 126, 15, -144, -63, 258, -405, -219, -75, 120, -69, 129, 79, -39, 114, 16, 187, 104, 56, -57, -191, 250, -165, -90, -335, -183, 216, -355, -49, 161, -48, -353, -9, 236, -29, 220, -58, 140, 37, -237, -64, 4, 206, -63, -214, 71, 9, 59, 130, 45, 165, -174, 127, 3, -5, 175, -54, -169, -59, 47, -160, -91, 266, 24, -328]
8020c28K29J00R1L8l61J05L7J4N11q40K71j53L07L6l30j80L77J63n6J73j09k76
8042a81K67J32j81j50J28j96L10J02L8j55l37M11l7pk04K04O9l95M8J29k3K92
8064B64m52mK1M97n08K80jk16j20m1O3J17J24q5p8N8J74j38L06l89L73l04n4m0
8088a53R8J37r3q4j67N21l71n5J13K87m09M71l52J73P5l51J16j66j1M73k32OK65
8111B91n20K15J73j21L14l99J95j93k44l0K12L02k19r0K09l1l06K22K37l43L9
8132h7j16N49k96J32l04P8M06p03N21j88N6K06k57k58R0K55p4j29j26J50J19j30
8154a06r5N9O5J14l44N3N24k63j47j38N44m00O6K71pm22j2L36j39j32j85J24L57
8177A23J9m08L38k3J53j19O5m47O68m14l02L09N7%
$$ y = [-328, -99, 1, 92, 130, -231, -126, -89, -75, 436, -404, -133, -286, 21, 57, -273, -453, -76, 87, 31, 204, 95, -181, 86, 218, 37, -113, 15, -181, 129, 231, 269, 114, -223, 188, 151, 144, -60, 144, 213, -182, -134, -5, -28, 264, -188, -192, -171, 326, -182, 98, 97, -119, -239, -280, -217, -100, 24, -61, -139, -81, 93, -45, 261, -128, 245, -59, -113, -153, -55, 82, -11, -95, -262, 259, -112, -167, -54, 233, -176, 295, -57, 116, 191, -160, -44, -210, -221, 252, 20, 26, 291, -229, -14, 159, 38, 352, -47, 148, -45, -289, -319, -107, 195, -24, -114, 95, 64, -242, -20, 217, -126, -87, -203, 346, 50, 182, -122, -44, 362, -341, 180, -8, 48, 254, -3, -261, -171, 84, 10, -119, -245, -95, 24, -106, -201, -142, -77, 37, -307, -254, 270, 7, -140, -278, 266, -134, -68, 203, 196, -226, -238, 98, -41, -173, -358, -234, 123, 142, -266, 72, 49, 202, 83, 148, -299, 369, -45, -347, -38, 19, 19]
8191A9
$$ Imaginary data points
##PAGE= N=2
##DATA TABLE= (X++(I..I)), XYDATA
0@%%%%%%%%%%%O4j28J28j28J92k56K56l20M41n05N76p04Q32r61J136j328J537
28H32j792K049k309K629l010L405l854M356m910N512o171O898p672Q523r467J0489
44E508j1605J2833j4169J5625j7222J8979k0906K3030k5387K7997l0918L4211
56A7976l7930M2186m7110N2872n9744O8096p8507R1905j09862J35357j74692K43840
68A44387m00669J393752J4929k356003J145854J033673r17523j208868R46669
77b03799P00478p23757n49144Q94824K82435r19845n05078Q51758O12465k67068
87A73269l11555K55707J43957j34908j44738N717J504J27227J18278j4727L729
98B23460J53567j77801n03492m5404N69381J03390o19511k06159N71439J51273
$$ y = [0, 0, 0, 0, 0, 0, 0, 0, 0, 0, 0, 0, 64, -64, 64, -64, 128, -128, 128, -192, 249, -256, 320, -384, 448, -513, 623, -705, 832, -960, 1089, -1220, 1409, -1601, 1804, -2050, 2306, -2604, 2908, -3263, 3635, -4037, 4486, -4981, 5508, -6097, 6736, -7433, 8192, -9030, 9949, -10957, 12073, -13314, 14683, -16235, 17976, -19954, 22232, -24878, 27994, -31750, 36346, -42161, 49744, -60118, 75239, -99453, 144387, -256282, 1137470, 1152399, -1203604, -57750, 975923, 58400, -1150468, -203799, 496679, -227078, -776222, 118602, 401037, -518808, -1023886, -172128, 440337, 173269, -138286, 117421, 261378, 126470, -18268, -12551, -11047, 116180, 234458, 219731, 223460, 377027, 199226, -304266, -349670, 219711, 323101, -296410, -502569, 68870, 220143]
108B20143o23735k43645N03687J80698l48850J23257O32560M0904n62845o2646
118a40472N08087O5742m67077j10382L59616R3012k74116p8572J25448j29922
128d8636k67685R2909L16323j6487l19847r0830K59357J92419j30054k27299Q756
139b31074K55480K02530n8896j47254K3959J06206k8648o8389O8912M3126j50019
150A5933j01470J44084R3784k03033k04242Q8452J45622n2340o2506J02147N0476
161A6907j28933l2950J98039J05298j84548j46502J74766K41096l6376j92057
171A4740m4829R7341M9734l2075m1718m5416m6385M532M8906M166p6021q3684
183a50709j344Q7627Q2844j4765p1626k590Q2988O2831j0230k8866j8584j5069
$$ y = [220143, -403592, -647237, -143550, 37148, -311702, -188445, 444115, 485019, -77826, -140472, 367615, 433357, -33720, -144102, 215514, 308526, 34410, -44162, 81286, -48636, -316321, -223412, 92911, 76424, -243423, -334253, -74896, 117523, -12531, -239830, -231074, 24406, 226936, 168040, 20786, 44745, 150951, 122303, 53914, 122826, 165952, 15933, -85537, 58547, 152331, -50702, -254944, -166492, -20870, -73210, -135716, -33569, 16907, -112026, -144976, 53063, 158361, -26187, -172689, 2077, 243173, 206797, 14740, -30089, 67252, 116986, 84911, 43193, -2223, -48608, -44076, 4830, 8996, -67025, -150709, -152053, -64426, 18418, 3653, -67973, -70563, 12425, 75256, 65026, 36160, 17576, 2507]
195B507K8529Q2639K0156j15087j07666N5657J24799j3798j35334n8698P9460
206c6836P2763k2039n0881j7513l660P971M0346L1285k7325l7915K0376N2118
218B8690K0091j0697j0185j3983r531K5936M5175n253p0381n6475K6460O9056
230C8903R748p7995p2837K7903R0454L3647o0901o7651J3034P3035M7825k1585
242C3580n1801j7457L6467M9715P579m2371m1959Q938M3352J8786k1855k7905
254d931j0038J291J2372K2350k112m4733l5009K8146N4226M558m9762l1511K5162
267b9991M8862J8064k2622l1222m620K6589L0510J054l0535k6793J0411L2864
279B2571J2597j9939k4927p530P034J3244J1111p668l1852k3735J8950M5991J1482
$$ y = [2507, 31036, 113675, 133831, 18744, -88922, -33265, 91534, 77736, -57598, -116296, -36836, 35927, 13888, -36993, -54506, -58166, -50195, -9849, 21436, -5889, -43804, -23428, 28690, 48781, 38084, 27899, 13916, 4385, 30321, 75496, 70243, -138, -56613, -30153, 38903, 48651, -29344, -102181, -74278, 16176, 49823, -11078, -78729, -65695, 7340, 55165, 33580, -18221, -35678, 789, 50504, 58083, 15712, -26247, -17309, 26043, 44829, 22974, -4931, -14969, -13678, -1306, 21044, 18932, -25801, -60810, -32664, 21562, 26120, -23642, -55153, -29991, 18871, 36935, 14313, -16909, -21529, 5060, 35570, 36624, 6089, -20704, -10293, 22571, 35168, 15229, -9698, -17228, -10194, 3050, 14161, 6493, -25359, -49094, -30144, 15847, 27329]
292B7329m4124m1746K5102O4876K1664m3094m4001J4317M8645K4297k5202m3099
304a5036j6532K7528L7509k103m1063k7975K0892L8363N620k8677k1763O275J3554
317c408K454k217k997j0260j1907R981L0348J4979j8828k1904J1593L3597J5458
330D6889j9509k9485q804J5455J4850n464k6384k2666N470K8347J7272j7071k6146
343b7246K872K8953J6781j0211j8855o947N244J1055J0771P03j6008j4579J3443
356d024L2933J2143k4851k8053P788K8297N762k7306k9591m231J5709J3268n793
369g949j7905q881J6147K6725J0087j2018j2254R461J8040L105j1679q917J3j967
383B008m770L663Q116n341j6326l677J7260J5109q495k2694p508J3277J5419k816
$$ y = [27329, -16795, -58541, -33439, 31437, 53101, 10007, -33994, -19677, 28968, 53265, 28063, -15036, -31568, -4040, 33469, 31366, -9697, -37672, -16780, 21583, 27203, -1474, -23237, -16962, -3408, -954, -3171, -6168, -16428, -28335, -18354, 11994, 26973, 8145, -13759, -2166, 31431, 46889, 27380, -2105, -10909, 4546, 19396, 13932, -12452, -35118, -29648, -1301, 15971, -1100, -27246, -24374, 4579, 21360, 11149, -7706, -14653, -9409, 1646, 12417, 13120, -2888, -17467, -4024, 28909, 41052, 16201, -11852, -4064, 24233, 29995, 2689, -26902, -31133, -15424, -2156, -7949, -25854, -34735, -18588, 8137, 18224, 6206, -6048, 3413, 21453, 24558, 12879, 3962, 3975, 2008, -2762, 901, 9017, 3676, -12650, -16327, 933, 16042, 7547, -15147, -22655, -9378, 6041, 3225]
397C225j7530j2134O857K1108J3574p844j7018K662K3601J5687j0098k0188n282
410c380J1168P998o533j3101r256k492M871R031J259j1070j0545O377J8725P777
424A0829j0823j1487L021J3800Q783k653r125n012N468J2040L929r841j3042N62
438c551J0825L538j0092j0605r37L594q4j079K020j041n893M39J2669J1602l995
453G410j1747l41J3317J0276l153j1449p050L637R738M573j0269j5907l121J4023
467f3J0858j1025j8406o68J5746Q473p812r081K746Q732L846J481Q60j874l724
482H9L203R294K463q146o910K822M774k859n740l475k104l568J147N793k52p925
498a1394k602J0197J0242k898p699J190R525K220m039j325K101l132l049N108
$$ y = [3225, -14305, -26439, -19582, 1526, 15100, 7256, -9762, -7100, 16501, 32188, 22090, 1902, -3380, 7788, 15786, 9253, -3848, -13104, -15596, -10725, -1694, -435, -11505, -22050, -15673, 3052, 10829, 6, -11481, -8460, 5340, 14123, 11470, 2345, -2667, 2801, 14841, 18770, 8929, -4113, -3551, 7274, 10812, 720, -9885, -10822, -7228, -7312, -8391, -6371, -7412, -13305, -12866, -197, 11405, 7410, -4337, -4678, 8639, 18915, 15762, 4313, -2737, 900, 10638, 15211, 4942, -10965, -14086, -63, 10795, -230, -18636, -19304, -3558, 4915, -2897, -11978, -9232, -500, 3346, 4827, 5687, 3813, 89, 3292, 12586, 15049, 6903, -7, 2815, 7589, 4730, -1010, -4485, -6589, -10157, -9010, -3217, -3469, -11394, -13996, -3799, 6443, 3545, -4154, -2964, 6561, 8781, 4742, 3417, 5518, 2386, -663, 4445]
512D445P403n108j1939k335J0878N395q983j0113J089O056J810j973k390m244
526a0009k467Q365J1514k82j1244j118J4692J0350r249j2327K454R951j276r500
540a46l518K074k756n943K049O629k338o195K671R131K334o852j674N254K136
555B856l140K905O811k647r236P3J0230K386j1689o735R201R437n641j0137k42
570e568M244k395l631L306L477n188m248P898Q307m740j0691L907J3817M548o591
585F452l941M073J767n070k185J318l719n194J864P795j714j1477l736J0646P122
600D001n287n099P478Q107l956p353K532M686l970n716L964P914j586p850k20
615b355N643K76m394P51M040j993m888Q21M193n373r408J300J1481L782p150k765
$$ y = [4445, 11848, 6740, -5199, -7534, 3344, 8739, -244, -10357, -9268, -3212, -1402, -3375, -5765, -10009, -12476, -4111, 7403, 7121, -4123, -5241, 9451, 19801, 10552, -1775, 679, 10630, 9354, -146, -3664, -1590, -4346, -10289, -8240, -1611, -3949, -10144, -7473, 1658, 3992, -2860, -4534, 720, 2856, -284, 2621, 9432, 6785, -2451, -2378, 7852, 10238, -1451, -8186, 1015, 10452, 4811, -5326, -5568, -1324, -3719, -7350, -4044, -567, -5755, -10003, -2105, 6202, 1462, -9229, -5322, 8495, 13043, 6452, 2511, 6584, 8351, 3281, 1096, 2414, -1305, -6499, -4635, 3160, 1446, -10031, -13767, -3121, 4001, -1286, -6385, 1093, 9200, 5244, -2109, 423, 5109, 1139, -4577, -613, 7301, 5715, -2135, -2355, 3288, 3564, -830, -79, 3961, 1968, -2920, -2099, 2094, -3279, -12687, -11387, 94, 3876, -3274, -6039]
631f039Q125N985m130m832L296M358k078k479K604k36p463n484M594N306l539
646b012m824L776P304j242o245q34L643k5k824K944M451j928n681J248N531k87
662B995n759N57P717K768n654l494L446j24o245l456N250M091l921l579L318M126
678B036k668m547K080M952n0j223K961J509l893m012L334L823m114n012L143P663
694E982l30p793k830M679K537m744j647M164J895k961j046L100M55m370j698N454
710H47L692l072l000L166K975k998l690J471L756k347k304K285L004k907m858
725c980J004M092l02m786N52M887O02l961r82L779R97l691l74M533K450l878k974
742b032K510K171j856l190K102K077j085j970J608N22k948j889L259L118k594
$$ y = [-6039, 2086, 8071, 3941, -891, 2405, 6763, 4685, 2206, 4810, 4574, -2889, -8373, -3779, 1527, -2012, -6836, -3060, 4244, 3002, -3243, -4077, -434, -459, -3283, -339, 4112, 2184, -3497, -2249, 3282, 2995, -2764, -2207, 5510, 8278, 2624, -870, 2576, 2452, -3793, -7249, -1999, 2092, -1829, -5408, -2090, 2036, -632, -5179, -3099, 1853, 1803, 580, 3541, 5050, 1157, -2855, 479, 4302, 188, -4824, -1681, 5982, 5652, -2141, -4971, -292, 2245, -2499, -4146, 18, 1913, -1048, -2094, 1006, 1461, -2909, -4607, 847, 4539, 1467, -1533, 1633, 4608, 1610, -2080, -609, 3147, 800, -1504, 781, 3785, 878, -3980, -2976, 1116, 814, -3972, -3420, 1467, 2069, -1892, -2874, 905, 1902, -1789, -2163, 2370, 4820, 942, -2032, 478, 2649, 793, -2397, -295, 1782, 697, -1273, 335, 857, -2091, -3980, -721, 2397, -197]
757a97l237K079M384j138m775J80M704J269k601j130K235R39l192j370J909J052
773A111j689p74K474J144k687j554J223J611j846j375J966K086j561k066J221
788g16K155p21k503J184L303L1k221m33J628q90j943n85J764Q67j825n76J711
805B30O05j913j418J658J639j59j504O92M87n40n70R13j29l44j39K021Q96j728
823F97j546J132K040j519k391n0J834O8j219j272O12J101m16o3P21R92j59J35
841F97P02k50n93j12N16K92j312n73J191J38j324o86R57J325n98j524N48P86k09
860b9p65L5O30r0n98L78P02j03p45P22Q15K76m71m21Q58o8q37j84q1J1n35k26
882g26l57Q6n71J86P50O37m29o10J843R42o33j397L70P15L06j222p32O90M5p8
$$ y = [-197, -3434, -1355, 3029, 1891, -2884, -2704, 2000, 3269, 668, -462, 1773, 2712, -480, -1850, 59, 1111, -578, -1352, 1122, 2266, -421, -1975, -752, 859, -987, -2362, -396, 1690, 129, -1937, -716, 1439, 718, -1785, -601, 2702, 2733, 512, 79, 1707, 817, -1126, -1711, 53, 920, -905, -1481, 230, 835, -1078, -2496, -838, 801, 642, -862, -170, 317, -223, -793, 120, -9, -353, -492, 1529, 2425, 697, -849, 283, 2323, 804, -1587, -1637, 197, 265, -954, -2226, -1614, -513, -929, -992, -271, 721, 562, 697, 1399, 1149, 556, 444, 960, 1252, -60, -633, 558, 696, -628, -1314, -357, 968, 370, -1154, -606, 180, -29, -794, -759, -129, -219, -817, -439, 263, 160, -585, 137, 952, 1228, 757, 336, 1194, 1126, 289, 105, 24, 35, -500, -726, -1083, -997, -1568, -1382, -632, 5, -424, -1034, 809, 1751, 1118, -279, 91, 806, 1112, -110, -842, -152, -107, -185]
902a85J7N3j01M24L31J63n15k50q5J69k73j243k47J606k24o79j68J235R73n42
922D59N8L35O51j13m88l32m54r3q81J64o5o22J05P20O76o60O3N10L57J03o18j11
944b36N65k94M4p1J0l98M87N02L02n25O1n77M75O22q90r56O94M69q29k40J10k0
966f95L86K7L61L05l32K94O74l41n82k8Q63K43j081m87M96J069r83o79n80J163
986I3j6p11l02K09K15L60k64K32K72l16O45J09m00j47K87M85L9n01n60O39P54
1007A122q65p74N63J92n99j5l74N04k47q7L91K02k90m8M73P11l36m99K13M71M1
1028G49m65K05J5o6j74m00O29m16l68k2O7k3p77L25O35k03p5l49M63Q57k82J16
1050D41j94O05m06o3m2J75m64q4k86P9l59m0N88j99m23J1M42Q19l51p14N1N71
$$ y = [-185, -168, -115, -216, 208, 539, 702, 187, -63, -148, 21, -252, -1495, -1742, -136, -360, -1039, -1207, 28, 1001, 459, 517, 852, 1503, 1390, 902, 570, 116, 23, -858, -694, -759, -1381, -1276, -556, 120, -540, -477, 33, 390, 493, -125, -236, 329, 35, 79, 8, 18, -380, 107, 609, 911, 386, 447, -130, 345, 967, 77, -879, -185, 284, -545, -785, -675, -695, -309, -282, 79, 384, 52, 346, 1020, 679, 97, 69, 932, 1175, 94, -393, 103, 1172, 189, -490, -1070, 93, 77, -634, -936, -727, -512, -152, -416, -184, 88, -228, 417, 526, 126, -21, 266, 751, 790, 289, -271, 368, 1122, 257, -517, 46, 238, -361, -376, -750, -246, -493, -580, -189, 13, -277, -325, 148, 859, 523, 24, 237, 708, 749, 284, 489, 504, 438, 264, -136, 493, 77, -291, -313, -246, -269, -1046, -721, -86, -289, -364, -713, -250, 607, 325, 441, 247, 852, 446, 383, 341, 516, 52, -32, -318, -239, -598, -638, -50, -249, -672, -661, -219, 600, 249, -465, -414, 157]
1072A57L35n13n85M39O91n71j22N37J98j92K73j00j42l03l14O88q09l15o4J01
1092f11K64q7j18Q2L56L56l4L00k2j11j87K76M3k17l29k68J037r90l44O9R29l7
1114C57q15P1M62r6j22j07j74J57r6K3N52L8n81M27L26j07m3l68Q03m2l99r37
1136f71O27M55r12l52J16M55M2J39l23M50q7j24L46J45j68j58J89O53n30n00L43
1157A35M77k62q70k6P62Mn91J5M03j17m10J54J79L15k38n58P25J3m64k21M10Q64
1179F99n65m24Q36k28K63n88L55q7m02n63L50K40j26m81K49N22L49o21j78P29
1199C29L53p40k1Q27q7p10m44Q4Q48o02j77L92O59q61L8M92j46p60J3M53L38n44
1221b66o16N18M71J02m63k41P06O82q97L6P93j14p43J09j11O15q03k44O54j18
$$ y = [157, 492, -21, -606, -167, 524, -47, -169, 368, 566, 374, 647, 547, 405, 102, -212, 476, -333, -648, -712, -611, -347, -434, -552, -470, -114, 242, 208, 508, 486, 375, 188, 464, 507, 290, -39, -307, 730, -260, -604, -535, 394, 357, -458, -387, 75, -21, -143, -250, -424, -267, -363, -340, 212, 250, -331, 96, 422, 315, 272, -96, 707, 665, 266, -671, -44, 411, -501, -853, -737, -282, -240, -101, -424, 26, -61, -185, 161, 306, 138, -20, 169, 822, 292, -208, 135, 612, 350, -520, -546, 216, 220, -371, -356, 47, -70, -480, -326, -147, 168, -70, -628, 97, 110, -354, -575, -165, 699, 134, -290, 546, 318, 581, -7, 348, 261, -141, -704, -354, -114, -240, -721, -472, 50, 399, -222, -400, 329, 682, -58, -79, 748, 661, -49, -493, -409, 439, -163, -340, 52, 711, -150, -112, 380, 234, -526, -513, -60, 278, -266, -882, -364, 107, 209, -254, -495, 211, 893, -4, 32, 825, 711, -32, 77, -34, 581, -222, -466, 188, 70]
1241G0k64n54P04J09r2n16M35O89n84m33M83N33j7o50J4N06m2n36j49Q69m90k74
1263a89J94J38k42k14n3M53J69m79m80M84M84p8n49J98K54L18m60o0K81j11j52
1284i4mM47o80P2Q7P31m0q64k8J21P75o37P6l21R07m00l19J54k30L62j27L85l07
1307F6J90j72K26k8n09m3N96K23m08l78N32N6j31o59j25N39J57r3r8K4O7J14k68
1330a22J81l14O1K67L95k03j06J19l32L36j03n79L0K53k5K28j11O1J42r4N6M7
1352A87K04j62j59l18J43l37J73N07q3q1k09n5K99j71O1j55Q37m63k93L65n54
1373b64K16N09n02p6k20M54K54l65k66qN5N06k75p3M7n7L60k49l0L3n00O65l95
1396a81J63j55j86M93k73L32j01J73mM1k85j04N26l85j58k3R8K19j19l4J86M0
$$ y = [70, -194, -748, -44, 65, -27, -543, -108, 581, -3, -436, 47, 580, 563, -87, -73, 433, 391, -145, -294, 575, 85, -189, 5, 143, -99, -313, -366, 87, 256, -223, -703, -219, 265, 187, -362, -164, 90, 408, -52, -112, 169, 58, -94, -98, 349, -331, -259, -172, 559, 519, -345, -373, -252, 523, -114, -38, -359, 548, 148, -171, -17, -247, 115, -12, 373, 66, 256, 84, 310, 282, -227, -270, 326, 549, 141, -237, 295, 351, 220, -439, -564, -25, 132, 39, -59, -35, 32, 146, -122, 59, -255, -194, 73, 468, 265, 159, 278, -54, 282, 179, -400, -370, -117, -142, 86, -25, 36, 178, 84, 140, 187, 391, 229, 70, -248, -105, -442, -269, 238, 155, 74, -135, -190, 109, -62, -1, -156, 681, 218, -75, 290, -264, -48, 461, -41, -117, -337, 117, 371, 6, -260, -268, -213, 293, 18, -55, -8, -65, 295, 46, 16, 49, -451, 214, -181, -18, -173, -359, 134, -139, 193, 92, 265, 261, 302, 17, -87, 439, 54, -104, -127, -29, 190, 71, 37, 223, 263]
1418B63n74M61O01n77k12j92K32J6n31O76m90L05j3J46l09j8K40j01j78M07l4
1439A18J75l90J80o4l56O51j62l43M8q8K27L14p95L15N93k13M8k37n7M5J4M1J0
1462G4L78o07J23j73K72l55J25M38j22l79j0N14L23k94n53K9K42l55m2k25K000
1483A403j477M4K38r73J153m72n78R75N42j405J382m4r36K44q71P03O67o54O06
1502E47k83p84P77l66N6K98j01l53M48q46k99O3P01l51M95j04K16n50O9J145j386
1523f08J997q28n85M30J1J88n51K34o2J78j221l35K80K77Q86j408M76k49J087
1542A97Q7n7O36j523J255k95K43k02p14m4k59O31M79k66m61O05j8q95K18O95q36
1563e24P95m33K85J59l88N32m77R3Q0L43j105N03K06J10J32r06J55N88j44K42
$$ y = [263, -311, 150, 751, 174, -38, -230, 2, 18, -513, 163, -327, -22, -35, 111, -198, -216, 24, -77, -255, 152, 118, 293, -97, 83, 19, -337, 314, 152, -191, -143, -231, -4, 310, -485, -170, 423, 210, 258, 21, -36, 9, 23, 64, 74, 452, -155, -32, -205, 67, -288, -163, 275, 153, -226, -236, 278, 601, 307, -246, -217, 25, -330, -372, -597, 1403, -74, -30, 208, -765, 388, -84, -662, 313, 855, -550, 832, 788, -148, 96, -775, -72, 595, -59, 547, 264, -520, 257, -109, -53, 245, 144, -209, 239, -607, -906, -843, -142, -493, 2, -102, 114, -436, -367, 778, -608, 1389, 561, -24, 406, 417, 605, 54, 288, 226, 404, -817, -1152, -872, -595, 291, -1117, -641, -890, 197, 284, 227, 863, -660, 595, 300, 543, 341, -373, -417, -676, -45, 434, 168, -293, 312, 294, -601, -383, 312, -524, 271, -162, 123, 282, -106, 426, -51, 42, 122, 465, -640, -137, 69, 179, 311, -595, -440, 148, 4, 246]
1583B46n70J35L02q07P9M52O77q77J012p97K86K43m98J83K31o10N60l29M17k4
1603C11m45J92r83Q01K76j52l53j30K08k41M78N94r95N86N79o15M39q29L73P61
1623H55j131L15j15L47l74P28j403J261m92L98j94K78j61j493J484m59k84Q23
1641C83k27J742j487o38L38j93l14L43K43k04M36j89r75M83N58m21k87j52P35
1660A74j74m93Q90o59L89n50R61j195O75j82O13n90N32l33j35k51n12J253k52
1679A61J54l00m60J35O04k23J64m72K94j09n7j098J717o55k52K77j64l0J173n17
1699C42n84q9L38j60J93q3N2J1m61L54k43L39O4J33J01m73O3o0K86l95O8K86j55
1722g3R2j17J84K52m47K89l11Q3o6M35N5n53L94l80MJ59Q9j31j43r2K73k2j21
$$ y = [246, -324, -189, 113, -694, -615, -163, 514, -363, 649, -148, 138, 381, -117, 66, 297, -313, 247, -82, 335, 311, -134, 58, -925, -124, 152, 0, -353, -483, -275, -516, -38, 556, -439, 147, 726, 111, 550, -279, 94, 855, -276, 39, -76, 271, -103, 625, -778, 483, -9, 389, 195, 473, 312, -1181, 303, -156, -440, 383, 156, 1898, 411, -227, 111, -82, -396, -53, 190, -14, 422, 233, -742, -259, 299, -122, -409, -561, 174, 0, -493, 397, -262, 127, -423, 538, -657, 18, -164, 449, -141, 391, 58, -77, -328, -840, 413, 161, 315, 15, -445, -310, 294, 71, 235, -237, 57, -52, -109, -1207, 510, -145, -397, -120, -284, -314, 859, 342, -242, -331, 7, -153, 40, -43, 9, 20, -441, -87, -330, 9, 73, 206, 307, -166, -103, -163, 123, -272, -204, 82, -73, 19, -98, 86, 338, -109, 180, -131, -48, -114, 321, 376, -177, 217, -163, -159, 0, 89, -42, -185, -277, -4, -26, -147]
1745a47M30q5l53J4Q9K41k62K5J49J29m09K84j27LJ25j86j76L17p6m83P48l24
1767g4No2M3K45l70L21L1l68L19K2O1K60o24m7M68j92k40K45l86M86J7J19j96
1790H3n7j58j6M63j16J54k92J03m60K51j49K82j30o7j32m5p3L21R3O1L21l27n2
1813E8l94M0N30l39L54n24k3L7K23j09j41N36m3m17j18J64K22l55L27J97k49L69
1835C45j04J17k38j82L24o6l04J39J43k34j85J41p7K48k52j56L30k8J97j95k70
1856c07K25J63k25J55P2r7L3k1l0j69K39J68J41l85J8Q4K15k43J02k00K8k50L78
1879I4J01j03M00n19K15R3n56j73K05J32J36J64m44N08J00k88o3j70J6r8L38J2
1901A00Q1P7o33O50m9k76Q4N9k23m3J15o9K12K11J3l49K96j40K89k55j63k2q1
$$ y = [-147, 283, 198, -155, -141, -52, 189, -73, -48, 101, 230, -179, 105, -22, -19, 106, -80, -256, 61, -15, -498, 250, -74, -69, -131, -88, 157, -213, 108, 139, -229, 90, 112, 173, 433, -191, -238, 230, 38, -202, 43, -343, 143, 160, 279, 83, 26, -132, -148, 315, 199, 353, 61, 164, -296, -45, -194, 88, -42, -109, -241, -286, -359, -38, 55, 116, 437, 110, 58, -336, -296, 234, -105, 249, -275, -298, -261, -38, -147, -288, 248, 205, -212, -330, -166, 56, -299, 28, 225, -24, 345, 241, 358, 120, -62, 262, 196, -108, 31, 174, -60, -245, -104, -181, 67, -185, -341, -11, -39, 158, -37, -307, -82, 81, -144, 11, 83, -14, 19, -2, -32, -201, 38, 206, 347, -38, -20, 64, 279, 36, 138, -62, -34, -284, 94, 195, 92, 492, -27, 188, 281, -275, -448, -243, -111, 25, 189, -255, 253, 353, 65, 2, -168, -152, -250, 88, 100, 181, 258, -375, 275, 226, -50, 34, 93, -130, -173, -58, -127, 85, 296, 309, -40, 256, 116, 405, 150, -13, -35, -116]
1924a16M15k37m6M8J65M9l57N20m25j04L42m38mK72j69o0J92j68M26l27n0J73
1946A01k6P0j78k18M52j97P9n6l06N42l99J65K38j40J5l74N33j47K6p8k06J57
1968E3j52K85k49K08j7l01M11l20k20L78J43n89N11q0MJ36k33K66m14J07j69J44
1990i8j70L35j34o5K99k63o9M97n23N7J13k52J07L70J47k06q2k3J85j49j53q0
2012a57j58M70j1L5K54k96l33K91J38k63K8m42Q73n40J61l69Q0QL83R6p8l62K17
2035B5J8j27L08j36N5K21m82m8L7N9o3N5j47L93k78j78L58j01P8k01K16j43j11
2058a92n8L75J7l26M32l02q5N6J93j41J94p0P3k78M3J70q6L8j01j24k43L90N84
2081E59p49M82J1l3l25J15P6J07k11n25Q89n75L20j2l36K27j50K01j11mL1n2n2
$$ y = [-116, 299, 62, 16, 64, 229, 278, -79, 441, 16, -88, 254, -184, -188, 84, -85, -145, 47, -121, 305, -22, -72, 101, 75, 145, -33, -251, 201, 4, 83, 27, -279, 263, -136, 29, 267, 127, 142, -232, 301, 154, 180, 102, -104, 53, -99, 186, -63, 145, 128, -173, 238, -82, -302, 76, 219, -370, 141, 61, 65, 201, -32, 234, -180, -73, -242, -98, -268, 67, -67, -132, 167, -96, -165, 332, -191, -134, -21, -273, -166, 204, 351, 145, 63, 40, 225, 76, -77, -157, -315, 155, 144, 179, 433, 137, -196, 95, 233, -30, -2, -444, 429, -111, 50, -319, -239, -231, 152, 248, 170, -192, 25, 43, -84, 224, 88, 143, 364, -118, -166, -129, -70, -133, -78, -225, 168, -110, -288, 70, -31, 47, -154, 62, -81, -192, -250, 125, 142, -184, 248, -54, -139, -83, 110, -31, 163, 93, 166, -112, -69, 101, 15, 53, -48, -172, -415, -25, 559, -190, 292, 303, 270, -55, 60, 136, 243, 32, -493, 396, -179, 141, 129, -207, 20, -130, 71, -40, -44, -13, -65, -117]
2104a17L43n8j99J32K82k27j31j23k66N32J35m78r3K48O52o76N9R5r1K40k82J92
2126A69q5P9Q7o25K38J53K54o62K98N8K46k80K57j97O0N7o7k08J90k46J08o0L81
2149B05J0l86N63l16J58n07N47j62J38k91j87K23p7J21l15J69K6J80k95K24n9
2170c1K7O2O0k44M21k1k32J67j7j2l9j56l49P0J36K23j63K27k06J22J32j68P3
2193H2n2P8k52J3m1L84n58J34J00o8O7j8j39L59k40M06J71j470J588o20N52j065
2215e89J376p07M08l09r28P57l18N35j05N25p48K96L25j046j51J151m86n6Q3o65
2235f52O97P92r95k58P81r99M24J17J48J49J13o90J07M77J52L35q20K99j25n9
2255gk15m91J191j74j99j35K5J96k90J10J39j77o1l02N95m10M08k70K15N4l0m30
$$ y = [-117, 226, 168, -31, 101, 383, 156, 25, -98, -364, 168, 303, -175, -268, -20, 632, -44, 15, 110, 19, 259, -23, 169, 84, 163, 250, -375, -137, 16, 270, -392, -94, -36, 210, -70, 187, -10, 50, 107, 40, -168, 22, -224, -116, -176, 205, 215, -171, 392, 76, 234, -273, 274, 112, 250, -41, -228, -5, -82, 39, -276, -107, -81, 99, -196, 28, -31, -4, 58, 118, -126, 295, 274, 42, 209, 192, 180, 141, -15, -364, -294, -158, 65, -98, 129, -77, 45, 177, 9, 82, 30, 108, -144, -131, -172, 212, -346, -212, -112, -180, -113, -131, -270, 89, -151, 255, 426, -1044, 544, -76, 476, -589, 787, 80, 488, 179, -749, 8, -310, 225, 120, 645, -103, 193, 518, -528, -679, 472, -14, -70, 13, -652, 45, 837, -158, -416, 365, -634, -210, -93, 55, 204, 317, -373, -266, 211, 363, 698, -122, 177, 52, -7, -222, -713, 478, 304, 105, -30, -5, 191, -99, 11, 150, -27, -88, -390, 205, -205, 203, -67, 148, 202, 172, -258]
2277b58L58J25k66K13j84j9K2l2J28J3m24J43p0J73L09j79R5j09j90N7K12K8l01
2300a56Q0K72j65l92K74n2k4K10Q2o43Q85m99J066r13mj0p0K39k76K66j93L05
2322B82m08M93k71o4l88J84K38p5k05J71j42L3L20k07K5M61l83J20k37K26n8k09
2344i4N50m47l5k29N18k12j0k4K33j56K35n16N92l98k86L18jm33K18L22j13m39
2366d07O62m06K9K81k17K68n0K18k45J67m63L3J31J22l12J62m7J65m5K9k64J25
2388f4O48p45M06l84L43j61K18j61M2J67j74J72m58M26m70p1K04J10k81J60L5
2409c8l4J88k69L14l69L22N9m35J95J52l0l4j69j25M27m02n0J11J92m48L20q3
2431b06J06J12L11j99K46k9m94l5K93J20k02o9k33J65J58R3j43K81j72j95O1M02
$$ y = [-258, 100, 225, -41, 172, -12, -31, -9, -41, 87, 100, -324, -181, -251, -78, 231, 52, 147, 38, -152, -95, 117, 145, -156, -76, 196, 31, -361, -87, -139, -163, 47, 129, -514, 371, -128, 938, 25, 21, 11, -59, 180, -96, 170, -23, 282, -126, 367, 96, 32, -356, -172, 66, -9, -214, -43, -185, -152, 168, -39, -14, 447, 64, 184, -53, 173, 115, -94, 456, 9, -26, -255, 263, 51, 41, 17, 250, 94, 329, -187, 405, 7, -279, 39, 38, -395, -177, 145, 32, -407, 255, -151, -122, 159, -58, 210, 160, 378, 133, 300, -163, -130, 1, 123, -189, -27, -74, 91, 46, 75, -189, -64, 584, -161, 245, -139, 204, 43, 261, 100, 142, 309, 135, 307, -151, 275, -195, -266, -62, 48, -233, -73, -38, -72, 116, -153, 161, -208, 114, 173, -262, -67, 85, 55, 21, -148, -273, 154, -248, -298, -187, 5, -443, -123, -206, -100, 12, 323, 124, 370, 341, -153, -188, 105, 225, 23, -46, -279, -114, 44, 137, -6, 275, 103, -92, -31, 371]
2453C71l23j83K14J4j02K49l48L84m62L6L30l94R9K51j61N6M4k2J50l2J31n24
2475b22L58K64j97j95k67J35K13J41rl04m4L21r2O7l94L83q3k88K22K45r8k73
2497a17m0J66q1n4J67j41M20p16K68K52j55l61M59j11pq3L33j45j65q3J04M08
2519C18m62L86P1k18m16P33m98L32k64ln41L23J46rM62m66L18k12K49l43l7R1
2541d0L8K07k19m2J41L4r9%K22N4k89l13L64l7k40J14J75j55J20k54L7j1l9R6
2565a36j44J06J30J59mk50K57j21J09Qk38K51K76l46J29J04k29j60n2j7K02%J93
2588B27m53K84K12l26L10n6j86k94L66J14j28J44J69o27J65q9L25O9k58k13M48
2609B03o8n1q3J95k83N7J37j79o5j72O04p5L1j58o0J41l02L28L3o1k81J53j11
$$ y = [371, 48, -135, 79, 93, -9, 240, -108, 276, -186, -150, 180, -214, -115, 136, -25, 31, 75, 53, 203, 171, 302, -222, 136, 400, 203, 8, -259, -124, 89, 230, 221, -83, -127, 194, 102, 169, -225, 158, 75, -213, 9, 254, 156, -117, -157, 9, -72, -126, 41, -100, 320, -396, -128, 124, -31, -392, 67, -44, -51, -134, 199, 54, -111, -194, -90, 318, -144, 242, 313, 95, -321, 412, -86, 246, -18, -21, -562, -239, -93, -102, 360, -106, 212, 0, 249, -94, -131, -40, -2, 205, -14, -56, 85, 119, 20, 20, 242, 296, 7, -306, 58, 21, -219, -105, 70, -85, 35, -219, -182, -193, -232, -136, -280, -174, -44, 115, 111, -139, 118, -3, 106, 114, -124, 127, 403, 57, 186, 290, 61, -99, -151, -168, 34, 34, 227, -226, 58, 270, -56, 254, 198, 12, -282, 84, 198, 70, 214, 383, -244, -79, -168, 157, 226, -32, -245, 203, 135, 84, 1, 196, -87, -30, 107, -72, -137, -309, 295, 220, 251, 93, 33, 174, -128, 200, 233, 172, -109, 44, -67]
2632f7L24J8k98K1n0L3K9k06J43o7L19m24M78l53J60k8RL2o2p8L06k15M1j66j27
2657b28L38L79o49M93l24K3K7J80m27N7L03o09P5L01J43j17L0J4Oj45K89l62L74
2680A71j25q1r3J06K23K43o27j53P64k10m6M6l78K30l40Q7K3m8k84N78j83r0M
2703a83J15j31M79M6k72Q6O0l19Q6K8j94L0J38Q5j76n7j56K78L36j37j29j87L02
2726A28l43P6L09m4j37L58l72J58m38N77m95L17N4j43J71l2k73L15m23M09j60
2747A2N6m5K62l07J52j53j51L73J5j19P3j50j75N64m28k48N4R2P8L28k79O3j66
2770i9j09j16M94N7j92j63L72k84K85o4K49l85r1q9J60l6J02J31l26K6J48k70
2792b00j27N08n8j76J26j8K97j64j1k60M41l01M4nM9m17J53K12k02N4j32M55j46
$$ y = [-67, 257, 275, -23, -2, -52, -19, 10, -196, -53, -120, 199, -225, 253, -100, 60, 32, 41, 73, 11, -67, 239, 24, 65, -101, -228, 110, 489, -160, 333, 9, 32, 59, 239, -188, -131, 172, -437, -362, -61, 82, -35, -5, 9, 15, -130, 159, -203, 171, 46, -35, -128, -22, 201, 444, -183, -336, 428, 218, 172, 218, -160, 70, -270, -183, -160, -208, -492, 86, -97, -187, -183, -68, -199, 280, 326, 54, 140, 200, -119, -33, -5, -199, -169, -31, 54, -122, -179, -335, -57, 279, 142, 13, -174, 128, -215, -139, 170, 126, -11, 347, -25, 133, -305, 272, -223, 94, 148, 5, 176, 144, -129, 186, -237, 172, 12, 68, 23, 285, -22, 130, -23, -174, 199, 214, 95, 168, 18, -157, 407, -21, -269, -215, -123, -45, 283, 4, 67, -99, -208, -324, 170, 227, 35, -128, 244, -40, 245, 181, 430, 45, -46, -135, 25, -11, 91, 222, -104, -78, 70, -200, -327, 181, 123, -53, 73, 55, 352, 188, 177, -83, 358, 57, 101, 96, 145, -272, -119, 93, -109, -55, -187, 268, 122]
2815A22m0J35k1l70m9r3M88l29j29J34j16J25K80j41k28J40M9j66M0k49J82M42
2837B06k90oj27Q21l88k14J81k8j82r8p1J93k29J79j51K49j81J08n7K09K80j94
2859B10q8r2J72l60K24J2K0j40%M8K5l18M9N13l16J85l01K27J83k21k67N79k08
2882A36l67Q5N1j8J43K43m08K7m6L15j09k05K33L1l15N31l59k84L91J57k51k28
2904b47K95N0J1k44j06K47k68M44m4L6k2j94K22m19M53j37m7l5K74n41O23k74
2926G7l6j72L89r3l09J08J06l22K39J32j50k6j7Qj24J15R5j91J6L14k53O9pJ72
2950A40K03R4o48J85J68J8k7R4m77L20K13n46L47p9J5k57R5J86l12L47l34K99
2972D4p0J46j06L91l71J7j98K38k99O0K33J01j2l39r0OP2k5K32J67J38l13K67
$$ y = [122, 82, 217, 196, -174, -223, -316, 172, -157, -286, -152, -268, -143, 137, -4, -232, -92, -43, -209, -169, -418, -236, 206, -84, -90, -217, 604, 216, 2, 183, 155, -27, -125, -196, -3, -232, -53, -204, 45, -136, -28, -85, 124, 404, 210, 122, 30, 202, -158, 66, 78, 98, -42, -42, 6, 31, -287, -238, 275, -41, 144, -157, 70, 253, 32, -235, 344, 136, -231, -146, -95, -113, 30, 273, -135, -108, -154, 161, 52, -153, 80, 111, -204, 327, -32, -316, 75, 232, -19, -247, 48, 98, 109, -135, -241, 6, -262, 182, 138, 174, 152, -42, 180, -239, 214, 77, 30, -5, 269, -272, 351, 77, 41, -131, 258, 165, -144, -36, 70, -252, -13, 119, -31, -57, -74, -66, -190, -75, 20, -171, -155, 159, -94, -25, -32, 140, 343, 437, -211, -26, 142, 160, 133, 227, -250, 70, 283, -263, 84, 5, 20, -237, -142, 44, -268, 79, -255, 44, -26, 120, 14, 405, 34, 51, -147, 91, -208, -148, 85, 186, 174, -165, -255, -249, -177, -202, 30, 197, 335, 22, 289]
2995B89l77K28j03J65l56m6K45r7j9L8O9l05K35l9n3K74q4J54l48Q4%j98k99N38
3019eM39m14J2p1N0k33L07O4J3p8M7k30n7n2L08j68O7J34P1l43o9L72j82Jj93
3044b10K30k7K36P0l57j16N35o83Q06m00l71N49j93Q4k78K76j33m1J49l60M68
3065B34l7l14K60k41P0k06q9L35N7k63j39N99j77k24J10j69O3L21l20M48m19J75
3087G4l20N3L06L27n23j76L77J86n42O15k01J78m36l0K16p4r0K04o8p1j64l2K2
3110a69J49p6J02K80j99J96k99l5J57L1Qk62K71o9k19P3K31J6k33O9ojj34j9q2
3135b20LL00K7k08o5K00K48l51j47L38j76k06L2K95n39N38kKJ00n4l84K00J60
3158I1p4M13k70l24N65n28K57j20j49K40n5K86l30Q9k62K89l45Q7O6J28j4J45
$$ y = [289, -88, 140, 37, 202, -154, -200, 45, -52, -71, -33, 36, -269, -34, -73, -126, 148, 64, 218, -130, -46, -46, -244, -543, -5, 434, 20, 32, -39, 11, -222, 85, 149, 162, 84, 131, -99, -156, -208, 100, -68, -1, 133, 204, -139, -208, 164, -18, -17, -210, 20, -7, 229, 299, -58, -174, 361, -322, 484, 84, -287, 262, 69, 153, -125, 151, 18, -23, 126, -234, 234, 197, -117, 143, -98, -28, -234, -323, 12, 69, -194, -333, 266, 89, -135, -25, -194, -131, 190, -130, 318, -101, 74, -246, -193, 113, 440, -83, -259, 118, 304, -238, 377, 176, 354, -82, -112, 104, 30, -60, 144, 76, 5, -159, -191, -169, -20, -96, 6, 286, 87, 283, -16, -51, 106, 137, 145, -117, 154, 85, -134, -61, 170, 186, -47, 22, 16, 15, -119, -138, -220, -217, 83, 110, -98, -163, 37, 285, -66, -213, 125, -51, -257, -225, 70, -469, 69, 67, 69, 169, 115, -269, -69, 91, 17, 430, 160, -164, 401, -127, 130, 10, -139, 101, 46, 332, 2, 91, -171, 118, -227, -140, -74, 54, 40, 185]
3180A85m14J78J38O8n6n5K27n3m11M02j94j06M04j30o2J02k88rj13K00P2K2k7
3203H0j21K21L9j88k43J07r2J55N0o5k7J65l89M92n4J46o14K16n4j08K40M7n4
3226e1l46P51k2m6j49n44M51p3J27K86l93k8oJ92k04p8O02k03k14J7J75k90J43
3249I7L7j32j80K20Kj27m2k9K26j81j4M41j32l46K80N1k5k56M09k22K04k02o0
3272A9l1K71j50j92J56r6M1k9j06P6J48o6M4j33O5m7K56k82K40k03k23K80j64
3295a26j9Ok49L11O35n27J59q0j91O8J12L0n07L01J57l92L09j90J13j21L84j70
$$ y = [185, -229, -51, 87, 155, 99, 44, 271, 218, -193, 209, 15, -91, 313, 183, 121, 223, -65, -74, -187, 13, 85, 107, 80, -41, 180, 219, 31, -212, -105, -197, -42, 8, -57, -84, 81, -308, 184, 130, 276, -338, -122, -176, -284, -44, 3, -51, -397, 354, 332, 286, 137, -407, 44, -29, 98, 384, -9, -37, -43, 149, -55, -133, 469, 266, 52, 69, 244, -46, 97, 134, 2, -178, 42, 44, -83, -125, -154, 72, -109, -123, 318, 186, -160, 120, 171, 146, -110, 299, 77, 281, 79, 19, -12, 259, 109, -83, 73, -23, 18, -11, -117, -41, 107, 41, 85, -48, 17, -30, 226, -56, 184, -19, -242, 38, -126, -145, -139, -388, -77, 558, 31, 190, 110, -81, -13, 99, 129, -378, -77, 80, -312, -3, -193, -80, -201, 183, 13]
$$ [...]
8191A57
##END NTUPLES=NMR FID
##END=
