##TITLE=1H ikalashn
DE-78_DMSO
22.11.2024
##JCAMPDX= 6.0         $$ Bruker NMR JCAMP-DX V2.0
##DATA TYPE= NMR FID
##DATA CLASS= NTUPLES
##ORIGIN= UXNMR, Bruker Analytische Messtechnik GmbH
##OWNER= root
$$ TOPSPIN		Version 1.3
$$ 2024-11-22 15:11:00.656 +0400  Irina@DPX200
$$ Compression mode = diff/dup
##.OBSERVE FREQUENCY= 200.131300845
##.OBSERVE NUCLEUS= ^1H
##.DELAY= (6, 6)
##.ACQUISITION MODE= SIMULTANEOUS
##.ACQUISITION SCHEME= undefined
##.AVERAGES= 64
##.DIGITISER RES= 18
##SPECTROMETER/DATA SYSTEM= spect
##.PULSE SEQUENCE= zg
##.SOLVENT NAME= CDCl3
##.SHIFT REFERENCE= INTERNAL, CDCl3, 1, 17.49637
##AUDIT TRAIL= $$ (NUMBER, WHEN, WHO, WHERE, WHAT)
$$ ##TITLE= Audit trail, TOPSPIN		Version 1.3
$$ ##JCAMPDX= 5.01
$$ ##ORIGIN= Bruker BioSpin GmbH
$$ ##OWNER= Irina
$$ $$ F:/spectra/data/iren/nmr/1H/4/audita.txt
$$ ##AUDIT TRAIL=  $$ (NUMBER, WHEN, WHO, WHERE, VERSION, WHAT)
(   1,<2024-11-22 15:10:18.109 +0400>,<Irina>,<DPX200>,<TOPSPIN 1.3>,
      <created by zg
	started at 2024-11-22 15:06:05.078 +0400,
	POWCHK disabled, PULCHK disabled
       configuration hash MD5:
       BE 6D 3F 07 2A EA 11 49 91 17 2B D3 AF B3 58 0D
       data hash MD5: 16K
       29 FF D1 8C 1E 63 30 7C 39 5B D2 1D BB 51 C2 A5>)
$$ ##END=
$$ 
$$ $$ hash MD5
$$ $$ BD 60 25 6F 16 59 B7 8D 53 C2 D8 78 79 44 E6 03
##$RELAX= 
##$RELAX= 
##$RELAX= 
##$RELAX= 
##$RELAX= 
##$RELAX= 
##$RELAX= 
##$RELAX= 
##$RELAX= 
$$ Bruker specific parameters
$$ --------------------------
##$DU= <F:/spectra>
##$EXPNO= 4
##$NAME= <1H>
##$PROCNO= 1
##$TYPE= <nmr>
##$USER= <iren>
##$AMP= (0..31)
100 100 100 100 100 100 100 100 100 100 100 100 100 100 100 100 100 100 
100 100 100 100 100 100 100 100 100 100 100 100 100 100 
##$ANAVPT= -1
##$AQSEQ= 0
##$AQ_mod= 1
##$AUNM= <au_zg>
##$AUTOPOS= <>
##$BF1= 200.13
##$BF2= 200.13
##$BF3= 200.13
##$BF4= 200.13
##$BF5= 200.13
##$BF6= 200.13
##$BF7= 200.13
##$BF8= 200.13
##$BYTORDA= 1
##$CFDGTYP= 0
##$CFRGTYP= 5
##$CHEMSTR= <none>
##$CNST= (0..63)
1 1 145 1 1 1 1 1 1 1 1 1 1 1 1 1 1 1 1 1 1 1 1 1 1 1 1 1 1 1 1 1 1 1 
1 1 1 1 1 1 1 1 1 1 1 1 1 1 1 1 1 1 1 1 1 1 1 1 1 1 1 1 1 1 
##$CPDPRG= <>
##$CPDPRG1= <>
##$CPDPRG2= <>
##$CPDPRG3= <>
##$CPDPRG4= <mlev>
##$CPDPRG5= <mlev>
##$CPDPRG6= <mlev>
##$CPDPRG7= <mlev>
##$CPDPRG8= <mlev>
##$CPDPRGB= <>
##$CPDPRGT= <>
##$D= (0..63)
0 2 0 0 0 0 0 0 0 0.06 0 0.03 0 0 0 0 0.0002 0 0 0 0 0 0 0 0 0 0 0 0 0 
0 0 0 0 0 0 0 0 0 0 0 0 0 0 0 0 0 0 0 0 0 0 0 0 0 0 0 0 0 0 0 0 0 0 
##$DATE= 1732273817
##$DBL= (0..7)
120 120 120 120 120 120 120 120 
##$DBP= (0..7)
150 150 150 150 150 150 150 150 
##$DBP07= 0
##$DBPNAM0= <>
##$DBPNAM1= <>
##$DBPNAM2= <>
##$DBPNAM3= <>
##$DBPNAM4= <>
##$DBPNAM5= <>
##$DBPNAM6= <>
##$DBPNAM7= <>
##$DBPOAL= (0..7)
0.5 0.5 0.5 0.5 0.5 0.5 0.5 0.5 
##$DBPOFFS= (0..7)
0 0 0 0 0 0 0 0 
##$DE= 6
##$DECBNUC= <off>
##$DECIM= 32
##$DECNUC= <off>
##$DECSTAT= 4
##$DIGMOD= 1
##$DIGTYP= 9
##$DL= (0..7)
0 120 120 120 120 120 120 120 
##$DP= (0..7)
150 150 150 150 150 150 150 150 
##$DP07= 0
##$DPNAME0= <>
$$ [...]
##$SW= 21.9926040160658
##$SWIBOX= (0..15)
0 0 2 0 0 0 0 0 0 0 0 0 0 0 0 0 
##$SW_h= 4401.40845070422
##$TD= 16384
##$TD0= 1
##$TE= 300
##$TE2= 300
##$TE3= 300
##$TEG= 300
##$TL= (0..7)
0 120 120 120 120 120 120 120 
##$TP= (0..7)
150 150 150 150 150 150 150 150 
##$TP07= 0
##$TPNAME0= <>
##$TPNAME1= <>
##$TPNAME2= <>
##$TPNAME3= <>
##$TPNAME4= <>
##$TPNAME5= <>
##$TPNAME6= <>
##$TPNAME7= <>
##$TPOAL= (0..7)
0.5 0.5 0.5 0.5 0.5 0.5 0.5 0.5 
##$TPOFFS= (0..7)
0 0 0 0 0 0 0 0 
##$TUNHIN= 0
##$TUNHOUT= 0
##$TUNXOUT= 0
##$USERA1= <user>
##$USERA2= <user>
##$USERA3= <user>
##$USERA4= <user>
##$USERA5= <user>
##$V9= 5
##$VALIST= <valist>
##$VCLIST= <CCCCCCCCCCCCCCC>
##$VD= 0
##$VDLIST= <DDDDDDDDDDDDDDD>
##$VPLIST= <PPPPPPPPPPPPPPP>
##$VTLIST= <TTTTTTTTTTTTTTT>
##$WBST= 1024
##$WBSW= 25
##$XGAIN= (0..3)
0 0 0 0 
##$XL= 0
##$YL= 0
##$YMAX_a= 3802237
##$YMIN_a= -1249778
##$ZGOPTNS= <>
##$ZL1= 120
##$ZL2= 120
##$ZL3= 120
##$ZL4= 120
##$ABSF1= 10
##$ABSF2= 0
##$ABSG= 5
##$ABSL= 3
##$ALPHA= 0
##$AQORDER= 0
##$ASSFAC= 0
##$ASSFACI= 0
##$ASSFACX= 0
##$ASSWID= 0
##$AUNMP= <proc_1d>
##$AXLEFT= 0
##$AXRIGHT= 0
##$AXTYPE= 0
##$AXUNIT= <>
##$AZFE= 0.1
##$AZFW= 0.1
##$BCFW= 1
##$BC_mod= 2
##$BYTORDP= 1
##$COROFFS= 0
##$CY= 7568.61572265625
##$DATMOD= 1
##$DC= 2
##$DFILT= <>
##$DTYPP= 0
##$F1P= 17.9538593292236
##$F2P= -4.03888763876832
##$FCOR= 0.5
##$FTSIZE= 32768
##$FT_mod= 4
##$GAMMA= 1
##$GB= 1
##$INTBC= 1
##$INTSCL= 1
##$ISEN= 128
##$LB= 0.02
##$LEV0= 0
##$LPBIN= 0
##$MAXI= 945.577
##$MC2= 0
##$MEAN= 0
##$ME_mod= 0
##$MI= -402.1523
##$NCOEF= 0
##$NC_proc= 0
##$NLEV= 6
##$NOISF1= 8.587773
##$NOISF2= 6.764455
##$NSP= 1
##$NTH_PI= 0
##$NZP= 0
##$OFFSET= 17.49637
##$PC= 1
##$PHC0= 102.8034
##$PHC1= 0.3094282
##$PH_mod= 0
##$PKNL= yes
##$PPARMOD= 0
##$PPDIAG= 0
##$PPIPTYP= 0
##$PPMPNUM= 100
##$PPRESOL= 1
##$PSCAL= 0
##$PSIGN= 0
##$REVERSE= no
##$SF= 200.13
##$SI= 32768
##$SIGF1= 18.5376
##$SIGF2= -6.396296
##$SINO= 400
##$SIOLD= 32768
##$SREGLST= <1H.CDCl3>
##$SSB= 3
##$STSI= 0
##$STSR= 0
##$SW_p= 4401.40845070422
##$SYMM= 0
##$S_DEV= 0
##$TDeff= 0
##$TDoff= 0
##$TI= <>
##$TILT= no
##$TM1= 0
##$TM2= 0
##$TOPLEV= 0
##$USERP1= <user>
##$USERP2= <user>
##$USERP3= <user>
##$USERP4= <user>
##$USERP5= <user>
##$WDW= 1
##$XDIM= 8192
##$YMAX_p= 0
##$YMIN_p= 0
$$ End of Bruker specific parameters
$$ ---------------------------------
##NTUPLES= NMR FID
##VAR_NAME=  TIME,          FID/REAL,        FID/IMAG
##SYMBOL=    X,             R,               I
##VAR_TYPE=  INDEPENDENT,   DEPENDENT,       DEPENDENT
##VAR_FORM=  AFFN,          ASDF,            ASDF
##VAR_DIM=   8192,          8192,            8192
##UNITS=     SECONDS,       ARBITRARY UNITS, ARBITRARY UNITS
##FACTOR=    0.0002272,     1,               1
##FIRST=     0,             0,               0
##LAST=      1.8609952,     -239,            -222
##MIN=       0,             -1249778,        -1249778
##MAX=       1.8609952,     3802237,         3802237
$$ Real data points
##PAGE= N=1
##DATA TABLE= (X++(R..R)), XYDATA
0@%%%%%%%%%%%%%%O4j28J28j28J28j92K56k56L20l84M48n31N95p04Q32r60J092
31E80j248J424j617J834k069K332k621K936l281L660m075M532n031N565o157O808
47C572p513Q283r126J0056j1080J2203j3451J4847j6402J8153k0149K2441k5095
60a3261K8223l1976L6564m2339M9855o0089P4945r8594J43191l69173J806254
71A523600N47117k245449r19281N36618J99713p99930K4061R29589N60951k59734
81I7255J34914M63036l07506j031005j6870J211406P27384o44001n80999L89296
91D42910L58667n50435n46236J49138Q7019n71615k80344O74019O33040m63325
101f7162p68615K05919Q10729Q7906n87313n8656O86845L84345l03644k65770
$$ plain form
0 0 0 0 0 0 0 0 0 0 0 0 0 0 0 0 64 -64 64 -64 64 -128 128 -128 192 -192 256 -275 320 -384 448 -512 580
31 580 -668 756 -861 973 -1096 1236 -1385 1551 -1730 1930 -2145 2387 -2644 2921 -3236 3572
47 3572 -3941 4342 -4784 5272 -5808 6395 -7056 7791 -8611 9542 -10607 11834 -13261
60 -13261 14962 -17014 19550 -22789 27066 -33023 41922 -56672 86519 -282654 1523600
71 1523600 2070717 -174732 -1094013 -557395 -357682 -1157612 -1133551 -203962 356989 97255
81 97255 232169 695205 387699 -643306 -660176 551230 1278614 634613 53614 442910
91 442910 801577 251142 -295094 -145956 -58937 -630552 -910896 -236877 396163 -67162
101 -67162 -835777 -629858 180871 268777 -318536 -377192 309653 693998 390354 124584
111A24584J04178n0895k98354M9445M50908J14076m46469l07170K34799K20677
121A95779k79329l83000N8508K99751P6004p8722M4459K2329j81676o0033L37067
132E1137L11355j87366l33110J36032M21899M1586l99625k42704J78399K16392
142A93995o8395j67164k1900K6454n5572k7887P7311J7017j24539n8227J47843
153f1064J48586m8637j28753p876Q5406N2194K0413M0696P972o1328k6983Q4986
165A05612O6688j06564j72363n889J50344O2302j19456j22899K3557Q6210K0792
176a1666l5582k2746J1224K8071M8057N2921l51n7611m0809L1933O1131O063n1382
189A9253l8237R088L3555K1565q748m5497m9381R287O4342L4586n1128p0334M351
$$ plain form
111 124584 228762 177867 -120487 -71042 379866 493942 47473 -259697 -24898 195779
121 195779 -83550 -466550 -408042 -108291 -32287 -111009 -66550 -44221 -225897 -285930 51137
132 51137 362492 175126 -157984 -21952 399947 441533 41908 -200796 -22397 193995
142 193995 125600 -41564 -63464 -37010 -92582 -120469 -43158 -26141 -150680 -208907 -61064
153 -61064 87522 38885 -89868 -97744 -12338 39856 60269 100965 108937 47609 20626 105612
165 105612 172300 65736 -106627 -112516 37828 100130 -19326 -142225 -118668 -32458 -11666
176 -11666 -47248 -69994 -58770 -30699 17358 70279 69928 12317 -28492 3441 64572 70635 19253
189 19253 -18984 -9896 23659 45224 36476 -9021 -58402 -49115 15227 49813 -1315 -71649 -67298
202f7298O9301L6608l9445n2746O046N4089L5398r660k6366j2324Q172J9404J0503
215C1682q060k1640j3033P607J6476N123j3925k1631j4652J0887K6021J0447k0817
228e515k8662M792L5628K4253k0906l4617l504L5218K8212j1442k9472j0867J8919
241B037K3839j57k2386j9272L575J6999J0108q254j6985p464R140J3649L429p102
255A156j2542j958J0185J3019K034j3081j4960N764J9004Q629j1466j5424N19
268i121J6445J2298p092j4366m905P516Q395l91j0596p041j366O803M003j155
282e73n383k333K084O727N386M27n835m133L036O742L360p107r317j047J0971
297C005P136n272j0999k050P935R278k564j0692n370M532O963J044o685n578J612
$$ plain form
202 -67298 2003 38611 -834 -53580 -47534 6555 41953 32293 5927 -6397 1775 21179 31682
215 31682 23622 1982 -11051 -3444 13032 18155 4230 -17401 -32053 -21166 4855 15302 -5515
228 -5515 -34177 -29385 6243 30496 9590 -25027 -28531 6687 34899 23457 -6015 -16882 2037
241 2037 25876 25719 3333 -15939 -12364 4635 14743 6489 -10496 -17960 -8820 4829 8258 1156
255 1156 -11386 -13344 -3159 9860 11894 -1187 -16147 -10383 8621 17250 5784 -9640 -9121
268 -9121 7324 19622 12530 -1836 -6741 775 9170 8779 -1817 -8858 -10224 -3421 582 -573
282 -573 -5956 -8289 -6205 522 5908 6335 500 -3633 -597 6145 9505 2398 -6919 -7966 3005
297 3005 10141 4869 -6130 -8180 -245 9033 6469 -4223 -9593 -5061 1902 2946 -3739 -9317 -7705
312g705O331M822j226l507j400L562L496J789j949l556l026J806L721J059n131
327i14m095l17N020K797j382m772j653L068M892m59l803k401J167L487J656k048
343B43o32K37K160K178k38j928k028N0O63J095m55l101k863J607K002K196j859
360f73m142J664L299L080k460j696p19J958K442n00k502j628J554J899O80k821
376e65L75J60J309J165k271Jj642O83P55L0r37j193P9O15J911O4j21j088L30J577
396A237J875j382j114j476J062P95l74l80j414o16J978l53J21j434M82O32M55
413I4L86m99j151K20R32O85j85q99q8J113K72J23q75k78M01J038m30m53q30p51
433a175J228O92j200m14o75M33K102k011J771r00k45J010l48P41j735O52L87K43
$$ plain form
312 -7705 -1374 3448 2222 -1285 -2685 877 4373 6162 4213 657 -2369 -563 3158 4217 -914
327 -914 -5009 -5326 -306 2491 1109 -3663 -5316 -2248 2644 2185 -1618 -4019 -2852 635 2291 243
343 243 -389 -152 2008 4186 3948 2020 -8 42 705 1800 1345 -1756 -4619 -3012 -1010 1186 -673
360 -673 -4815 -3151 148 3228 768 -928 -1647 311 2753 2253 -249 -1877 -323 1576 2256 -565
376 -565 -190 -30 1279 2444 173 174 -1468 -785 -30 0 -937 -2130 -2051 -1436 475 539 418 -670 -340 1237
396 1237 3112 1730 616 -860 202 997 623 243 -1171 -1787 191 -162 -41 -1475 -993 -361 94
413 94 480 -19 -1170 -950 -18 667 482 -417 -505 608 880 1003 128 -150 251 1289 859 406 -424 -1175
433 -1175 53 745 -455 -869 -1544 -1111 991 -1020 751 -149 -394 616 268 1009 -726 -74 313 556
451E56n53N00k39k01K45j93K10K70k56j579R70j07J135j994j03J125P51r50J51
470b62j64R68Q80j703Q80j732Q17J44J193m35K0l51J87k19O0k20j69R0n43N43
490a6O87R6q15j29l82J116l40J05l02k0K31n16N8Q10p71K31m31k12M68k93j82
511f07R11m46p30R03p32P27k76R17j352O21J17m17rP86j022j23P39K71o79L96
531eM96p22M61L21j064J72R47j57L05o70M3K95l34r4K08n68k75J002m46m52m21
552i58J200m98P41n38m00M61p2J300j088K28L00o28m54k51Q11k23j058R68K96
571A37n30J01L95l73j68K64R9N60n09k51jk17Q39p9j84K88r79K84j70K20m45N51
593a68p00J245o90l3K06K64M09n06o6m5M44P33m16l51j68K61J370k412J65N14
$$ plain form
451 556 3 503 264 63 308 115 325 595 339 -1240 -270 -377 758 -1236 -1339 -214 537 -413 -262
470 -262 -426 542 1422 -281 599 -1133 -316 -172 1021 586 606 255 442 223 283 63 -106 -16 -559 -16
490 -16 671 767 -48 -177 -559 557 217 322 20 0 231 -285 -227 583 -188 43 -388 -600 -132 -425 -607
511 -607 304 -142 -872 31 -701 26 -250 667 -685 -64 53 -364 -373 413 -609 -732 7 278 -401 -5
531 -5 491 -231 230 551 -513 -341 606 449 754 84 127 422 88 -6 202 -366 -641 361 -85 -537 -958
552 -958 242 -256 485 -53 -453 8 -64 1236 148 376 676 48 -406 -657 154 -69 -1127 -159 137
571 137 -393 -292 103 -270 -438 -174 -75 485 -24 -275 -276 -493 346 267 83 371 -608 -324 -494 -274 -719 -168
593 -168 -868 377 -313 -346 -140 124 533 27 -39 -84 360 1093 677 326 158 419 1789 -623 -458 56
613E6O5l54J22l45J828j933Q27L0n80K09l51M92k16J42L72p83L45Q30m03r9k25
634B9L52Q9j74n38L81P82r11L32Q3p61k62K82M47M97K46j060N62o37O04p44P18
655C17M24p09J66J90j463J373j457N43J292m15Lr15l04J789j190P84m12L19k21
674A14o80O83m60R55l92j042Q56K51m64j81N12j26M13j33q17L43n14R16j107K23
694f50J176k26m69k40Q99l07On34N20j52k8l38M05k64k97O95k1r40J57J055q37
715c90Q27p53J760j893j91J063m32l68Q12m32j45O80j52l51K98K77m04n8O37k93
735D92n89J88n25N11K38N3m1k14K02r90m65N96L40K59j4j17K72K64j016R42n23
756a37o09R33p33J65kL80m20J75K3o00N63O28J24j513J065K04k36M81j38l77m2
$$ plain form
613 56 121 -233 -111 -456 1372 -561 266 296 -284 -75 -426 66 -150 -8 364 -419 -74 756 353 254 29
634 29 381 470 296 -242 139 921 10 342 425 -336 -598 -316 131 628 874 -186 376 -261 343 -401 317
655 317 741 32 198 388 -1075 298 -1159 -616 676 261 264 -651 -955 834 -356 428 16 335 114
674 114 -566 117 -343 612 220 -822 34 285 -179 -360 152 26 439 306 -511 -168 -682 234 -873 -650
694 -650 526 300 -169 -409 490 183 189 -345 175 23 -5 -343 62 -202 -499 196 175 -765 -608 447 -390
715 -390 437 -316 1444 -449 -640 423 -9 -377 435 3 -142 538 386 35 333 610 206 148 785 492
735 492 -97 91 -434 77 315 368 327 113 315 -675 -1140 -544 -204 55 41 -76 196 460 -556 386 -137
756 -137 -746 187 -546 -381 -383 -3 -423 -248 -225 -825 -262 366 490 -1023 42 246 10 491 353 -24 -66
777f6j3L40k80R10k08l46o99R09m01M16o54O94l96K91l52J52k36J0L96p97n78
798i08P65K56J049j347k58O09p63R90l79K92r34P68Lo09Q98l15K5L06k70Q0J90
819D48n99N84l34n91J27N84l63o52N05N87r37J246j048n18R29q4R09j222l52J242
839D61Q0l42K4K08p4l67p27J088q13o6M23l01O35m4J80%l25j214J244q74J157
860C53L16k40j89r98K49RJ04M09N19j372K33L50J57M09l23K80n84o5O79P74j476
881d06J26k85Q7l53J443m14K18q6R4p26J06k70J77J85m34N11o14N58M36j006j33
902g86J407r43O87j044J517p84l76J44K65J63r39J086p67J49l52K77L93K76J71
921E44lr84J311p68K8p0l43k57P42K9n77m46P61J041j440P61j157J490p89l0O36
$$ plain form
777 -66 -79 261 -19 891 683 337 -362 547 146 562 -92 602 206 497 145 297 61 71 467 -330 -908
798 -908 -143 113 1162 -185 -443 166 -597 393 14 306 -628 140 143 -466 432 117 142 448 178 258 448
819 448 -151 433 99 -492 -365 219 -144 -796 -291 296 -641 605 -443 -961 -32 -116 793 -429 -781 461
839 461 541 199 223 431 357 -10 -737 351 -462 -528 -105 -406 229 185 365 365 40 -1174 70 -804 353
860 353 669 429 240 -758 -509 -500 -396 13 532 -840 -607 -257 -100 309 -14 266 -318 -383 296 1070 -406
881 -406 -280 -565 -478 -831 612 198 416 330 424 -302 -196 -466 -289 -104 -538 -27 -641 -83 353 -653 -786
902 -786 621 -322 365 -679 838 54 -322 -178 87 250 -689 397 -370 -221 -573 -296 97 373 544
921 544 541 -443 868 100 128 58 -285 -542 200 229 -348 -794 -33 1008 -432 329 -828 662 -127 -157 479
942D79j025J039l07k0M90j124k44J598j640O45Q97j107L66p77J509Pp01l09M32
961B08K52M70p00P8r14J024r45j88J169p13O46k99L1K5l6N48q44m04QL75k39Q99
983D51J22n57l65l20R91r08J880k060J899j533j30J74Q42k62J8k76o18R37j09
1002A76l11L56J32p43O18J59j346J389n66N20o0n59L53K9N3q21M01J89K25p55
1022e61J20N19k13k22l3l88J858q22j92M24m20k70n4Q49j053M53L05n52K13l23
1042c62lJ57J065k88p63M69j17Q1L61p03n45j13J085l84L85k32m05K39P3n96L62
1063b34k66O25N67o48p2q38J835q74n77M31j5k41q0J1M15l00J102q70k9K00j014
1084h72M01N38m8M27j278M10J08J561j030j3J188j482q12J132m74M38p47P16J82
$$ plain form
942 479 -546 493 186 166 656 -468 -712 886 -754 -109 788 -319 47 -730 779 786 85 -224 208
961 208 460 930 230 308 -606 418 -527 -715 454 -259 387 88 119 144 108 656 -188 -592 -584 -209 -448 451
983 451 573 16 -349 -669 322 -586 1294 -766 1133 -400 -530 -356 486 224 242 -34 -652 285 176
1002 176 -135 221 353 -390 228 387 -959 430 -136 384 324 -235 118 147 200 -621 -220 -31 194 -561
1022 -561 -441 78 -135 -357 -390 -778 1080 258 66 490 70 -200 -254 595 -458 -5 300 -252 -39 -362
1042 -362 -365 -208 857 569 -194 275 158 239 600 -103 -648 -761 324 -60 325 93 -312 -73 0 -596 -234
1063 -234 -500 125 692 44 -28 -866 969 95 -482 -51 -66 -307 -387 -376 39 -261 841 -29 -58 142 -872
1084 -872 -471 67 19 446 -832 -422 -314 1247 217 204 1392 -90 -902 230 -244 194 -553 163 345
1103C45m21o07O45j50L50n64k38O57j552J757j156K48m02J327r39M05L95k8j96
1122a24j05n96Q71N39j084N76l70N85r03L50K91l93j18J85K26O04m75k24R10j224
1142d79N22r75Q29l60q27J656o06P09n26Q63l87k76N9j60n27K35k45J94M94l05
1162a12l78J40K61L02m19K07l43N82r1r05Q58L69n01L67k4K03o55P35l42m62J21
1183h7L02K6n80K77R9R5p09J069J11r31L17M43r53J679j704N24j81J233r90J54
1203A94j11K68L46o09L41q84L68j82J223p56n15M69j67K29p20J058K65j459J396
1222G54j67M1n75m2M80r89M67K98k03l35j54P79p6m01j87K27j011O20l60P49k03
1243b88R54r66N12m63P4M12N9j39o88K12R21p91K46O79M3m94m42q56J282N97n62
$$ plain form
1103 345 -76 -683 -38 -188 162 -402 -640 17 -1535 222 -934 -686 -1088 239 -700 -295 100 72 -124
1122 -124 -229 -825 46 585 -499 77 -293 292 -611 -261 30 -363 -481 -296 -70 534 59 -165 745 -479
1142 -479 43 -932 -103 -463 -1290 366 -240 469 -57 806 419 143 202 42 -485 -250 -495 -301 193 -112
1162 -112 -490 -350 -89 213 -206 1 -342 240 149 -756 102 471 -30 337 313 516 -139 596 254 -208 -87
1183 -87 215 241 -339 -62 37 132 -577 492 603 -328 -11 432 -521 1158 -546 -22 -203 1030 40 194
1203 194 83 351 697 88 429 -455 -87 -269 954 198 -317 152 -15 214 -506 552 817 -642 754
1222 754 587 628 53 11 491 -498 -31 267 64 -271 -425 354 278 -123 -310 -83 -1094 -474 -834 -85 -288
1243 -288 666 -300 212 -251 -177 235 294 155 -533 -321 600 -191 55 734 777 283 -159 -1015 267 864 302
1264C02l9N9k71l79L86k57j08j87K87M42J03K33m96O7K20l73J94n80P51P86j580
1285d40O37J62j453P88Q4Q02o6o88l21Q85k95m14L19M35l83p94R63n95O33M52
1305G11j009P3LM46n30n56K75N35K90m2l32l9J17q53J400j479K06O47m81l76J669
1326F75N96j564l2J18j23N18L94j160N66l37J75Q14j320R00M7j78J09r05J008
1345C01P5n38M05j6j51k49J060m74m14M16j92K5J20q80M66k09k5j28P57P83j314
1366a82N35o93L6L90k04P39r18Q79j201o99J374p08K57P90j229N35P42j201J682
1385I24j192K20J09R6o18O27J65n3j57k11m69K89L2J029m61n24l12J149k41L31
1405G33q35k3J79j08k36m68j30R72j124J081l09O36K04p32R45q02p53J326o74
$$ plain form
1264 302 263 322 51 -328 58 -199 -307 -494 -207 235 338 571 75 142 362 -11 183 -397 354 1140 -440
1285 -440 197 359 -1094 -306 -222 580 514 -174 -495 390 95 -319 0 435 52 -742 221 -374 259 711
1305 711 -298 -225 -222 224 -306 -862 -587 -52 238 196 -136 -175 -58 -911 489 -990 -784 -137 -618 -994 675
1326 675 1271 -293 -325 -207 -330 188 582 -578 -12 -349 -174 640 -680 220 267 89 198 -707 301
1345 301 376 -162 243 227 76 -173 887 413 -1 415 223 248 368 -512 -46 -255 -280 -408 349 1132 -182
1366 -182 353 -340 -304 86 -118 621 -297 582 -619 -1318 56 -652 -395 395 -834 -299 443 -758 924
1385 924 -268 -48 61 157 -461 166 331 278 121 -90 -559 -270 -238 791 330 -194 -506 643 402 733
1405 733 -102 -125 54 -54 -290 -758 -888 84 -1040 41 -268 368 572 -160 785 -17 -770 556 -118
1424a18j35M13K14L61r90K93rn1K36R65p03p7K13j203k13O51M91p39N81N7n25
1445b88O12L55j030L99P4j85J73M54r14k61R39j77j14O43j429J114j090R11o15
1464d29O15M7l67j54o5L96o80J111r7l78j2O84j090J40L87M73k92k81O86o39k21
1485a66l59J141k83J07o02M64j26m80P36Pj008M00L05j70j013J116N65n78r03
1504h47L07P48J27j048R86l11O68K17q33j48L94ro56L69O8l22K88Q79m50o45m0
1525b58J33j33p2K44Q91n78K44k78M90o26J14k65L84l70m80R72k68J291j111r62
1545f38J543m28k77k83N61P9K85j172m61l81R12N66r98J024l61n23N95k41L36
1564A38p13N9K57L71O53n49k46p29M72R92p25K44k72P04p59m38K23L84m00J016
$$ plain form
1424 -118 -253 160 374 735 -255 38 29 -22 214 1179 476 399 612 -591 -804 -153 338 -401 180 237 -288
1445 -288 324 679 -351 48 122 -63 110 564 -350 -611 328 151 37 680 -749 365 -725 186 -429
1464 -429 186 233 -134 -288 -353 43 -637 474 377 -1 -13 671 -419 -279 108 581 289 8 694 55 -166
1485 -166 -525 616 333 440 -162 302 176 -304 432 439 -569 -169 136 -34 -1047 69 634 56 -847
1504 -847 -540 208 335 -713 273 -38 630 847 14 -134 260 251 -405 -36 32 -290 -2 877 427 -218 -258
1525 -258 -125 -258 -330 -86 805 227 471 193 683 57 171 -94 290 -80 -560 412 144 1435 324 -638
1545 -638 905 477 200 -83 478 557 842 -330 -791 -1172 -260 306 -692 332 -29 -552 43 -198 138
1564 138 -575 -516 -259 112 765 216 -30 -759 -287 705 -20 224 -48 656 -103 -541 -318 66 -334 682
1584F82j096j34M52QL56l5n81K90l39L85l48m63M46K81m36J144q51N29q3L25l19
1605B13j81P04m56N99m12p49j199J303P74m04j135Q16O5L90j22l02o51J378p37
1624a06j28O31l93O50n03n3N0L37K67J2j55j525J283m27l46J86L6J45k1N1l26
1645c35N06q3l82M94J69j54L76n14R2p80L19O20K10r00j40J035o78m29k04R47
1665A69k92K36k56k84O04J66Q4q32K56QP5L43Kn79n70J088q27L49K21k11p00J162
1687B12O51j154P41q20m2R6k36j64J536k45j057K79Q4p79L25J069k83M18p13k12
1707b94l50Q13k90N05R0r21n2m13P28l9K71n16L38L44j318N21N46M51j145Q34
1727A03K37n1r7L41o7j203P93k26L69J82p16m32Q39K73m36n4p4M64r10Q07l27
$$ plain form
1584 682 -414 -548 -96 -88 268 233 -348 -58 -397 -12 -360 -823 -377 -96 -532 612 -239 290 207 532 213
1605 213 32 736 280 879 467 -282 -1481 -178 596 192 -943 -127 -62 328 206 -96 -747 631 -106
1624 -106 -234 397 4 654 151 98 148 485 752 764 609 -916 367 -60 -406 -220 -184 -39 -60 -9 -335
1645 -335 171 88 -294 200 369 215 591 77 169 -611 -292 328 538 -362 -502 533 -145 -574 -778 169
1665 169 -123 113 -143 -427 177 343 427 -405 -149 -141 -66 277 279 -300 -870 218 -609 -260 -39 -250 -950 212
1687 212 863 -291 450 -370 -412 -316 -552 -716 820 575 -482 -203 -119 -898 -573 496 213 631 -82 -294
1707 -294 -644 169 -121 384 474 -447 -499 -912 -184 -223 48 -468 -130 214 -1104 -583 -37 414 -731 103
1727 103 340 289 192 533 466 -737 56 -170 199 381 -335 -767 72 345 -91 -145 -219 245 -665 142 -185
1748a85K86P14j330N2P61j165J378m68l12J093o40j03q31Q23k07jl29M97p4k06
1768b47j71J05K46o40M8J81L84P35p59k06J97O16n07m79L31j66K23O75n78N9P36
1789G83k63l5n99l55K79K8k29N25k3m1K48p1l88K31j73K01m17j126N99J111k97
1810a2o60M20J0j42P95p07l94O54P88r19L78q58J119m37M49O3q74O26N6j23l71
1831a39J07o11L43P50K3k63m35P2J55m58J90Q37o59p88J121o80R80r45K53J09
1851c8o99J015R4j47j16O98q57j48L18L91m65M6j65Q8m8N53K5j4m73p12J45K76
1873b33O93p52r31J615j87Q6j421R37m32R06l97M50K91n71p52k46P4J280q84J000
1893E26m98k13q7l28M1N84K51o6O13r09l4NL8m39Q46m66lL46m33R45m6j485N31
$$ plain form
1748 -185 101 815 -515 -463 298 -867 511 43 -269 824 184 81 -750 73 -134 -135 -464 33 -41 -247
1768 -247 -418 -313 -67 -707 -659 -478 -94 641 -118 -324 -127 489 -18 -497 -166 -332 -109 566 -12 47 783
1789 783 520 485 -114 -469 -190 -162 -391 134 111 70 318 247 -141 90 -83 118 -299 -1425 -826 285 -12
1810 -12 -672 -252 -242 -384 411 -296 -690 -36 752 -167 211 -647 472 35 484 547 -327 299 355 232 -139
1831 -139 -32 -643 -300 450 473 210 -225 -153 2 -456 -266 571 -88 -876 245 -435 545 -400 -147 -38
1851 -38 -737 278 372 225 109 807 -50 -198 120 511 46 92 -73 15 -33 520 545 531 58 -654 -509 -233
1873 -233 460 -292 -1223 392 205 291 -1130 -193 -625 281 -116 334 625 54 -698 -944 -870 410 -474 526
1893 526 28 -185 -272 -600 -559 25 276 210 823 -86 -120 -115 -77 -516 330 -136 -139 207 -226 719 673 -812 -281
1916b81O02J58J11o34L31k66k29P41j03o24J47L86L26j020k80P03J68p11j82K05
1936d52J080K13p88mj62j94M07N13R9j211L49j62Q44m42j85N65L86o55P29p85
1956A45%n93Q11M89p41p04L24J38j02J8N70L5J72j079J256J35j3n89o1R3j69n51
1978d16Q36m4o50j22R25O37j144Q6nK60l70k94J06l02L17M81r5r37J520l49l06
1999A34k25j88K11Nj56P92m96p9k24L97J92m62K62O84j50j214N96R2R50l83j250
2020e12J510j105P87j41o01M78o69J71P33j55n06l35j32O29J08o61N60j00K86
2039C45p42m93J276m13Q73r56k51Q5M58k68M34p58J00J22N3o38K97J378j164N89
2059C27k92j594J038M91Q44j170J87R14j315J97O15m77P84K55n00J4j132Q41L71
$$ plain form
1916 -281 321 479 590 -44 287 21 -208 533 430 -194 -47 339 665 -355 -635 68 236 -475 -657 -452
1936 -452 628 841 53 49 -113 -307 100 613 712 -499 -150 -312 532 90 -95 470 856 201 930 145
1956 145 145 -448 363 852 111 -593 -269 -131 -233 -215 355 390 562 -517 739 874 861 272 211 304 135 -416
1978 -416 420 376 -274 -396 529 1166 22 108 103 363 -7 -301 -195 -497 -180 301 206 -731 789 440 134
1999 134 -91 -279 -68 -63 -219 573 77 -2 -226 171 363 -99 163 847 697 -517 79 171 1121 738 -512
2020 -512 998 -107 680 539 -62 416 -253 -82 651 496 -10 -345 -477 152 260 -401 159 59 345
2039 345 -397 -890 386 -27 846 -110 -361 -276 182 -86 348 -410 -310 -188 -135 -773 -476 902 -262 327
2059 327 35 -1559 -521 -30 814 -356 -169 745 -570 -373 242 -235 549 804 304 318 -814 27 398
2078C98j121O27K15q6J90o40L15k66O57l71Q07j44n34O32j10L68l89q68m8J69
2098a99P80m41R6r61P61m83Q09j111J401r77N49M39r31L94m06M42j118J228k02
2117G0o70O53o20l1J518p90n74R04m06l36P6N46j37k60P24p75o4J37k00k85M74
2138d6q51R69M02o93R8L03o02O76j2M5J2n59J22J76N09r55Q11r8M9m18L39p13
2160d36L30R55O4j140n5j28R96j351O03L15j221N84N89m93p70J335l8p34L1Q22
2180B58n37q2J084k40j381J138m42J226m17j042O75l82L71l64J112q67L08o49
2198b31L65l12l0K32k22P85j282J029q31L23r8n96J805r72n67P15n53O28kr97
2218h11K31j52R45M12j14m79L55k31l27m43J361n76m00n25Q20N96o57m20P35J55
$$ plain form
2078 398 -723 -96 119 33 223 -417 -102 -368 289 -82 725 581 47 679 569 937 548 -320 -368 -199
2098 -199 581 140 236 -725 36 -447 362 -749 652 -325 224 663 -268 126 -280 162 -956 272 70
2117 70 -600 53 -567 -598 920 130 -444 460 54 -282 -206 340 203 -57 667 -108 -172 -35 -235 -520 -46
2138 -46 -897 72 474 -219 -121 182 -420 256 244 289 301 -258 -136 40 549 -406 405 307 356 -62 277 -436
2160 -436 -106 849 913 -227 -282 -410 586 -765 -162 153 -1068 -484 105 -388 -1158 177 139 -595 -564 258
2180 258 -279 -361 723 483 -898 240 -202 1024 607 -435 240 -142 229 -135 977 110 418 -231
2198 -231 134 -178 -208 24 -198 587 -695 334 -497 -174 -272 -868 937 -35 -602 113 -440 188 186 -811
2218 -811 -580 -732 213 625 511 32 387 156 -171 -614 747 171 -229 -754 66 662 5 -415 320 475
2238D75p14K95o16n58J406q62Q04p39K96J42K36k3k85J091n60j7k33P9p41J92
2258c32J026n63m19q2N13j31m94P92j14J03m36M32j109K44J07N87n59o46j55J218
2278a8N08j030J235n16o37J368Q2j317n10P22J27l76j51L54P66o21L29K96k74
2297C37n05L23M55j067M40l36N36O11j168P71r77Q18q39M79Q70j218L27q2K86
2316F1k03L82o64O98m40K49j2m98j04J04O26l03J75J40k82O1M73j112J308j029
2336c70L96l38L92J8M8k68P63J42M2j109N03M28j301J066J38j363P93J96o52N99
2356A23L6l67K24j2N60j032k12P46k8J20j69q21O79L20j478K350j396j03O57O40
2376H37r31N40J73q86M74k10J069n25r54K61O98m2j77r43J260j9J07l03J46k43
$$ plain form
2238 475 -239 56 -560 -1118 288 -574 230 -509 -213 -71 165 142 -143 948 388 371 138 217 -524 -332
2258 -332 694 131 -288 -370 143 12 -482 310 196 299 -137 295 -814 -570 -463 124 -435 -1081 -1236 -18
2278 -18 490 -540 695 179 -458 910 992 -325 -835 -113 14 -362 -513 -159 607 -14 315 611 337
2297 337 -168 155 610 -457 -17 -353 183 794 -374 397 -580 238 -601 -122 748 -470 -143 -225 61
2316 61 -142 240 -424 274 -166 83 71 -427 -531 -427 199 -104 71 211 -71 -10 463 -649 659 -370
2336 -370 26 -312 80 98 146 -122 641 783 825 -284 219 647 -654 412 550 -813 -20 176 -476 123
2356 123 159 -208 16 4 564 -468 -680 66 38 158 -11 -832 -153 167 -1311 1039 -357 -460 197 837
2376 837 -94 446 619 -267 207 -3 1066 541 -413 -152 546 504 327 -616 644 625 732 429 575 332
2396C32m40J55j14J024j550N54r7Nj73M04k65j25J72L04R0J45R3L20q9p29J21
2417A37q20O49M28j304O49M20N20j020l93N54M77o34L47l49P61o03oO66q07J334
2437A006j613L44l06M79J50Q75l18j136N58K35O0j75m29J88J30l3O39n16K36J27
2457E01j081J075l31q79R32M4k33L52O5l82P76j121K17m83J174r55l5j23K78J46
2477f3O09j362J693n87j247N68P18m79J3L38n88M90K57o63O83J74p7K29o92J21
2497A35k88L37l22J48K93L0Q90j316j82M12L16L04j078N24k38l83J85K37O45j454
2517h05P22P8Q2K31m40j64J061j69k99m08k04P49o2k93M8l39K26k92j42K99M53
2538C32k99j92j66M73qm88n3J12P97j400P90O71n90L54l47R7O18j201R24r55n00
$$ plain form
2396 332 -108 47 -67 957 -593 -39 -136 -131 -304 100 -165 -290 -118 186 276 421 514 834 745 16 137
2417 137 -683 -34 394 -910 -261 159 679 -341 -734 -180 297 -337 10 -339 422 -181 -187 479 -328 1006
2437 1006 -607 -263 -569 -90 60 935 617 -519 39 274 334 159 -270 -82 48 15 654 138 374 501
2457 501 -580 495 164 -715 217 261 28 380 445 63 839 -282 -65 -548 626 -329 -364 -487 -209 -63
2477 -63 546 -816 877 290 -957 -389 329 -150 -137 201 -387 103 360 -303 380 554 477 706 14 135
2497 135 -153 184 -138 10 303 333 1223 -93 -275 137 453 757 -321 203 -35 -418 -233 4 649 -805
2517 -805 -83 -5 77 308 -132 -296 765 596 297 -111 -315 434 372 79 127 -212 14 -278 -420 -121 332
2538 332 33 -159 -325 148 140 -348 -401 -289 508 -892 -102 569 -21 333 -14 83 701 -500 424 -531 -1031
2559a031N56P06r60k32M56M93J02p6j84L40P22r02l42J04l22L7J26J49R87j490
2579g61J222q7j137R99N10j012L84n54J211p04k63j20Q65j02q10O43J04p56P35
2598C67nk35m2o45K85P98k71M5k12j66n64l8P50k64J93j32K32L76j286Q82Q63
2619I31m26O39p27n85K85q01R72m68l06j80J008l44q0L80J8k59P14j10j354L69
2639c24L20P8K97n48n86M86J99J240j740J594j581O54m59J027r72m80N17O54l49
2658B7l20P05o26n02J044k55M5J76n7n52k8l01K24L56j56K03k39M10j064R65k69
2679b14l35M96Q4Q51l45r32J94j31L15p9k32J167q22K63j055n3M77L71m06J035
2699F49M9q69J88k3j82l17K66L97l57n00J287r48J91p36J301L94n82O35j087J38
$$ plain form
2559 -1031 -475 231 -729 -961 -505 -12 90 14 -170 170 892 -10 -352 -248 -570 -533 -407 -258 729 -761
2579 -761 461 374 -763 236 746 -266 118 -436 775 71 -192 -312 553 451 -359 284 388 -368 367
2598 367 362 127 85 -560 -275 523 252 297 85 -81 -645 -683 67 -197 -4 -136 96 472 -814 68 931
2619 931 505 1144 417 -168 117 -684 288 -180 -486 -666 342 -2 -82 298 316 57 771 661 -693 -324
2639 -324 -4 74 371 -177 -763 -277 -78 1162 -578 1016 -565 89 -370 657 -315 -795 -278 376 27
2658 27 -293 412 -214 -716 328 73 118 294 237 -315 -343 -644 -420 -64 -220 -17 -256 154 -910 55 -214
2679 -214 -549 -53 31 882 537 -395 -201 -332 -17 -96 -328 839 17 280 -775 -828 -351 20 -386 649
2699 649 698 -171 17 -6 -188 -505 -239 158 -199 -699 588 -360 -169 -905 396 790 208 843 -244 -106
2719a06J54m75Q50N1o32k69P4L65L37j33j93j12R31j312N88q8j94p19J564r81
2739c00P97m69L04l69j1M94p15O76l83o24N4K60j11K01J061p95l34O44p14N61
2759B27o67l41R71k14m54J305j092O4N65n55M31m65j88R57n37L28r8J69l33M68
2779E41o22l30P34o98R7Q45n09j31k72q4L76j1l37N73qq16J704m92m60N9L26o01
2801a16K17o67J94N23K26o36n38L00J552m71p64N32m01j88P65n86n67J573l59
2820E89p48K97j57m37N52J56q95J133j98n0k62K31j37P43j71N31j445J7o5O44
2840C28n34l64J01M97j133J461K38j34J97k65o12K07N74l07r25M46qJ54Q25j74
2860E72n34L46n4j358J727j059L34Q28k34j624J122n86J116j143kP36l65l74Q03
$$ plain form
2719 -106 48 -427 423 474 -158 -427 -353 12 349 216 23 -89 842 -470 118 30 -164 -883 681 -300
2739 -300 497 28 332 -37 -48 446 -269 407 24 -600 -546 -286 -397 -196 865 70 -264 380 -334 227
2759 227 -440 -781 190 -24 -478 827 -265 -201 364 -191 240 -225 -413 544 7 335 237 406 73 541
2779 541 -81 -411 323 -375 -278 567 58 -73 -345 -429 -53 -64 -401 172 164 -652 1052 560 100 159 485 -116
2801 -116 101 -566 -372 151 377 -259 -797 -497 1055 584 -180 352 -49 -237 528 -58 -625 948 589
2820 589 -159 138 -19 -456 96 252 -643 490 292 242 -20 211 74 817 646 1177 -268 -251 -316 328
2840 328 -206 -570 -469 28 -1105 356 594 460 657 392 -220 -13 561 254 -671 -225 -233 -79 746 572
2860 572 38 384 330 -1028 699 -360 -26 802 568 -1056 66 -520 596 -547 -549 187 -178 -552 251
2879B51J59k92l0R47o59O4ro19N75l68N43k12k75L20p41J3O55l82m88J472j109
2900a85K07J92m15L67n97K44P7J80j032l39J045K0pR5K39l68j51L87M60N17j718
2921g82J215R2k84o58J42K89K4M39k31l50l14K58m50M94K70q45J65J379M73j291
2941C5L7l17K44J6J020j402j53R76k56J41o6P09j164J57K50j11n74M41M86m03
2961F6n14m7oN14K78j101L73Q20n23Q16j082P50L4O60j546L07J84k00j25L88L35
2982C81l23K14L81q25m91R69n42l44M97m69Q99j438J579p60k25J038q24o2L72
3001B7K23M1p49L4l90M57O67l30M17n78l34q7J144k91j92n18R14q02J028o69N29
3022E41n12o29J155p89O42o00J075o30p44O69J91o35M33l45l34J444j559N95N33
$$ plain form
2879 251 410 118 88 1035 376 440 431 -188 387 19 562 350 75 395 -346 -333 322 -60 -548 924 -185
2900 -185 22 214 -201 166 -431 -187 -110 70 -962 -1301 -256 -236 -243 -148 91 -277 -428 -41 419 936 -782
2921 -782 433 525 241 -417 -275 14 38 477 246 -104 -418 -160 -610 -116 154 -691 -526 853 1326 35
2941 35 72 -245 -1 15 1035 -367 -520 456 200 341 275 984 -180 -23 227 116 -458 -17 469 66
2961 66 -448 -495 -501 13 291 -810 -437 383 -140 676 -406 344 378 1038 -508 -201 -17 -217 -342 46 381
2982 381 58 272 653 -172 -663 306 -236 -580 -83 -552 347 -1091 488 -272 -497 541 -283 -345 27
3001 27 250 291 -458 -424 -814 -357 310 -20 397 -181 -515 -602 542 251 59 -459 455 -347 681 12 541
3022 541 29 -600 555 -234 408 -192 883 253 -491 178 369 -266 167 -178 -512 932 -627 -32 501
3041E01k03o89M77j150P47p3M90K37n00j55O64r50R80j158J159N88j797J236p10
3060c06N81M4k63j96K82m55J107l69j125j44J063J56j9j128J36N62R6L1k18L71
3080B06j17k40l1P59q13pP90n92K72n59J76L99q26R13o63P32r21J66M65p82N43
3101a30n39P88j28q59N19j64Q09j017J285j137k20M47L25M44r61L51p67J391j013
3120e76R4K49K58O47n05r92M85Q5M32j27k71J062j424J037l23O18q76J7L2J41
3140F3K13N57j015K10k91L16M45j007M7J638j239J11m2J29m60m84J406l30J6p52
3160d69P1M42n80J305o57m58p7O52l66k72Q90n13J4O43q34M15k53j19O17l42p71
3181f62Q62J01m66n24O32L92J49j152O88m55l20L24M69j72P76n04j81o62j59O41
$$ plain form
3041 501 298 -391 86 -1064 -317 -390 100 337 -163 -318 346 -604 376 -782 377 965 -832 404 -306
3060 -306 275 319 56 -140 142 -313 794 425 -700 -844 219 375 356 -772 -636 -74 22 53 -165 206
3080 206 89 -151 -182 577 -236 -243 547 -45 227 -332 -156 243 -583 330 -333 399 -522 -356 109 -673 -130
3101 -130 -669 119 -9 -868 -349 -513 296 -721 564 -573 -793 -346 -21 423 -538 -187 -954 437 -576
3120 -576 -482 -233 25 672 167 -825 -340 -255 177 50 -221 841 -583 454 131 749 -127 -110 -78 63
3140 63 276 833 -182 28 -263 53 498 -509 -462 1176 -63 48 6 135 -325 -809 597 267 283 -469
3160 -469 -398 44 -536 769 112 -346 -423 229 -137 -409 481 -32 -18 625 -209 206 -47 -166 451 109 -662
3181 -662 200 301 -165 -689 -57 335 484 -668 20 -435 -755 -431 38 -134 642 138 -43 -705 -864 -223
3201b23P49N6o79K11j05o24N28O43r13J51oM87J23k88n95J12J289o19l63m46J516
3222A004p09q73J058r83Q56l1j00L01q22L94L00r88P91q04N7m1K75p1J024K74
3242I12m65j137Q21K77p7l9j209J470p29J013j215O26J05o64O84j48O72j674O36
3261a41L40L58m78n30j81J398p63q95K82R79p20K1Q03m71L92k05n96k88K69P67
3281C41R5j34l58O3p58J511m52K23j036O1L76j5L09q21O57o66M41jL57M19p04
3302i2K60m13p49J618j02o79R6L45o13O35m86p09J055j26k28J03k86N27p46P33
3322A43M15j172J56N49p15N44o17J25J414l63m88r2L16K24k4J89q71l8P01r20
3342e24J036k6j399J281n48n73J610j321L19l64P92N5j1l09K34j37n21L06L56
$$ plain form
3201 -223 526 582 -97 114 9 -615 -87 556 -357 -206 -212 275 398 110 -485 -373 916 297 -66 -512 1004
3222 1004 295 -578 480 -503 353 322 222 523 -299 95 395 -593 198 -606 -549 -590 -315 -386 638 912
3242 912 447 -690 131 408 331 292 -917 553 -176 837 -378 248 353 -311 373 225 897 -777 -141
3261 -141 199 557 79 -451 -632 766 3 -892 -610 369 -351 -330 473 2 394 189 -407 -695 -426 341
3281 341 436 302 -56 7 -751 760 308 531 -505 -444 -68 -83 226 -595 62 -604 -163 -164 193 612 -92
3302 -92 168 -245 -994 624 522 -157 -61 284 -329 306 -180 -889 166 40 -188 -85 -371 156 -590 143
3322 143 558 -614 -458 91 -624 -80 -697 -572 842 479 -9 -101 215 439 415 604 -267 -305 396 -524
3342 -524 512 486 -913 368 -180 -753 857 -464 -145 -509 283 338 327 18 252 115 -406 -100 256
3361B56k94L32J62o36O34R54j493P74n25k60k01N96q68Q91m27n45J435o08o05
3380d28K74J91j70P32p89O34q48N23p24P32l34O65j227J300r96n87J124o8O1m8
3400A7J40K34n24n31J408j300OQ07l22nq16J03Q52o35N66j6J33O01q0j315J50
3421e27M9J487j518L43M13k99L44k85m70J009q05p3n7M59K18K29k53j18m27l06
3441e87N79N47k47O68j843R31M35j109J201p89m30P53j91L00o32q6P37L95r25
3460b93M01o03M56l52l45M20R78m80p0l38Q03j598R21j00P20k54m00L24r44K03
3480e51Q04k8j58P39j096n40L89J066j487Q84J042j245L17L99n44L73q2p20K78
3499a60K84n56N88n70J05L38k78rN38Q3o34P02j75o20L7P43j388J061N57j108
$$ plain form
3361 256 -38 294 456 -180 454 1408 -85 689 164 -96 -297 299 -569 322 -105 -650 785 177 -428
3380 -428 -154 37 -133 599 -190 444 -404 119 -605 127 -207 458 -769 531 -465 -1052 72 4 65 17
3400 17 157 391 -133 -664 744 -556 -550 257 -65 -70 -886 -783 69 -566 0 -16 117 718 638 -677 -527
3421 -527 -478 1009 -509 -166 247 -52 292 7 -463 546 -259 -332 -389 70 288 517 264 146 -281 -587
3441 -587 -8 539 292 960 -883 48 483 -626 575 -214 -644 109 -82 218 -414 -500 237 632 -293
3460 -293 108 -495 -39 -391 -736 -316 662 182 112 -226 577 -1021 -100 -200 520 266 -134 190 -754 -551
3480 -551 253 225 67 806 -290 -830 -441 625 -862 22 1064 -181 136 535 -9 364 282 -438 -160
3499 -160 124 -432 156 -414 -309 29 -249 -258 280 363 -271 431 256 -364 -327 416 -972 89 646 -462
3519d62Q95m59j3J36r76J030m33K67p00Q30j8j2p02J174j308L5N37n42K53R25
3539D57j053J80Q49j312K448q39m7m36J98j17n90j94N34L43O58q66J31m29j24
3558b09n78P43Q21q41Q80o88m04j97N46K43j07Po58J100p97l79J93L93P07n31
3578B44m45q3K69M09p14R69o67j66N1m04L65j98Q4j76p02J122K69n16j95M65r6
3599a15O0L47o56J332j370N31l54J6O06M08j317J127j261M65j42M2R1J20L86M93
3619H09j098P08l18r60K91O31K42j01P5o37R96K04r61j50j85J78R96l26J53r48
3639d01J29K39k46j26J070j38n72N46n78J34M24o54K59L63Rr0Q9q65k32Q72k48
3660a6L79o42m72K36J308q31j88K43l61K34K70n92R61r88J16M24o43J302k29N72
$$ plain form
3519 -462 433 -26 -39 97 -879 151 -282 -15 -715 115 97 85 -617 557 -751 -716 -179 -721 -468 457
3539 457 -596 -416 433 -879 1569 730 683 247 445 328 -262 -456 78 421 1079 213 344 -85 -209
3558 -209 -787 -44 777 -64 816 128 -276 -473 73 316 209 216 -442 658 -139 -518 -325 68 775 244
3578 244 -201 -284 -15 394 -320 649 -18 -184 -133 -537 -172 -370 -286 -462 -1164 -42 227 -289 -484 -19 -115
3599 -115 -55 292 -364 968 -402 129 -225 -209 397 805 -512 615 -646 -181 -323 -281 -190 -70 316 809
3619 809 -289 419 101 -859 -568 63 305 204 279 -358 638 842 -119 -269 -454 -276 720 394 547 -401
3639 -401 -272 -33 -279 -405 665 527 -45 501 -77 57 481 -173 86 449 458 368 457 -408 -640 232 -16
3660 -16 363 -279 -751 -515 793 -38 -226 17 -344 -110 160 -432 529 -459 -343 81 -562 740 511 1083
3680A083r12q90Q96q40R26k94j96l39J09k90K02J71O32j56m67J50L59j93p98J610
3700G63r84j36m84J154l89M62p98Q60K58j652R75k92Q81l84m35n74n06J216R2
3719B7N1p4j32j77N04m12J35Q46l30m35j87m64O87j1m3M42n47K15K02q12O23o3
3741D5l04k34Q08Pm72R14j327J263j485J116p83N84r65P27j32P08q87k73R57m5
3761B22k86P9q8J62Q40r07k45M44k96O0k95J27K0P1N50r41P57m32K15j05k07N58
3783C03l77K77L37p50P4J79m56R9m68J261m38o3R1Q1M69p47m9N17m0k24O9J03
3805B48j87J7o21M14n3O28j24j93Q1R6p86Q59j142R16M02j011j52M02O99m03j63
3826g3J515j125j359J589m18o68O66K21O9K68j219N16M91k94j76j24K4m21K35
$$ plain form
3680 1083 171 -719 177 -663 263 -31 -227 -566 -457 -747 -545 -374 258 102 -365 -215 144 -49 -847 763
3700 763 -221 -357 -841 313 -76 386 -412 448 706 -946 29 -263 618 234 -201 -775 -1281 -65 27
3719 27 78 4 -128 -305 199 -213 -78 768 438 3 -184 -648 39 28 -15 427 -120 95 297 -515 108 45
3741 45 -259 -493 315 322 -150 764 -563 700 -785 331 -452 132 -833 -106 -238 470 -417 -690 267 222
3761 222 -64 15 -73 89 929 22 -223 221 -75 -15 -310 -183 -163 -92 458 -483 274 -158 57 -48 -255 303
3783 303 -74 203 540 -210 -136 43 -413 -314 -782 479 41 -22 69 150 619 -128 -177 340 300 76 145 248
3805 248 61 78 -543 -129 -182 446 322 129 210 306 -480 379 -763 153 555 -456 -608 -206 493 90 -73
3826 -73 1442 317 -1042 547 129 -539 127 348 417 685 -534 -18 473 179 3 -121 -97 -518 -283
3845b83m95L88k42M54l95L57R05j42n44l37M75j80j51M34k74M22r64P9J196m3
3865F60j213P67o69l3N07j61j13L15k69R9m49R74p00m07J511j093K00K24n49j16
3885e15J071p33j90q04J295M70Q1k42p34N86P55j91j275M23K14m58l46Q55l78
3904a16j77K80N60J99m80l24L56m6r2k7q83J200q92M61n70l63R93p5l49k17L21
3925b41j38P0j95J482j472O45K16p57N3l9M2K31j34j47n12O77P16k64p09J506
3945A030p14l47K51q24L1J511m34p55M40J03k72K38J16K42r2p35K00p24M12N10
3965A87K37n65L82r5l89O43m09q1o8n81Q00m16Q13p48M31m00J10P85n60j003O93
3986b34L9J80n58k09J439j025M32J7O67p11n90J69l34M57m00O72o7J43o61Q66
$$ plain form
3845 -283 -778 -390 -632 -178 -573 -216 689 547 3 -334 141 -39 -190 244 -30 392 -572 -493 703 660
3865 660 -553 214 -455 -488 19 -142 -255 60 -209 -110 -559 415 -285 -692 819 -274 -74 150 -399 -515
3885 -515 556 -177 -367 -1171 124 594 675 433 -301 285 1040 849 -426 -3 211 -247 -593 262 -116
3904 -116 -293 -13 547 746 266 -58 298 252 160 133 -750 450 -442 19 -551 -914 79 4 -345 -562 -241
3925 -241 -379 -309 -504 978 -494 151 367 -390 -337 -376 -334 -103 -237 -384 -896 -219 497 233 -476 1030
3945 1030 316 -31 220 -604 -573 938 504 -251 189 292 20 258 374 616 524 -211 -11 -735 -323 187
3965 187 424 -141 241 146 -243 400 -9 -90 -158 -739 61 -355 458 -290 141 -259 -149 636 76 -927 -234
3986 -234 -195 -15 -573 -782 657 -368 64 81 748 37 -553 -384 -718 -261 -661 11 -56 87 -574 292
4006B92K77l29N2j57k45K0k12k9L19qk23Q57o90j50O95m03k03P53p23l93J040
4027E40j061R64n30N5J067j515L66L92n68N62j194M65O80m07L86o29L65Q3j32
4046a11J39j063J286j85j52L49j434R60R98j002l40P42r10J005k12Q2j66J23o96
4065e87R2J37LJ688j916O81m72R2O21O98j133N61m56o5J63J76j062J027K66J08
4085F22o29l81L82o31N56m58O03N48n85o44j10K30Q83K22q51l13Q7J23Q17p88
4105c17J60P00o99o35R2J287p84o79J206j218J081m80J6p30J084j34O22m15j12
4124D5O2m01Q19o98L99J2o56r1j20Q02q49j36J134L25j828J465p62J34l16l07
4144i67J348m05m2M91k88j53p06J085k19m99M27l7K39r53m53J080P65p52Q40r95
$$ plain form
4006 292 569 240 292 135 -110 -90 -302 -331 -12 -20 -243 614 -76 -226 469 66 -137 616 -107 -500 540
4027 540 -521 443 -87 -32 1035 -480 -114 278 -290 272 -922 -457 223 -184 202 -427 -62 21 -111
4046 -111 28 -1035 251 66 -86 263 -1171 -211 787 -215 -555 187 -723 282 70 152 -14 109 -587
4065 -587 -495 -358 -355 1333 -583 98 -374 -282 339 1037 -96 465 9 -56 107 283 -779 248 514 622
4085 622 -7 -388 -6 -637 -81 -539 64 612 27 -617 -727 -497 386 608 -243 -556 -469 -346 471 -317
4105 -317 -157 543 -156 -791 -699 588 -196 -875 331 -887 194 -286 -270 -1000 84 -50 572 157 45
4124 45 107 -294 525 -173 226 238 -418 -509 -629 173 -676 -812 322 647 -1181 284 -478 -344 -660 -967
4144 -967 381 -24 -66 425 137 -16 -722 363 144 -355 72 35 274 -679 -1132 -52 713 -39 801 -194
4164a94L40l06K90Q3j06J87O03l44m44m45K23K47k21o14R17kJ97n10l06k48r6
4185g49P26J98l58M11K27K24r83J244l42q44j09M61j001J254m10n10J192k48l3
4204C50j048Q1J18L51K15n03N86J52q53P74n00N89M5O5j076J350n66O0L36o64
4224a38J45L3k38P89p14N3Q70q82m96P49R14o18N14p41l15O43j522J100K9K10
4244C85j72n42L6Q08J25q26M70k61r3J95k48J34O18j288P98l89L41J84N70j383
4264e38N84K5o3o3K15p32O20m39R05m19k09L60n32R24j010O86o92N1O38k69K51
4285B93K42r26L65O34o62M85k12p68J287r09P8j78k20n9M38K06m40Q18p11J01
4305a38J020m25q28K26m50K24K53n30k45J048N17m78k19J53l53M6m72L16M0J517
$$ plain form
4164 -194 146 -160 130 213 107 294 897 553 109 -336 -113 134 -87 -701 216 214 411 -99 -405 -653 -749
4185 -749 -23 175 -183 228 455 679 -304 940 598 -246 -355 106 -895 359 -51 -561 631 383 350
4204 350 -698 -617 -499 -148 67 -436 150 302 -551 223 -277 312 357 422 -654 696 130 190 526 -138
4224 -138 7 40 -198 591 -123 -70 800 -82 -578 171 1085 467 981 240 -75 568 -954 146 175 385
4244 385 213 -329 -293 515 640 -186 284 23 -70 125 -123 11 629 -659 139 -250 91 275 845 -538
4264 -538 46 71 8 -55 160 -572 48 -391 514 95 -114 246 -286 638 -372 314 -378 -327 311 42 293
4285 293 535 -391 -26 608 -54 431 219 -549 738 -171 -93 -271 -491 -550 -112 94 -346 472 -239 -138
4305 -138 882 457 -371 -145 -595 -371 -118 -648 -893 155 672 194 -25 128 -225 -179 -651 -335 -295 1222
4325A222j694n54N12Q20n0q73N18J572r89p2k34q99J312j514O56L40R7l39Q20
4344F51n03m87R54n90l09j22N58j15m9M60m26r8N30j465Q46Q24r81M05o19J23
4364d13n6r2J54K00K10p5l36J55k1N8K52K68l57k14J248r01m08j96O02j084J185
4385A79l19J77j17J51q32P71j85m78M32J88L63p41R10m49p51J292n42N79j07r44
4405d23Q22K70l47K64j07p52O12r61J445n84N0j37m30M30L6j537J297l85O6Q23
4425D52k18m88P05J43o75J31M35m58j94P15j047J68L05N3l68L84P88j88q40n15
4445g12L8R34p86P58N6O8l87M0P89j049k2Qj07P84j163N61L1L82l5l99p7K19P5
4468Fn66N18m08j13N49N52r29N48J18q0n11j54O81L01l20j96o33O57o0Q0P3k89
$$ plain form
4325 1222 -472 -1026 -514 306 256 -617 -99 1473 484 412 178 -721 591 -923 -267 73 170 -169 651
4344 651 148 -339 615 25 -284 -406 152 37 -12 448 22 -76 454 -1011 -165 659 -322 83 -536 -413
4364 -413 -469 -561 -407 -207 3 -72 -408 -253 -274 -216 36 304 -53 -267 981 80 -328 -524 78 -1006 179
4385 179 -140 37 -80 71 -761 10 -175 -653 -221 -33 330 -411 499 50 -701 591 49 628 521 -423
4405 -423 399 669 322 586 479 -273 339 -622 823 239 289 152 -278 152 188 -1349 -52 -437 -371 452
4425 452 234 -254 451 594 -81 50 485 27 -167 548 -499 -331 -26 27 -341 43 831 643 -197 -712
4445 -712 -674 260 -526 232 288 356 -31 9 798 -251 -273 -265 -372 412 -751 -190 -159 223 188 -211 -288 -69 6
4468 6 -560 -42 -450 -563 -14 538 -391 157 275 195 -316 -470 211 512 192 -4 -637 20 -40 40 113 -176
4490a76K83p9k7M76J05n38o62N87r28J153L20j210J71M98J049q01j94K02L37m98
4510F8o68O87K26p19Q17L89o95p70M59O43L40k55j70p46R00R4n00p74J145j746
4530a275J157O20p73L78l80j16O06L3l70J37m94P36j189Q74k71j22k93P35j037
4549a044J104q92P56K16j7q0n26O30o86P29l10j42J71j98p5j99L77J057l65K90
4569G96l30o54P75l28p52J520j012j14L00n93j89m3J209n01j96N04K30n38k07
4588a23R7N2M91pq49j93l03K16Q21q55P83o71N56o0O29j283P33l32l84J030n77
4609b29R79j81n91n83R05N84j155L53K19m49j02J017p13M07K47j317Q09N47r8
4628F49k7l55l82J60n60M40O4l53O73j072P93Q4k75L94L73j328P01m96Q35l69
$$ plain form
4490 -176 107 28 1 477 582 44 -618 -31 -959 194 514 -696 -525 -27 1022 221 27 229 566 68
4510 68 -600 87 313 -406 411 800 105 -665 -206 437 777 522 352 -394 506 600 100 -674 471 -1275
4530 -1275 -118 502 -271 107 -273 -389 217 250 -120 17 -477 259 -930 -56 -327 -449 -742 -7 -1044
4549 -1044 60 -832 -76 140 123 43 -483 147 -539 190 -120 -262 -91 -289 -364 -563 -186 871 506 796
4569 796 466 -188 587 259 -493 1027 15 -99 201 -392 -581 -624 585 84 -112 392 622 84 -123
4588 -123 -26 26 517 510 -339 -532 -835 -619 202 -653 130 -541 15 -45 584 -699 34 -298 -682 348 -229
4609 -229 750 569 -22 -605 300 884 -271 82 301 -148 -250 767 54 461 708 -609 200 747 649
4628 649 622 267 -115 45 -515 -75 -11 -364 309 -763 30 114 -161 233 606 -722 -21 -517 318 -51
4648e1l95N76R33p26k03N32r69K04j69k7j2M54k21k33K46m33Q68L60j429O23o81
4669g53N36K52M52n80J27L1l16R0n9Lm46P45k36j05M42L37J5m45j16m00n7M72
4691a1J64j3q50J673j339P30k51m98o38J4R67QJ153k052P94j47n47L61j41O83
4711F0K59l74J8J60J25k59l42j7k52L93O42q62l80N46M48j0p58Q94m4o83M01N92
4733E57q19R91l73l88K83j083J496m10j19n04J49N77j46k74K01P5k85K13K75m48
4753c2p97M80N8m1j58L36M3L75l89N40n49O71l02Q56k089J089K21n38k11l82J218
4774C99k67K94n10K27L09l29N22o85Q85k37j120N02P03q83J081j354M7K73R28
4793G85l61j81j53J5J37k13m79J88M00R7k40M19J49j79k20m75j13O60l97n29P44
$$ plain form
4648 -51 -446 130 1063 337 134 666 -303 -99 -268 -295 -307 147 -74 -307 -61 -494 374 734 -695 -72 -753
4669 -753 -217 35 487 -93 34 65 -251 -161 -220 -217 -663 82 -154 -259 183 520 535 90 -26 -426 -483 -11
4691 -11 153 140 -710 963 -376 354 103 -395 -1033 -1019 -52 -44 1109 -943 -149 -296 -843 -482 -623 60
4711 60 319 -55 -37 123 248 -11 -353 -370 -622 -229 413 -449 -829 -283 165 155 -603 291 247 -436 -35 557
4733 557 -262 729 356 -32 251 -832 664 254 135 -369 -220 357 211 -63 138 213 -72 141 416 -32
4753 -32 -829 -349 -291 -332 -490 -154 -111 264 -125 415 -134 537 235 1091 -998 91 312 -226 -437 -819 399
4774 399 132 426 -84 143 452 123 645 -40 845 608 -512 -10 693 -190 891 -463 -416 -143 785
4793 785 424 243 90 105 242 29 -450 -262 138 235 -5 414 563 384 164 -311 -424 236 -161 -690 54
4814E4M70m19n04J026k96n78j4K21o14R0Q32K73q22M44K64l10N86j181K63P19
4834E04q50M80r4m09j23M56o8P77q50N31n30l83K64K99m3K13p65J69P11p53K45
4855b19J24p1L50o27j75L67L13O87l05j79k10K80M30q07L55O0o36P70m41o01J41
4876c94N10m11M82nL43r58q9M43J6j30J89O54j006P91o54Q00j189J071m62m39
4896d38PJ399J89j667K79N0J90r3L11j32O20n44j09k34l06J153j183n09J546N7
4916E86l69l85l76L38J55j48R3l61j87Q73k04K46j93Kk6L3K37p59M59M03k82k58
4938a23k41N31j89Q1k66N36o44K73N93m36j91o95Q26K29j022J55M2N68N92p86
4958a67L78l63J73J28K66o20j07N66j10R9l88M94p90J404p42j81N03p86P09N65
$$ plain form
4814 54 524 105 -399 627 331 -247 -261 -40 -654 -564 268 541 -281 163 427 117 703 -478 -215 504
4834 504 -346 134 40 -369 -492 -36 -104 673 -177 354 -176 -559 -295 4 -39 174 -591 -422 289 -464 -219
4855 -219 -95 -166 184 -443 -618 -251 62 749 444 265 55 335 765 -42 313 373 -263 507 66 -535 -394
4876 -394 116 -295 187 182 525 -433 -522 -79 -63 -193 -4 650 -356 435 -219 581 -608 463 1 -438
4896 -438 -431 968 1157 -510 -231 -181 9 -84 227 95 715 171 62 -172 -478 675 -508 -1017 529 586
4916 586 217 -168 -544 -206 -51 -199 -106 -467 -654 219 15 261 68 70 44 77 314 -445 14 417 135 -123
4938 -123 -364 167 -22 59 -207 329 -315 -42 551 115 -76 -771 55 284 -738 -583 -541 27 619 -167
4958 -167 211 -152 21 149 415 -205 -312 254 144 243 -145 349 -441 963 221 40 543 -243 466 1031
4978A031j651L64L47M98j138J001p29M46k74K27K21j319R98n22O38J50j34N2J66
4997C72j226Q80l3l37K24O35m65L7j6kk19Q46r84Q92o74n63R37k44J31o03L23
5018h9J54n70l00J438o69o10M76N19m4k52K60O4p55P50O62m82R37j199j85j82
5038g7L40o68l22L02P20K59p86k77P88n04o3P74q1m42n28O64Q75p50p98P96P9
5059C01k01j50P65j709J532j618J777o35m57J299m97q65O08m6J22O2N75p70m21
5078c28P38j05M80j396P37rJ362j299k2Q8k22k50M74N8r4k17k15k85M07J50j133
5099a081J474R56j528m55J4J122n18k74m95M91l86L5J445q98O12k28J56o50j75
5118c83nR42p05j61J63J88l29P17k5p92J56o1l27O91M37j044N93Q23j384J188
$$ plain form
4978 1031 -620 -256 91 589 -549 452 -277 169 -105 122 343 -976 22 -500 138 288 154 206 372
4997 372 -854 26 -7 -344 -120 515 50 87 71 69 -150 696 -288 604 -70 -633 304 60 191 -412 -89
5018 -89 65 -505 -805 633 -36 -646 -170 349 305 53 313 377 -378 372 1034 552 1489 290 105 -77
5038 -77 263 -405 -727 -425 295 554 -232 -509 279 -225 -288 486 405 -37 -565 99 974 224 -574 222 301
5059 301 100 -50 715 -994 538 -1080 697 62 -395 904 407 -458 150 104 226 288 863 93 -328
5078 -328 410 305 785 -611 126 117 1479 180 158 246 24 -226 248 306 212 -5 -220 -505 -98 52 -1081
5099 -1081 393 1349 -179 -634 -620 502 -16 -290 -785 -294 -680 -645 800 -98 514 286 442 -208 -383
5118 -383 -388 554 -151 -312 -149 39 -290 427 402 -390 -234 -295 -622 69 506 -538 55 878 -506 682
5138F82n95j38J67Q53n71j52j219P17N04m39m16O89k07q4M29k38j87N71m51Q39
5158G54m75o34l38J503j342L68L69j344J362k29K5K8n41M11m8l97O18k1k45P12
5178E36r75R59o88K53p82J730j284k34J030o84M85k84k33K26n74P09K44L23m78
5197B79L7M24r26k4K27n62P16r57R05N51j793J062l03M56K01o74m65N34L59l74
5217c27P45k65q04O63n79P69q71O79J68p35n41L84J222n09j18J30K22j57M6J41
5237B63o13M37K83q31J57O6k05K82j271K025q11n06j6J367j454J143k06N75j822
5256a137N93O38k69J140n76p91P86p83N89r84L74J184j305j01O43q3n05J42j96
5275f41O11k41O04m07M53m52r14M86O89j185Q87j00L46j64n54j57J644j703J419
$$ plain form
5138 682 87 -51 116 969 398 246 -973 -256 248 -191 -607 82 -125 -209 220 -18 -205 366 -85 754
5158 754 279 -355 -693 810 -532 -164 205 -1139 223 -6 19 47 -494 -83 -131 -528 90 69 -176 536
5178 536 -439 520 -168 85 -697 1033 -251 -485 545 -139 346 62 -171 55 -519 190 434 757 279
5197 279 316 740 -186 -210 17 -545 171 -786 119 670 -1123 -61 -364 92 293 -381 -846 -312 47 -327
5217 -327 418 153 -651 12 -567 202 -669 10 178 -557 -1098 -714 508 -1 -119 11 233 76 122 263
5237 263 -350 87 370 -461 -304 -238 -443 -161 -1432 593 -218 -724 -740 627 -827 316 110 685 -1137
5256 -1137 -544 94 -175 965 389 -402 384 -399 190 -794 -420 764 -541 -642 1 -82 -587 -445 -641
5275 -641 -30 -271 333 -74 379 -73 -987 -501 188 -997 -110 -210 136 -28 -582 -739 905 -798 621
5294F21L73p01l17p65K67j30K10K40J01k21K98K99L58r88Q03m35r0n88N76Q3j6
5315b2M09j274Q83O2M88j072k98O31j74J15K02P16r03L01l46j05K31J97J07M65
5335F13l21N2l10p57K99R9P80o11M86n30j94M45l58k43M9J000j070J040m46K25
5355B48J25m68K86n63J03m13J390j693R36J14O33j096R00k63P8M48o65L87k03
5374B84n18M28k5m29J096m63l09m7J94k4n85N10o47L17P30r95J24L96n26j94J169
5395D86o16q7K19j21L70p5m81J90l9nL99Q5j15K89p23L06p67P45K4J76L36k56
5417C40J08p41R77n06J29k13J57R73m44j252j92j34k17J366k60p85K56R33l09
5436A86k01m26o9N71j97K51n12N50k84n51Q73m56K05K16L8O03n00L07q99K71j147
$$ plain form
5294 621 994 293 -24 -789 -522 -652 -442 -202 -101 -322 -24 275 633 -355 448 13 -77 -665 -89 -6 -22
5315 -22 387 -887 -4 58 546 -526 -824 -193 -367 -252 -50 666 -237 64 -282 -387 -156 41 148 613
5335 613 292 344 34 -723 -424 -325 455 -156 330 -200 -394 51 -307 -550 -501 499 -571 469 23 248
5355 248 373 -95 191 -372 -269 -682 708 -985 -49 65 698 -398 502 239 317 765 100 487 284
5374 284 -234 194 169 -260 836 373 64 17 211 187 -398 112 -535 -218 512 -483 -359 37 -489 -683 486
5395 486 -130 -217 2 -119 251 176 -305 -115 -154 -159 240 325 210 499 -224 82 -685 60 84 260 596 340
5417 340 448 -293 684 178 307 94 251 1224 780 -472 -664 -798 -1015 351 91 -694 -438 495 186
5436 186 -15 -441 -510 61 -136 115 -397 153 -131 -682 191 -265 -60 156 194 797 297 604 -295 -24 -1171
5457a171O38P82J23o78L37j7%m60O01Q3K11n49pN22M59r20N25l18J61k60N1K61
5479C74L98j261R4K75k51J40j03P60p28J285j557J300j054n7P92n80J65J79O22
5498G93o09J87L18k72q10J071j812J429o96Q23k42j49m52M6O22n13Q58J5o27p9
5518i9k46J39K37O02q51N31q42J6M98K58k10l74L98K33k40O01n20k2P51n53m51
5539a44O53l86J02M78j425Q48m90N52M11j306J415o76K63o20MJ89O69p39J41J32
5559G1k38j49K08p3N43n26l94J970r60o24k01N9l79N50M48n83k26J20k07K36n72
5580i27J488m88j05J31j40K07n47Q97l1q56N04m77n59J891j572J106o83K17l73
5599c17l56J205j56k26k37Q88k9j047N65j061N4L25K69O10o46J20k88N42J081
$$ plain form
5457 -1171 -533 249 372 -306 31 14 14 -446 155 238 449 -100 -107 415 874 -46 479 161 322 62 113 374
5479 374 772 -489 -395 -120 -371 -231 -334 426 -302 983 -574 726 -328 -385 407 -173 -8 171 793
5498 793 184 371 689 417 -393 678 -1134 295 -401 422 180 31 -421 -375 247 -266 592 607 -20 -99
5518 -99 -345 -206 31 633 -218 313 -529 -513 -15 243 33 -341 57 290 50 651 131 109 860 307 -144
5539 -144 509 123 225 703 -722 126 -364 188 599 -707 708 32 295 -325 -321 -132 537 -202 -61 71
5559 71 -167 -316 -108 -181 362 -164 -558 1412 452 -172 -373 -314 -693 -143 305 -278 -504 -384 -591 -355 -927
5580 -927 561 73 -32 99 -41 166 -381 516 485 -371 133 -344 -903 988 -584 522 -161 56 -317
5599 -317 -673 532 376 150 -87 801 772 -275 290 -771 -717 -392 -123 487 -159 -39 -327 215 1296
5618A296j186O36n24K2n40L46m30K50K16p91O01K24p67Q25k99J106j335k65O15
5637@r9m75r8J246r09N18m07k43P96m7j173J669j067K26o9l91M72J90L24j12k54
5658I7l52L62p3j18k79N00l34n99l0J063n80M62L88j27K68r39n0P34j91M02m95
5679A09J05O25j459O3Q39r34P05n72J013o07M23K33k32p13P63P0m91P61j249K63
5699b85p4J051p57n83M90O59p87N89k34N36r74N66O58j90l60r2j37n6K95M50o46
5720A19l67O84k82p2M12l56m54K06j00J19K88m55n30J297j233J382j31n41o59
5739f73Q48M39n28L04j92l97N76n38l00M92J10K8N02n12q22P48N15m0o22j52L
5760b11O15k43j394Q80L84j25K24K91j54L21j010L5J003j315L62J09j43L10M59
$$ plain form
5618 1296 110 746 222 244 -296 50 -380 -130 86 -705 -104 120 -647 178 -121 985 -350 -615 0
5637 0 -99 -574 -672 574 -335 183 -224 -467 329 282 -891 778 -289 -63 -132 -523 -51 139 463 351 97
5658 97 -255 107 34 -84 -363 137 -197 -796 -826 237 -343 119 507 380 648 -291 -341 393 202 604 109
5679 109 214 839 -620 -557 282 -652 53 -519 494 -113 310 543 311 -402 361 431 -60 701 -548 -285
5699 -285 -359 692 -65 -648 -158 501 -286 303 69 605 -369 197 855 665 305 213 76 20 315 765 119
5720 119 -248 436 154 82 494 138 -316 -110 -210 -91 197 -258 -788 509 -724 658 527 -14 -673
5739 -673 175 614 86 390 198 -199 377 -161 -461 31 141 169 671 159 -663 85 600 560 -62 -214 -211
5760 -211 404 161 -1233 -353 31 -94 130 421 267 588 -422 -387 616 -699 -337 -228 -371 -61 398
5779C98l31j012K17J175m61j6j30L71M77j384k55L20J068p19L23J76o37l70J041
5798B51o35K4O29km39k93Q20j238L71K79m5J32j07N10K88j118R86N3l90m78L15
5819h7k16L66j59P5j4Q29j956O55o47J549l59k0K02k12K86m61J45r1P58R8o18
5840A23J42p06N72j028M04P3M27j92j72n28Q48J110j439Q73o80k07l63J006L41
5859F04l39P75r17j93Q81p78J46j87O56p09N03m43j38J26j49r54J096j45M42p04
5879d27J309k09p32r16O83n38J472K62p38O82j003N55r31Q24J00m85k05KQ62j20
5899D47l19o4j54l15O73q47Q78q08J396q66l28P59l47K85n33K14k51l44M68J61
5919A05r72J172j104J245L08r84R2p62R38O07m15m20l53O80O9O04K16j292R2Q86
$$ plain form
5779 398 67 -945 -728 447 -14 -30 -160 211 688 -696 -951 -631 437 -282 41 217 -420 -790 251
5798 251 -384 -360 269 267 -172 -465 355 -883 -512 -233 -278 -146 -253 257 545 -573 413 466 76 -402 -87
5819 -87 -303 63 -96 -21 -35 794 -1162 -507 -1154 395 36 16 218 6 292 -169 -24 -115 643 741 123
5840 123 265 -441 131 -897 -493 -420 7 -185 -357 -885 -37 1073 -366 507 -173 -380 -743 263 604
5859 604 265 1040 123 -70 811 33 179 -8 648 -61 442 -1 -139 -13 -162 -1116 -20 -165 277 -427
5879 -427 882 673 -59 -975 -292 -830 642 904 166 848 -155 400 -531 293 393 -92 -297 -295 567 447
5899 447 128 64 -90 -405 268 -579 299 -509 887 21 -307 452 105 390 -143 71 -180 -524 -56 105
5919 105 -867 305 -799 446 754 -230 -138 -900 38 645 230 -190 -543 137 206 810 1026 -266 -174 712
5939G12p26k57K44m44l41J062j56j37P82j284J268o79K11o82O54o72l61N42P26
5958D62q61M29j40O18k60k12N75o02Nk58M43m27Q15n70K42m02J63j68L85q26Q73
5979B84n13J60m28J163j280L23k07N85K74j40L06O0k25k51M80m08l50J241j216
5998a42L79q9l93N85r31J4j21R95p64R4N12J77K66p66m24K61Q70l48M23j00j328
6019h30N56J44k12J31l23Q41o67O02l98J31L82K02l62Q02j098n22N87K66q3K9
6039A78k92L17L73p5m57j83J549j062p96O97j33Q2M72k29j019M21L16R1j24K73
6059C99j99l28J14m20J53L48j96M01j3l68l1Q00j209K23N89p40M97L2J12p86J500
6080H78n80o63P92O5p38K83r39L51Q31k64j22J7J35m3o6j09qO21j073Q65l76K51
$$ plain form
5939 712 -14 -271 -27 -471 -812 250 94 -43 739 -545 723 44 255 -427 227 -445 -806 -264 462
5958 462 -399 30 -110 508 248 36 611 9 14 -244 199 -228 587 17 259 -143 20 -148 237 -589 284
5979 284 -229 -69 -497 666 -614 -291 -498 87 361 221 527 587 362 111 591 183 -167 1074 -142
5998 -142 237 148 -245 340 -591 -577 -698 297 -467 -373 139 316 582 -184 -608 -347 523 175 598 498 -830
6019 -830 -274 -130 -342 -211 -534 307 -360 242 -156 -25 357 559 197 999 -99 -621 -34 232 149 178
6039 178 -114 203 576 501 44 -139 1410 348 -448 249 116 198 670 441 -578 -157 159 250 126 399
6059 399 200 -128 -14 -434 -281 67 -129 272 259 -109 -140 660 -549 -326 263 -477 20 52 164 -622 878
6080 878 298 -365 427 492 -246 37 -902 -551 280 16 -106 -89 46 3 -63 -172 -180 441 -632 233 -143 108
6102A08p98P32M02K56L61j157O99o78j39K26q58Q64J171j254N86o70M73m43L96
6121B77k70r3K00Q51q78P62m45l88R57r49j304J862m10p23k5O96K21k70j024J179
6141B26k37J94j75o5J460j451L20p79P12j25o98K95K5J341j518N08L41j005J396
6160G65j422J310j120M70N98j116P91q0P94p13p2r10K96M71j406J454L88n64j73
6179b39N27k35k2O04q06k44J84M93r87N32J99N36m53m55N1M12p44L43J517j537
6199c24P53n52L39m40L07L73K96l63R24q95l98k07M07J38m22k77R88J02o33N8
6219A74R64n69P8o31J42Rn20P51n76k61N03l89O89m69P27k48k11L9J94n08K21
6240A09n77m82J155j058O49J8j72J77K07J99j91l96J3J007j180M5O15L67j8oj07
$$ plain form
6102 108 -690 42 444 700 1061 -96 603 -75 -214 12 -846 18 1189 -65 521 -149 324 -119 277
6121 277 7 -86 114 965 87 849 404 16 973 24 -1280 582 172 -551 -576 120 341 71 -953 226
6141 226 -11 183 8 -57 1403 -48 272 -507 205 80 -618 -323 -298 1043 -475 33 374 -631 765
6160 765 -657 653 -467 3 601 -515 276 196 990 277 205 -705 -409 62 -1344 110 498 -66 -239
6179 -239 288 53 31 635 -171 -415 -231 262 -725 -193 6 542 89 -366 -315 97 -647 -304 1213 -324
6199 -324 429 -123 216 -224 83 456 752 389 1313 418 20 -187 220 358 -64 -341 647 749 116 174
6219 174 1138 569 647 16 158 167 -353 398 -178 -439 64 -325 364 -105 622 374 163 202 396 -112 109
6240 109 -468 -950 205 -853 -204 -186 -358 -181 26 225 34 -362 -349 658 -522 -477 138 505 487 481 374
6261C74j203P10L98N0o38M55J40n82N51l72k53N14K6J60m03O33j093R9P97M02
6281G65j00j015N88m57Qm31O56j118R70Q82j23j127R21M64j448J182m77p95l11
6300i66J105j81K90P4j94l29N34o58k46J360j20k62n16j53P99m60L90l29M90p63
6320a35J556j971Q69j062J079m14K67L81n88l92J35j52Q65j06K86j012J28J64
6338a02M22n40q2P27j052K51O30k81l84J368q98q83M76M34o16L15R9J78l16N44
6358B90j49K88j250O45J40P79p64l05K31k90R89n80P10n72N99q24j6J7j71J24
6378a09K83k44J75j64O0m09M5J099q14o26l76R39n52O16K43N5k85O26r28M37n92
6399e21k95N80o4j14l2M04m66M13L85l38m19N79m19L25O64n38O5J24Q4k42K44
$$ plain form
6261 374 -829 -119 279 329 -309 146 286 -296 255 -117 -370 144 170 330 -73 560 -533 -434 363 765
6281 765 665 -350 238 -219 -211 -642 14 -1104 -134 748 625 -502 419 883 -565 617 140 -655 -966
6300 -966 139 -42 248 322 128 -201 333 -325 -571 789 669 407 -109 -262 537 77 467 138 628 -135
6320 -135 1421 -550 319 -743 336 -78 189 570 -18 -410 -275 -427 438 332 618 -394 -266 -102
6338 -102 320 -220 -302 425 -627 -376 254 -27 -411 957 59 -824 -348 86 -530 -215 -116 62 -254 290
6358 290 141 429 -821 -176 -36 743 -21 -326 -95 -385 604 24 734 162 761 -63 -79 -62 -233 -109
6378 -109 174 -70 105 -59 1 -408 -363 736 -78 -704 -1080 -141 -693 -77 166 221 -64 562 -366 71 -521
6399 -521 -816 -236 -300 -414 -446 -42 -508 -95 290 -48 -467 112 -307 18 682 144 209 333 417 175 419
6420D19o6m27j48K05L7m70J097o77j99l04O71l68J087p27m40p16J041oM92j23
6440C78j898J065K19M88k23K66m68J01p28P93o43M40l1p7J098r85n87L04O28M88
6460F28n27m32J150n07q90R47o44k54J409l99J20k17q37k07J340j028Q43j220
6478g25J109p91K41O80n70j7k68J304o84r07R6Q45o50P47l98o22K88Q65L6n42
6498C7L41l58l48j77P15o26L62k08R62p32o99O50k15R6N20q0L5m28K37j45L07
6519B46L0n54M45J55j68l49N97q71L38N19K92k72p22R08r18j7K28P57m57K94r80
6540d99Q9L72k44N46L66j663J132m03J144j890Q53K49n24J230r04o43L92J041
6558F44n86J186j953N61k11P97j82m14Q50o04m77K39J9k3K31J49m56m30R75j7
$$ plain form
6420 419 353 -74 -222 -17 20 -450 647 -30 -229 -533 138 -230 857 130 -310 -1026 15 9 501 378
6440 378 -1520 -455 -236 252 29 295 -173 -72 -800 -7 -650 -210 -241 -318 780 -205 -792 -488 140 628
6460 628 101 -331 819 312 -578 369 -275 -529 880 481 601 384 -453 -660 680 -348 495 -725
6478 -725 384 -407 -166 514 -56 -73 -341 963 279 -628 -532 313 -337 410 12 -610 -322 543 579 37
6498 37 378 20 -328 -505 210 -416 -54 -262 700 -32 -731 -81 -296 -200 320 240 275 -153 84 -61 246
6519 246 276 -278 167 322 154 -195 402 -469 -131 388 680 408 -314 594 -324 -341 -113 644 187 481 -499
6540 -499 -410 -38 -282 264 630 -1033 99 -304 840 -1050 -197 52 -472 758 -146 -789 -397 644
6558 644 58 1244 -709 -148 -359 438 256 -158 692 88 -389 -150 -131 -154 77 226 -230 -660 315 298
6578B98j93j64n81J61m80Q55K60l57O78j30p76J4L8m18R07K28j97j92M87q33l62
6599g57J94J258j580J543p37l41K64K47N88r16o33Q41r6R10j528N15J43P8j41
6618a48J69L18p42J089o63m37K17P22L91j772Q80L99j249M30K62J92n75J074p99
6637b42L13n04K87k50N58M1p27Q05l92J02o4L49j064M45l24J267p43nM51n89K57
6658b9O7L41p7l96O46q73nJ23M32M4r72L00L15O6n93M08M06n07J70j58J188j587
6680f91J022K3o68R68l80l72k13K04R94j555J23M78K80m67j39K34k43R78r88J276
6700H64j128K40k42P61p7o40P96j051l87P95P0K51l21M94l93o10J306m73j013
6719g58P02K10q55Q47j71k14J59J13L6k97K36n02p6n34J420o49m0P16k7o13J33
$$ plain form
6578 298 105 -59 -640 -479 -959 -104 156 -201 477 347 -429 -415 -377 -795 112 340 143 -49 438 -395 -757
6599 -757 -563 695 -885 658 -79 -420 -156 91 679 -237 -870 -29 -125 785 -743 -228 -85 -7 -148
6618 -148 21 339 -403 686 23 -414 -197 525 916 -856 24 423 -826 -396 -134 58 -517 557 -242
6637 -242 71 -433 -146 -396 162 203 -524 281 -111 -9 -73 276 -788 -343 -667 600 -143 -148 303 -286 -29
6658 -29 38 379 302 -94 552 -321 -326 -203 229 273 -699 -399 -84 -18 -611 -203 203 -304 -134 -292 896 -691
6680 -691 331 354 -314 654 274 -98 -311 -107 887 -668 -545 -67 213 -254 -393 -159 -402 576 -412 864
6700 864 -264 -24 -266 495 418 -222 574 -477 -864 -69 1 252 -69 425 32 -578 728 255 -758
6719 -758 -56 154 -701 146 -25 -239 -80 33 69 -228 8 -494 -570 -1104 316 -333 -373 343 316 -297 -164
6740a64p1m39Q72m33K68n12M89O04l3o60K96K38k06r79l68J120k49n47N10P09
6760D45q41P10j029J078j19J250j676N40p81K36M37N59j073J88k28R19o3o52K08
6779A08n59Q20J45k81r1j060J032m3p87P03K00K06k14p97R11L3q01Q86j020j44
6799g53N24k20M99K27p07P39k64L68J79m18r21K84L79P08o98p38J188q91J257
6818G42k07q90K64J7N68n25K37j75N67L92l82k76j63J19K40n41M07J47k90l99
6838a48L26m50K25o51J024l23M40o93J58n52P14k03O20j448J084n57j28O76M11
6857E25p28L6N76L69j049J54m79J374j434R25m87K32Q60j108P35J46k79p0p08
6876d10R77j23R59j706R96j585J150J59l43o66L18O44n10p15R78M10q02%L28p4
$$ plain form
6740 -164 -235 -674 198 -235 33 -479 10 614 581 -79 217 455 249 -730 -1098 22 -227 -774 -264 445
6760 445 -396 314 -715 363 244 1494 -182 358 -423 -187 250 809 -264 -76 -304 615 552 -100 108
6779 108 -451 369 514 233 142 -918 114 71 -716 -13 187 393 179 -618 293 326 -475 411 -609 -753
6799 -753 -229 -449 50 277 -430 309 45 413 592 174 -747 -463 -84 624 -74 -812 376 -515 742
6818 742 535 -355 -91 -74 494 -31 206 31 598 990 608 332 169 288 528 -13 394 541 251 -148
6838 -148 178 -272 -47 -698 326 3 443 -250 -92 -644 70 -133 487 -961 123 -434 -562 114 525
6857 525 -203 -167 409 778 -271 -117 -596 778 -656 269 -218 14 874 -234 501 647 368 298 -410
6876 -410 567 444 1403 -303 693 -892 258 417 74 -592 -274 370 -140 -855 123 533 -269 -269 59 -15
6896a5L10M24j039M74n42l03L35o80m0P46K31l23J78K40m73J007p71R07j359N37
6916a56L34m19J35N19p24K30o0k36Q73k98M3m83M05o02L17l30J92m25j64J281
6936D32p7j22j61L75r39O97q4Rm73J99P99j523P7J070J46o03K42n05J20J4K4o56
6958i39Q40N87o65L77j91p45M7J508o94q29N85N28J07q82O64l07M91r52n5J193
6978F68j066j14N19K69K58r99L09o1P68m78r59J018p48L68m23J166o26K49k37
6997a19M97N32o08o60J135j548O22O39j023Q85J16q28m83N71L76j42Q35oj201
7016d10J660k64j050n04M84M80j93n69N6M85j23l37j82l40M40oJ323j100o30J045
7036B65m20L92n47M17q5Q4m75N44N47n66K0j108J417p48k8L65q4P45k107J127
$$ plain form
6896 -15 295 719 -320 154 -388 -691 -356 -1036 -1076 -330 -99 -422 -244 -4 -477 530 -241 666 -693 -156
6916 -156 178 -241 -106 413 -311 -81 -141 -377 496 198 241 -242 163 -439 -122 -452 -260 -685 -849 432
6936 432 355 233 72 447 -492 205 121 130 -343 -144 655 -868 -791 279 425 -178 64 -441 -321 -307 -283 -939
6958 -939 -99 488 -177 200 9 -736 -689 819 125 -704 -119 409 516 -366 298 -9 482 -470 -525 668
6978 668 -398 -512 7 276 534 -465 -156 -217 551 73 -886 132 -616 -248 -671 495 -131 118 -119
6997 -119 378 910 302 -358 777 -771 -149 490 -533 352 468 -360 -843 -272 104 -38 797 791 -410
7016 -410 1250 986 -64 -568 -84 396 203 -366 -310 175 52 -285 -467 -807 -367 -373 950 -150 -780 265
7036 265 -155 237 -310 107 22 106 -369 175 722 156 176 -932 485 -263 -291 74 -10 735 -1372 -245
7056b45o12R19l9o21J283k57k18L08J31k18L52m5m04K77m93K80o0o07O34m74N59
7077D50r91O78o81Q01l77l04j88n35P99J37L06L14p26l34N05l42L2N46J58m01
7097a53k08O6p1L35j02K7L96l52N5j28p35J310o18k69J448j873P46L56j066N86
7117b50L18O28n08j5J41J24j599J124M1n71j28O44n38M4N96M11p39J255n75j018
7137f15J07N79k99N06o0K29K70N6l20j006J129m23p15R3p6O27O69m93q25P7N79
7158H9l75M27j24o00N99r5J60m32O22j91J52k80L19o70P78o89N02N92j29m37K8
7179B46O3q05K52K34M58k27k09q77J046m78J241q87p57Q53j31k3N11rj364J224
7199C61k77l40q42J586n91L51J5n09O3K91j4k29r8L45j82M29j68j92O26j372J010
$$ plain form
7056 -245 -857 62 23 -598 685 428 210 518 649 431 783 738 334 611 118 398 338 -269 365 -109 450
7077 450 -541 137 -544 257 -120 -424 -612 -1147 -348 -211 95 409 -317 -651 -146 -488 -456 90 248 -153
7097 -153 -361 -295 -366 -31 -133 -106 290 -62 -7 -135 -870 440 -178 -447 1001 -872 -126 230 -836 -250
7117 -250 68 696 188 173 314 438 -1161 -37 4 -567 -695 -51 -589 -545 51 462 -277 978 403 -615
7137 -615 -508 71 -228 278 218 447 717 773 453 -553 576 153 -562 -469 -545 82 751 258 -567 -490 89
7158 89 -286 141 17 -583 16 -79 81 -351 271 80 232 -48 271 -399 379 -310 192 784 655 218 246
7179 246 309 -496 -244 -10 448 221 12 -865 181 -297 944 57 -700 153 22 -1 510 501 -863 361
7199 361 84 -256 -1098 488 -103 248 263 -246 -183 108 94 -135 -233 112 -70 359 191 -1 625 -747 263
7220B63p45O6J29K91P0j63K31K52m78J236k018k64J928p95k12Jk71O5J45J36N35
7241D02r69n49J840j51l74Q74j637J49K9Q81q05m57J001p6l05P11j188K04K34
7260a86n26R67Lm50L63m06P09J17m16K5l05O63m33k54J33l05L66K24K93m09k44
7281g1Q3J26m85k40R48K22r50l46O1R75m85K99L90n05J57k54M88k74l94N56o00
7302b99N96l66l80K66m33K33Q91m59j004J479L32j170Q83q81L19Q52j454R58j41
7321B22l84N54l12n05L84o20O62N69k42J1J51l29n03K96L90J12n81o41J917j602
7341d51Q7k58J148o10J15o16J77K65J49K37m3n69K55q24J401o63p6l52J48P03
7361B23p91O01N35r74N16j72m63N45l97M37k3K19O0k24j89j92k29J565n82L16
$$ plain form
7220 263 -482 -416 -287 4 74 -89 142 394 -84 1152 -866 -1130 798 3 -209 -208 -479 -414 -269 -133 402
7241 402 -567 -1116 724 573 199 1073 -564 -415 -386 495 -310 -767 234 158 -147 564 -624 -420 -186
7260 -186 -712 255 258 -192 171 -235 474 591 175 200 -105 558 125 -129 4 -301 65 289 582 173 -71
7281 -71 12 138 -347 -587 361 583 -367 -713 -652 323 -162 137 527 22 179 -75 413 139 -255 301 -299
7302 -299 297 -69 -449 -183 -616 -383 508 49 -955 524 856 -314 569 -312 7 859 -595 363 222
7321 222 -162 392 80 -425 -41 -661 1 570 328 339 490 161 -342 -46 344 456 -125 -766 1151 -451
7341 -451 -364 -622 526 -84 31 -585 -408 -143 6 243 200 -369 -114 -938 463 -200 -276 -628 -480 223
7361 223 -568 33 568 -406 110 -62 -525 20 -377 60 37 256 316 92 -97 -289 -518 1047 465 781
7381G81L14j288n00P24M12K51p54J56R1r2m47q36J023K71k97k89N06j80o49Q52
7401D9M84j259O99m4m41L77qM20m94K65k91m75J204M31q19n35j28R95J99o7q6
7422D76p08K75k74m68J489j009j29M7N74k34L53p87O4Q82p13nO91o9j160O86n68
7443e87J156M78l27m51j450J662q37J23L57K15j80l10O51j217J295o15J02M0O98
7462H03o01L98n43n57N15J72K66j050P52M02o72J98L15k90O1M25o57k98P73p56
7482c44J002j241k1k00L41R19p12K55n00Q42l49N3N82k64j41k74O07l19J87j154
7502g31J01J173l68r13J307n03N09q40J62K94k88J133j681N12N12K26L92j057
7520f0O9J42k98K02L39o68Q94Kp58L58m95j00K11M05p38J025j056Q67J51n81M60
$$ plain form
7381 781 1095 -193 -693 31 443 694 -60 96 187 95 -352 -1188 -165 106 -191 -480 26 -154 -803 49
7401 49 533 -726 -27 -71 -512 -135 -143 277 -217 48 -243 -718 486 917 98 -437 -565 430 629 562 476
7422 476 -232 43 -231 -699 790 -219 -348 -301 273 39 392 -395 -331 551 -162 -167 524 455 -705 -19 -587
7443 -587 569 1047 720 269 -1181 481 -356 -233 124 339 159 -151 500 -717 578 -37 65 105 803
7462 803 202 600 57 -500 15 187 453 -597 155 557 -115 83 398 108 169 594 -63 -361 412 -344
7482 -344 658 -583 -604 -804 -463 456 -256 -1 -501 341 -8 45 627 363 222 -52 555 236 423 -731
7502 -731 -630 543 175 -738 569 66 575 -265 -103 191 -97 1036 -645 -133 379 605 997 -60
7520 -60 9 151 -147 55 394 -274 620 622 -136 222 -273 -373 -162 243 -495 530 -526 341 492 -89 371
7541C71j03j44k85j6L34o39J222j390L39J218j399M96m41J477m17j36j129N57
7559h5N78n58k97N31R5j275J542J06j068M86M71p43M72n08j3k38J095j184O14
7578B1j64j20L19n28J40J632j600M65k05O47j70K25r02O22k15l32M99q0L5l42
7598e3L65K19p42m77J05P01M73m86m26N1K34o29N75N27l28M87l16o38L80O23o02
7619D3q41J230l59m26M9J011l93l77M28k32l37P20r1n86L56k73J91P78j045m15
7639e69P86j06m05M18Q4M01n44J1J87j018J269m56k93j0k97J311j246J033n13
7658D3q1m44J003j093K93l49J251j85k31L16r54M46J9M05k01j84n8M07k34m85
7678c16k99M61j6N32l81L30j313J573l90K59j059j09J080j59m14k53Q62o05L8
$$ plain form
7541 371 268 124 -161 -177 157 -482 740 -650 -311 907 -492 4 -437 1040 623 487 -642 -85
7559 -85 493 -65 -362 169 264 -1011 531 637 -431 55 526 -217 255 -253 -266 -504 591 -593 21
7578 21 -143 -263 56 -472 -332 1300 -300 165 -40 607 437 662 -240 382 167 -165 334 254 289 -53
7598 -53 312 531 -211 -688 -583 118 591 105 -321 -270 -36 -665 -90 437 109 596 280 -358 22 645 43
7619 43 -798 432 73 -353 -304 707 314 -63 365 133 -204 516 425 -161 195 -78 113 891 -154 -569
7639 -569 217 111 -294 124 208 609 65 76 263 -755 514 58 -235 -245 -542 769 -477 556 43
7658 43 -38 -482 521 -572 -279 -628 623 438 207 523 -431 15 34 439 238 54 -4 403 169 -316
7678 -316 -615 -154 -170 362 -19 311 -1002 571 181 440 -619 -728 352 193 -221 -474 388 -217 -179
7697a79m70J442n34j22k07m02P92j174l60Q82K3J91K46l64J158l49J85o17k72
7716a31R67m0r62N08M05k87L1l75m82N27j04k67m45J289p02j73J66l0K46l7J45
7737B49l18Q35r84q2O32j04k35k98n9Q99j092Q64p47N26O47j618N63l7P62o79
7757b76L76%M78k23o35K54K1p58O46J272j921P01k34o79J132j48p30k3K80O77
7777B10l71l9J002r6r89q54J358r62M87l04M13J212j545J144K59j197Q58j000
7795d14P52n3O92p93K34j052Q9k32R08l87K43m04O16J01q11K65M35j020O49J54
7815b8M54l99L82K73p7j46o53J014j025K2M5o62J526q30L96j65q60Q50r60J062
7835B19j28q75N23M28K49N89j543J148k72o05O69p4k41l40J177q36p34J152p85
$$ plain form
7697 -179 -649 793 259 137 -70 -472 320 -854 -1214 -332 -309 -118 128 -236 922 573 758 141 -131
7716 -131 836 796 -166 342 747 460 491 116 -366 161 57 -210 -655 634 -68 -241 -75 -105 141 104 249
7737 249 -69 766 -218 -300 332 228 -7 -305 -364 535 -557 307 -440 86 733 -885 -322 -359 403 -276
7757 -276 100 100 578 355 -280 -26 -5 -763 -117 1155 -766 -65 -299 -978 154 6 -724 -747 -467 210
7777 210 -161 -200 802 706 -283 -1137 221 -741 -254 -558 -145 1067 -478 666 925 -272 586 -414
7795 -414 338 285 977 184 418 -634 -545 -777 131 -256 -13 -417 199 300 -511 -246 189 -831 -182 -28
7815 -28 426 27 409 682 605 459 -194 820 -205 -183 -138 -800 726 -104 292 127 -733 117 -843 219
7835 219 91 -784 -261 167 416 1005 -538 610 338 -267 402 328 87 -253 924 88 -646 506 -279
7854b79N88k12l51l35J403q20m82k12Q92m23P71l88m30J02o3J36p92J222Q7k68
7874A46m9q6j12l51J159j104L02n63M22J49l51N7J61L90j079N13J14J75K45L95
7894E33l46m48j64P95j274K31L26L42P05j19k2j298N76J100r81l0L73J42m59j85
7914b03L92l03P0j91K82L59K39n42k01o18k06M96j9l9O27M81l41o4j74M26k99
7935A72r0m92R73K21m04j91m70M03n94RJ71j46J50n3k99O17J52j393M00O04RJ98
7957e3o59O10N05m22J93j222J772m82j84o2J33p2K29k56J182j670K03q9M45J23
7977B24m12J87o46O33k98L69K98K08o84l12K37J95K64K26k76M15k21K11j262j69
7997h13J810o92K5O23q71J68m46o06lP97j82J19j24j87J547j002l57K32p76M33
$$ plain form
7854 -279 309 97 -254 -589 814 -6 -488 -700 192 -231 540 152 -278 -176 -239 -103 -895 327 414 146
7874 146 97 11 -101 -452 707 -397 -95 -658 -236 -87 -438 -381 -220 170 -909 -396 -282 -107 138 533
7894 533 187 -261 -425 370 -904 -673 -347 -5 700 581 559 -739 -163 937 -44 -74 299 441 -18 -203
7914 -203 189 -114 -44 -235 47 406 645 103 -98 -716 -922 -426 -445 -484 143 624 283 219 45 471 172
7935 172 82 -410 563 784 380 189 -281 122 -472 -463 -292 -438 -288 -341 -640 -23 129 -1264 -864 -260 -251 -53
7957 -53 -712 -102 403 -19 174 -1048 724 242 58 -4 129 57 286 30 1212 -458 -255 -344 101 224
7977 224 -188 -1 -647 -14 -312 57 355 563 -121 -433 -196 -1 263 489 213 628 407 618 -644 -813
7997 -813 997 305 330 953 82 250 -196 -802 -805 -8 -190 -71 -195 -382 1165 163 -194 38 -738 -305
8017c05l17M18k45J68P27K57r09l88R95m19O1O19j037N65p65J066R9o94N97m23
8037G0N4p28P1P54o53O14l51K16m48K45L84o62P25L90q39J296j490l13J065k06
8057A94O75k49k0n02l21k59K93j53O38ml97K32k44L51P15j277n22K9J688j119
8077b52O51r52j8J093m92j11O74k64o1m24j54qK79O36q71L18N62j428R62k91O13
8098D62k82k95j50L77J06l15N87o64N93K70n13o02J312j088j05L24L26j50N42
8117G35o94M76o62M57O28j153r1K27O40M44j220J96k65J157r37l47K34M05m32
8136b02P2j67K57k31P34j99j033R38P33m89n16K10n25l93N79J06P6P15j370O02
8156a03L51K65l7j126J564r28K60M87l97j45K49p91P27q40q35J446j15m04l18
$$ plain form
8017 -305 -622 -204 -449 -281 446 703 -206 -594 401 -18 43 662 -375 190 -575 491 590 -104 493 70
8037 70 124 -604 -533 221 -432 182 -169 47 -401 -156 228 -434 291 681 -158 1138 -352 -665 400 194
8057 194 869 620 600 98 -223 -482 -189 -342 296 292 -105 127 -117 234 949 -328 -850 -821 867 -252
8077 -252 399 -553 -571 522 30 -81 593 329 268 -156 -310 -318 -39 597 -274 44 606 -822 140 -151 462
8098 462 180 -115 -265 112 218 -97 490 -174 419 689 176 -426 886 -202 -307 17 343 193 735
8117 735 41 517 -145 312 940 -213 -304 -77 563 1007 -213 -17 -282 875 -62 -409 -175 230 -202
8136 -202 -130 -297 -40 -271 463 264 -769 169 902 413 -103 107 -418 -811 -232 -126 -50 665 -705 -103
8156 -103 248 513 476 -650 914 -14 246 733 336 191 440 -351 376 -464 -1299 147 32 -372 -690
8175f90M10J41j77J95j46N21k88K33l75p22P35O26n24n3N4j79
$$ plain form
8175 -690 -280 -139 -316 -121 -267 254 -34 199 -176 -898 -163 463 -61 -114 -60 -239
8191b39
$$ Imaginary data points
##PAGE= N=2
##DATA TABLE= (X++(I..I)), XYDATA
0@%%%%%%%%%O4j28J28j28J92k56L20l84M48n76P04q32R61j153J408j664J921k242
27a217K597k981L415l911M467n060N757o524P342q242R236j0334J1540j2859J4300
42G526j5868J7579j9457K1513k3750K6196k8878L1818l5047L8607m2558M6947
54B4628n1847N7362o3616P0773p9059Q8787j00385J14506j32150J54930j85627
65a01698K29477k97711M19612p04173K597355J659375m008907r07292O19540N96063
75A01641r76673j8201O89787M35358o27950j22350K02742k00696p33436M19090
85h30688J332906O26547q61589n61201N24726N43658m83189m44768K90037L13351
95D49790l89302j80080N56003L77578o97681q00680K37613P38632j07954p17292
$$ plain form
0 0 0 0 0 0 0 0 0 0 0 64 -64 64 -64 128 -128 192 -192 256 -320 384 -448 513 -640 768 -896 1025 -1217
27 -1217 1380 -1601 1814 -2097 2370 -2690 3067 -3457 3885 -4357 4879 -5455 6085 -6774 7526
42 7526 -8342 9237 -10220 11293 -12457 13739 -15139 16679 -18368 20239 -22319 24628
54 24628 -27219 30143 -33473 37300 -41759 47028 -53357 61149 -71001 83929 -101698
65 -101698 127779 -169932 249680 -454493 2142862 3802237 -206670 -1113962 -494422 101641
75 101641 -875032 -893233 -203446 231912 -396038 -518388 -315646 -516342 -1249778 -830688
85 -830688 502218 1128765 267176 -294025 230701 774359 291170 -153598 136439 449790
95 449790 60488 -119592 436411 813989 116308 -684372 -446759 291873 183919 -533373
105e33373r3111O33135K00618m98241l12338K64756K00520p4311J85323N07961
115D80939J27677m10435k36552K81929K08775k91007l29421J30634K84676n7499
125A89716k58108p4950K605j44931n4753K64274K00739k37572k89567K01799M15808
136B15060j9524l87511j09237L39227K81424r2089j87360Q635Q2595k4968l6421
147F9831M2858j6125j44741p0006J14888Q0576j28801j73443P824J24772O7629
158b4738K120J4123L600l0676J3748R9087N2755j03950j24502O5571J83760M0805
170A91703j51956j18801N5717J01951l596p6803m5913M767J7344K2434Q947l3531
182b7737o1759j6927O0830O8857K896m7433j2989M3242M8239R438k3042l8440
$$ plain form
105 -533373 -626484 6651 207269 -290972 -603310 -338554 -138034 -212345 -27022 480939
115 480939 608616 198181 -38371 243558 452333 161326 -168095 -37461 247215 189716
125 189716 -68392 -143342 -140737 -285668 -340421 -76147 124592 -112980 -402547 -200748 215060
136 215060 195536 -191975 -301212 38015 319439 227350 39990 48625 131220 106252 69831
147 69831 112689 96564 -48177 -118183 -3295 77281 -51520 -224963 -217139 -92367 -24738
158 -24738 -22618 -8495 -4895 -35571 -21823 77264 130019 26069 -98433 -32862 150898 191703
170 191703 39747 -79054 -23337 78614 75018 -1785 -47698 -42931 -25587 -3153 5794 -27737
182 -27737 -89496 -106423 -45593 23264 26160 -21273 -34262 8980 57219 66657 43615 5175
194E175j8541K9080N4510K700p1298o1600K2053O5636P918o3541m7063K8318O0084
207A3431J6962l2462l0308K692K3440J8482K516j2065j2509K696J8935J5653l540
220B3923j4295j5403n58J5036J6809l614k7454k2733J0323L1763R446l0503l1405
233c8665Q921L8450J8005k3438k8219R15K5708K0258p443k1638r545J2659K0031
246A5999N292j3275j3905j88J2074R414k411j2358j1137R57R344Q238m712j5377
260a2045r862R255J9729L485j4473j1853P368J7380P529j0677j4153p8J0682J0229
274A2516m777j0471l950M200Q712K027m786o850j072L010M011R03l802q239k308
289a0876N480P340K058r399o577N775J2523N348q020r795K810J0537N298o012
$$ plain form
194 5175 -13366 15714 70224 72924 1626 -59974 -37921 27715 35633 -27908 -74971 -46653 13431
207 13431 30393 -2069 -32377 -29685 -6245 12237 14753 2688 -9821 -7125 11810 27463 23923
220 23923 9628 -5775 -6333 8703 25512 21898 -5556 -28289 -17966 13797 23243 -7260 -38665
233 -38665 -29744 8706 26711 3273 -24946 -24031 1677 21935 14492 -7146 -16691 -4032 15999
246 15999 21291 8016 -5889 -6077 5997 15411 13000 642 -10495 -9538 -194 8044 3332 -12045
260 -12045 -21907 -12652 7077 10562 -3911 -15764 -8396 8984 16513 5836 -8317 -8395 2287 12516
274 12516 7739 -2732 -6682 -2482 6230 8257 3471 -3379 -4451 -1441 2570 3473 -329 -8568 -10876
289 -10876 -5396 1944 4002 -5397 -11974 -6199 6324 11672 3652 -6143 -3333 7204 12502 6490
303F490j0311m011P866O420k442r095k971L634O370J303l265n139j6M616L350
318B799k47l475k031N17K829M052K53l807k729J799O304k61l016m998N05L221
334A715J935k846n189j142L127K704l9j767j434J378K482J880j570k059K99q62
350a388L528R13k091j703r9J398L620j198k793j603l65L921K54k949l395q9L096
367i43J876r20l511Q9M041J533L00k740k35J677J298K92k255o38N56j121J604
384I03n17p4j511J09j94K092O75j161j002j264K364K05j218j599Q36N51K353r64
402E84k35r71J319J184J76o69k184L82J001O11j640k12k09J96J262j329j84q65
420a783R29R66O47M27j893J61L14J339P31o92k264R32P68p39J35J3p85J618k02
$$ plain form
303 6490 -3821 -7832 34 6454 4012 -5083 -8054 -4420 1950 3253 -12 -5151 -5167 -551 2799
318 2799 2552 -923 -2954 -2437 392 4444 4697 890 -1839 -40 6264 6003 2987 -2011 -1506 1715
334 1715 3650 804 -4385 -5527 -2400 304 265 -1502 -2936 -1558 924 2804 1234 -825 -526 -1388
350 -1388 2140 3053 962 -741 -840 558 4178 2980 187 -1416 -1781 2140 2394 -555 -3950 -4039 -943
367 -943 933 13 -3498 -3409 632 2165 2465 -275 -510 1167 2465 2757 502 -136 420 -701 903
384 903 386 312 -1199 -1090 -1284 808 1483 322 -680 -1944 420 625 -593 -2192 -1356 -805 1548 584
402 584 349 -622 697 1881 2057 1388 -796 -414 587 1198 -442 -654 -863 -667 595 -734 -918 -1783
420 -1783 -854 112 759 1186 -707 -546 -232 1107 1838 1146 -1118 -186 582 -157 -22 -9 -794 824 622
439F22K32j966O68N93k04o6j56j80r1R72m72N32N37j258K97M39m11M68L0m26m22
460b62J076k81k5j012P33k12N45J21j597P5P67n65J507j349L5L00L06n82J80p69
480a009M61j99J809o69o13J012m62L01j315P12l70Q40J48j465J330q30m6K32m
499a37O5P48j055M51K47r63N38J3n65L39m58R54J041j046j264O82K76K21q98j80
519i91J336q52j42k17M98P2K43J39j8l70JK5k69K334j306N2j211M24P23l21m03
540b53q57J330j75N5J64q61J11J121p23P95p55l87J99J69P76p28M9N06m31q4j063
561a042J424l18k90R84p01j41Q59r56r7R22o26O81q87k29K10o3L51r21M23O43
581B26L88O07j303j4J85l29Q79l08l0l53q24J430o21O48p99j17M33k51P52j074
$$ plain form
439 622 854 -1112 -444 149 -55 -121 -277 -457 -548 424 -48 484 1021 -237 60 499 88 556 586 160 -262
460 -262 814 533 508 -504 229 17 562 683 -914 -839 -72 -637 870 -479 -444 -144 162 -420 -240 -1009
480 -1009 -548 -747 1062 393 -220 792 330 631 -684 28 -342 498 646 -819 511 -319 -365 -133 -137
499 -137 -72 676 -379 72 319 -644 -106 -93 -658 -319 -777 177 1218 172 -1092 -410 -134 87 -811 -991
519 -991 345 -507 -649 -866 -368 -296 -53 86 68 -302 -301 -276 -545 1789 483 535 -676 -252 471 150 -253
540 -253 -1110 220 45 100 264 -597 -486 635 -88 707 -48 -435 -236 -67 709 -19 30 536 105 21 -1042
561 -1042 382 64 -226 758 57 -84 775 -181 -278 644 18 699 -188 -417 -207 -270 81 -840 -417 226
581 226 614 1221 -82 -96 89 -240 639 331 301 -52 -876 554 -67 581 -218 -335 98 -153 599 -475
601d75j48J156k35n30j80o66J224q79M90P73r48M58J76l37R36o37M35j075M16
620d6J53m49O19k38o48K37P69p21N60m01M18l71M66n46o59Q50K36j70M01p00J214
641I74j684J81Q63o66K60n43q8K152l74j194J041J3q24k11J133j010j46O23k71
660B29o04P87j62L92j279Q81q9M06L64l99n9j85J28n40Qj50J539j290l10l67N74
681a26K50K21o82m0k53P33K09n32J72k75P87m92p5M0N06m94n12Q8P96p93O97p19
703d94O21n3q94M80j16Q70n57m22P37M4l2k40O37o44n53N52L83N1p18N91o07P
725c57N72J47M4r59Q78m58p1L4j29l70J604q01k20P05n42J07M11j06l10L65r08
746c64m4O65k58K38j521J317j084J207n60N21m49J188l30M41j002k45K65M90j008
$$ plain form
601 -475 -623 533 298 -232 -412 -1078 146 -733 -243 530 -418 40 216 -121 815 178 613 -462 -46
620 -46 107 -342 277 39 -609 -372 397 -324 236 -165 253 -118 348 -198 -857 -7 229 59 460 -240 974
641 974 -710 -529 334 -332 -72 -615 -703 1449 1075 -119 922 935 111 -100 1033 23 -123 500 229
660 229 -375 412 250 642 -637 244 155 561 925 526 467 282 410 -130 -122 -272 1267 -23 -333 -700 -126
681 -126 124 345 -337 -377 -630 103 312 -220 -48 -323 464 -28 -103 -63 443 -51 -563 -475 321 -472 225 -494
703 -494 127 74 -820 -340 -456 414 -143 -565 172 216 184 -56 581 -63 -616 -64 319 370 -348 243 -364 -357
725 -357 215 362 406 -553 325 -133 -204 -170 -299 -669 935 134 -86 619 77 184 595 489 179 544 -364
746 -364 -408 257 -1 237 -1284 33 -1051 156 -404 117 -332 856 526 967 -35 -280 -15 475 -533
765e33P82L5l98J498j221l76J48k21p1N99k47L5J61R6j36N97n05l94P04k81O4
786C36p84MM98l02m8L99p88M58N23n66M53N23j134K6M91K15N0r3k13n80O78j53
808gN14l80j53j28j7J198r73m31P01r79J049l80L21l03j80J116j711N74q42R73
828c8J17p84N42L92k26N32o52L26j26j284J757l76m15J483j542R43j94j87n88
847c20L22L70L6l63J83J17m26K6n52r7J334n15j055J357l32m03JJ8M80pL28L9
869E41K22m36n15K53M99l3k26n55M39J57m14L91M90q93m37O36j26L63o38M07k49
890a24q01N85L34J07j93N74l08M45m65O29p74o92P99r9J17R2O2n47J31J4m76M10
912a80j048R62L63m18R22p93J51l97k15Q80rK25m60M65j96l27qk38J47J53K30
$$ plain form
765 -533 249 284 -114 1384 163 -213 -65 -286 -357 242 -5 30 191 287 151 748 243 -151 553 272 336
786 336 -448 -444 54 -248 -296 103 -685 -227 296 -270 183 706 -428 -402 89 304 354 261 48 -532 146 -7
808 -7 507 127 -26 -154 -171 1027 54 -377 324 -655 394 14 335 32 -148 968 -743 -169 -1011 -38
828 -38 79 -705 -163 229 3 535 -117 209 83 -1201 556 180 -235 1248 -294 649 455 268 -320
847 -320 2 372 408 45 228 345 -81 -55 -607 -704 630 115 -940 417 85 -318 -317 -299 181 174 502 541
869 541 763 327 -188 65 564 531 305 -250 189 346 -68 323 813 -80 -517 119 -7 356 -282 125 -124
890 -124 -925 -340 -6 101 -92 482 174 619 154 783 9 -683 116 17 134 226 288 -259 -128 -114 -590 -180
912 -180 -1228 -266 97 -321 601 -192 -41 -438 -653 227 218 443 -17 448 252 -75 -83 -321 -174 -21 209
933B09n19J338j053J15O49m16m32R06j184O2L58J2l97L37n39R09l31p25J033p9
953B53l40R35o91J53o70l05N65j75J047q30P17k043K077o04k57j75L38p56R54
972A93M17q50m18K20l56J364j327J248m18n31J27o90Q76j01J52K1j32P60o0j249
992g54N66O71j540Q91k81L07j90O33M08q74j07M84J04k11L9r4r29J192m15M98
1012C98qr50J120l50J42J89j050N09k56L61J98j248N29Q23P2k92J036j784R21
1031C60q40k39O91p91L09J102N4j39m29o03K81M48p44M24L40kk70q08N36N14L44
1052E38m10L06K21n57o17J309k94r34N42K54m67J58J25j9K09k37p97K96R56j073
1072d91N78L58q39O11k1o85K71l72J07N23p3l97R05J35r26L70O29n70J32q10J16
$$ plain form
933 209 -310 1028 -25 90 739 323 -109 797 -387 -325 33 45 -352 -15 -554 355 24 -701 332 253
953 253 -87 848 157 310 -360 -665 -100 -275 772 -58 659 -1384 693 89 -168 -343 -5 -761 193
972 193 610 -240 -658 -438 -794 570 -757 491 73 -458 -331 -1021 -145 -246 -94 -73 -205 555 495 -754
992 -754 -188 483 -1057 -166 -447 -140 -330 303 711 -163 -270 214 318 107 146 52 -877 315 -100 398
1012 398 390 -560 560 210 352 541 -509 0 -256 105 303 -945 -416 407 479 187 1223 -561 360
1031 360 -480 -719 -28 -819 -510 592 646 507 78 -525 -244 204 -540 -116 224 222 -48 -856 -320 194 538
1052 538 128 434 655 98 -519 790 496 -438 104 358 -109 49 174 155 364 127 -670 -374 582 -491
1072 -491 87 445 -394 217 196 -489 -218 -590 -483 40 -33 -430 475 610 -316 54 683 113 245 -565 -449
1093d49J87N7K12k0J51Kn27P5N77Lk14L67M5j58l63L06r50q53Q38J179l00k98
1115a33N61o90j24L31k26N25p99N94N2j76n39K9J326j480O86n04O31j89J4M98
1135C87l69j86L56n2j32J29l37J32L70J02Qn24L60K94n13r72P58P34r58M70J97
1156B54q18K35M25j39%j44J04l13M12J242j565Q12o62oq0K06q60P51l38n19J571
1177E68j420K42R25n6k77J8K00j78m71N5P9N50r67J176Lm27j7O06q20q2J96Q49
1199G52o31J6p79Q17m91M16k3K97K89n74j11n8%M98l01K59o48Q20l21q01J327
1220G53j505P43J41o3N3M75r89L32O70j56k96j94J09N29o62n30J803j581O76n8
1240B50N5R6n2L51j353K83R58n67O1j03M36oq55L36J92o81K17O39k66p57P02R80
$$ plain form
1093 -449 -262 -205 7 -13 138 140 -387 -312 265 268 54 421 466 308 -55 251 -699 -1552 -714 465 165 -133
1115 -133 428 -262 -386 -55 -281 244 -555 39 91 -85 -624 -595 731 -749 -63 -567 64 -125 -111 387
1135 387 18 -168 188 136 4 133 -204 -72 298 400 408 -116 244 538 25 -947 -189 545 -413 57 254
1156 254 -564 -329 96 -43 -43 -187 -83 -396 16 1258 -307 505 -157 -163 -243 -37 -897 -146 -484 -1003 568
1177 568 -852 -610 315 259 -18 0 200 22 -449 -394 -315 235 -732 444 447 20 3 609 -211 -293 -97 752
1199 752 121 137 -642 175 -316 100 77 374 663 89 -22 -80 -80 418 117 376 -272 548 227 -574 753
1220 753 -752 -9 132 69 122 597 -392 -60 610 454 158 -36 73 602 -60 -590 1213 -368 308 250
1240 250 305 401 349 700 -653 -370 588 21 82 -21 415 409 -446 -110 82 -599 -382 257 -9 -766 -64 916
1262I16r88o26N66J90P45j551O87O20P3l63J0j62n01M65l89q59J713m70L05k65
1282A16o65N2N59l51J08L46m39o76P27J19n06M44J5N1N85j20m25Q8L51J15n54
1303f0J19j86M07q87M96j15J081K77r35L4R8m84o56N69k94P74n29O9m68K56L62
1324g2j34k63J41Q3k69J090q79k8J19O04J34n1o07q55J07J019n13k17J85J529
1344A123m87k71l19J37M09k75L75q52r28J004M12m91l78J128M9k94J1L4l07M21
1364E01P61k098P68Q9m13R23j170J53J402j130k53Q07L27r55j03n18J421L51r56
1383i3k54J038j468k7Q45J07j20J029j281M13j326J069M00j030K22K19L64l89
1401b82J032k68j039J053N33q18L8q62J414r0M6r52N77q83J131m97j55j8Mm50
$$ plain form
1262 916 -72 -698 -132 58 803 -748 -61 559 632 269 279 117 -384 81 -308 -1167 546 76 381 116
1282 116 -549 -497 62 -289 -181 165 -274 -950 -223 -104 -610 -166 -151 -100 485 365 -60 28 379 494 -60
1303 -60 59 -127 280 -607 -111 -226 855 1132 197 231 329 -155 -811 -242 -536 238 -291 -222 -690 -434 -72
1324 -72 -206 -469 -328 -245 -514 576 -303 -331 -212 392 526 475 -132 -987 -880 139 -374 -591 -406 1123
1344 1123 636 365 46 183 592 317 692 -160 -1088 -84 328 -163 -541 587 636 342 353 387 80 501
1364 501 1262 -836 -68 21 -392 531 -639 -486 916 -214 -467 340 667 -288 -391 -909 512 863 -93
1383 -93 -347 691 -777 -804 41 148 28 1057 -224 189 -1137 -68 332 -698 -476 -257 107 -282
1401 -282 750 482 -557 496 1029 211 249 -613 801 711 757 -195 382 -501 630 133 -22 -40 -36 -486
1421d86M32j65N90M71j592pJ070n59J5O54k55J37j74m37M49o55Q06l76J69p8j134
1442a125N86l30L26M68N08l86J38N63l06r35J475j442P84P37j046N8n87O80n33
1461c67J256o79l84J58m11J65M08J5m14K02m12J11J390j367K22L50j06m39O32
1480C30J1p6P19j003j71J08k01J46Q90p12p94O47O33o74o59R53p8q65r6J032M73
1501F13j066Q83k65K24j239N18R19J17l08l58J30k07j0Q36p94Q9J51p60M23j78
1521b82L9O81q06J97k63m1O61N96j280J54k2L34k42L74O93j544K56J28L71L69
1541C73m95J173r91K38l39J20m18k73M67N78n17n67J063k59p55O08J54m64L00
1560dl89J44j58M64K59q32J486p69j82j60k00L93n55L76l75K88k53J228j669N11
$$ plain form
1421 -486 -54 -219 371 842 -750 -757 313 -246 -231 423 168 305 131 -306 143 -512 294 -82 87 9 -1125
1442 -1125 -539 -869 -543 -75 433 47 185 748 442 -493 982 -460 324 1061 15 73 -514 166 -367
1461 -367 889 210 -174 -16 -427 -262 146 161 -253 -51 -463 -352 1038 -329 -107 243 137 -302 330
1480 330 341 265 984 -19 -190 -82 -283 -137 753 41 -753 -106 527 -147 -806 147 69 -796 -892 140 613
1501 613 -453 430 165 389 -850 -332 587 704 396 38 168 -39 -49 787 -7 82 233 -527 -104 -282
1521 -282 -243 438 -368 -171 -434 -475 186 782 -498 -344 -366 -32 -274 100 793 -751 -495 -367 4 373
1541 373 -122 1051 60 298 -41 79 -339 -612 -145 433 -84 -651 412 153 -602 6 160 -304 -4
1560 -4 -393 -249 -407 57 316 -516 970 201 19 -141 -341 52 -503 -127 -502 -214 -467 761 -908 -397
1580c97L82j14J50o7j63jK57K81o01K70R40p88K79J29J20q90P60o25n97J018l7
1601C06l74j37k77Q6O64j72k66l34N67p67O18o88P89l38R69j144N30N62l87J35
1621C42N76r32M19j9k08N08m14m50o1K24L12q9m77J03K84l4n64P98o40k48R73
1642D03j61j754J452N76m28n79K58P6M07K60l24n36P13j14m75l08O43k14M76m31
1662f0O56k35p84M41M9j11Q5Q49j367M68N35l27j01n99P47K29n17l75P74o6l85
1683i4O6K16J3Pr23M87n7L27j274J022K54j032R96K33j38l28N71M99r29m9J301
1704A168j214n65n7K93J116r59J275j146j33K79P4k82n34R96j028K14L70o68R57
1723A56m08K3M82j92m61L83N69p00m14k57J020m13L39q6N57j152Q93l55L16m46
$$ plain form
1580 -397 -15 -129 21 -46 -209 -210 47 328 -273 -3 937 149 428 557 677 -213 547 -78 -675 343 306
1601 306 -68 -205 -482 -396 268 96 -170 -504 63 -704 -86 -774 15 -323 646 -498 32 594 207 342
1621 342 918 -14 405 386 178 686 272 -178 -239 -15 297 208 -269 -166 118 84 -480 318 -322 -570 403
1642 403 242 -1512 -60 516 88 -491 -233 -157 250 510 186 -350 363 249 -226 -534 109 -105 371 -60
1662 -60 596 361 -423 18 67 -44 41 890 -477 -9 526 199 98 -501 246 475 -42 -417 357 291 -94
1683 -94 -28 188 201 208 -715 -228 -285 42 -1232 -210 44 -988 8 241 103 -225 346 845 -84 -133 1168
1704 1168 -46 -611 -668 -375 741 -218 1057 -89 -222 57 131 -151 -685 311 -717 -503 -133 -801 156
1723 156 -252 -229 253 61 -400 -17 552 -148 -562 -819 201 -212 127 41 598 -554 339 -16 300 -146
1743a46q74J52J113j43n83O45k57km86J15L78L33p07J93j05R29q23n71P98p7L25
1764B07n10J246j165N45j24n3J59j000J003k35J52n70p54Q70L20P36r25J46j71
1783a23Q78n15k36m8M6r0o37J322j402M53O86k16o23O13J66j258J455n87l1K59
1803A12n40N1j00N55l06l63J371n57o53j98P18o8Q7k95L11k01M46M84j51r02j27
1824c26M29j06k89N18n57P39K40j095R95q75J63Q11q0p80o42J417r07m11J290
1843E34q18L2J130q27J15O70n89j33k74J80M2k5J44m81N94j68J58j79j226J740
1863F19l48L40l07n7j585J737l67O63o89M28Oq06O80p3q60m9O85N7l67nQ78r01
1885c21J83N67p13K24M96p24O84j248J512k38mo28L22l45L36j017J617l54n42
$$ plain form
1743 -146 -1020 -868 245 102 -481 164 -93 -95 -581 -466 -88 245 -462 -269 -374 555 -268 -839 -41 -118 207
1764 207 -303 943 -222 323 199 146 305 -695 308 73 225 -345 -1099 -229 91 827 -98 48 -123
1783 -123 755 240 4 -44 2 -88 -725 597 -805 -352 334 118 -505 108 274 -984 471 -116 -147 112
1803 112 -428 -377 -477 78 -228 -591 780 223 -430 -628 90 22 109 -186 125 -76 370 854 703 -199 -326
1824 -326 103 -3 -292 226 -331 408 648 -447 548 -327 -164 647 567 -213 -855 562 -345 -756 534
1843 534 -284 -252 878 51 166 836 247 114 -160 20 62 37 181 -300 294 126 284 105 -1121 619
1863 619 271 611 304 247 -1338 399 32 695 6 434 440 -366 314 241 -619 -668 17 74 -293 -298 580 -321
1885 -321 -138 429 -284 -60 436 -288 396 -852 660 422 418 -210 112 -233 103 -914 703 349 -193
1904a93N23p72L31j41K35o62J453l07p57L94o3R51j823R14p5k06k87P02j58r05
1924h46M81K39K68J86j84n77Q34Nm1k12j407J840j100R2P76l57o3r16Q92k47K57
1945h0j6K06o98J149p23Q0O73l10j056L94M13L32l70p9M5J285j576L36j54P81
1965F32m25M5L24o06L35r07J76O31k5p54O56n00N62r33M18L97j12J96P7k51J97
1986A33L5L1q34N07l58J042m74o1l47M65k27j97J299r39k90O65k36J08r45J53
2006d70Q04j383P80j0m80M00O87m75p5Q47N61j415P68J08k65q3n5j35q3M73j579
2027a080K15R05k8k90l80O76l36K33J61q02R46R40j233M5k75K79mK22n6p95m06
2048a063R08k68M42m85N33k63Q7j97j9L02K57j37N74L39j236K10N08m65P15o49
$$ plain form
1904 -193 330 -442 -111 -252 -17 -679 774 467 -290 104 41 992 -831 83 8 -198 -485 217 59 -846
1924 -846 -365 -126 142 328 144 -433 401 406 365 153 -1254 586 -514 -422 354 -3 -66 -982 -90 -337 -80
1945 -80 -96 110 -588 561 -162 -82 591 281 -775 -381 32 364 -6 -85 -40 1245 -331 5 -149 632
1965 632 207 252 576 -30 305 -602 -426 205 180 -574 82 -418 144 -789 -371 26 -86 110 187 -64 133
1986 133 168 199 -635 -128 -486 556 82 21 -326 139 -88 -285 1014 75 -215 450 214 322 -623 -470
2006 -470 334 -1049 -269 -279 -759 -359 328 -147 -222 625 1186 -229 539 647 382 299 244 109 26 499 -1080
2027 -1080 -865 40 12 -278 -658 18 -318 -85 76 -726 220 1160 -73 -28 -303 -24 -28 194 138 -657 -1063
2048 -1063 -155 -423 19 -466 67 -196 -109 -306 -325 -23 234 97 671 1010 -226 -16 492 27 742 93
2068I3l54n45O23K12J31r1P96r66L42q44O80N68o63L65o95N86r12M52N68p07P87
2089D26m34P13r66l62O63j76R5K66n11J005l95n03K24K16N0k12l64J105j067O72
2109D45q64L00n09m35R91j17N39j94m72j35J55J53J82K68l40J29M18n56r6L27
2129A89j90l28K3M10k40R99l69k04r22P33l47k97O90N31m32n53L49q93J047Q5
2149B81k92l29k0J320n58m81O34l57P61j325N44J175j727j96M08O02r74L19J44
2168g1K30J23l33J06l26N75q77R41j020L4J71O73N7n10J20L78p86O18p17J135
2188E21m46k51k3j60J2O39q02L40p72J080k93J60m55O43r24J323r45m81J024J08
2208B98k75K91n57L90N14l95m30L5L80k11J2J46k02l47L93n66J092l02n89Q29
$$ plain form
2068 93 -261 -806 -183 29 160 69 865 -101 241 -603 77 645 -18 347 -348 238 -674 -222 346 -361 426
2089 426 -8 705 -261 -623 40 -136 -41 225 -286 719 324 -179 45 261 311 99 -265 840 -227 445
2109 445 -419 -119 -628 -1063 -72 -189 350 156 -316 -451 -296 -143 39 307 -33 96 514 -42 -138 189
2129 189 -1 -329 -306 104 -136 863 494 290 -632 101 -246 -543 147 678 246 -307 42 -851 196 281
2149 281 -11 -340 -360 960 402 -79 555 198 959 -366 178 1353 -374 -570 -162 440 -534 -215 -71
2168 -71 159 282 -51 55 -271 304 -573 368 -652 -618 -447 226 283 -227 -107 271 -515 103 -614 521
2188 521 75 -176 -199 -359 -347 292 -510 -170 -942 138 -155 5 -450 193 -731 592 -353 -834 190 298
2208 298 23 314 -243 147 661 266 -164 -129 251 40 52 198 -4 -351 42 -524 568 266 -323 506
2228E06o71O74n26R8J50q3N32o85N21q1p53Q44k83R4P9l39N56n34j46J50r68J304
2250D39r49M50m89L21k20L31j29l7M70n36M82j008P87j5J84K43k73m00j69R19
2270D01p25L77l17M46o17P25k09q0l61O88M56j76j036J20J92N42P36r38mo07N86
2291A99j77n0k78k11O62j74J36q62r5M44N73L11Q16j319Qn4K51L60p0l25o3O46
2313G28j47n59L56J75j458R41K00r15L78J70N71k25K90q46J39o75J158K57j043
2332e05J335o99k30l19O20q95J414j659P42P46n95L68r43J563j191R7Q7k61m6
2351c71L10J33j59n26J266q63J28M46n15M07M31j22o80r90J081r16J272pn13M93
2371C05r60R84m63K48K46J020j240p30Q2J50K57J39m29J039o01K2n52N17R50o11
$$ plain form
2228 506 -165 509 -17 81 231 148 680 -5 516 435 -318 526 243 337 416 77 633 99 -47 103 -865 439
2250 439 -510 -60 -549 -228 -448 -117 -246 -283 187 -349 133 -875 -88 -103 81 324 51 -349 -518 401
2270 401 -324 53 -264 182 -435 290 81 1 -360 328 784 608 -428 -308 -116 426 1162 224 220 -387 199
2291 199 22 -28 -306 -517 145 -29 107 -755 -850 -406 167 478 1294 -25 -17 -71 180 540 470 145 82 728
2313 728 581 22 378 553 -905 36 236 -679 -301 -131 440 215 505 -341 -202 -877 281 538 -505
2332 -505 830 131 -99 -418 202 -693 721 -938 -196 550 -45 323 -620 943 -248 -151 -64 -325 -371
2351 -371 -61 72 -87 -613 653 -210 -82 364 -151 256 687 565 -115 -1105 -24 -940 332 325 -188 305
2371 305 -655 329 -134 114 360 1380 140 -590 -508 -358 -101 38 -391 648 47 69 -483 34 984 373
2391C73l3j8L41Pr9q16M24K16L27m88K92p53n42O93r56J324p6j528J722l66M26
2412D70r48O00M12l16N75l83j09j078R06j20M9Mk40l67P26J68o43N86o34L66J26
2433A50k48Q7k33l80P51K63n5m29%l74j42M38o13J034l9m17j5Q04j540M85N0K24
2455a99Q51n54J235k187K63P60l46k34M17O10k07l50l97J01L98l79k35R38k24
2474B61o26L65j003J938r54J19MJ63q67J158l15L29j64l1K02o98J35J9M28l63
2494A00N48r05K88R7j52q39P73O3N96m63k91k43M29k12L13o32pP54J57o75k01
2515e02j23K97Q80p55J60m49O13Q37j051O31o42r9O15kP8j57o57j62l41J108j75
2536A04K59J16j052M2M00M21p7r40J150m77o68J471j123j81k12P80L31k9k38m84
$$ plain form
2391 373 340 322 663 670 571 -245 179 395 722 234 526 -227 -769 -76 -1032 292 216 -1312 410 44 470
2412 470 -478 122 534 218 793 410 301 -777 129 9 58 62 -178 -545 181 349 -294 292 -342 24 150
2433 150 -98 -11 -244 -624 127 390 335 -94 -94 -468 -610 -172 -785 249 210 -207 -222 582 -958 -473 -423 -199
2455 -199 652 98 1333 -854 -591 169 -177 -411 6 616 409 59 -338 -237 161 -218 -453 485 261
2474 261 -365 0 -1003 935 -19 100 104 267 -600 558 243 572 408 377 579 -119 16 35 463 100
2494 100 648 -257 31 128 -24 -863 -90 -27 569 106 -185 -428 1 -211 102 -530 -537 217 374 -301 -502
2515 -502 -625 -328 552 -203 -43 -492 121 958 -93 538 -104 -203 412 410 488 331 -326 -488 -829 279 104
2536 104 363 479 -573 -531 -131 290 213 -727 423 -54 -722 749 -374 -555 -767 13 344 315 77 -407
2556d07J91k45K85P8j49M69p82J620j062l70Q89j033O89j41O95o72k35m33P56
2575A43L84o29J74j25j6N19n51l95K84K19K17j5l09M7K07l89O83M27j020N90J78
2596F23p58O52n59j053R7N97j06J402l82k7j277O83N61k66Pp16R73L03j007J163
2616I10j693J135N6q34m42O69k58O84L59j01l59J4N1l40j98L40n04k66J131n93
2636b39N6R2J081j147q5J49N32j305O20N59j94J10o51R49m47M37o44K00L14l97
2656a0o06N45Q02j703O01Q72q51J99P55p90m55L0n59J561k51K46o95R14q00j4
2676b09j4J22k32J379k68r05K28L4k82M6r79J62J104p45K85L72K09l82j60J64
2696g1O41j038O7l75Q15l7m76N09J94N78K22q11K13q77K15K41l96J28J57J57k79
$$ plain form
2556 -407 -216 -461 -176 -98 -247 222 -560 1060 -2 -372 517 -516 173 32 727 55 -180 -613 143
2575 143 527 -102 72 -53 -69 450 -101 -496 -212 7 224 209 -100 -53 154 -235 448 875 -145 445 623
2596 623 -135 517 -42 -1095 -998 -401 -507 895 513 486 -791 -108 453 187 194 -522 451 754 -253 910
2616 910 -783 352 408 -426 -868 -199 -457 227 586 485 126 140 191 -149 -347 -7 -511 -777 354 -239
2636 -239 -183 -91 990 -157 -242 -93 439 -866 -246 313 119 229 -422 527 80 517 -127 73 387 -10
2656 -10 -616 -71 731 -972 -371 501 -350 -151 604 -186 -641 -611 -1170 391 140 386 -309 605 -195 -209
2676 -209 -223 -101 -333 1046 778 -127 101 135 -147 -101 -1080 -918 186 -559 -274 98 307 -75 -235 -71
2696 -71 570 -468 -401 -776 39 2 -474 35 229 807 1029 218 431 -446 -231 10 -386 -258 -101 56 -223
2717b23r4M12O49n95m01P65p60m7J61J43l59O88j261N26N44l05K3r30J397r2k59
2738a8k22J207j48j275k8J198o59R03o44j184P3N35j65M51m42N18k5J4o34J007
2758D62m81R29k70r61M48j57L1n00K97n89J31K084r87M2n97N87n64k7N36o95N45
2779B64N54j168k53J324n92j37m71J394j169N23q21J624j838J197k63n72l33J164
2797D27r78J156o77O44l31j18O65j955J495j54l15o37Q81j77J38M92j045Q15Q3
2816D09j21N3P3o86j39J99m47J643m75j45o56p72J216j51o67L91l7J39M03k37
2836gn54K22R08o00K97l53o3K40k51K03r1o06J134m32l59k20N10K29r15K72O8
2857c68N43j347L30J175p61J237m40l59nM74L30k55k25k53l82K77o80L81k76q4
$$ plain form
2717 -223 -317 95 744 149 -252 513 -247 -294 -133 10 -349 339 -922 -396 148 -157 -134 -1064 333 241 -18
2738 -18 -240 967 819 -456 -484 714 55 958 314 -870 -797 -262 -427 24 -418 100 75 89 -545 462
2758 462 -19 910 640 -321 127 -30 1 -499 -202 -791 -660 1424 437 479 -118 469 -95 -122 414 -281 264
2779 264 818 -350 -603 721 129 -8 -479 915 -254 269 -552 1072 -766 431 168 -404 -737 427
2797 427 -551 605 -72 572 241 123 788 -1167 328 174 -141 -778 103 -74 64 556 -489 326 409
2816 409 288 341 414 -272 -411 -212 -659 984 509 364 -292 -1064 152 1 -666 -275 -312 -173 230 -7
2836 -7 -561 -339 569 -31 266 -87 -150 90 -161 42 -49 -655 479 47 -312 -532 -22 207 -708 -436 -368
2857 -368 175 -1172 -842 333 -428 809 369 10 5 479 809 554 329 76 -306 -29 -709 -328 -604 -688
2877f88J18P77k50J94p27P39j7n74J576o64j20m08M74n5k46j17R64r28o5k05M92
2898B70r4l39J104j347JP72k84j86J20p6k33P77l61n30N81j01k09R98j236RO99
2919C35K54p78N15j006R02p91N52P32p01J038j383P65J56j64j15k43K76m18j49
2938b23M76l81j38J79L9J02K90n80N15O27j506M58Q60k15j54m62jQ03l50o31O07
$$ plain form
2877 -688 -570 207 -43 151 -576 163 146 -428 1148 484 364 -44 430 375 129 12 976 48 -17 -222 270
2898 270 176 -163 941 -406 -405 367 83 -103 17 -59 -292 485 124 -406 175 74 -135 863 -373 -364 335
2919 335 589 -189 326 -680 222 -569 -17 715 14 1052 -331 434 590 426 311 68 344 -74 -223
2938 -223 253 -128 -266 -87 -48 54 344 -236 279 906 -600 -142 718 503 349 -113 -114 689 339 -292 315
$$ [...]
8191b22
##END NTUPLES=NMR FID
##END=
