##TITLE=1H ikalashn
DE-77w
21.11.2024
##JCAMPDX= 6.0         $$ Bruker NMR JCAMP-DX V2.0
##DATA TYPE= NMR FID
##DATA CLASS= NTUPLES
##ORIGIN= UXNMR, Bruker Analytische Messtechnik GmbH
##OWNER= root
$$ TOPSPIN		Version 1.3
$$ 2024-11-21 16:10:44.796 +0400  Irina@DPX200
$$ Compression mode = diff/dup
##.OBSERVE FREQUENCY= 200.131300845
##.OBSERVE NUCLEUS= ^1H
##.DELAY= (6, 6)
##.ACQUISITION MODE= SIMULTANEOUS
##.ACQUISITION SCHEME= undefined
##.AVERAGES= 64
##.DIGITISER RES= 18
##SPECTROMETER/DATA SYSTEM= spect
##.PULSE SEQUENCE= zg
##.SOLVENT NAME= CDCl3
##.SHIFT REFERENCE= INTERNAL, CDCl3, 1, 17.49637
##AUDIT TRAIL= $$ (NUMBER, WHEN, WHO, WHERE, WHAT)
$$ ##TITLE= Audit trail, TOPSPIN		Version 1.3
$$ ##JCAMPDX= 5.01
$$ ##ORIGIN= Bruker BioSpin GmbH
$$ ##OWNER= Irina
$$ $$ F:/spectra/data/iren/nmr/1H/4/audita.txt
$$ ##AUDIT TRAIL=  $$ (NUMBER, WHEN, WHO, WHERE, VERSION, WHAT)
(   1,<2024-11-21 16:10:28.296 +0400>,<Irina>,<DPX200>,<TOPSPIN 1.3>,
      <created by zg
	started at 2024-11-21 16:04:19.171 +0400,
	POWCHK disabled, PULCHK disabled
       configuration hash MD5:
       BE 6D 3F 07 2A EA 11 49 91 17 2B D3 AF B3 58 0D
       data hash MD5: 16K
       8C 07 50 00 92 05 AD 55 90 FF 5C DD 8D C5 87 75>)
$$ ##END=
$$ 
$$ $$ hash MD5
$$ $$ AF F8 B4 10 69 82 9A 0A F3 95 E1 47 55 39 FE 83
##$RELAX= 
##$RELAX= 
##$RELAX= 
##$RELAX= 
##$RELAX= 
##$RELAX= 
##$RELAX= 
##$RELAX= 
##$RELAX= 
$$ Bruker specific parameters
$$ --------------------------
##$DU= <F:/spectra>
##$EXPNO= 4
##$NAME= <1H>
##$PROCNO= 1
##$TYPE= <nmr>
##$USER= <iren>
##$AMP= (0..31)
100 100 100 100 100 100 100 100 100 100 100 100 100 100 100 100 100 100 
100 100 100 100 100 100 100 100 100 100 100 100 100 100 
##$ANAVPT= -1
##$AQSEQ= 0
##$AQ_mod= 1
##$AUNM= <au_zg>
##$AUTOPOS= <>
##$BF1= 200.13
##$BF2= 200.13
##$BF3= 200.13
##$BF4= 200.13
##$BF5= 200.13
##$BF6= 200.13
##$BF7= 200.13
##$BF8= 200.13
##$BYTORDA= 1
##$CFDGTYP= 0
##$CFRGTYP= 5
##$CHEMSTR= <none>
##$CNST= (0..63)
1 1 145 1 1 1 1 1 1 1 1 1 1 1 1 1 1 1 1 1 1 1 1 1 1 1 1 1 1 1 1 1 1 1 
1 1 1 1 1 1 1 1 1 1 1 1 1 1 1 1 1 1 1 1 1 1 1 1 1 1 1 1 1 1 
##$CPDPRG= <>
##$CPDPRG1= <>
##$CPDPRG2= <>
##$CPDPRG3= <>
##$CPDPRG4= <mlev>
##$CPDPRG5= <mlev>
##$CPDPRG6= <mlev>
##$CPDPRG7= <mlev>
##$CPDPRG8= <mlev>
##$CPDPRGB= <>
##$CPDPRGT= <>
##$D= (0..63)
0 2 0 0 0 0 0 0 0 0.06 0 0.03 0 0 0 0 0.0002 0 0 0 0 0 0 0 0 0 0 0 0 0 
0 0 0 0 0 0 0 0 0 0 0 0 0 0 0 0 0 0 0 0 0 0 0 0 0 0 0 0 0 0 0 0 0 0 
##$DATE= 1732191027
##$DBL= (0..7)
120 120 120 120 120 120 120 120 
##$DBP= (0..7)
150 150 150 150 150 150 150 150 
##$DBP07= 0
##$DBPNAM0= <>
##$DBPNAM1= <>
##$DBPNAM2= <>
##$DBPNAM3= <>
##$DBPNAM4= <>
##$DBPNAM5= <>
##$DBPNAM6= <>
##$DBPNAM7= <>
##$DBPOAL= (0..7)
0.5 0.5 0.5 0.5 0.5 0.5 0.5 0.5 
##$DBPOFFS= (0..7)
0 0 0 0 0 0 0 0 
##$DE= 6
##$DECBNUC= <off>
##$DECIM= 32
##$DECNUC= <off>
##$DECSTAT= 4
##$DIGMOD= 1
##$DIGTYP= 9
##$DL= (0..7)
0 120 120 120 120 120 120 120 
##$DP= (0..7)
150 150 150 150 150 150 150 150 
##$DP07= 0
##$DPNAME0= <>
$$ [...]
##$SW= 21.9926040160658
##$SWIBOX= (0..15)
0 0 2 0 0 0 0 0 0 0 0 0 0 0 0 0 
##$SW_h= 4401.40845070422
##$TD= 16384
##$TD0= 1
##$TE= 300
##$TE2= 300
##$TE3= 300
##$TEG= 300
##$TL= (0..7)
0 120 120 120 120 120 120 120 
##$TP= (0..7)
150 150 150 150 150 150 150 150 
##$TP07= 0
##$TPNAME0= <>
##$TPNAME1= <>
##$TPNAME2= <>
##$TPNAME3= <>
##$TPNAME4= <>
##$TPNAME5= <>
##$TPNAME6= <>
##$TPNAME7= <>
##$TPOAL= (0..7)
0.5 0.5 0.5 0.5 0.5 0.5 0.5 0.5 
##$TPOFFS= (0..7)
0 0 0 0 0 0 0 0 
##$TUNHIN= 0
##$TUNHOUT= 0
##$TUNXOUT= 0
##$USERA1= <user>
##$USERA2= <user>
##$USERA3= <user>
##$USERA4= <user>
##$USERA5= <user>
##$V9= 5
##$VALIST= <valist>
##$VCLIST= <CCCCCCCCCCCCCCC>
##$VD= 0
##$VDLIST= <DDDDDDDDDDDDDDD>
##$VPLIST= <PPPPPPPPPPPPPPP>
##$VTLIST= <TTTTTTTTTTTTTTT>
##$WBST= 1024
##$WBSW= 25
##$XGAIN= (0..3)
0 0 0 0 
##$XL= 0
##$YL= 0
##$YMAX_a= 379545
##$YMIN_a= -612687
##$ZGOPTNS= <>
##$ZL1= 120
##$ZL2= 120
##$ZL3= 120
##$ZL4= 120
##$ABSF1= 10
##$ABSF2= 0
##$ABSG= 5
##$ABSL= 3
##$ALPHA= 0
##$AQORDER= 0
##$ASSFAC= 0
##$ASSFACI= 0
##$ASSFACX= 0
##$ASSWID= 0
##$AUNMP= <proc_1d>
##$AXLEFT= 0
##$AXRIGHT= 0
##$AXTYPE= 0
##$AXUNIT= <>
##$AZFE= 0.1
##$AZFW= 0.1
##$BCFW= 1
##$BC_mod= 2
##$BYTORDP= 1
##$COROFFS= 0
##$CY= 7568.61572265625
##$DATMOD= 1
##$DC= 2
##$DFILT= <>
##$DTYPP= 0
##$F1P= 17.9538593292236
##$F2P= -4.03888763876832
##$FCOR= 0.5
##$FTSIZE= 32768
##$FT_mod= 4
##$GAMMA= 1
##$GB= 1
##$INTBC= 1
##$INTSCL= 1
##$ISEN= 128
##$LB= 0.02
##$LEV0= 0
##$LPBIN= 0
##$MAXI= 945.577
##$MC2= 0
##$MEAN= 0
##$ME_mod= 0
##$MI= -402.1523
##$NCOEF= 0
##$NC_proc= 0
##$NLEV= 6
##$NOISF1= 8.587773
##$NOISF2= 6.764455
##$NSP= 1
##$NTH_PI= 0
##$NZP= 0
##$OFFSET= 17.49637
##$PC= 1
##$PHC0= 339.719
##$PHC1= -32.92317
##$PH_mod= 0
##$PKNL= yes
##$PPARMOD= 0
##$PPDIAG= 0
##$PPIPTYP= 0
##$PPMPNUM= 100
##$PPRESOL= 1
##$PSCAL= 0
##$PSIGN= 0
##$REVERSE= no
##$SF= 200.13
##$SI= 32768
##$SIGF1= 18.5376
##$SIGF2= -6.396296
##$SINO= 400
##$SIOLD= 32768
##$SREGLST= <1H.CDCl3>
##$SSB= 3
##$STSI= 0
##$STSR= 0
##$SW_p= 4401.40845070422
##$SYMM= 0
##$S_DEV= 0
##$TDeff= 0
##$TDoff= 0
##$TI= <>
##$TILT= no
##$TM1= 0
##$TM2= 0
##$TOPLEV= 0
##$USERP1= <user>
##$USERP2= <user>
##$USERP3= <user>
##$USERP4= <user>
##$USERP5= <user>
##$WDW= 1
##$XDIM= 8192
##$YMAX_p= 0
##$YMIN_p= 0
$$ End of Bruker specific parameters
$$ ---------------------------------
##NTUPLES= NMR FID
##VAR_NAME=  TIME,          FID/REAL,        FID/IMAG
##SYMBOL=    X,             R,               I
##VAR_TYPE=  INDEPENDENT,   DEPENDENT,       DEPENDENT
##VAR_FORM=  AFFN,          ASDF,            ASDF
##VAR_DIM=   8192,          8192,            8192
##UNITS=     SECONDS,       ARBITRARY UNITS, ARBITRARY UNITS
##FACTOR=    0.0002272,     1,               1
##FIRST=     0,             0,               0
##LAST=      1.8609952,     266,             -85
##MIN=       0,             -612687,         -612687
##MAX=       1.8609952,     379545,          379545
$$ Real data points
##PAGE= N=1
##DATA TABLE= (X++(R..R)), XYDATA
$$ [...]
2486A452k146k540j372j89J016K016K130K489J210J068j322k110j745k091k046
2501d180j002R80J627K319K242J986O87o31j203k263k183k264r32L92J156K609
2517f60J891K144J127%j543j747k471j930j547j36J296J999K359K458R55O8m71
2534C792k087k366k004j440m36N43J434K695K516J494O3j70j427k126k548j071
2550c138j556M48J672J854K286J738Q72J65j447j936k311j833j047J3J347J519
2566a354K108K545O71J96q70k096j654k421j735L00P05J987J832K027J544J07
2582C892j54j699k510j974j337m39L16J262K413K206J052J550q01j232k082j911
2598a448j864o95N02R20J523K466J410J455l34j004j737k088j928j051k52J050
$$ y = [1452, -694, -3234, -4606, -4795, -3779, -1763, 367, 2856, 4066, 5134, 3812, 1702, -43, -2134, -4180, -5182, -4202, -2575, -256, 1986, 3972, 4659, 4028, 2825, 562, -1621, -3885, -4817, -4425, -3269, -660, 1231, 3375, 4502, 4502, 2959, 1212, -1259, -3189, -4736, -4872, -3576, -1577, 782, 3240, 4195, 4263, 3792, 1705, -661, -2665, -4105, -4541, -3998, -2564, 131, 2647, 4141, 4204, 4034, 2607, 481, -2067, -3138, -4694, -4246, -2574, -720, 1566, 3304, 4176, 4341, 2894, 958, -1353, -3186, -4233, -4220, -2873, -1354, 754, 3299, 3970, 4166, 3296, 1200, -454, -2875, -4610, -4310, -3605, -1618, 214, 2241, 3785, 3892, 3738, 2039, -471, -2445, -3782, -4221, -3905, -2643, -230, 1976, 3028, 4578, 3777, 2545, 463, -1448, -3312, -4007, -3505, -2585, -1062, 1404, 2814, 4269, 3935, 2931, 1194, -894, -2822, -3873, -4125, -3075]
2614c075J672J854K279J215L23r33j657k020j878j886n5Q04J095J952K288J883
2630C861L31o55j567j756j801j955n61L34J646J488K003J660O73j43r06j755k163
2647a266j784j028J71P29J812K294J877J076J2m62j678k515j798j088P4L90J592
2664a592J807J669J683O96q82j614j871j755j612l37K34J365J773J923J950N04
2680C941P4k050j637j299k224n39l05J538J263K434J469R11P5r81j839j668j950
2697b787j026n3O56J587K106J491J521J50l03j687j959j627j109n99Q68R96J885
2714A10J799J078N62L4j528j936j960j200k62R5J196J160K161J374R04l84j094
2731B109j269j613j914r72N56R01J181J805J503J273j04o63j697j707j413j328
$$ y = [-3075, -1403, 451, 2730, 3945, 4268, 3335, 1678, -342, -2220, -4106, -4161, -3357, -2262, -310, 1978, 3861, 4192, 3537, 1970, 214, -1587, -3542, -4103, -3769, -2123, -635, 1368, 3028, 3701, 3558, 2652, 897, -1266, -3050, -4078, -3907, -3178, -1366, 928, 2805, 3881, 3893, 3431, 1753, -762, -2560, -3648, -3574, -3184, -1592, 215, 1884, 3567, 4263, 3381, 1767, -104, -1859, -3471, -3808, -3574, -2209, -436, 1487, 3437, 3941, 4015, 1965, 328, -971, -3195, -3734, -4039, -2501, -1238, 1196, 2665, 3576, 3651, 2670, 831, -837, -2787, -3813, -3866, -3210, -1623, 483, 1974, 3495, 3645, 3342, 1655, -304, -1931, -3040, -3639, -2771, -1775, 110, 1909, 2987, 3549, 3583, 2055, 119, -1841, -3041, -3303, -3208, -2012, -852, 1309, 2683, 3587, 3203, 2109, 840, -773, -2687, -3659, -3103, -2202, -1021, 784, 2287, 3560, 3456, 2793, 1096, -611, -2024, -3352]
2747c352k6L69J385J923J603J197N64r90j137j477j911p42p89L38J200J584J583
2764A322J541N01j80j067j587j560j380r10P6J056J629J435J515R28R7j081j346
2781I89k347o89j448Q1Q33J574J412J660J431k34n49j251j822j574q90k14O65
2798b373L72K071J546J031L25m2j179j673j379j429m77J23J396J091J864J183
2814B450Q29l1j327j659j199j298j057L61L75J771J505J731P75j1n58j378j771
2831d92j545r75l26J017J189J696J503P43J81k43j294j502j469r25o24L67J384
2848a315J119J559J108L65p2p45j487j926j146j41n05J264J548J207J317P57k54
2865B653m92j384j513r75q13n51O15J325J722J354P14K73r33o14j721j510o41
$$ y = [-3352, -3378, -3009, -1624, 299, 1902, 3099, 3663, 2673, 1536, 59, -1852, -2594, -3383, -3045, -1845, -261, 1322, 2863, 3364, 3184, 2117, 530, -1030, -2410, -3320, -3244, -2188, -559, 876, 2391, 3319, 3416, 2335, 989, -1358, -2047, -3495, -3414, -2581, -1007, 405, 2065, 3496, 3262, 2713, 1462, -360, -1934, -2824, -3038, -2373, -2001, 70, 1616, 2647, 2972, 2930, 1751, 78, -1301, -2730, -3207, -3084, -1688, -597, 1267, 2450, 3279, 3248, 1921, 262, -937, -2235, -3292, -2931, -2556, -785, 720, 2451, 3226, 3215, 2657, 1279, -492, -2037, -3012, -3338, -2321, -1132, 564, 2067, 2810, 2991, 2748, 1454, -48, -1517, -2442, -3066, -2699, -1315, -196, 1363, 2471, 2836, 2764, 2019, 532, -1394, -2540, -2681, -3186, -1922, -374, 833, 2150, 2907, 2653, 2161, 777, -736, -1711, -2524, -3075, -2460, -1135, 587, 1941, 2655, 2928, 1995, 1381, -340, -1850, -2491]
2882b491l36N05R48J312J442J140N28l55j217j932o35j250k45j05J326Q01J719
2899A155J318K68l7q69j254j519j231q60J35P00J099J612J600Q61j92r02j182
2916G02j221j198p53J9K19J217J369J527M70L92k75j083j615j056j324m6L65J012
2934a279J086J465R55L55j10j279j169j061o52r44K36N90J422J709P83O13K55
2951B975q99j526j496r24o59k57P91J474P40J070Q93Q7l01q63j176j501q67k17
2969b656K03J403J239J180J184J69n08r39j145j458m36p04K65J011R48J130J121
2986B007N88n92m40j268j536n82q66N59N57Q87J194J332L05k78l48o74j403j031
3004a589n44Q2M84O95J158J032J096k12l60r97p89r60j212j00O52N01J039P99
$$ y = [-2491, -2827, -2322, -1374, -62, 1380, 2520, 3048, 2693, 1476, -456, -1091, -2341, -2586, -2691, -1365, -564, 1155, 2473, 2741, 2704, 1835, 581, -938, -2169, -3029, -2894, -2194, -1095, 517, 2117, 2978, 2786, 1884, 702, -519, -1717, -2470, -2451, -2232, -1015, 354, 1881, 2351, 2743, 2468, 1385, -230, -1286, -2610, -2656, -2291, -1279, -193, 1272, 2227, 2582, 2472, 1193, 24, -1037, -1689, -2633, -2397, -1807, -385, 1324, 2107, 2720, 2975, 2076, 550, -946, -1870, -2529, -2786, -1995, -521, 219, 1289, 2182, 2269, 1968, 1105, -71, -1572, -2439, -2656, -2453, -1050, 189, 1369, 2553, 2722, 2214, 1275, 130, -1328, -1764, -2468, -2203, -1192, -244, 886, 2007, 2595, 2003, 1563, 295, -1241, -1823, -2689, -2130, -1573, -686, 508, 1840, 2145, 1867, 1519, 845, -558, -1589, -2133, -2051, -1567, -872, 286, 1318, 2414, 2202, 1842, 845, 56, -904, -2116, -2216, -1564, -1063, -24, 775]
3022G75J172M70o22m21j102r91j240j48k8O63J349R02Q55L38N0m61j485r70n99
3041a493o47k14P38P56J405Q11M34J06m30o86j112r71o91k87P90R58P95J210K35
3060A707L65l00o96j077n36r45n36L65N26R44J161K38P10K51j076q97j097r46
3078a839l57J14Q82Q86P13J197N60l10n86q42q53j048n02L00L47M75J209O54P90
3097A790j11j00m12j440n40j167M14j17P17R96R91N71M36n54j92j316r98m35k69
3116a736L14N86N38J140N08P8P3m04p44q07p16n46M7P13N02P13R57M57j97m68
3136A008l83j378l94o29K1K75P52J086P73L20P03p53q08p18o42n03m85P28L33
3155f94Q50O62N31K52k38m32q27o49q56l46J83P93M48R26P51J89j33n96m70q23
$$ y = [775, 1947, 2417, 1795, 1374, 272, -719, -1959, -2107, -2135, -1472, -123, 779, 1634, 1972, 2022, 1561, 76, -894, -1493, -2140, -2354, -1616, -860, 545, 1356, 1790, 1896, 1466, 780, -332, -1303, -1994, -2281, -1491, -533, 262, 1472, 1707, 2072, 1772, 1076, -1, -537, -1482, -2018, -1653, -1127, -183, 978, 1216, 1926, 2177, 1101, 204, -893, -1839, -2196, -2082, -1200, -314, 399, 1596, 2156, 1846, 1260, 418, -435, -1483, -1985, -1685, -1338, -863, 346, 1000, 1790, 1679, 1579, 1167, -273, -813, -1980, -1566, -1683, -966, 30, 1021, 1592, 2028, 1474, 1282, -34, -1032, -1467, -1736, -1422, -836, -298, 842, 1350, 1428, 1501, 1097, 353, -454, -1170, -1716, -1669, -956, -454, 259, 1216, 1673, 1476, 1008, 625, -753, -1147, -1776, -1755, -1480, -728, 358, 1131, 1451, 2154, 1401, 593, -125, -767, -1270, -1755, -1027, -694, 156, 818, 1349, 1601, 1363, 931, 104, -545, -1401, -1747, -1564, -771, -323, 603, 1354, 1543, 1410, 814, 344, -479]
3175d79q73m11L57L76N71Q48N39P35J2o90l67p46o95m50m38L50O50P71Q21N43
3195A424k17J15p54k18p44j042J5R8J022L21O07M84L62q0o21l35q36j081L24J28
3215a028K44K51J109P16k55M9n5q09m76l77q01K17N48K43J045K20K04L16m07p23
3235B31m79m85m05m85L36O79R30N78O26m22J71p57o40p29j58n55K60O93O37O69
3255F95M82K65n20N7q37p94l99J8m01J038M16N76L77l1J07k38n74l90m65m11j74
3276a203K43P89M53O18Q7k6K20r99l88n04o09K38L93M10R7Q83K52J84k7r41k87
3297a17k64r20o3L31P5P22Q55M42R9o1p57o23k32k57k88k32P90J78L33O90N82
3318A283J90p57n40n09m37k64L38m22R62N25k0O61O9n02m66k26n63o38L02K80
$$ y = [-479, -1352, -1763, -1406, -1030, -459, 389, 928, 1663, 1675, 985, 618, -128, -823, -1273, -1711, -1361, -711, 60, 881, 1424, 1207, 1322, 568, 350, -394, -1436, -1421, -1323, -301, 20, 627, 1111, 1473, 1393, 772, 437, -399, -1480, -1156, -1028, -784, -533, 576, 1292, 1037, 1086, 1031, 222, -254, -631, -1432, -1215, -667, -424, 621, 841, 1045, 1361, 954, 231, -248, -733, -1138, -1623, -1287, -608, 322, 900, 1526, 1104, 1275, 518, -122, -851, -1009, -1564, -1304, -611, 26, 695, 1177, 1442, 922, 979, 142, -652, -1051, -1033, -1434, -396, 20, 596, 973, 942, 1049, 811, 237, -153, -618, -1029, -1203, -960, -171, 282, 900, 987, 961, 1181, 182, -206, -710, -1319, -1081, -688, -278, -181, 702, 954, 1138, 1111, 170, -117, -381, -1301, -1364, -1033, -958, -236, 619, 1061, 1160, 1099, 342, -281, -513, -770, -1058, -1290, -500, -322, 11, 701, 1283, 1473, 716, 176, -333, -770, -1034, -696, -1118, -156, 369, 349, 1010, 1079, 577, 111, -115, -678, -1316, -1014, -734]
3338g34M50j12O84L97K91k85J60j254n74l34N14j73P09j5L82Q69p3Q4l76n29l80
3359b99n05J65j85K42L45K52O50OJ55l33n18m09m05j16O3M2O53J48P37K7J2k68
3381D59m59j13l96k37k11J16L65R48j3L99k38Q5n64m75J6p38K66J50k19Q43O79
3402F63l9K31J67n94N7r19m36j36R4M13J17P67K01M07k94J43q45k58k81j68O0
3423f50K65M25J22J41N52J02n11j95n81l28J4j25J11M86R2Q34l65N53Kn81k32
3444A31l95n78k43M14Q7L72N66K49m1K23m10k01p42J61l06O6K95Q0M49M57J35
3465G69n67K29m44k65n9m29R3P8L94K00O28J98m1k54k31l36p45J07l48M88K35
3486c00N18N56j75J3k89o1o16K36m11j34n2Q0M62M89R6J51j26n7k86m80m71j63
$$ y = [-734, -284, -396, 288, 685, 976, 691, 851, -403, -977, -1311, -797, -970, -261, -276, 106, 975, 902, 986, 610, 81, -299, -804, -639, -824, -582, -237, 15, 665, 671, 826, 493, -25, -434, -839, -955, -892, -850, -197, -49, 688, 715, 727, 459, 0, -113, -509, -746, -957, -841, -476, 472, 459, 858, 620, 705, 141, -334, -318, -1056, -790, -640, -859, -16, 663, 624, 855, 1022, 428, 485, -434, -870, -1006, -912, -499, -382, 385, 586, 993, 699, 842, -3, -261, -542, -710, -650, -385, 40, 162, 303, 855, 957, 446, 251, -330, -658, -644, -769, -658, -172, -80, 754, 389, 942, 944, 363, 131, -264, -842, -1085, -671, -584, -212, 354, 603, 562, 785, 375, 174, -568, -407, -713, -647, -352, -272, 177, 634, 769, 202, 431, -13, -278, -337, -766, -673, -595, -201, -1, 627, 825, 784, 530, 299, -37, -782, -675, -1023, -535, -300, 218, 774, 599, 612, 323, 262, -354, -118, -529, -663, -715, -635, -173, 316, 412, 563, 437, 380, 94, -386, -857, -1020]
3508a020k97R47N01O5O25l04q2k45j9k37m62m41M67j95L34P42K68O8N4n03n2k80
3530f6n05k08Pk1L13Q13Q2N42j70l03Mp73k66m06K83L85J0K21L48K38J26l11o7
3553B76j83m71p1J53m80O07K1N53KP2l1j37j32m36m4k34r6J56M60K71n5M31n4
3576E78j15k97m45p1j44j4oR1P25o5K18M21n68j36j86m61K56n81L79M3N29Q6L41
3599E78K5K2k24l12m27j76l03N38o0K77L11k2M64L8n32l0n50K34m76j9M52J00
3621i2J97J47J35O7K98q21Qj19j85p4J81O7j62Q02k1J73m98J32l12k12r4k43K36
3644c90j88M32L39N25j82M19r44m3j76j56j99ML9O52lL37L11j35n22L5n51J95
3666b01m38L28l20O25J36L20j46L33j62p08n0K71l15l56M31n4L67K50lK02m0l82
$$ y = [-1020, -1317, -370, 131, 196, 821, 517, 435, 190, 171, -66, -528, -969, -502, -697, -363, 379, 647, 715, 769, 266, 214, -66, -571, -779, -772, -793, -480, 333, 415, 957, 787, 484, 488, -285, -551, -957, -674, -289, -279, -58, 290, 528, 654, 343, 276, 93, -378, -449, -296, -776, -169, -148, 405, 407, 479, 448, 311, 179, -257, -301, -535, -631, -475, -15, 256, 201, 632, 578, 463, 166, -279, -350, -494, -508, -514, -423, 302, 237, 455, 876, 308, 172, -14, -475, -219, -800, -421, -378, 151, 237, 578, 603, 625, 401, 89, -338, -514, -817, -279, -339, -62, 249, 227, 691, 729, 197, 167, -383, -149, -625, -644, -192, -92, 105, 252, 387, 454, 752, -69, -61, -180, -365, -439, -258, -191, -353, 449, 428, 601, 103, 235, -77, -289, -383, -626, -390, -578, -146, 193, 718, 536, 955, 11, -32, -208, -364, -563, -559, -520, 132, 129, 466, 777, 642, 120, 155, -396, -201, -639, -311, -631, -6, 130, 450, 304, 637, 475, -233, -283, -12, -327, -683, -252, -306, 61, 311, 308, 510, 470, 88]
3688H8m74j33N2J3Q8r6O14Q9N10k58l25K60n07p8k46K32l22L3N34o3L30M29k39
3711E31%p55J53l16m42J27J98L94O1K45J79j08J1j18J37o57j82K93j01K06M82
3732C38j56J81K03j65j18k27n5l84p4k39M00M48M68r3J91l02n8j81l72l06m22
3753i23M96k6L31M22q4M44l17L43p51k18K15n66K70K15k01P99r3O3J68k61m13
3774h7O8k28j11l34J43M64L99J08j86N48m55l22r2j83k65M1j33M5P49k42M09L06
3796F42l64R5k00n36K17k62J26J24j74K90K17K30n5p2j98l86K18l16j47M41N0
3817f0k00N39J11o0k9k94j57j82j41k09o2N90Q6O66k05K02m35J57l16n62J97k74
3839f38K21P0J89N27J80j31M82n97k48k07k81M1m9L24K27L54N8J08n35L0K22n12
$$ y = [88, -386, -519, -467, -454, -366, -462, 152, 241, 751, 493, 168, 428, -79, -157, -403, -171, -493, -460, 74, 11, 341, 770, 531, 531, -224, -71, -387, -829, -702, -504, -110, -49, 196, 375, 267, 278, 160, 297, -360, -542, -249, -350, -144, 338, 182, 363, 566, 401, 283, 56, 1, -383, -457, -696, -296, 152, 620, 527, 718, 416, 358, 177, -195, -501, -923, -427, -453, -122, 300, 216, 660, 343, 686, -65, -283, -68, -634, -364, -149, -350, 449, 356, 419, 587, 326, -87, -19, -247, -358, -692, -549, -85, 314, 422, 236, 784, 329, 7, -85, -268, -533, -492, -625, -580, 169, -73, 336, 642, 278, 373, 173, -363, -146, -408, -282, -158, -332, -42, 175, 405, 350, 278, 80, -306, -88, -404, -551, -110, -60, -260, 279, 390, 330, 301, 7, -150, -332, -473, -682, -744, -154, -68, 598, 393, 595, 160, 317, 1, -561, -364, -638, -417, -347, -158, 369, 549, 418, 900, 303, 55, -152, -433, -392, -441, -117, 110, 464, 522, 630, 95, 125, 347, -165]
3861a65J18o32M46l58K96L75K20K68r8M2l44l56j28j41J00KL92qJ26M73m11J72
3883C89j51n50j14j07J04p3kL30J24L38P4N0l70J68l85k8m48M23l8R2K72M12J65
3906F75l36J53n43k58L1j0mm18J59K81L09L37n9J79j27j60m33l13J60q4L3P0O33
3929B75J01M74l70m53K10o27p4K8J95j12K68K73M4J20m0L03m05m44n8l30L9L55
3951b28LN88K65k3N1j34M5r23r8l51Q07l90J30P00jM68n2n19r1k83j83k84p3K71
3975c05J66L83K81k87N38m65k8j25n29j5n06M11J11J79K99M27m74J093m52l27
3995C75q52J84k02J6Q2L35K49QJ96N79n44n87j39J96m02k29J19J54K28N93O2m46
4017b5J67K8j21j27l18o5JO0p6M61L59r9K21k56j0l78k31J03l53K15K81M08j01
$$ y = [-165, -47, -679, -233, -591, -295, 80, 300, 568, 470, 512, 168, -188, -316, -457, -357, -355, 37, 29, 155, 628, 217, 389, 238, -312, -426, -533, -429, -502, -504, -174, -50, 288, 362, 412, 42, 210, -175, -203, -651, -228, -266, -174, 98, 510, 675, 339, 492, -51, -309, -278, -288, -292, -710, -551, -270, 39, 376, 317, 496, 369, 209, -224, -537, -377, -461, -428, -358, 275, 376, 850, 480, 27, 237, -390, -464, -436, -241, -353, -85, 188, 232, 352, 312, 615, 210, -234, -292, -622, -583, -228, -225, 363, 628, 605, 656, 522, 567, -356, -454, -805, 2, -388, -258, 442, 441, 909, 857, 338, 247, -36, -219, -503, -576, -305, -139, 244, 525, 238, 776, 311, 283, 158, -371, -386, -892, -481, -370, -191, 108, 535, 61, 1154, 702, 375, -477, -293, -495, -479, -397, -62, 187, 195, 391, 970, 426, -161, -300, -104, -506, -735, -616, -462, -234, 359, 421, -25, 142, 170, 49, -78, -396, -461, -460, -400, -476, -15, 344, 245, 466, 210, 200, -178, -409, -306, -659, -444, -163, 245, 144]
4040A44J81L45l79k2m24q2l49L86m37L51N52l17L83L90p24O02k19o13n46K1K88
4061d69L68j41O37K5J45j32Pm51j79j15l05L72l43M41K48N5M00j34J51k45m32
4082i7j37n32N6L33N14q2L52L80l81Oj64l64q1n54K89K0R1K1O87k33M78K80n78
4105C04j08k81j53l93M4J55K25L99M75l5J59m84k08m72J26j63m2l18N82N19r7
4126B34K99m14K2M09m39j68n04M7M46j27r3N01o6N59l70j96L6o66O0k37K07q0
4148e40K71M04M67l09M25o50J48l81l27m7J23L65L7K2K45K1M22n59L11l35l73
4169b60m12K4M8J86N51M39L02l17n0l09n54k1j21J24k08j43J029l6L71j55K73
4190G61k86j17l86l80j53L61M0rN28j05J54K57l09k61k63J04n29J09J3K71J81
$$ y = [144, 325, 670, 291, 269, -155, -237, -586, -200, -637, -286, 266, -51, 332, 722, -2, 600, 381, -232, -778, -757, -469, -101, -242, 395, 420, 565, 433, 440, -11, -190, -305, -610, -238, -581, -140, 108, 163, 563, 429, 580, 335, -97, -234, -766, -710, -377, 137, 55, 407, 787, 406, 412, 248, -116, -197, -751, -462, -442, -351, -330, 357, 124, 602, 882, 304, 196, -85, -238, -631, -587, -432, -207, 192, 667, 632, 791, 307, 99, -373, -247, -410, -452, -770, -188, 331, 234, 533, 119, 141, 550, 111, -57, -561, -514, -68, -195, -288, 213, 147, 706, 336, 140, 176, -490, -430, -667, -460, -540, -269, 135, 602, 293, 718, 68, 216, -165, -492, -539, -416, -51, -14, 8, 253, 274, 696, 137, 448, 113, -260, -672, -648, -600, -414, 137, 576, 878, 561, 511, 202, -352, -373, -494, -370, -578, -721, 308, 272, 643, 488, 761, 475, 358, -28, -408, -561, -200, -160, -169, 359, 254, 408, 665, 356, 95, -168, -64, -593, -484, -471, -200, -19]
4211a9J01O70K5k72m05%m48k9r3k87L19L78j4M70N4L07m58j66j34l10m20m0N32
4234b39k33L80O1O74K32m53n64K21o50m8J7L64J36Q4N39L46m17p4l96J49o26K2
4256d75k50j2n1N91K91M98k80J59j23l59j40o91K19J48J78L40k53O30L44m6K83
4277A001j110j39Q3m51k46L71L82L28N57j58j99J76k86o11K57k70m5r1M34k98
4297c15Q39r6J66j37j61m52Q4k48j61O5P3L00J9J99P0K63k49J99n81R7n57j35
4319g18K67M42J95J97j07M51j23k21j72q29K31l53J46L57J42O73L28l21p3j61
4339C51j39j92m69J8l27L82N10J35L50j58L15j93p86K59l39m03J72P2L54K1M21
4360C54N84m07L82m68l88l80l03K44k39L07K97J91L22L47o84K64n21l53o2N1j48
$$ y = [-19, 82, 752, 777, 505, 100, 100, -348, -377, -470, -757, -438, -60, -74, 396, 450, 757, 299, 133, -1, -311, -731, -771, -239, -472, -92, -31, 643, 875, 422, -142, 79, -571, -619, -602, -238, -102, -18, 521, 867, 450, 376, -20, 129, -497, -475, -725, -737, -788, -197, 94, 592, 312, 471, 348, -11, -151, -842, -623, -475, -297, 43, -210, 420, 764, 718, 1001, -109, -248, -165, -616, -862, -491, -109, 219, 776, 618, 419, 595, 309, -302, -45, -315, -360, -451, -17, -315, 524, 428, 594, 457, 296, -156, -72, -320, -481, -416, -343, -43, -24, 175, 245, 508, 259, 458, -123, -26, -583, -718, -451, -9, 186, 383, 276, 727, 604, 383, 211, -618, -387, -740, -594, -237, -95, 578, 906, 585, 512, 351, 212, 20, -449, -431, -758, -376, 134, 269, 619, 461, 776, 583, -203, 56, -283, -686, -514, -442, -88, -67, 354, 938, 531, 913, 445, 57, -323, -626, -382, -621, -314, -17, 174, 496, 843, 159, 423, -98, -451, -513, -462, -610]
4381f10M63J6K18Q6N91l18j95k00k12j42o37O40m4K8N10J99k87M88k59J01n72
4402a36l73J9k94M11N90k62j08N14K02o6p50M04n17L48p17M40J0J19N62J83j3
4423E66L8k72j1l75m34j10J27J98n3N23L67ok69J52l36l60n4J2k50j52N10K31
4445D2K87R8L31l83j75j72m12R4l13k93N04M41K43K12l09J68j19k58l62P5J10
4466a91k17ON2O66j5J07k47N08q51l22K77k73J5K40K5r8N57K66J96J46q53j30
4488a36n81K90l81O6P12n4K63K32K31L4k33n94m6j08Oj52K03K37K61J82k03K89
4510E18P6o13k8k24K4j50j04K69M52l54P97J24M6q86k40j30l1j98J62N05J25J08
4532B48K92Q3K15k98n76n23j2l5K99j8p8O18Q8K46k48P6k87n47j7%n1K39M14m2
$$ y = [-610, -147, -131, 87, 173, 764, 446, 251, 51, -161, -303, -940, -300, -344, -316, 194, 393, 106, 594, 335, 436, -136, -509, -490, -784, -373, 217, -45, -153, 361, 563, 497, -253, 151, -366, -18, -735, -295, -285, -166, 396, 579, 566, 604, 332, 321, -54, -488, -598, -471, -273, -326, 197, 564, 558, 289, 441, 105, -255, -309, -297, -547, -699, -189, 42, 329, 427, 758, 375, 200, 28, -384, -290, -603, -896, -392, 49, 292, 504, 195, 363, 244, -14, -376, -301, -191, -408, -402, -350, 316, 301, 408, 161, 669, -182, -504, -227, -500, -485, -245, -220, -318, 239, 505, 701, 847, -6, -136, -717, -427, -808, -742, -30, -84, 179, 411, 642, 676, 443, -151, -197, -305, -299, -451, -248, -11, 250, 432, 229, 518, 594, -19, -47, -271, -247, -397, -501, -232, 220, -134, 663, 787, 833, -53, -293, -423, -454, -652, -490, 15, 140, 248, 540, 623, 838, 540, -36, -559, -571, -606, -307, -325, -403, 215, 303, 549, 301, 377, 90, -457, -474, -474, -525, -286, 128, 86]
4556H6k34R63k27K07p03j79j31n37k9M74L32j61K95N62n7l40K15p70K64o24L71
4577b23K7m83O97Q0N28j0l03q9l61K11l76m86O9M38N29M7L69K1n5n44K4k38n06
4600f34O3J35K77k8L55JL57K16l95k55r6j33m04l32M06J37J37K86j36L46J17p0
4622C50l48l33P8J28q72N32J46M84J91K23Q6k41j22k19m08k02J00n4L87N7N21
4643D84J78N2j13n00k06k30k70p7M48k1m1J029m04K31O3o18R7k83l24j73J05L5
4665e38l7P64R1L92n1j85m85k5n22K60rJ12j84L42K23M45O1l08K20o38k33K18
4687h7j95j1J42J00L66K4J60j13j4j1o27k5j99k32J57M58K94K47L05m65N1m64
4709a39r3l7j27l91J08L64K89L23K49Q2k94J3m2o25j58k29L30J25M9L97Q4J79
$$ y = [86, -148, 815, 588, 795, 92, -87, -218, -755, -784, -310, 22, -139, 156, 718, 661, 321, 536, -234, 30, -594, -223, -196, -679, 18, 98, 626, 616, 313, 224, -137, 74, -302, -788, -719, -281, 248, 295, 664, 685, 630, 86, 110, -128, -634, -571, -436, -159, -187, 168, 169, 526, 742, 347, 92, -4, -137, -541, -873, -467, -330, -193, 93, -43, 303, 420, 350, 2, -331, -253, -125, -997, -465, -319, 165, 356, 579, 665, 424, 302, 83, -325, -527, -427, -481, -94, -37, 484, 662, 714, 601, 101, -105, -335, -605, -682, -234, -255, -296, 733, 329, 560, 623, 5, 102, -181, -505, -678, -573, -538, -575, 189, 280, 672, 621, 436, -49, -74, -596, -336, -345, -233, -417, -75, 148, 593, 654, 346, 566, -72, -305, -87, -282, -293, -151, -51, 315, 339, 499, 386, 372, 361, -266, -291, -490, -722, -565, -107, 187, 434, 739, 274, 325, -139, -232, -269, -396, -787, -679, -315, -26, 297, 546, 628, 334, 347, 305, -320, -478, -707, -377, -252, -203, 194, 278, 457]
4731D57L94n10m21J84p22Lk10P07j38r0M93M42L3J6l36j87n26j84O7K34q6M01
4753B1M11j90K78n9m04q0n8J9o01L62K44L59l79K43M61Q3p81J72o9k05j19l47
4775f39M28r6M76K53LJ21j09q6k27n03Ql0N2J37M16j16L67L82r3K9q84k32O0j62
4799d45J57j9K71ML52J34j49M62l24j057L36k05j90L81k46L48M39J48J11j05k8
4820C75m49j28k23l38K45L21J03L88J96J97j63l34j09q0m74p0J25j1J42J61L38
4841B12L19k27L44m04n13j41j60k94M71R9N56J6M35j64j25Q7n61k03k6j37o9K69
4863b16L83M1K5N24j67k26Pp42j97J96o56N37K45M77j48O05j5n82L63l71p10K88
4885c39j91L11J89K49L38l23N01k38j66n30j62m0k76O20j7l24L71K59M18l82M94
$$ y = [457, 851, 341, -80, 104, -618, -615, -825, -118, -256, -346, 147, 589, 622, 638, 302, 115, -411, -595, -528, -294, -380, 21, 432, 242, 520, 461, 57, -23, -81, -62, -663, -301, -57, 302, -77, 166, 627, 710, -71, 101, 32, -173, -292, -639, -211, -307, 169, 422, 425, 546, 437, 351, 124, -379, -371, -401, -349, -212, 204, 88, 455, 837, 744, 773, -111, -343, -283, -445, -288, -307, -36, -32, 320, 454, 305, 767, 443, -614, -278, -483, -673, -292, -538, -190, 249, 397, 508, 403, 375, -74, -202, -425, -763, -518, -197, -94, 294, 490, 687, 524, 190, 81, 1, -473, -543, -418, -429, -287, -126, 212, 531, 304, 648, 244, -269, -410, -570, -864, -393, -294, 262, 278, 713, 549, 424, 511, -50, -253, -279, -416, -485, -216, 167, 208, 233, 757, 590, 364, 371, -371, -568, -372, -1028, -491, -246, 231, 83, 688, 673, 91, 454, 83, -627, -339, -530, -219, -30, 219, 557, 234, 735, 497, 331, -199, -361, -401, -677, -57, -74, -398, -27, 232, 650, 268, 762]
4906G62n05n72%j88m7l3P20N8J53P5J89k67k5m40l3n17P6J62J52L1N18M5N40m24
4930D30m16o7l50j56l44N98j43K10K05M51l8l9k01P7n39q3R2l69K36Q4O75l61
4952d8M92q6K94n63j74k79j54j41Q5L5O12L02J65J00J16o53J31l20l86o13N20
4973e65P7J74P88k37O06m88J76n22j93m60n8J99j46N50K04o5O56l95L34l62n51
4994b78O2n90K00K33R3j18M73L34J2n68J23R2m98l65L87l63O30j43M46L54k75
5015B41K76l19k79k41j20l41J57o4M64K12L21j09O71l77j52l39n50LL0N8Q2L42
5037c4L56n9R5m3M3l72k14m91p5K05L92K05M01L6K97j19j19k28n65l06J51k61
5059g05Q2P13k73J033l5j63p7n42k04o31J02J0M00J69N3O21M49o29J97j33n38
$$ y = [762, 257, -315, -315, -503, -550, -583, 137, 195, 348, 423, 612, 345, 320, -120, -153, -670, -594, -432, -280, -249, 269, 314, 854, 430, 14, -53, -403, -559, -903, -305, -448, -238, -33, 418, 380, 341, 140, 217, -322, -405, -313, -682, -446, -362, 313, -48, 444, 358, 652, 89, -85, -364, -518, -659, -574, -539, 73, 375, 540, 640, 756, 103, 234, -86, -472, -1085, -565, -488, -314, 474, 237, 843, 355, 531, 9, -184, -644, -702, -503, -649, -99, 105, 40, 696, 301, 635, 273, -278, -216, -806, -606, -373, -280, -398, 75, 409, 421, -147, -24, 68, -430, -795, -408, -771, -141, -284, 162, 516, 241, 517, 198, -81, -322, -442, -783, -626, -690, -226, -14, 307, 198, 869, 492, 340, 1, -549, -546, -516, -458, -376, -34, 322, 263, 358, 315, 358, -14, -228, -719, -794, -589, -197, 8, 409, 445, 742, 623, 504, 276, -289, -595, -444, -705, -623, 90, -183, 850, 815, 652, 575, 33, -171, -802, -700, -690, -290, -121, -68, 553, 1002, 373, 570, 437, -101]
5080a01j37m95j98M23Q4K25L47L52j07J49J11l39o45j25m24K8K91L76L99K89K78
5101G81k90J49k22l51o00k10l6L25l2O83J03L01j03j89j75P7o12k20j73Q03l58
5122c49O41K06j82K83l7k15k91k98l12j43O5N41J59p4P17l16K9k36J00n88j20
5143d20n10o4M80K37M06J36J22L26l00k85l40k29J56l08L8J67J95M21M80J22j72
5164F58n36j47J4n39p1K66j25M90M43j0j12J68M75j099k44k88k49J47L3P14N32
5185E20J75l20M40m46l2l53n76r3Q4n0M62L4O56l19O73R5m21l09l84m08K2pK28
5208c29N59k94M46K69L61p82l59j90k72j43j47P57k23O04K36J92J67rj31q14j42
5229b44k24k90P6P53j86O33M99m20j11p7j75n75m03J47j12K36K27M29P30m48L52
$$ y = [-101, -238, -733, -931, -508, -424, -199, 148, 500, 393, 542, 653, 314, -331, -456, -880, -852, -561, -185, 214, 503, 781, 491, 640, 418, 67, -533, -743, -779, -454, -486, 197, 300, 601, 498, 309, 134, 211, -401, -621, -794, 9, -349, 292, 498, 316, 599, 562, 347, 56, -242, -554, -697, -632, -91, 68, -6, 711, 395, 424, 188, 288, -300, -420, -930, -994, -514, -277, 129, 265, 387, 713, 413, 128, -212, -441, -285, -593, -555, -388, -193, 228, 708, 830, 658, 122, -25, -11, -550, -621, -355, -480, 10, 453, 443, 331, 499, 974, -125, -369, -657, -906, -759, -726, -12, 520, 695, 375, 815, 369, 337, -16, -592, -685, -601, -651, -189, -155, 501, 182, 855, 950, 529, 220, -164, -572, -550, -557, -329, 230, -64, 382, 651, 1012, 230, -129, -319, -591, -734, -881, -124, -347, 257, 493, 685, 852, 843, 712, -102, -244, -468, -758, -682, 71, -115, 518, 1017, 597, 486, 409, 234, -341, -744, -597, -709, -473, -246, 183, 913, 465, 817]
5250H17l96m70k71m24l5K4M45N6L76K83L08km61Q7k68o59j59j31J33O22J06M64
5272D45K82M32l50p35J11n47k75k13K9K99J78Q51M9K9q5L23k44q44o01K25K7m
5294f18M80o6M44J13N06j29o18m63L5k68l03M12K10L60J56O3K37j2n2m89n30j48
5316f80J68L1K43M83M58o8M06m17K39p73l11l05r0J28j17N47L59NN89k06j95l32
5338A62l52l23K5k90J69M38M61M42l1M6j91N5o06n53l45O6m0R6P10J69N29J41
5360G78j52j6n82l90l12k56j01L25O58M26K16L70o58K01l91m23m9l57p4K11N51
5381b5jM84L27j43l01J45n46r8k58j47J47oN93N37K4L89o85m54K18q51J43o4J12
5404d60mL93K05L01L73r0k39r9p39j34j85N7j21N98K77K80M66j35k32l62k89m03
$$ y = [817, 421, -49, -320, -744, -779, -755, -310, -254, 122, 405, 713, 711, 250, 337, 69, -590, -749, -880, -747, -125, -19, 445, 727, 1159, 809, 74, 185, -362, -637, -850, -821, -522, -344, 507, 556, 585, 500, 823, 579, -265, -866, -641, -614, -618, -138, -204, 240, 353, 859, 730, 112, -351, -316, -584, -887, -475, -265, 95, 251, 314, 551, 539, 487, -2, -532, -680, -512, -481, -238, 245, 703, 635, 1041, 624, 863, 90, -221, -526, -616, -488, -605, -58, 301, 306, 895, 689, 494, 162, -190, -513, -488, -778, -609, -171, 290, 732, 701, 747, 556, 611, 5, -548, -893, -827, -867, -771, -61, 108, 637, 778, 626, 610, 28, -362, -674, -930, -1031, -706, -48, 378, 594, 964, 306, 507, 116, -307, -356, -713, -787, -576, -25, -26, 458, 785, 642, 341, 486, -60, -158, -416, -563, -416, -422, 171, 708, 732, 1121, 436, -18, 200, -651, -508, -572, -460, -464, -71, 134, 435, 808, 718, 479, 380, -359, -493, -678, -621, -742, -144, 133, 413, 879, 744, 512, 150, -139, -542]
5426e42P8k43p7P43K12M58m0J15j28k69m02o86J97n64O23J38M28M58K89K64%o64
5448C88j81j58o60m74L07O31J28M8L67K22j28J11n92l22k24k69J17M05M5L35M02
5469D98l23M06l8l78n57J29p34R7K02N57M42L0M66K7L1n70n72l05l01K38q4N6
5491f83M66P55J23j04J78l43m44k55L7m52jK68K75J95O59K18n0m31k83l93k23
5512d88l23l3M74r3O79K60O25m86j37L57q71Q3q36k63K97K35j4O96M51J78m7l23
5534D21r9n76l76j11k75O94N36J04J72J22K20J7r95Q6n49j5L9q5K63O23M85l1
5556F70j12J81J08q24o85k93q5L53K23M85J32M90N9k67K9l54k84o04N5P9n7K33
5578d68Q04K13L8J72j62m10o65J05j57j30j70L73R49l66K36L65q3k43m50o30J85
$$ y = [-542, -464, -707, -784, -41, 171, 629, 589, 704, 576, 307, -95, -781, -584, -1148, -525, -387, 41, 499, 788, 1052, 1052, 388, 207, 49, -611, -1085, -778, -147, -19, 29, 396, 618, 490, 601, 9, -313, -537, -806, -689, -284, -239, 96, 498, 175, 581, 543, 165, -392, -263, -997, -900, -698, -141, 301, 331, 797, 824, 855, 285, -287, -592, -893, -655, -739, -683, -217, 538, 661, 557, 735, 392, -52, -307, -270, -722, -723, -455, -180, 15, 674, 892, 842, 411, 128, -265, -488, -811, -844, -370, -463, 216, 476, 1101, 615, 478, 835, -36, 47, -789, -1052, -755, -520, -534, 162, 613, 791, 744, 421, 322, -254, -630, -741, -1016, -322, 214, 318, 490, 612, 832, 849, -146, -60, -609, -624, -585, -670, -407, 216, 701, 670, 558, 739, 847, 23, -662, -955, -1040, -687, -464, 21, 153, 643, 702, 435, 464, 110, -174, -778, -723, -644, -701, -468, 336, 549, 587, 759, 597, 187, -478, -373, -530, -660, -830, -457, 492, 126, 362, 727, 644, 401, -49, -679, -494]
5599d94K49k06M15K57L61M13j81k6q28K48m21m97P3P1L18J51L57L22L64l69N73
5620A150j280L63o03m60J41oK98L01P05J73K28n89Q5m19n80o8n38L23O14r9R36
5641F75N07o74P0m77K65p23p55O15l83K93L29J24N95J01J05P0l24m41k90n36m53
5662a307Q81M97K67P1J45R9l00p7l39m53k81r8J73O44J35K35N37l71j30M1l07
5683F2p47j86L30K85k03M40L56L27mJ76l35m22j47m24l57J56K77M98K06K54Q8
5704F30J0k0n37k68k49Kk06L48j05M36N32M10K9n20j63n63k31K8p94N60j30O99
5726a02L04K47L3K16m30j88m28k57kN1K84o4P41M36lj28p5n75p8m42k10P5m69
5749a064N41M66N69N28l55J72q26j46r8j26j63j47J23N28L84N3K04K23r09J57
$$ y = [-494, -245, -451, -36, 221, 582, 995, 814, 788, -40, 208, -213, -710, -637, -566, -248, -97, 260, 582, 946, 577, 1150, -130, 233, -370, -830, -689, -695, -397, -96, 609, 782, 1010, 421, 506, 87, -493, -561, -1099, -776, -162, -261, 675, 1182, 508, 578, 101, 366, -357, -1112, -497, -880, -587, -258, -134, 461, 562, 667, 737, 413, -28, -318, -854, -1307, -426, 71, 338, 409, 554, 653, 353, 276, -63, -516, -797, -895, -722, -78, 57, 292, 829, 458, 328, 369, 62, -685, -871, -541, -256, -459, -19, 337, 664, 660, 836, 501, 79, -68, -492, -849, -693, -416, 82, 288, 542, 630, 640, 620, 83, -185, -434, -432, -638, -290, -395, 41, 573, 983, 1012, 492, 329, -234, -465, -437, -1231, -671, -801, -102, 202, 449, 482, 698, 268, 80, -348, -605, -607, -556, -272, -336, 405, 841, 838, 710, 635, 60, -18, -460, -670, -595, -1064, -523, -57, 512, 1040, 685, 857, 31, -115, -213, -339, -502, -649, -526, 2, 386, 439, 643, 866, -43, 114]
5769A14l81j53o86O17K74j14L39L97N06m06J92q40l56k2k11J43K31O4M48L30L24
5790H10q8%m05n82j55n58l7J28O17L24O18r3j00K84m8p08k16k66J1OJ34L92l7
5813C1O41J4M47p72l75j50n60j50K22j81P10L2K06O28j20k98J17l88n78q01Q85
5834d40l00L12L97L64K91K84k13m68n14q7n80K55k1L10L71L98L36J31Q9m33k49
5855B33k75n66k96L06M0O89j41K47M79k00L61m62o07l43k28LJ57M58L01L98j04
5876D50J02j96j18j86m70m52J12J21K74L97O20M9ol30L23n20m90l00j06p5K71
5897e30M50M49L40j61N34k69n45m21l34j37l0r9N48J5P16Q2j43L78l27m73q07
5918g64K78j50l75P31K80K92M00J17l03l08l59n9l55p0J80j3j11N67M21Q2J47
$$ y = [114, -267, -420, -1106, -489, -215, -329, 10, 407, 913, 507, 699, -141, -497, -519, -730, -587, -356, -292, 156, 486, 810, 722, 722, 317, -265, -420, -978, -1015, -887, -270, 54, 672, 579, 479, 763, 715, 7, -209, -475, -464, -458, -324, 68, 31, 672, 686, 1133, 361, -14, -164, -724, -874, -652, -833, -123, -91, 115, 743, 623, 325, 442, 54, -524, -1325, -440, -740, -428, -31, 333, 624, 908, 695, 227, -287, -374, -954, -699, -720, -410, -39, 359, 695, 826, 915, 482, 233, -42, -608, -904, -598, -558, 131, -10, 237, 716, 516, 877, 415, -192, -535, -763, -760, -603, -145, 156, 554, 450, 552, 356, 238, 52, -418, -870, -758, -637, -363, 34, 654, 703, 697, 367, 690, 170, -320, -620, -726, -801, -530, -80, 369, 709, 548, 1082, 813, 268, -153, -487, -624, -654, -753, -205, -190, 526, 608, 465, 843, 516, 43, -764, -486, -636, -1011, -280, 0, 292, 692, 809, 506, 198, -161, -220, -575, -645, -465, -478, -589, -22, 399, 481, 628]
5939F28j12l19k96j62m65J83N0L39N04J36K67m4l05k61j89k77J1l93J82O8N10
5960E5N81K4J33k3l24k89p27j06M0m03P26J10M02O14J1k52m00k0m29j77l26R2
5982f88q5N21N00L0L55P4p3m65k70m27l09K53K0L33L07J5N96L9l27j82j68k15
6004a66l54j18K29J47K56M96j20N64k68j51l06q97K8j92l45P39K54K70L03K44
6024F13j87k14J51o66l37K0Q9L22J81N5O22Q0k36l00J70o58j86k07k56M66q8N81
6046A5K66O48o10L12q03r0J76n10n2r4K30O13Q5Q19k30n46J44n9k73n74m4j00
6068f77K89Q3M38P29k47k42K6p8k75l19m91O2J48K42M02K01J61J46L9k39k27o22
6090d51j75k66Q02m95N89M99J61j16j40j03Q7q25J11n07K96L84L6M78j07M88r0
$$ y = [628, 516, 197, -99, -261, -726, -543, -493, -154, 350, 486, 753, 709, 404, 143, -46, -323, -312, -705, -523, -455, 55, 636, 660, 793, 770, 446, 157, -570, -676, -636, -1039, -313, -203, 199, 813, 824, 572, 172, 152, -277, -454, -780, -688, -773, -252, 248, 278, 633, 707, 634, 169, -101, -528, -837, -584, -564, -231, 76, 91, 687, 726, 399, 217, 49, -166, -520, -638, -409, -262, -6, 490, 370, 934, 666, 515, 209, -688, -660, -852, -1197, -458, -204, 66, 369, 613, 426, 212, 363, -303, -640, -620, -531, -209, -28, 27, 649, 729, 493, 193, 363, -295, -481, -688, -944, -478, -566, 15, 281, 929, 319, 631, -172, -262, -86, -596, -648, -742, -512, 101, 186, 1005, 775, 229, 373, 314, 41, -533, -577, -677, -388, -305, 133, 862, 615, 373, 399, 321, 46, -273, -764, -702, -554, -312, 90, 291, 452, 598, 637, 398, 171, -451, -626, -892, -90, -585, 4, 503, 664, 548, 408, 305, 392, -433, -322, -829, -533, -149, -113, 365, 258, 746, 656]
6111F56o9l86k61n34k03q9M30K62N92P2J68j85J32k61o20Q2k48k06l08N39M03
6132c4K06K26J80j9q8l61m48l11j3Q2J08K82K01O91J1R1j46n55n6p29k89M87j46
6155f30M34K34M31M7J08j99j10k69n57l97M58J45L4L05J82p6N17K01k61p77n2
6176b32k63l94M04J4K22N31K90K65j27j41n63K8o61k87R2J16L68N45%L73N7L5
6198F72o53K6m94j07k40j07N84qP66L63K08n31j96l52Ml90j86J19L39M22K32L8
6220E09j75K24k33p8m03n34o9k84M28K69M57K88J40J35L7n17j04k0n31j49M5O36
6242G1k12N75l24N76j31m77p6m13k07n54M38L91M91K40J80kJ42m74j4o19j82q4
6264f65J52j53K43N35L60K68j62m81K27l95k58o00J87K48M70k57P34L18j36k44
$$ y = [656, 587, 201, -60, -594, -797, -886, -456, -194, 398, 470, 638, 453, 585, 324, -296, -214, -462, -668, -976, -437, -34, 172, 398, 578, 559, 471, 110, -338, -649, -662, -580, -472, -190, 11, 702, 713, 804, 658, 103, 47, -682, -971, -484, -630, -196, 38, 469, 516, 624, 425, 315, 46, -511, -908, -450, -305, -271, 34, 216, 140, 657, 858, 597, -180, -232, -495, -889, -485, -471, -249, 282, 572, 837, 710, 569, 6, 34, -627, -914, -822, -706, -338, 207, 207, 580, 637, 672, 19, 45, -449, -556, -796, -903, -319, -327, 439, 802, 1010, 479, 283, -69, -65, -455, -641, -522, -183, 239, 471, 509, 334, 558, 325, 247, -156, -690, -759, -1043, -615, -346, 111, 399, 539, 674, 711, 194, 90, 70, -461, -610, -565, 71, -141, 434, 110, 686, 555, 78, 2, -411, -618, -1172, -734, -343, 148, 388, 568, 566, 708, 234, 220, -399, -581, -665, -513, -666, -423, 112, 472, 740, 578, 97, 324, -71, -329, -929, -742, -494, -24, -281, 453, 771, 635, 391]
6284C91k26k30q3p54P21o23P42J5O1N47J47k63ok34l45n49j40L5L8N05O55J91
6306E95K30j80j04n19l18k33j08J4j71M75N80J85K20j45k69K42n17J47p71k24
6326h71L56K82N17j2J04M26k80p5n48m30J80o00M83J0N49L78j07K62n8k86l73
6347i3j20m93K06J82j0L68l59Q66O2K87m13o96L05n38j68L3J01L31j12O55K6J12
6369E32j6j03j56j13m93k52J60k2L76K02M46K13j59n32j11Qo61K80p2K27O9N28
6391C51M00L4J07r5o52j89m41l26N16k16K76L95M57j2J77m04J02o46m2k9m12j54
6413h03L73N14K39K60m2J26k89m18k09j87m77J55K59L66K18M14K30k62l32L77
6433E12p63n2j50q8Q1L57J20O27l9j56O0k77k94k39l47k09N70m3L83L57K11j86
$$ y = [391, 165, -65, -148, -902, -181, -804, -62, -47, 14, 561, 708, 445, 439, 205, -140, -689, -829, -794, -756, -251, 404, 595, 825, 645, 541, 22, -296, -529, -637, -623, -794, -319, 261, 446, 666, 521, 252, 494, -23, 124, -647, -871, -515, -233, 284, 272, 376, 802, 522, 447, -101, -531, -351, -951, -468, -458, 91, 469, 362, 624, 566, 280, -93, -213, -706, -500, -318, -328, 40, -319, 547, 609, 896, 483, -213, 92, -446, -614, -581, -480, -149, -261, 394, 420, 532, 516, 413, 257, 144, -349, -601, -441, -463, -87, 115, 561, 774, 615, 83, -28, -20, -681, -401, -473, -246, -177, 351, 751, 785, 892, 797, 145, -44, -485, -811, -295, -511, -235, 160, 617, 605, 782, 378, 480, -166, -208, -237, -649, -803, -430, 84, 323, 583, 541, 667, 378, -40, -249, -436, -913, -758, -499, -133, 85, 499, 729, 467, 135, 512, -251, -303, -453, -541, -460, -103, 17, 644, 605, 449, 509, 232, -62, -301, -648, -857, -287, -330, 53, 410, 621, 435]
6455D35R06q71k38l63m88Kl03P43J79K15J36J55L21n14j11l98O7m42K01q0K43
6476b05M01J39N9M38l92k14k97j39l33J48k93N95n1O64J29k17K38n07j73k02k72
6497d84k95K27J74J40K27M26K53j38P6n32J6n33J67j49k00L13O85%j80L65k12
6518C46k0l66l51l41K16m8O28j58N29L9O4pk93j74l08L3m66P2M24j45O84K11o4
6541E05ml31K07k09n90k47r9N58P0N74l69L79J63j29m52P5m27j91l26M46M87K44
6563C34J62P5J15o8m22j37j3l05l10O2M97o5N87j73O6%J2m51l21m15K17j8J54
6586d17N49J20L77L31m93J02k80l53m52j80N25k87J07N08K3M00q5J92o32j74l29
6607d48k01K92q7k22P03J14M17k54j82j53j61J57o17Q9K08L02L9L64j46R7r7k94
$$ y = [435, 1341, 470, 232, -131, -619, -617, -920, -177, 2, 217, 353, 508, 829, 315, 204, -194, -127, -569, -368, -448, -205, 196, 335, 394, 832, 440, 226, -71, -210, -543, -395, -688, -93, -144, 520, 649, 432, 670, 163, -10, -212, -484, -779, -552, -378, -238, -11, 415, 668, 530, 606, 74, 90, -443, -276, -425, -625, -312, 373, 373, 193, 558, 346, 326, -40, -391, -732, -516, -564, 64, -94, 435, 474, 538, 531, 238, 64, -244, -211, -677, -605, -181, -326, 358, 569, 505, 501, 170, 377, 168, -422, -669, -768, -210, -140, 434, 65, 444, 607, 478, 26, 101, -326, -517, -843, -397, 90, 334, 496, 571, 686, 618, 196, 59, 46, -259, -569, -507, -10, -75, 512, 339, 405, 405, 417, -34, -355, -770, -553, -571, -417, 132, 252, 629, 960, 467, 569, 289, -64, -516, -696, -171, -458, -351, 157, 180, 580, 495, 687, 55, -119, -448, -649, -357, -444, -666, 37, 151, 568, 314, 132, -21, -182, -25, -642, -553, -345, -43, -4, 360, 214, 311, 214, -80]
6629h0L67n47k66o3J28m2M81L13J79Q7j29J35l73m49M2m9l70K38m6M35J62J67
6651C20Q5L8n89ql60j62K01n4L82L32k42N19M6N3O0m00m04k30O2rp0L56J74k7
6675G3M87N3m98P3l96q5k90pM22rQ5K09J03O46p05p0P7k26m87J3J65J27J41N27
6699D28K20l11J36L6o07O3m96j50K40j65M79K19O52j18N3n70p6k44k27l8J86j42
6721d32L63M78J05l5O9n86J90k61j97k14j35j2L59K24J85L96Q6p1j27n45k2l63
6743e45K27k99N88R9K41K79K47l13n53K75m18p9l43L37k65J79K13L67L70l50K60
6764E17m77j40k99k64K71M12l26K43K35M71n7j87n46o9K83n48Q1J79K87K42j1
6785B97j20L6K03k16l05m02N1J76J83l01P41Q1M1J44L8o5l48k64j73k47L88j73
$$ y = [-80, 287, -260, -526, -589, -461, -503, -22, 291, 470, 557, 428, 563, 190, -259, -217, -266, -636, -398, -444, -9, 153, 320, 405, 443, -146, -154, -514, -676, -475, -529, -147, 185, -57, 462, 508, 561, 621, 221, -183, -413, -351, -360, -430, -74, 100, 73, 560, 613, 115, 188, -208, -293, -583, -590, -168, -177, -92, 117, 220, 866, 161, 91, 168, -58, -545, -532, -367, -240, -99, 428, 648, 337, 473, 509, -98, -35, -531, -681, -441, -606, -127, 92, 744, 626, 679, 109, 33, -211, -438, -476, -290, -432, -69, 409, 514, 479, 548, -38, 152, -109, -306, -520, -655, -667, -308, -84, 101, 497, 583, 512, 385, -160, -182, -545, -318, -617, -29, 70, 311, 590, 837, 524, -29, 246, -172, -251, -594, -257, -522, -343, -130, 237, 607, 257, 517, 40, -100, -399, -663, -392, 20, -306, -63, 172, 643, 586, 399, -147, -216, 67, -481, -400, -221, 66, 308, 297, 177, 213, 416, 200, -105, -507, -456, -280, -97, -398, 343, 424, 465, 609, 647, 582, 234, -30, -203, -450, -62, -235]
6807b35j25N0L86K76J88j39k26j50j01o43M88m84J56N23J28O27k86j23L0l36l65
6828c61p4j13k4N04r6J27P20r3k88J41m49r9m98K22j64J91J42M25K90Kq5k12j74
6851C4j41O9n56J76K21l7L62l3M9K71l86K77l16l13J70Pk94m3L24L20L17K97m90
6874B85L9l26K4l03K01l03O8L4M38L51q8K05l54Q4k37k85l72P9K35J95K26L6L56
6897E88j49J07l52j9n81N4j07j17L89J80J78L00r2j52J21l00o3m19J19m20N55
6918a80l1M96p5M99k59p9J6j07m84m0k08%N68O1L3j26J34J23j0l01j65j45r0j56
6942e26P71l64K04L99L21n28J67m15j65j51nj44K82K29o8j34L52M4j22j19l97
6963c69j8r6K02j29J45L08M98m2k01O3k59J05m27k36J88m86O40J42J30O18k70
$$ y = [-235, -360, -310, 76, 352, 540, 401, 175, 25, -76, -719, -231, -715, -559, -36, 92, 719, 433, 310, 340, 4, -361, -435, -548, -572, -68, -164, -37, 683, 590, 302, 443, -6, -105, -603, -381, -545, -354, -212, 213, 503, 505, 420, 208, 34, -107, -38, -594, -418, -197, -234, 128, 95, 144, 415, 29, 306, -10, -323, -153, -146, -440, -483, -159, 161, 478, 775, 285, 324, -2, 22, -281, -80, -383, -315, -281, 157, 508, 420, 625, 271, 355, 118, -167, -539, -460, -225, -30, 196, 232, 588, 439, 546, 194, 175, -406, -352, -459, -576, -187, -7, 171, 471, 379, 227, 348, 48, -15, -434, -315, -735, -180, -211, 285, 210, 709, 450, 371, 387, 280, -204, -244, -452, -452, 116, 177, 210, 84, 218, 341, 331, 30, -135, -280, -370, -526, 245, -119, 85, 484, 805, 277, 444, 29, -136, -287, -292, -436, -154, 75, 7, -127, 225, 269, 147, 28, -369, -387, -483, -281, -410, -265, 43, 541, 499, 298, 361, 102, 207, -220, -456, -268, -754, -114, 28, 158, 776, 506]
6984E06j31l38k66k0j8m0k72N96o5M72k04K0N86n30O4p29Q9j39j01P6O14r9L23
7007C94P7K82m97k83M28q84l89L28j9N55L6q4M72J6J08m07j61n65j20n5K77L80
7029a11L5N34o0K34j42k78l7k89m50L61K0k98M59m2L51K66k73J29k60l31p7j25
7051c84j85M69o4K78m8K06N07q60K30K71o74j77j28%L25l4M62n0K83j08L6l10
7073D5m02l7J01k23j39M81N95m34O8L96k67K15L9m89O7l43L78m03K40M06j56M23
7095E61k71N8r0l34K50n98K8L35j59o3O35L14k83j9k88l80J69l72J45J30K32J23
7117A23J53n24N16J15m36K47l34j60o86M64L38J40J53L06o0j47J18k32j32l87
7137d25j85m0K51L61K89J09k28N48m84Q2j88j38l45j51K68N9L08L10J8j12j73
$$ y = [506, 375, 37, -229, -249, -267, -307, -579, 17, -48, 424, 220, 240, 826, 296, 360, -369, -280, -419, -520, -444, 170, 71, 394, 471, 753, 256, -27, 401, -483, -872, -544, -563, -8, 28, -56, 416, 432, 540, 133, -28, -593, -713, -768, -491, -111, -76, 458, 398, 632, 490, 212, 175, -114, -564, -203, -183, -481, -22, -64, 287, 553, 280, 409, 149, -182, -259, -384, -569, -100, -164, 114, 66, 272, 779, -81, 149, 420, -254, -431, -559, -559, -234, -268, 194, 144, 427, 319, 355, 45, -357, -394, -293, -516, -655, -174, 421, -13, 55, 451, 184, 399, 438, -51, 16, -327, 51, -352, -112, 294, 138, 561, 290, 348, 258, -76, 174, -424, -396, -61, -220, -283, 352, 666, 383, 364, 76, -304, -135, -507, -362, -232, 0, 123, 276, -248, 268, 383, -53, 194, -140, -300, -986, -522, -184, -44, 109, 415, 355, 208, 326, 94, -38, -425, -610, -650, -399, -38, 251, 360, 132, 680, 196, 278, 90, -48, -393, -544, -276, -217, 91, 401, 419, 307, 134]
7158A34J28m53L50p26L59M8j3K45J9K29o9l8MO5k21p34k2L0M75K23K51K06J09
7181E99k82j86j18R3n01K05j25J27M33o2j27N22q5m48K19n31K6K82k21m30L77
7202b33K63J49O10m34K39j18m69j07n13L51j23M79k95M64K24n03L41k5m08l30
7222d38n7K35j2K35K28Lk56N75n05L22j49k74j51k70K18RL06J85L85k59N5N9m62
7245a8M2Ko77J16K42M60l7Q1M94m2l36j91l35j70oj99J5N38p6N78j23J88l69J7
7269A94j80j16k00k98K55q2K08N64r3KO2Pj20j65n37O2K43m02O39K49q8M45J22
7292G71p77J21P3n75m1K29j73K81J91M56k54K30j78L3k45j09m90J88o8J67j92
7313c62O61J89j1m10k16K73l29j76K52q2m60K01J10N47l19N48l5l10k78j5K3k21
$$ y = [134, 262, -191, 159, -567, -208, -160, -173, 72, 91, 320, 251, 213, 217, 282, 61, -673, -695, -665, -190, 33, 284, 490, 599, 317, 131, 13, 106, -395, -190, -315, -188, 245, 183, 56, 578, 493, 45, 264, -267, -241, 41, -180, -610, -233, 30, 179, 789, 355, 594, 476, 7, -100, -613, -262, -385, 94, -201, 263, 487, -16, 325, 300, -108, -438, -495, -260, -272, -37, 191, 194, -62, 513, 8, 330, 181, -93, -244, -514, -296, -287, 19, 204, 589, 330, 385, 444, -18, 24, 26, -651, -535, -293, 167, 130, 211, 705, 663, 327, 136, -199, -369, -375, -574, -559, -21, -97, 481, 358, 546, 177, 194, 14, -102, -302, -600, -345, -427, -219, 345, 252, 254, 316, 323, 203, 38, -499, -437, -194, -596, 43, 292, 204, 649, 771, -6, 115, 188, -387, -428, -199, -372, -91, 100, 556, 302, 532, 354, 387, 142, 33, -457, -269, -337, -170, -362, 299, 488, 477, 67, -149, 124, -205, -381, -129, -211, -671, -470, -360, 187, -132, 416, 381, 71, -207, -222, -199, -420]
7335d20j6J16J49m2N39J65m2l70n1k49p7j87J58L86p5lN00k60M29k51n00k51k15
7358e67N60k42j31L15k99N99n3j11K58m77L36n74n2J58l40J01O69Q4k53M97qn78
7380a08N8k82J95m03L57J47j76J29L23K76k08L8L07o44m97n0O60l74J59j43Q94
7401F58k15l59M47l87k58k12L12o24M29N80j88k5RL62k94p2N9j05j23j66J80l38
7423c30N01k14J62k94K93r7J41l13j90J56q6N4K6L39J07J39q0j75l38J86j48j95
7445c56k10N00r6J42o6J77K65j82rJ29j87o91L79n5O0L01J03o9N48j74l04j47
7467E8o59j3N54q1J93j95J64J19lJ11lq8j54M5k82L9r2J39j9K96K17pm28K33j19
7492B5k74J19j42k10R31m21P3K38j16K69p3m67O1l69K50j86P3J04K07k73R91k02
$$ y = [-420, -436, -320, -171, -213, 326, 491, 449, 79, 28, -221, -298, -485, -327, 59, -16, -19, 481, 221, 650, 399, -101, -352, -567, -7, -249, -380, -65, -364, 235, 182, 71, 329, -148, 188, -386, -438, -280, -620, -519, 150, 234, -19, 478, 470, -108, -50, -332, -137, -540, -183, -36, -212, -83, 240, 516, 308, 346, 653, 9, -488, -538, 122, -252, -93, -236, 658, 443, 84, 531, 144, -114, -326, -14, -638, -209, 371, 183, 158, 167, 529, 235, 163, 222, 117, -6, -172, 8, -330, 171, -43, 119, -175, 118, 21, 162, -151, -341, -185, -271, -217, -191, 148, 255, 394, 314, 139, -199, -13, -161, -356, -566, -66, -162, -20, -86, 91, 356, 174, 165, 294, 107, -584, -205, -260, -200, 101, 204, 135, 683, 509, 205, 58, -601, -614, -60, -141, 52, -143, 21, 140, 137, 248, 245, 157, 3, 48, -234, -195, -287, -148, -167, 129, 346, 339, -89, 144, 25, -249, -130, -272, -482, 449, 28, 101, 339, 223, 492, 419, -48, 13, -356, -106, -292, -219, -115, 92, -181, 810, 608]
7514F08k31m43k7p6m59L55m8K97J36O2p6k7j81k4l9k99J69k39N1J90l8M51L07
7537D19L1k58k90l8R0m98J16M71j65J05K62K33n87N09o6m10k38J36q8m02L44P78
7559D54J74n11M02k63K51N4l34l65o25L11J38k95O78K28L36k11M07q36K62m86
7579b31k04J1K04q3K35K8K1M05k76J64j06n04J43Q7l31J42K90J21NK17l21J35
7601A52J18j59m19k14R4L48k58O64k23j6K64k3m98J70n0k11R0l76Q70o38K90P18
7623F93l89k67J09R3j83k8m95M06P6m54J66M84j58J19K22m94M06l11p7Mn7N7K32
7646A54k23J52K69j62j6m14L77m96L26j07O4J42PK18L25n11k03j08J94J76o45
7667d81J54j8L73M77m36r7K85j39L58j94k38n05J77l3K50J77L09j66J44N5l88
$$ y = [608, 377, -66, -93, -169, -628, -273, -321, -24, 112, 174, 98, 71, -110, -134, -173, -472, -303, -542, -491, -301, -339, 112, 419, 450, 192, -98, -136, -46, -544, -428, 43, -122, -17, 245, 478, -109, 400, 334, -76, -314, -178, -266, -668, -324, 454, 628, 117, 519, 256, 507, 561, 227, -138, -763, -452, -314, -609, 69, 297, 633, 422, 829, -7, 255, -231, -435, -424, -220, -303, -68, -40, -19, 386, 110, 274, 168, -336, -193, -106, -437, -295, -5, 116, 121, 338, 17, 152, 270, 111, -308, -522, -428, -80, -338, 326, 103, 87, 351, 328, -170, 0, -50, -261, -171, -547, 323, -315, -25, 693, 304, 37, 146, 239, 56, 28, -467, -61, 15, -439, -273, 211, 53, 172, 394, -100, 306, -5, -82, -78, -135, -78, 154, -69, 83, 352, 190, 174, -240, 137, -359, -33, -140, -76, 66, 73, 291, 616, 105, -98, -206, -12, 164, -481, -327, -345, 28, 505, 69, -28, 257, 118, 476, 282, 44, -461, -284, -317, -67, 110, 419, 253, 397, 452, 64]
7688F4k47K03k96J07J26l73M10J98M7J99j29m0J13m06m4k02J57K5l40Q20j54j77
7710F1K24j36J19r5n9n13M31M8k13K59L16j49J61J37m10L5k92k75R3k5k51Q34
7732C00l24M19j7j53J12o6k33l24K11Q0K5l08L28M58j02k56Jj6j34j36o1j83J01
7755b78J30J54k13M53J77Kk20K01m73j90K29l13OL22q2N78l26R1R9k17k4l66k96
7778e56J82J87L06J16q4J99l09O8K96o70j19J49N2k30N22j6K09J02K47k24j54
7799B73k22J99m46L42j93k82K24Q6j02N73L5l17j17q2k90J61J48k85M62r9K9O1
7821A58j56L05n81L67k43j2P6j74L22k63L0L37l6o8J54k90j44K00k66R4j2J02
7843a00K79J83n03M83k64O5m29j15J07kN86l20j09N17J3P0l45J65n9j51k26K42
$$ y = [64, -183, 20, -276, -169, -43, -416, -6, 192, 239, 438, 309, 269, 382, -24, -68, -270, -113, -88, -428, 392, 238, 61, 285, 149, 268, 173, 114, -399, 32, 80, -133, 126, 442, 293, 454, 591, 181, 216, -76, -351, -258, -283, -534, 300, -24, 395, 378, 225, 337, 271, 38, -286, -75, 5, 30, -278, 50, 508, 406, 150, 151, 135, 1, -135, -196, -379, -278, -148, 6, -207, 246, 423, 425, 205, 406, -67, -257, -28, -341, -335, -13, -95, 483, 157, 248, 347, 130, 106, -260, -556, -374, -187, 119, 235, 151, 350, 41, 109, 405, -265, -384, -235, -183, -413, 109, 93, 302, 404, 651, 427, 273, 51, 250, -196, 146, -47, -329, -105, -19, -121, 452, 487, 170, 53, -29, -319, -158, -10, -295, 167, 68, 97, 158, 2, 307, -274, 93, -150, -162, -86, -260, 62, -201, -171, 166, 130, 62, 216, -74, -218, -18, -284, -190, -202, -100, 179, 362, -141, 342, 78, 143, -286, -401, -294, -296, 290, -30, -139, 378, 391, 461, 116, 281, 222, 71, -155, 87]
7865H7L5l68K72K82R6k64n7r2L06o03K00j61k86L95n1P15j82j86J88j93l7j86
7887i0k79K90l77K21J92j20L89qK0J67m15r3k21Oj53K38Q5J66Q1L84m06K15o44
7910c52M53m48O0j31r3M36rJ74j8J43r9p2K52l72k72K36j77L7K47P0l48M82JJ05
7934C05l86Lj77j4k10K91o9j31M99L67o18M44j02k69k21K62k78m3K09K47J01R8
7956C08j91J26J08J40n31l33J69k26mL46K51j02K81J45l11m2j8l23l02K47l0K65
7978b7K3M7oL28l8j68k06p9m8j29J45k36J71K96M24l48K8kK87m51o4k41k31M26
8002i9j26P8M55J30j76k29j03J55k62K07l40R8K85K19J82Q8m23j5Q4j57k04j65
8024c18k66M06L33k77L21r0O1J83j16Pj80k96j29k29J67O87P7n4j13l7L65k92
$$ y = [87, 122, -246, 26, 308, 404, 140, 83, -9, 297, -306, -106, -267, -553, -158, -209, 506, 324, 138, 326, 133, 96, -90, -369, -79, -456, -235, -43, -163, 226, 218, 238, 405, -10, -103, -324, -318, -471, -233, -148, 18, 99, 483, 77, 292, -352, 101, -347, -287, -418, -511, -75, -84, 90, 72, 215, 116, 44, 296, -76, -348, -112, -289, -252, -5, 65, -283, 199, 200, 305, -81, -78, -255, -269, -479, -188, -257, -388, 111, 478, -140, 304, 202, -67, -288, -26, -304, -347, -138, 109, 210, 308, 117, 243, 351, 491, -40, -373, -204, -430, -434, -88, 163, 61, 342, 487, 176, 134, 116, -207, -509, -262, -292, -27, -4, 43, 37, 365, 327, 159, -47, -126, -174, -303, -158, -394, -223, 73, 497, 149, 177, 175, 462, 11, -53, -294, -525, -99, -225, -147, 308, 438, 262, 33, -70, 85, -177, 30, -310, -212, 73, 292, 474, 562, 139, 124, 208, 51, -153, -318, -584, -178, 155, -122, 199, 109, 170, 353, 237, 244, 64, -232, -361, -590, -423, 264, 341, 287, 174, 137, 502, 210]
8046B10o27N3J00m20L56o1L50MK63Q8M9k19k05J91l67j80K65J12o4oK60N19n17
8069A54Q6k39r1k56P4K05N7J19k12N82l25l1K09o1l72J27k27j22K27j37L99N35
8091G01n20n4j15J10j72k93k5K6K31J10m8L36m5J53l3j55l75o1k84M02l76K44
8113b43J62O30o77L07M9n7j17m40L89l47J36J34K37J40M8p6K76j60l09P2j50j89
8135a85p5o6K86M9J82q0L38m3J27l94m18k65M63k61M42L6m7K42L34m50k58p5l5
8158a53o8p1OM25L51q94M60J85j90np3j17P0j95K53N9k90J84N53j32Op0l4m57
8182a97M8r1J47j11N72j91m68O36p9
$$ y = [210, -417, -364, -264, -684, -328, -389, -39, -35, 228, 316, 365, 146, -59, 132, -235, -415, -150, -38, -102, -108, 152, 671, 154, 240, 1, -90, -346, -272, -67, -10, 109, -103, 479, 154, 123, 332, 271, -101, 26, -201, -323, -96, -233, 166, 701, 181, 127, 12, 122, -50, -343, -368, -342, -111, -1, -49, 287, 242, 395, 362, 207, -168, -229, -513, -111, -487, -243, -81, 549, -128, 179, 228, 171, 54, -386, 3, -344, -208, -74, 163, 303, 351, 275, 551, 391, 82, 154, 4, -185, -260, -326, -40, 9, 191, 111, 449, 406, 533, 139, -279, -544, -81, -342, 100, 136, 89, 331, 665, 215, -43, -118, -153, -221, -292, -286, 139, 490, -404, 56, 241, 51, 46, -27, -144, -74, -269, -16, 43, -247, -63, 490, 358, 364, 294, 260, -197, -149, -240, -93, -204, 368, 177, -291, 345, 266]
8191B66
$$ Imaginary data points
##PAGE= N=2
##DATA TABLE= (X++(I..I)), XYDATA
0@%%%%%%%%%%%%%%%%%%Jo5J28j28J28j28J29j47K10k56K57l21L85l87M51n15N79
35C21o90P56q37R62j087J210j338J472j607J777j969K179k407K644k913L212l538
52a853L896m304M757n261N836o502P271q171R249j0563J2211j4361J7275k1472
66a1992K8081m0153O9301k67684l90240K77084K00367P3223M3294K37477J60787
77C79545m5929j75144r4943q8244j14265r5393J197J0877M1470J45098K19948
88A84217Q2967p4661n1294M6254n3162k24029j92586J7143R0152J2293L1454J88264
100E7012K16889M2464j10143r4298o4149j18803j36815l5189O0965O5929O2437
111e3701J08942J09805K4374l3785j6574l5412j21767j36820k8078N0059O453
$$ y = [0, 0, 0, 0, 0, 0, 0, 0, 0, 0, 0, 0, 0, 0, 0, 0, 0, 0, 0, 1, -64, 64, -64, 64, -64, 65, -82, 128, -128, 129, -192, 193, -194, 257, -258, 321, -369, 387, -450, 512, -575, 635, -703, 769, -838, 939, -1030, 1149, -1258, 1386, -1527, 1685, -1853, 2043, -2261, 2496, -2765, 3071, -3431, 3840, -4331, 4918, -5645, 6566, -7795, 9480, -11992, 16089, -24064, 45237, -222447, -612687, -335603, -135236, -62013, -18719, 218758, 379545, 333616, 158472, 63529, -24715, -138980, -234373, -233176, -222299, -180829, -35731, 184217, 267184, 192523, 141229, 187483, 134321, -89708, -282294, -265151, -174999, -162706, -131252, 57012, 273901, 316365, 206222, 111924, 47775, -71028, -207843, -243032, -182067, -116138, -53701, 55241, 165046, 189420, 155635, 139061, 103649, -18118, -154938, -183016, -132957, -126504]
122a26504j7941Q4715J72591J01126k5477m3314j4294p4270j59333j20730Q318
133b15113P2582N6714O3628J02365Q4520J3746k7548l6871p1824j08834p8940
144a45575j2922P866J0795O7612J31982R6396k942l3881M693j6272j06335j35960
156a34543n2498L0133L4214K9958Q1089J20318P8934k858n0893o9774q2402p4607
168i2929l9932j1084K035L9573R2999R9131M1994m687k38q459p0997j14914p3368
181a40876L61K2234J2218M1621R3528R2919L4744j5976l4689n1653p6350p8758
193a00677m5530k124L4825O5910P5649N5679K8229J9327J219n0812r5444p8856
205i2605k4224J859k219K0861P5900R5937N2622k106k0289k2945m6834p5065p0762
$$ y = [-126504, -144445, -59730, 112861, 213987, 188510, 145196, 130902, 56632, -102701, -223431, -215113, -142531, -85817, -22189, 80176, 164696, 178442, 150894, 114023, 42199, -66635, -145575, -158497, -150631, -139836, -72224, 59758, 156154, 153212, 119331, 124024, 107752, 1417, -134543, -187041, -156908, -122694, -92736, -11647, 108671, 187605, 184747, 133854, 64080, -18322, -92929, -132861, -143945, -141910, -102337, -9338, 89793, 131787, 127100, 126862, 118403, 47406, -67508, -140876, -140515, -118281, -106063, -64442, 29086, 122005, 156749, 140773, 106084, 54431, -21919, -100677, -146207, -148331, -113506, -47596, 28053, 83732, 111961, 131288, 132507, 81695, -13749, -92605, -116829, -114970, -117189, -96328, -20428, 75509, 128131, 126025, 105736, 82791, 35957, -39108, -109870]
218a09870l3133J1746M5478O4392O3471M9212L2853Q775l3055p0441p1500m1583
230h3655k0180j5546O075N4830Q4296O3270K2498J292q643l6721p0927p5328m1305
243a20044l19K4536L7022M9449O0566N5742K6558j8434n4712o2003m6804l6257
255h4700k9753o757L8804P1524O3685L2223J3372P669j4095n2532p3971n6208
267i0739k0411O985K1948L8643N6642O1002L9796K204l0186m6263m8139m8052
279e6570m3527j9602K0662N3175N7287M2573L0882K1699k177m0475o3951n5529
291e5553k9333j1227K22K1677N1009O4678M8890J4980j3190k7187l6760m8591
303b0385n3382l4997K305L6738M7460M2798L7563L4369J5022k1274n1822n5869
$$ y = [-109870, -143003, -131257, -85779, -21387, 42084, 91296, 124149, 132924, 99869, 29428, -42072, -83655, -103835, -119381, -113306, -58476, 25820, 89090, 111588, 112880, 104237, 67516, -3411, -78739, -120044, -120363, -95827, -58805, -9356, 51210, 106952, 133510, 115076, 60364, -1639, -48443, -84700, -114453, -121210, -82406, -10882, 52803, 85026, 98398, 106067, 91972, 39440, -34531, -90739, -111150, -104165, -82217, -43574, 13068, 74070, 113866, 116070, 85884, 39621, -8518, -56570, -100097, -119699, -99037, -45862, 11425, 53998, 84880, 106579, 104402, 63927, -24, -55553, -84886, -96113, -95891, -74214, -23205, 41473, 90363, 105343, 92153, 64966, 28206, -20385, -73767, -108764, -106459, -69721, -22261, 20537, 58100, 92469, 107491, 86217, 34395, -21474]
315b1474l8983k3649j1165P754L7021N7058N2034K8927N105j1437k7630m4644
327H917n4099m1935j1369J6464L0690L7061M5602M4816K5713q959l7312m5031
339A0558l8989l3465k7500p425K5425N0579N1718L4028J6107M568j1190l6396
351C8018n4896m9264k2485M112J8758K7712L9510M7859L7218Q096k2166l5348
363C7124l7766l8697l5327j8945J1812L7013M4599L8310K8570J7500j080k6829
375E6284m6016m6619l0775j2646J656J7466L6866M9833M1859J5921q185k1367
387E4277k7297l7351m3021l1132j812K6443L6963L4192L1631K8518J4871j3755
399G2527l8852m5448l3636j9357j0370M106K4065M3678M5388K8514N671r891k0824
$$ y = [-21474, -60457, -84106, -95271, -87517, -50496, 6562, 58596, 87523, 92628, 81191, 53561, 8917, -45182, -87117, -98486, -82022, -51332, -14271, 31331, 76147, 101860, 92901, 55589, 10558, -28431, -61896, -89396, -96821, -71396, -20817, 30901, 64929, 81036, 85604, 74414, 38018, -16878, -66142, -88627, -84515, -65757, -38045, 1465, 49324, 86542, 94638, 72472, 37124, -642, -39339, -74666, -93611, -81799, -44786, -187, 38123, 66693, 84193, 83113, 56284, 10268, -36351, -67126, -79772, -78116, -60650, -23784, 26049, 67908, 83829, 75644, 54277, 26980, -10371, -53392, -84524, -86336, -59893, -22930, 11262, 42893, 71411, 86282, 72527, 33675, -11773, -45409, -64766, -75136, -71030, -46965, -3287, 42101, 70615, 76286, 66395, 45571]
412D5571l3205m2649l6484j3691J1783K5069K9472L3802L5819K3248j606k6600
424E0529l5686l3721k9009k1868p971J6950L7546M1688L0072J4955N067o553k5679
437C6320m2261m2711k2086R53J4670K0355K9991L9592L3329R425j7600k7867k8511
450C599k8738k9131j9574M206K7424L7008L3260K3714J3434J151j6748l3383l9574
463b3352k9478j1518K534J1852K4268L7874L8101J9090n237j7377k1441k9118
475c802l5453k7582l472J9570K7225K7282K6711K4724J3710q107k7415l5969l1491
488c4069j8628p450K661J5183L2381L9086K7822N535r359j3299k2050l4380l5414
501e1981j6365R163K0936K3159K7747K9823K0386J99j8192k7244k9088k6369j7796
$$ y = [45571, 12366, -30283, -66767, -80458, -68675, -43606, -14134, 19668, 55487, 78735, 77129, 50529, 14843, -18878, -47887, -69755, -77726, -60776, -23230, 18458, 48530, 63485, 68552, 61999, 36320, -5941, -48652, -70738, -69785, -55115, -34760, -4769, 34823, 68152, 77577, 59977, 32110, 3599, -25139, -54270, -73844, -69638, -42214, -5206, 28054, 51768, 65202, 66353, 49605, 16222, -23352, -52830, -64348, -61814, -49962, -25694, 12180, 50281, 69371, 64134, 46757, 25316, -3802, -39255, -66837, -70309, -50739, -23514, 3768, 30479, 55203, 68913, 60806, 33391, -2578, -34069, -52697, -60147, -57486, -42303, -9922, 29164, 56986, 62521, 53162, 39863, 17813, -16567, -51981, -68346, -59183, -38247, -15088, 12659, 42482, 62868, 63067, 44875, 17631, -11457, -37826, -55622]
514e5622m666R624K4647L3994K9557J5934K055o185j5940l1286l6234k1339j759
527e7220J0312J3846K3087L3391L0377R643j1560k0637k3222k6060k5170j5097
539e8310J801J7826K8629K8959K1164J1321J507r180k3573l3945k7718j0242K172
552d9589P865J5618K9985L2802J7522j612j1330j5689k4118l0300k2498m441J1034
565d4751J9942K3687K4289J9951R559k938j7951k7974k7267j6430o164j518Q412
578c9153K5167L4318K2860M584m543p031j6642k9058k9533j2962L295J3424J8462
591a6812K3567K4213J6435L731j0709k2055k6500k0165j1379n968K379J6663K9142
604B542K5189J1634K915q96j0084k4702l0216j7519l198M344R021J9665K7170
$$ y = [-55622, -60288, -50664, -26017, 7977, 37534, 53468, 55523, 49338, 33398, 2112, -34122, -55461, -57220, -46908, -33062, -9975, 23416, 53793, 63436, 51876, 31239, 8017, -18043, -43213, -58310, -56509, -38683, -10054, 18905, 40069, 51390, 52897, 43717, 20144, -13801, -41519, -51761, -49589, -41724, -26106, 3879, 36681, 54203, 52591, 41261, 25572, 1454, -28846, -51344, -55785, -44751, -24809, -1122, 23167, 43118, 52677, 49739, 31788, 3814, -23453, -39883, -46047, -47565, -39153, -13986, 20332, 43192, 47776, 43233, 36202, 19560, -9498, -39031, -51993, -48698, -35274, -16812, 6755, 30968, 47403, 51134, 40425, 18370, -8130, -28295, -39674, -45642, -43263, -26600, 2542, 27731, 39365, 42280, 41384, 31300, 6598, -23618, -41137, -44335, -39991, -30970, -11305, 15865]
617A5865K2652R687m418j3282k0926k2434j8903j2127k689J1101K4009K5848J5609
630B9992O561M917k599j8952k8866k1309p335q88K428J1874K4013K5551J3554
643C8941K861n073j2516k1354k2367j6746p328K917J5146K2870K0673J3412Q447
656C9883K309j2731k4242k3017j1296n593m272N250K0288K6813J6918N174N92
669C6076l238j4392k3552k1664j1959j388P403J5734J9896J7908J3539P456m448
682C7371j8996k3248j5609q867p238j710J3499K4655K0464Q740M477J710p090
695B8158k0583k2723j4400n560k98P529J6072K0848J7426J0640J324r573j7790
708A1070j8813j4249j1800n959O773K0120K1377J3041P570O254p47j4818k4104
$$ y = [15865, 38517, 48204, 43786, 30504, 9578, -12856, -31759, -43886, -46575, -35474, -11465, 14383, 29992, 36553, 41470, 38871, 19919, -8947, -30256, -37591, -38479, -36051, -24177, -164, 25387, 38941, 41802, 36729, 24213, 2859, -19508, -36254, -43582, -40665, -25519, -2649, 18024, 31436, 39883, 42192, 29461, 5219, -17798, -29094, -34687, -38959, -33709, -13421, 13392, 30310, 35484, 36076, 32838, 18446, -5106, -26770, -38729, -40117, -32714, -16980, 2916, 20824, 34363, 41819, 37371, 18375, -4873, -20482, -29349, -36587, -38297, -24798, -143, 20321, 29061, 33538, 35248, 28158, 7575, -15148, -29548, -35108, -35406, -27877, -11805, 9043, 26469, 37109, 38433, 28860, 11070, -7743, -21992, -33792, -39751, -32978, -12858, 8519, 21560, 29130, 35384, 34637, 19819, -4285]
721d285j7402p555l002N70R006J9274J9709J3497N312k440j0934j5714j7059j4928
735b5951r687n91J2136J8048J6518J2147R913M265q406j9316j8928j2314p624
748b9790m150M162J5577K0582J5318Q114K147l402j1280j7212j7605j2985l717
761c4241N439J2059J4684J4909J3734Q355k332j3417j7099j4053j0834q409k200
774c3405R771J7947J7189J1613O451R81n546j4126j7720j5245p993q07O461J1824
788a2605J4905J6253J1714K513o752j2961j4201j3785j2103o263M696J3677J5841
801I29J2844R923O642o11j0618j6130j5802j0905m829J064O818J2893J6463J4585
815B3266O591j387q408j1164j2712j4734j1228j136Q659J2847J3589J1656J0725
$$ y = [-4285, -21687, -29242, -32244, -31674, -22668, -3394, 16315, 29812, 35124, 32684, 21750, 6036, -11023, -25951, -35638, -36229, -24093, -6045, 10473, 22620, 32533, 36798, 28392, 9076, -9852, -22166, -29790, -33940, -29778, -14201, 6381, 21699, 29813, 31960, 28558, 17278, 66, -17539, -30524, -34241, -28802, -16743, -2059, 12850, 26584, 34939, 32607, 19190, 2091, -11962, -22796, -31205, -33405, -23634, -5687, 11502, 23115, 29566, 30547, 25001, 10875, -6845, -22090, -30083, -30890, -24429, -12605, 2300, 18553, 30267, 32780, 26028, 13067, -1134, -14919, -27022, -33285, -28589, -14912, 929, 13773, 23696, 30338, 29727, 19109, 2979, -12823, -23728, -28557, -27493, -20675, -7782, 8681, 23266, 29857, 28470, 20062, 8898, -3814, -18548, -29776, -30912, -22253, -9406, 4183, 15839, 26564]
828B6564L887n543j2354j5441j2717r310l492K634R816J5401J5022J0005L507
841B7979l311q010j2311j4879j2903m945K878Q904J0900J2440J3410Q839j143
854B7848r095j2720j2377j0460q933j904N826J2312J4631J1794P330J817l824
867B2245r356j4129j4285r214j362M231Q793J1320J3369J1351M169l624r285j1353
881B870j2404j0608o807J969Q562J2419J2161J0257O241Q02o664j2166j3327j1316
895a8011m983r56M494R646J3319J3177P573J18n011q371j1192j2844r936k733
909b5710M787R737J1089J0598R637M571j372q957j2347j2224q570m252O67O223
923a6123J1060J3601J0153M279r49n404r552j2210j1395o332J57N660Q688J1265
$$ y = [26564, 30451, 24908, 12554, -2887, -15604, -24914, -28406, -25772, -15956, -555, 14467, 24472, 27979, 24668, 16658, 4347, -10532, -23435, -28380, -25502, -16598, -5698, 6742, 20152, 28991, 27848, 18753, 6033, -6344, -16804, -25737, -27641, -21815, -9503, 5128, 16922, 24252, 26069, 22245, 12889, -1240, -15525, -24739, -26101, -21870, -13077, -1757, 11612, 22963, 27132, 23508, 14223, 2870, -9534, -20142, -26949, -24980, -16418, -3999, 8162, 18419, 24660, 25462, 18798, 6632, -6695, -18011, -22994, -23950, -19456, -9810, 3509, 16686, 24259, 24377, 19366, 10995, -197, -13041, -22977, -25710, -20923, -11186, -97, 10501, 20138, 24709, 23337, 14380, 2033, -10191, -18761, -23013, -22346, -16123, -5063, 8538, 18691, 22970, 22021, 16617, 7065, -5145, -16540, -22872, -22715, -17055, -8367, 2898]
937B898J0874Q290J584n525r145j0600j0394p427l964K891R024J2132J0604P567
951A8809L205j239o762j1447j2446q528l114J483N963R007J1377J0673N702j341
965B1342o713q843j0196r969o861o54N019R653J0655R444O653J854k992r334j0832
980a774r833o776k191J816P241J0617J1403P579K982k371o743q846j1144q499
994a6539n207K263O780R108R158Q576O238J39n487j0054j0506p847n073j043L240
1009a6254Q472J1246R526N538R26l317o939j0219r982o914k069L116O843R175
1023h52R515P671L764k387o763q962r152p112n068R76N628R502R362P457M249
1038A7828N73m091q597j0087r027m411k29L720P217R002R547O226J261m320o524
$$ y = [2898, 13772, 22062, 23646, 18121, 8976, -1624, -12018, -19445, -23409, -20518, -11494, 638, 11242, 18809, 22014, 20775, 14013, 2566, -9880, -18408, -21522, -20039, -14076, -5069, 6308, 16981, 22683, 21342, 14629, 5786, -4410, -14379, -21240, -21894, -16875, -7222, 3433, 12877, 19530, 21384, 18392, 9058, -1774, -11607, -18383, -20574, -18758, -11517, -900, 10503, 18082, 21064, 18693, 11950, 3104, -8040, -16539, -21746, -19483, -12703, -3595, 5563, 14139, 20377, 20516, 15029, 4975, -5531, -13378, -18451, -19494, -16254, -7782, 3464, 12990, 18528, 19454, 16137, 9198, -1021, -11003, -17917, -19986, -16870, -10027, -852, 8663, 16334, 20098, 17711, 10948, 1986, -7166, -14278, -19346, -18370, -12742, -3240, 6122, 13579, 17828, 18401, 14310, 5713, -4374, -13401, -17812, -18041, -14321, -7104, 1898, 11445, 17671, 18932, 14612, 8088]
1053H088q839q597o524k910K564P081R382Q117O087L640j074n901r277r342o869
1068a4374k830L11M584Q937Q937P683M232n37m567p299q449q615n473j89M838
1083a2811O911P896Q460O151J613l676p737q666p447n246k783J667O089R511Q778
1098H710N654K610j551n367p741r341p280k779J536M834P521Q149P477M387l6
1113A6783n099p172q633o812m761j180L578P596Q941O860M646J527k309o694q661
1128a390q216m733j812K250N247Q072Q777N948K448k431n268p488p477o739l749
1143a6561N84N950P820P413O256M366K27m499p877q056o601l824o08L315O375
1158e720Q187P700M293J178l105n598p693q152n373j595K669N905P149P438O240
$$ y = [8088, -751, -9348, -15872, -18782, -16218, -9137, 245, 8362, 14449, 18089, 17015, 11114, 1837, -7505, -14374, -17204, -16893, -12309, -3372, 5565, 13248, 17480, 16943, 12376, 5077, -3372, -11987, -17460, -17649, -12811, -5900, 1996, 10456, 16607, 18220, 14544, 6807, -1859, -9306, -14552, -17335, -15668, -9579, -68, 8710, 14364, 16974, 15423, 10056, 2315, -7026, -14306, -17085, -15549, -10715, -3194, 4955, 12432, 16819, 16783, 11684, 4512, -4121, -10933, -15694, -16874, -13296, -5700, 3241, 10101, 14747, 16274, 13965, 7271, -1390, -9606, -14339, -16151, -13901, -8654, -582, 8195, 14143, 16591, 14160, 8892, 1404, -6073, -12812, -16561, -15977, -10027, -2207, 5206, 11462, 15828, 16055, 11556, 3679, -4377, -10978, -14802, -15410, -12095, -5720, 2467, 10167, 14460, 15638, 12533, 6935, -758, -8910, -14283, -15878, -13209, -7304, -155, 7283, 13523]
1173A3523K793j782n874q052p114n424l244O60M605P636Q023N459L127O68m109
1188A0895o700p932o857m467M16L626O054P623O459N425R29l595o180o936o729
1203g969n013k289K268N937P302P341M733K307j027n283p131p477n150l212J252
1218a3411L836P030P570O246K803k28m208o111o583o914m208k59L821O635O546
1233B565O150M395J241k529o458o816o975m132j117J994M414P122P211N159J727
1248A3951j804m490o216p088n675k812J920L725O125O690N983L640p71l682o183
1263C313o984n334l783l20K794O099O888O249L380R23k843m502o588p403l982
1278a2093r03J915M266O477O750N112K327k079m649n696o646n339k566J176L617
$$ y = [13523, 16316, 14534, 8660, 608, -6506, -11930, -15174, -14514, -9909, -2273, 5750, 11209, 14336, 15004, 10895, 4195, -3737, -10594, -15061, -14645, -11019, -4965, 2658, 9117, 14542, 15471, 11876, 5696, -1240, -7969, -12982, -15271, -13003, -7066, 236, 7577, 12310, 14617, 13590, 8307, 1176, -6301, -11451, -14663, -13411, -9575, -2545, 5025, 11271, 14074, 13846, 9638, 3527, -3056, -9970, -14178, -14437, -10616, -3981, 2565, 8715, 13110, 14351, 11822, 5364, -1452, -8427, -12559, -13676, -11682, -7268, -146, 7065, 12224, 13951, 12147, 7657, 1441, -5647, -11322, -14134, -12214, -8489, -2364, 4326, 10309, 13949, 13178, 9496, 3313, -3671, -9005, -12788, -13108, -10314, -4215, 2673, 8922, 12302, 13225, 10382, 5880, -708, -8111, -12093, -12996, -11081, -6815, -338, 6412, 11524, 13851, 11772, 7123, 1427, -5219, -10558, -13124, -11948, -8331]
1293h331O147O699N156K793k66k728n785p118n663l357Q7K741N061O527O401L506
1309A1870M93k500m292o300n937m761j485K256M504O044N944M569K020j045m388
1324F992n919o061m833j938L26L423N487O392N420K694m49k669n357n925n996
1339h413l213Q5K815M391O123N417L895P09k261m157o415n425m135j471J614M281
1355f160N420O194M225J568q77l341n405o043m583k320N99L199N254N576N238
1370H544K893K0l199m783n496n534l059n73K274M813N632M893L839J026j480m412
1386E398n988n516l542j676J375L759N531N548M175K020q66l396n091n759m665
1401h693k522Q32L122M767N536M407L185J25k640m938m926n009l370m30J631M534
$$ y = [-8331, -2184, 4515, 9671, 12464, 12198, 9470, 3685, -3433, -9096, -12453, -12366, -9625, -4564, 1963, 8364, 11870, 12363, 9863, 5571, -729, -6666, -11427, -12912, -10656, -6152, -108, 5836, 10405, 12425, 11380, 6992, 1073, -4988, -9821, -11759, -11433, -8010, -2523, 3869, 9289, 11983, 11534, 8865, 3508, -2417, -8413, -11626, -11541, -8726, -4335, 1788, 7205, 11100, 11809, 9548, 5391, -1024, -6449, -10584, -12055, -10441, -6160, -740, 5454, 9679, 11247, 10370, 7029, 1624, -4419, -9002, -11322, -10723, -7524, -2270, 3306, 8544, 11437, 11457, 8258, 3475, -2021, -7555, -10614, -11187, -8913, -4100, 1532, 6425, 10264, 11290, 9810, 5398, -590, -6106, -9648, -11324, -9949, -6190, -659, 4889, 9064, 11084, 10218, 6822, 1731, -4028, -8693, -11215, -10383, -7261, -2494, 3042, 7449, 10634, 10759, 8119, 3181, -1745, -6754, -10124, -10554, -8923, -4389]
1417d389N740M852L544J186k130l100n482n822l851j367J175L740N098N186M529
1432H909J647n64l612m772n321m019k607j43L444M870N390M158K918o5k023m727
1448C483n646m492l238k56J638M273N151N114L373J152j241m271m891m992m227
1463i070j521R16M032M930N406L753J779r29k854m793n081m228k330L34K626M359
1479b671N499M349K677J85k316m383n009m560l154m46J862L770M906N116L367
1494I192J431k221l231n027m906l652j406Q11L193M864N206L592K093o74k584
1509F681m904m881m526k260N75K454M516M883M291K556K29k530l858m728m526
1524f028k586r67J731L969M541M606L180J064r28l578n377m378l785j320P67L380
$$ y = [-4389, 1351, 6203, 9747, 10933, 8803, 5703, 221, -5601, -9452, -10819, -9644, -5904, -806, 4380, 8909, 10556, 9992, 6380, 1608, -3713, -7732, -10339, -10482, -7038, -2168, 3222, 7380, 10298, 10233, 8210, 3483, -2163, -6655, -9893, -10149, -8511, -4238, 913, 6027, 9400, 10552, 9311, 5040, 149, -4843, -9070, -10591, -9675, -5643, -713, 4693, 8446, 10225, 9296, 6442, 1649, -3432, -7660, -9990, -9656, -7030, -2671, 2828, 7177, 9854, 10039, 7723, 3340, -1669, -6229, -9383, -9829, -7967, -4197, 709, 5825, 9192, 10623, 8402, 5171, 144, -4762, -8414, -9820, -9009, -5816, -952, 4254, 7846, 9939, 9265, 6681, 1777, -3104, -7630, -9890, -9315, -6861, -2345, 2538, 6829, 9385, 9614, 7084, 3226, -1502, -6028, -8614, -9581, -7850, -3881, 660, 5266, 8446, 9510, 8582, 5004, -373, -4751, -8536, -9856, -9089, -5709]
1540e709N099M733L320J907n25k831m187m768m104k383N59K480L944M972M264
1555F771K202O1j793l869m912m317k816l37J472L451M618M552L089R05j174l291
1571D612m274m529l287j711O81L303M324M575L490J917o04k620m076m651l658
1586f508k549M62K385L989M293M114K496J31k316l354m517m221k695l84J256L660
1602c758M502M006L246P58j082k936m412m417l119j868O26L269M200M715K883
1617F613K148n14k494l926m611l569k170k77K403L661M551M318K540J02k006l545
1633C224m549l960k410r68J490L305M460M228L333O61r27l545m111m142l856j070
1649h837P59L211L874M157L759J439j30k500m304m049l615k273J26K819L304M034
$$ y = [-5709, -610, 4123, 7443, 9350, 8825, 5994, 1807, -2961, -7065, -9448, -8889, -6409, -2465, 2507, 6771, 8973, 9034, 7241, 3372, -1540, -5857, -8673, -9010, -7538, -4087, 531, 5083, 8172, 9077, 7903, 4612, 338, -4191, -7478, -9189, -8508, -5205, -881, 3694, 7184, 9101, 8497, 5877, 1801, -2850, -6508, -9057, -8595, -6210, -2221, 2072, 6186, 8682, 8813, 6497, 3143, -1374, -5595, -8290, -8674, -7418, -3758, 744, 4750, 7996, 8754, 7672, 4736, 324, -4093, -7212, -9080, -8454, -5185, -985, 3730, 6613, 8761, 8247, 5753, 1827, -2784, -6353, -8523, -8800, -6397, -2736, 1815, 6133, 8673, 8775, 6769, 3224, -1325, -5285, -7695, -8663, -7173, -3868, 592, 4820, 8153, 8814, 7887, 4342, 231, -3911, -7767, -8837, -8078, -4867, -993, 3164, 6923, 8362, 8232, 5732, 1428, -2621, -6236, -8509, -8383, -5564, -2260, 1774]
1665A774M336K025K36j684l352m151m344k494j015J727L662L554M219L286O33
1680H412q69l379l930m315l044j489J165K395M053M093L810J392j04k540l786
1695A864m004m039j849l22J998L853M437L458K051R90j827l128m598l774k869
1710g759n61J243L208M345L968L071J157j198k775m603l908l152j264O56K619
1725d953L918L988L694J524N4k499l806m502l146k249J21K041L280M283L626K400
1741G774M2j635l117m064l896k428j057J812K632M323L704K837J423j286k693
1756D371l977l749l547j606Q36K757L851L907L458J908m23k273l939l718l845
1771e989j877K8J916L315M134M288K012K36j917k828m372l965k460m70J433K521
$$ y = [1774, 6110, 8135, 8371, 6687, 3335, -816, -5160, -7654, -8669, -6942, -3280, 274, 4493, 7779, 8412, 7543, 4164, 234, -4081, -7125, -8614, -7449, -5054, -1001, 3092, 6902, 8294, 8190, 5650, 1864, -2140, -6179, -8028, -8350, -6352, -2499, 1938, 5396, 7447, 8437, 6610, 3482, -1116, -4890, -7759, -8320, -7077, -3869, 476, 4444, 7515, 8672, 7474, 4699, 96, -3812, -6964, -8228, -7572, -4953, -1035, 2953, 6647, 8171, 8225, 5726, 1920, -2582, -5728, -7977, -7856, -5815, -2535, 1748, 5374, 7774, 7816, 6181, 3064, -1000, -4896, -7324, -8381, -6569, -3937, 386, 4090, 6927, 8350, 7064, 4371, 394, -3355, -6902, -8508, -7672, -4915, -1064, 2843, 6301, 8209, 7786, 5513, 1574, -2144, -5989, -7866, -7838, -5922, -2607, 1527, 5815, 7827, 8063, 6146, 3318, -1054, -5019, -7479, -7949, -6516, -3995]
1787c995M136M080K734J215j179k853l995m056k519j743R84K073M106M168K928
1802F084J910m23j967l639m458l463j602j78J973L050M182L595K395L07j465l265
1818C036l755l821k521j195J319L428L813L477L243R00q98l087l770l817l166
1833f814j351J367J832M026L725L299J466l28k328l217l931l679j808K08K047
1848e486L194M222L204K190M14j754k834m244m040j963k80J247K734L646M011
1863D261K607M58o91k689l662m094k557q61K26K784L374L694L158J561j33k461
1879D975l620l659l234k103N1K184L210L838L612J829P3j325l084l889l644k393
1895g179m85J438L030L901L745K185J005j143l182k999l441l088j577R09K499
$$ y = [-3995, 141, 4221, 6955, 8170, 6991, 4138, 143, -3913, -6432, -8175, -7191, -5118, -1012, 3156, 6084, 7994, 7571, 5604, 1965, -2493, -5956, -7558, -7736, -5763, -2713, 1469, 5064, 7459, 7766, 6301, 3036, -719, -4540, -7061, -8256, -6937, -3509, 304, 3781, 7024, 7924, 7026, 3939, 169, -3648, -6814, -8165, -6798, -4966, -940, 2785, 6084, 7550, 7222, 4894, 1677, -2254, -5933, -7741, -7533, -5486, -2292, 1930, 5134, 7324, 7738, 5984, 3150, -1094, -5134, -7097, -7377, -6130, -3396, 250, 4261, 6868, 7326, 6635, 3946, 284, -3810, -6367, -7228, -7002, -4218, -844, 2850, 6008, 7569, 7436, 4975, 1355, -2304, -5538, -7641, -7590, -5406, -2196, 1642, 5254, 7083, 7156, 5831, 2747, -1142, -4786, -7179, -7664, -6226, -3196, 705, 4450, 6635, 7640, 6497, 3315, 316, -3125, -6213, -7790, -6881, -4382]
1910d382L358L758L063J449j75k091l877l557k957j732r0K212L300L160L731K121
1926G291k4j644k808m147l267k220m51J431L020L750L303K235R33j408k172l824
1942bl544k302j423J064K091L261M467K343R09j03k168l545l632l026j710O46
1958f674J825L146L516L412J712j26j583l024l719l162k101n08J477K877L966
1973A034L203K585L58r45k971l424l493k514q14O23K600L136L715K950R64n39
1989F468j978l213l365l416j249j55K260L266L631K832J874K20k043l082l177
2004a127l703j872l60J684K631L547L643J793O89r93k820l558l160k765q34R75
2020f230K671L372L469K962J170j140k197l340l476l048j345J015J126L599L516
$$ y = [-4382, -1024, 2734, 5797, 7246, 7071, 4980, 1103, -2454, -5411, -7143, -7233, -5021, -1721, 1439, 5170, 7291, 7267, 5623, 2815, -1332, -4599, -6819, -7270, -5839, -2819, 931, 4234, 6469, 7402, 5994, 3822, -2, -3546, -5848, -7271, -6207, -4116, -855, 3612, 5955, 6864, 6761, 4593, 1048, -2584, -5610, -7320, -6674, -4849, -1703, 1813, 5225, 6937, 6811, 5228, 2204, -1515, -4677, -6778, -7286, -5809, -2932, 1034, 4237, 6822, 7180, 6235, 3264, -160, -3653, -6167, -6981, -6358, -3758, -622, 3093, 6043, 7007, 6468, 4490, 1277, -2088, -5504, -6753, -6908, -4648, -1382, 2249, 5081, 6955, 7175, 5132, 2050, -1127, -4830, -6702, -7062, -5378, -2747, 800, 4443, 6236, 6925, 5932, 3112, -446, -3606, -6371, -7205, -6230, -3559, -187, 3282, 6244, 7414, 6274, 4077, 737, -2739, -5787, -7132, -6117, -4991, -1392, 2124]
2035B124L376J227P9j891k919l673k805k397L79J178K815L646K973K553L69j390
2051E644k900l365l415k133m50N69K625L838K608K481J256p26j937l142l658l066
2067e771j008N26J849L215L489L282J235n86j430l166l194l340j847k11K052K808
2083b097L239L059K105K70q32l230l483k693k327o27R01K269L443L630K301Q96
2099F824j017j708l393l858k185j582Q76K204L051L359K598J349j52j914k903
2114A549l324l416j517L12J585K339L820K978K034J85j241k799l423l062k364
2129f344j78Q49K906L247K888K479R97j208k745k887k994k252j568O55K397L089
2145f69L481K398J343m70k073k974l263k553j796L7J829K575M200K360J870O7
$$ y = [2124, 5500, 6727, 6806, 4915, 1996, -1677, -4482, -6879, -6500, -5322, -2507, 1139, 4112, 6665, 7034, 5644, 2744, -621, -4036, -6169, -6619, -6050, -3425, 413, 3021, 5502, 6758, 6032, 4095, 953, -2705, -5771, -6779, -6253, -4404, -1189, 2300, 5582, 6817, 6231, 4801, 1635, -1559, -4899, -6746, -6957, -4905, -2097, 1142, 4201, 6306, 6576, 5744, 2514, -969, -3662, -5989, -6616, -5715, -3446, -3, 3627, 5928, 6824, 5807, 4099, 706, -3152, -5337, -6919, -6043, -3839, -788, 2571, 5169, 6518, 6366, 4452, 1549, -1775, -5191, -6708, -6396, -4811, -2472, 1348, 4326, 6360, 6545, 5304, 2505, -918, -3980, -6344, -6522, -5673, -2767, 480, 3368, 5847, 6844, 5636, 2891, 4, -2990, -5242, -6810, -6155, -3758, -669, 2812, 5210, 6553, 6083, 4010, 1036, -2227, -4780, -6576, -6539, -4710, -2135, 2065, 4425, 6295, 6362]
2161F362j613k517l373k796j656q59J122K830L199K751J930J142r90k591l094
2176a53l148j691j393L92K327L231L336K321J257p88j847k928l120k615j293J94
2192e918J577L304L013K305J458R33k161k577l267k752j809m01J611K165L245
2207G26L067J846P32j072k590l177k981k271m05N11K387K630L291K125J280l45
2223E754j857l050l559k208j609R56J471L204L008K043J522M44j827k491l469
2238a668k430j859J66J308K107L315L083J703K39j050k537k925k680k337o50J144
2254e071K220L011K846K012Q21m82j772l076l166k089j012K56J813K707K902K420
2270D340J106Q2j822k404l038k496j445o8J577K059L693K360J694L22j030k748
$$ y = [6362, 4749, 2232, -1141, -3937, -5593, -6452, -5330, -2500, 699, 3450, 5380, 6522, 5532, 2941, -153, -3301, -4992, -6385, -5993, -3666, -435, 2901, 5222, 6479, 5691, 3844, 916, -2204, -4819, -6112, -5918, -4341, -1037, 1976, 4281, 5739, 6672, 4511, 1934, -1333, -4085, -5894, -6295, -4684, -2519, 726, 3793, 5639, 6371, 5299, 2709, -468, -3449, -5720, -6125, -5614, -3227, -597, 2694, 4819, 6099, 5754, 3897, 847, -2712, -4920, -6529, -5573, -4102, -898, 2110, 4153, 5675, 6119, 4292, 1801, -1668, -4098, -5957, -5791, -4483, -2376, 939, 4022, 5725, 5964, 4914, 2377, -548, -3228, -5565, -6215, -5071, -2851, 160, 3006, 5018, 5839, 5357, 3585, 509, -2657, -4746, -5758, -5502, -3689, -982, 1920, 4340, 5446, 5528, 3706, 1302, -1736, -4232, -5677, -5745, -4168, -2109, 1584, 3944, 5638, 5960, 4930, 2182]
2286B182l092k619j832o82J244J972L404K850J472R58q28k079k703k835k480p61
2302e829N16K311K281K980K708K79p8j737k524k829k231j566L13K050J952L133
2318A729K433J153jj118k804k308k681j830J35P34K474K895K318K145O51j494
2334D431j779k864k575j928r96Q37K085K027L023K203J299m23k088k415k881j755
2350c799j386j7J077L051K921K344J302m11j236k619k439k100j606l60J245K119
2366a914K671K541J563N12j047k201k349k855j569l02N13J470L082K153K142R57
2382E367l77k239j953k976j911j338L04J964K189K544K416J144Pj580k690k153
2398a282k389j511r7J143K074L530J530K043k05r07j879k831k571j438l04J188
$$ y = [2182, -910, -3529, -5361, -6043, -4799, -2827, 577, 3427, 4899, 5857, 5029, 2950, 247, -2588, -5068, -5829, -5313, -3002, -721, 2259, 4967, 5246, 5168, 3431, 907, -1922, -4153, -5719, -5406, -3356, -1404, 1729, 4162, 5315, 5314, 4196, 1392, -916, -3597, -5427, -5292, -4558, -2084, 811, 3129, 5274, 5925, 4431, 2652, -212, -2787, -4715, -5711, -4874, -2789, -762, 2261, 4464, 5763, 5340, 3252, 837, -2044, -3799, -5185, -5202, -4125, -1074, 1847, 4191, 5493, 5082, 3846, 1227, -1212, -3312, -4918, -5278, -4033, -1914, 757, 3298, 4861, 5373, 4326, 2125, -224, -3079, -4648, -4950, -4437, -2967, 115, 2268, 4410, 5367, 4990, 2751, 798, -2178, -4089, -5427, -5123, -3159, -970, 1574, 3990, 5134, 5141, 3561, 871, -1282, -3671, -5182, -5279, -4136, -2062, 1468, 2998, 5041, 4836, 3929, 2050, -781, -3352, -4790, -5094, -3906]
2414c906J634K786J798K079P99m96k096k393k578j868l85L35J445K080K950J937
2430D121J284l35j979j989k756k067j104L0J167K329K176K545J354P9j076j962
2446A817k543k277j613l96Q64K040K798K277J733O5n45j937k789j728k359k74
2462d867N49J278K794K718J665P99m61j522k480k484k017p70j29K137J482K863
2478A555J730J708r8j501j608k883j978j597n5R86K248K432K350J292J35o88k403
2495A625k331k169j087p58O01J892K120K239J823R48o44j822k380k117j674o23
2511d357K47J282K079K164K134J441n74j057k387j897k655p72k81J495J477K705
2527A044K112J203M83j245k012k014k100j563l10N67J789K248K344J470Q10j004
$$ y = [-3906, -2272, 514, 2312, 4391, 5190, 4694, 2598, 205, -2373, -4241, -4626, -4291, -2846, -766, 2184, 4121, 5405, 5070, 3091, 1102, -1654, -3721, -4825, -4795, -3628, -1299, 877, 3422, 4776, 4855, 3779, 1817, -726, -3003, -4616, -5012, -4148, -2108, 690, 2967, 4700, 4765, 4220, 2283, -506, -2234, -4593, -4867, -4318, -3040, -246, 2472, 4137, 4936, 4475, 2953, 473, -2011, -4028, -4798, -4927, -2790, -1308, 1555, 3285, 4993, 4895, 3394, 1786, -1097, -3075, -4672, -4727, -3741, -1493, 939, 3289, 4581, 4716, 4028, 1625, -706, -2875, -3962, -4720, -4119, -2227, -107, 2132, 3955, 4903, 4259, 2437, 57, -2060, -3734, -4357, -4110, -2828, -749, 1415, 3549, 4990, 4416, 3359, 972, -925, -3580, -4352, -4633, -3138, -1661, 1044, 3156, 4359, 4842, 3597, 1585, -429, -2529, -4092, -4402, -3835, -2046, 202, 2546, 4016, 4826, 3822]
2543C822j745j617k799j555o71M81J537K239K129J318J376k50j619j907k199j801
2559c261j074L96J016J789K324J687J006P94j359k056k370j751j159l37R57J859
2575a539J950K514R77N88j011j387k154k103j446r73R99J311K622J677J665N01
2591D191%j620k056j898j850q13K29J318J971K229J547J128l55j049j759k505
2607a292j751j468O84J070J577J999K000J079M24j257j528k129j979p43j100P92
2623c622J995J652K207J476N65n98j590j839j991j684j005R66J160J832J965J614
2639C103P19j38q66k471j435j939j249L65J326J395K268J120J541J43o30k009
2655A243k204j565j257j0N36J876J929J604J285O18j054j053k149k125j094r41
$$ y = [3822, 2077, 460, -2339, -3894, -4565, -4084, -2547, -308, 1821, 3139, 4515, 4265, 2646, 739, -1460, -3261, -4335, -3939, -2923, -1134, 1190, 2877, 3883, 4677, 3318, 1262, -1108, -2859, -4018, -4355, -3398, -1539, 411, 2925, 3902, 4490, 3479, 2092, -62, -2165, -3611, -4584, -3585, -2274, 348, 2025, 3690, 4191, 4191, 2571, 515, -1383, -3233, -4046, -3817, -2499, -528, 1701, 3248, 4376, 4021, 2972, 1213, -1292, -3043, -4511, -3827, -2757, -1180, 819, 2819, 3898, 4322, 3065, 1537, -592, -2571, -3314, -4414, -3622, -1627, 25, 2232, 3708, 4273, 3675, 2085, 246, -1745, -3429, -4434, -3468, -2308, -476, 1489, 3103, 3822, 3684, 2818, 347, -1088, -3027, -4276, -3911, -2585, -1190, 1078, 2198, 3739, 3882, 3252, 1243, -961, -2526, -3783, -3793, -3257, -1381, 548, 2152, 3437, 4055, 3001, 1948, -201, -2326, -3420, -4361]
2671d361J219J104J936J912J441N71l81j250j935j895j415j007N46J209J840J487
2687A021J891J007l21j000j593j348k169j227J85J025J348K256J341J588n06q40
2703B658j288j961j507j245k83P37J155J473K300Q81P10o19j112j789j681j545
2719c116l38kJ439J453J671J870N42j69j131j567k165r79j052n0Q95J863J871
2736A035J564O67M43j263j245j599j835p55m16N87J545J740J873R24K30j79j895
2753A421j632j587j266j30M84J023J581J724J511M05k65j833j044j799j265q47
2769c519O38P68J610J589J501O16k4r17j391j822j452o74l9Q10J224J534J802
2786B254P97J35p50j167j865j351q72l98K98J306J681J600R81P40O1k019j337
$$ y = [-4361, -3142, -2038, -102, 1810, 3251, 3822, 3441, 2191, 256, -1639, -3054, -4061, -3515, -2306, -466, 1021, 2912, 3919, 3598, 2598, 1005, -343, -2512, -3739, -3554, -2529, -1181, 1075, 2416, 4004, 3498, 2658, 1370, -591, -2098, -3343, -3626, -2889, -1734, -261, 2039, 2920, 3630, 3011, 1899, 110, -1571, -3116, -3454, -3456, -2017, -564, 1107, 2977, 3519, 3350, 2219, 652, -1513, -2492, -3544, -3594, -2699, -836, 1035, 2599, 3266, 3709, 2446, 1201, -398, -2233, -2988, -3404, -2817, -1272, 468, 2341, 3265, 3495, 3316, 1421, -211, -1798, -3064, -3194, -2710, -1687, -106, 1618, 3129, 3534, 3269, 1436, 392, -1407, -2672, -3519, -2881, -2113, -503, 1086, 2587, 3203, 3179, 2262, 871, -951, -2403, -3077, -3116, -2306, -1082, 452, 2254, 3051, 3186, 2436, 1269, -596, -1947, -2819, -3217, -2919, -1613, 68, 1668, 2649, 3389, 3450, 1431, 94]
2803I4j579j109n62M31P40J536J645J479K52j3r51j445j599r75j053K24Q33J275
2821g77K096N98R92R2r70q83j625j689p43k55O20J598J378J821M87K93n42j058
2839A433j617j368j108m20K97J001J856J289R99N96n04q21j149j677j395l88K99
2856b677O35J564J509J381J40L93q33j116j853j229p79n3Q02J353J022J629J229
2873C117m72p9j933p92j529r03k10N44Q71J569J487R09N46p10j158j253j106j240
2891b342j16j62J142J381J505R64N85j52j169j074j485j173j103O94O66J419R79
2908E59J472O01K49j291n23j875r94q02j30R52L48J991J043J242n7p29p57j696
2926c97r76r75k95O13P03J256J640O28M58l03r58j316q61j256q97K14Q94J615
$$ y = [94, -1485, -2594, -3156, -2725, -1985, -449, 1196, 2675, 2927, 2914, 1963, 518, -1081, -2056, -3109, -2885, -2052, -777, 1319, 1917, 2909, 3001, 2031, 1148, -477, -2166, -2909, -3164, -2544, -946, 432, 2253, 2740, 3033, 2491, 1433, -184, -1552, -2660, -3080, -2783, -1782, 74, 1363, 2362, 2958, 2454, 1633, 484, -1193, -2588, -2976, -2677, -2042, -478, 1031, 2412, 2552, 2945, 2112, 996, -857, -2086, -2865, -2918, -2116, -763, 259, 1888, 3117, 2645, 2566, 633, -159, -1688, -2591, -2801, -2257, -1386, 183, 1670, 2579, 3125, 2415, 1257, 4, -1102, -2342, -2458, -2620, -1478, -97, 1408, 2372, 2957, 2805, 1636, 562, -923, -2096, -3199, -2505, -1839, -420, 559, 2031, 2632, 2881, 1590, 1067, -808, -1802, -2604, -2734, -1782, -1434, 557, 1600, 2842, 2785, 2056, 1299, -397, -1373, -2348, -2643, -2030, -1327, -71, 1569, 2197, 2655, 2352, 1394, 78, -783, -2039, -2936, -2722, -1828, -213]
2944b13J325J259k5J63o13j354j452j165l87J37P92Q90J198J059O71M5o07p51
2962I72j199j046j135J4M84R31J332J229Q30K11l52j176j246j211q14j99J15J171
2980a089R37J638O03O11o33j053r13r65j013m64J28P59R61J262R37P40m35j35
2998A876j252j503l12r25k98N76Q24J124J183Q98j47l70p94j050r59j095j7K23
3016b018P88J356Q27J134j14k22l52j415j453k12m70M1Q97R88R43J253L44m69
3034A846o14p98j189r39k11j28L92J100J210R63P62m40m51j043r01q05o32l22
3052b200O39Q57R36R24P89J25q94l22j113q63n80k52K18P55J063Q76J060k1l12
3071A685o82j130n91q83m89k4Q14J044J045R23J64N1o45n47j433k99j039O4P88
$$ y = [-213, 1112, 2371, 2346, 2509, 1896, 542, -910, -2075, -2462, -2325, -1533, -643, 555, 1614, 2285, 2330, 1723, 972, -227, -1273, -2408, -2394, -1910, -979, 353, 1582, 2412, 2623, 2271, 1095, -151, -1362, -2176, -2375, -2260, -1089, -152, 1486, 2089, 2700, 2067, 1014, 101, -864, -1877, -2341, -2213, -1454, -493, 769, 1706, 2446, 2011, 1876, 624, -879, -1191, -2116, -2414, -1838, -1014, 110, 1293, 2191, 2044, 1674, 880, -170, -1129, -2224, -2241, -2018, -1230, 126, 953, 2087, 1973, 1751, 1399, -16, -1469, -1681, -2151, -2110, -1213, -225, 718, 1971, 2315, 1846, 1232, 434, -755, -1694, -1905, -2033, -1641, -541, 669, 1632, 2394, 1954, 1503, 460, -441, -1246, -1878, -2200, -1561, -704, 232, 1156, 1945, 2070, 1176, 854, -259, -1122, -1702, -1954, -1736, -981, 82, 958, 2018, 1997, 1685, 1003, -127, -718, -1601, -2090, -2114, -1300, -256, 789, 1712, 1876, 1927, 1282, 735, -698, -997, -2036, -1972, -1184]
3090a184M55J665Q78J70J25n25n89j216r46o68k6K72P39J285O07M81M08n15q09
3109F07m46j054n40j80J53K79Q65J055P07K34Q8p33j041l80r46n10L20N7J023
3128d42R88Q11M44k83k88n97q81q18r76J56N66Q12J100L53N86K9o4r04q08p92
3148a008o43K15p2O32J165Q66mK86r6j56q73j031q62j38k5O69J096M93R32l60
3168A086M15p50l91q07l51q74K40M67N38R66O77N18l96n0j129o08p01m27k8J57
3188a448O47R86Q98K48M6K38r05q39p66l35J77j35P33N57N66N85k3m4k63p33q83
3209f93m17k95L33M00L91P30O41M90l24l86l25j164n72m16R7L51Q23O43O93M82
3229A482P1m53j132K27j004k14n24N21N91N93O71K81J29k2n65q22k12r29J26J78
$$ y = [-1184, -729, 936, 1814, 1984, 2109, 1584, 995, -221, -1167, -1835, -1861, -1589, -850, 435, 1042, 1523, 1931, 1416, 607, 161, -893, -1433, -1613, -1460, -1181, -316, 739, 1446, 1680, 1768, 1035, -6, -386, -1332, -1842, -1522, -1465, -442, 546, 1357, 1801, 1518, 1230, 633, -248, -1066, -2042, -1886, -1320, -508, 592, 945, 1531, 1560, 1496, 592, -216, -1008, -1651, -1436, -1508, -876, 289, 1155, 1151, 1437, 1341, 1185, 312, -719, -1581, -1719, -1744, -1075, 21, 514, 1446, 1086, 1501, 751, 360, -447, -798, -1672, -1432, -965, -427, 539, 1216, 1734, 1338, 1288, 159, -449, -1150, -1577, -1605, -1448, -801, 185, 1083, 1331, 1377, 1615, 710, -129, -895, -1230, -1053, -1188, -455, 102, 668, 1253, 1230, 1186, 923, 190, -693, -1110, -1405, -1072, -672, -281, 449, 1090, 1580, 1256, 870, 545, -619, -1191, -1607, -1510, -1159, -336, 307, 1000, 1482, 1553, 1100, -32, 195, -809, -1023, -1547, -1026, -435, 158, 829, 1110, 1239, 1217, 652, -170, -382, -1311, -1185, -1007]
3249a007L27Q94L58L83L52k48k09r30m29j031J17L78L36M91Q31N86n4P2j47j085
3269a5m06q44K57p5J34P80N10L40N95k36k59k14n92q40k79rO9J155J8M37N71j44
3291I53L07j050l34l87n97K7K7M54P61N43J61J74j67j23p36o04j37l65K09L51
3311e33L13Q39j7Q16m03lo81j011l1n28J4J64O56N84P34J33J57k95m35q62n26
3332i15Q3k49L65M35N74P60k12J20l76o52J24q30j19l84J17O49O13M23L81m64
3352D43N33l49n99p12k23p2M63k60K77P40Q79K3j07k20o57l82n53k43j43J98L43
3373f21Q24N20K60l2l00o85k45m52r9k32J01L34P28M02M02N1n12p8o09m42n1k41
3395i77M33k3O73K18O30m7m31j07n25k20k08j11K07P4K2N63N74K40qj36q57N6
$$ y = [-1007, -680, 214, 572, 955, 1307, 1059, 850, -80, -509, -1540, -1423, -1045, -709, -218, 613, 1199, 1145, 1217, 1070, -15, -421, -1265, -1008, -1083, -949, -169, 341, 681, 1276, 1040, 781, 567, -25, -865, -1144, -1153, -1084, 71, 89, 526, 1097, 953, 1260, 210, -124, -511, -1108, -1081, -1054, -600, 161, 704, 865, 1039, 872, 749, 13, -591, -728, -1093, -884, -533, -220, 619, 602, 1418, 1015, 1012, 331, -680, -711, -1239, -1225, -1061, -405, 179, 913, 1046, 1203, 908, 473, -389, -915, -832, -1081, -716, -281, 293, 1053, 841, 961, 585, -67, 57, -773, -892, -1276, -1159, -510, 103, 526, 907, 443, 976, 627, 28, -684, -907, -979, -516, -776, -499, 241, 1120, 1143, 1036, 816, 159, -223, -776, -1019, -1162, -964, -621, 203, 723, 983, 951, 651, -34, -279, -731, -830, -1062, -961, -627, 101, 503, 905, 956, 444, 366, -243, -685, -736, -977, -544, -567, 106, 324, 954, 907, 476, 369, -156, -376, -584, -695, -488, -414, -392, 171, 745, 985, 977, 841, -16, 40]
3417D0r44j71L05N01K64QN96K89K43n75k46o21m50j85N3N0Q95K01L38M80k47l93
3439D31K0l68m12l48l3K71K14M87J61K23J35l37j28k87o19j19k40J09N33k18O13
3460H8L50N42j24n74l28l33k08l8J62k94N76N40L14J87j32j04l17k38m73j68k00
3481g72J96K29N14J70L17j60R8j35o02j25l32o7n2N16R2O23J68K76k18J01r50
3502a13n43K05l35L11q9L67M03K70L61l50K59p88k56j88P4j43K7J57O44K78K01
3523G52J32l74m69n01L29n92O4O34j77Q23r7M9K06j47n57j73j58l10k9j03N57
3544a41O59l9k25M68J95j047R8m7n23q9K16K97j93Q03J32q0n1J40n23k68j19l34
3566f71j3N08j81M68K15L31j77k0k98m35k85J42n6r3M59K58L27K30k1m23J92n05
$$ y = [40, -904, -1075, -770, -269, -5, 3, 599, 888, 1131, 556, 310, -311, -761, -946, -893, -843, 52, 253, 591, 1071, 824, 431, 451, 83, -329, -677, -710, -439, -225, 262, 423, 646, 781, 444, 316, 29, -590, -709, -949, -840, -307, -525, 88, 438, 980, 856, 282, -46, -379, -587, -625, -463, -757, -181, 359, 673, 860, 728, 624, 307, 69, -404, -572, -772, -576, -347, 167, 337, 654, 494, 592, 457, -145, -270, -602, -669, -721, -205, -113, 510, 678, 954, 736, 837, -113, -656, -451, -786, -475, -564, -197, 206, 476, 837, 487, 746, -42, -298, -486, -412, -555, -528, -371, 273, 551, 752, 884, 510, 41, -460, -131, -723, -659, -25, -202, 621, 524, 573, 779, 632, 75, -98, -256, -566, -595, -698, -141, 518, 479, 254, 722, 917, -130, -32, -79, -602, -691, -475, -178, -371, 432, 564, 484, 433, 573, 50, -218, -337, -671, -684, -176, -357, 111, 326, 657, 480, 460, 162, -273, -558, -416, -472, -565, -106, 152, 479, 709, 688, 265, 457, -48]
3588d8J0o50k33K00O07J42P61n97N94k5k91o04j26j68l23M92n4J63K61J91L10
3609F12j35q0k03j27o52J17k03p6L62L81N13k73K26j57K99q02j07j4j26j35N64
3630a6J45L01p2o0P4j69j80n11j61k26N53J70J87n7M07L63l72m18J14o94J3R0
3652e19J56J72K67L18N6K16j82J59k81k15k45n22K07J69N16j94R89n95J36m35
3672A73j57q1n0j76j52j12J19N99j0M93r2l67J44k00l79Mk63K33l6L34m1M45K00
3695F28n33K4j8n49J76r3p9J68N29l92L06N07r8j22K7o47j09m61L4K92L62J1L93
3718C56q1L0k1K51n52o05L6J26j66K36N27J83K02j94j8j17o2q66K63jL1K49M11
3741B18k68O52j07J12o09J35m05k66p7K6L03K81M75j84P0J51j39m15m08J05O3
$$ y = [-48, -38, -688, -921, -721, -114, 28, 789, 192, 786, 761, 470, -134, -260, -428, -751, -259, -313, -150, 111, 302, 612, 477, 397, 194, 67, -585, -468, -671, -747, -385, -4, 509, 236, 462, 305, 604, -198, -305, -319, -445, -580, -16, 129, 430, 358, 298, 372, 203, 23, -488, -649, -875, -322, -152, 35, -22, 385, 748, 376, -42, 72, -622, -609, -519, -363, -191, 76, 394, 450, 666, 484, 643, 362, 147, -98, -620, -413, -244, 272, 78, 1067, 472, 608, 173, 16, -65, -115, -291, -443, -555, -436, 163, 153, 646, 554, 187, 331, 131, -248, -244, -507, -274, -310, 24, -17, 428, 628, 95, 119, 101, -448, -272, -365, -444, -276, 253, -139, 167, 674, 576, 454, 481, -166, -275, -736, -702, -410, -48, -37, 356, 275, 305, 284, 535, -17, -622, -586, -460, -626, -390, 137, 320, 522, 328, 310, 193, 131, -735, -472, -473, -442, -193, 218, -50, 602, 495, 607, -2, 133, -272, -538, -615, -589, -286, -5, 470, 286, 356, 507, 368, -47, -455, -350, -287]
3762b87Nj07N70K19K25k68K6j17P5q13N6j19J49JP7O50K4K01K2k25pk99l49J88
3786a03m47M21k79M30J98K79P5l43j33j57K83o29k69J63k8J16J013O5m2l82J00
3807C31l38n51J82m89K40J59N23K41j71K29O5N41r84l1l22l92O52k06K34J86M37
3828E36M7K46l24j41k84l08J2l38m6N32k46Q83l5R6l46J00m02K9j72k73K15J71
3850d8PJ39N09L09m73ml06j46m01j31J11n7N8O28J92N7k45L99l68o82j90J88P6
3873c78k35J74N27K33N30k52K2l93k64j3l27k24K12O8K58L99l16Q15k97J30n57
3894A12l63m2l00L85k17J72L08p0P71m17n4J21m77m07J74m5K8L44K5M62r4J96
3916F12j50k84l28l18k52L36J37O6N44K8P3J24m84K04l08n24j11k94J46P58K89
$$ y = [-287, -282, -389, 181, 400, 625, 357, 383, 266, 341, -472, -416, -535, -386, -385, -308, 342, 366, 567, 589, 364, 357, 58, -291, -103, -550, -129, -408, 22, 220, 499, 574, 231, 98, -59, 224, -405, -674, -511, -539, -423, 590, 655, 613, 231, 331, -7, -558, -376, -865, -625, -466, 57, 298, 127, 356, 421, 962, -22, -53, -375, -767, -115, -321, -87, 99, 536, 583, 829, 505, 364, 80, -228, -216, -554, -600, -68, -314, 569, 534, 630, 284, 384, -18, 11, -161, -434, -219, -48, -41, 98, 607, 916, 443, 439, 133, -13, -414, -545, -434, -491, -433, 195, 387, 444, 199, 598, 230, -452, -642, -454, -378, -613, -439, 88, 321, 851, 599, 621, 228, -36, -49, -376, -600, -388, -320, -62, 337, 21, 836, 539, 669, 112, -251, -293, -593, -208, -425, -253, 55, -15, 756, 339, 285, 406, -71, -478, -304, -349, -321, 23, 48, 510, 416, 612, 462, 178, -150, -468, -720, -384, -247, -181, 363, 391, 464, 588, 104, 308, 0, -524, -635, -929, -783, -25, 264]
3937B64M9K91k89N4K95p48p1k97n8K59p4K52J71L11J58k59K51m63j22P7q66K94
3959e21M00k71K77O42j47L90n15O8j60k33p00N80m05M12J50L37J11N38m46k36
3979B71J96o99k22l83N8O86k42K14N46J50l30K34l41o8o15K91k41k62N18K08K79
4000B48L99N1o62J48l69M7k85M3N4J99L90k20N59j52j0J65n84k09kk22J37M14
4022A39k39J16J67N20p2l21j78m54j32Q9k58K40J95M64M8J80j34n5l65k36J51
4043a35n42R5Q3k2M20N22K3J66l69q8m5l68k43l7J17K77n3J49M47K03n39K01m3
4066B19o87P9K35l59L63L1K8M24K79m94N75n99j26l77j97K41j20J47P49l95L10
4087C26M50k8q02J14k33o37M05k42L84L75K73j04K01l18J56K7j37n73K10j99p
$$ y = [264, 313, 604, 315, 369, 664, -84, -155, -452, -510, -251, -325, -73, 98, 409, 567, 308, 559, 96, -26, 51, -815, -521, -121, -392, -115, 527, 380, 770, 255, 323, 163, -70, -770, -190, -595, -183, -33, 304, 415, 953, 507, 271, 467, -232, -454, -837, -779, -93, -335, -121, 425, 575, 245, 479, 138, 70, -545, -254, -495, -757, -239, -31, 248, 647, 698, 36, 184, -185, -138, -423, -380, -326, -127, 263, 43, 602, 450, 440, 605, 21, -188, -190, -412, -275, 139, -100, 16, 183, 703, 631, 310, 132, -322, -454, -365, -623, -383, -188, 276, 324, 504, 370, 315, -50, -286, -135, -677, -582, -499, -521, -101, 421, 444, 610, 241, 153, 108, -260, -503, -540, -423, -146, -199, -50, 397, 600, 61, 262, 219, -468, -389, -154, -513, -150, -119, -91, 333, 612, 118, 693, 94, -32, -409, -606, -365, -485, -338, 411, 16, 326, 776, 748, -54, 60, -173, -810, -405, -647, -263, 112, 385, 281, 482, 164, 320, 347, 210, -363, -153, -352, -359]
4108c59M1O36NMK39q8j73l61l71l28J44L97L1K68L96J49K48n88J23o52o8M7n05
4131g65M20k21O70K18J47L13m90J95n69J7n53l23N25J3J72N38N61J3l47j53l03
4152G8n42M4k67R7K52K42K71J71J60L44j5o18k00n91r2j45K77O16o11P98K54j57
4174C66L37l92k11l43j36k84K63J28K29L98J99J6J33l72k42m22K9j48J74K59J08
4195H9K61K67k83N4J7l40l36k17n5Q4J45R5J94K24O91l58j67o3m51l14J18l85
4217g30K77K62K7M17NL03o9r3k99k90l22k53L22k71O30K27L73J45k58Q7m90n32
4239e32J73k23m4N73k31N28M09n5q8l18N7l07j87o49P6L22N10l03L18L87J36j99
4261C53j03n2m21k61k88k7M90M56K15K79l01L06n59Q2N7q14J23O5j44N81L05K14
$$ y = [-359, -318, 318, 323, 327, 566, 478, 305, -56, -427, -755, -611, -214, -183, 85, 481, 630, 878, 290, 413, -239, -307, -260, -765, -345, -566, 104, 322, 469, 782, 292, 487, -82, -65, -618, -941, -416, -403, -231, 307, 868, 881, 534, 381, 78, -464, -420, -687, -590, -338, -96, 175, 346, 506, 850, 835, 217, 17, -574, -666, -811, -534, 82, -529, 269, 523, 366, 703, 311, 100, -243, -379, -663, -400, -272, -43, 355, 554, 570, 703, 331, 89, -333, -304, -452, -278, -19, 89, 350, 617, 334, 388, 405, 65, -271, -488, -543, -459, -314, -219, -25, 199, 890, 532, 365, 302, -149, -463, -345, -730, -453, -191, -164, 253, 258, 561, 492, 399, 100, -190, -512, -765, -443, -714, -84, 143, 516, 661, 403, 490, 0, -532, -359, -582, -626, -53, -284, 244, 653, 598, 510, 192, 249, -58, -245, -894, -818, -496, 14, -289, 29, 416, 552, 353, 250, 198, -223, -484, -772, -799, -309, 147, 362, 641, 340, 646, 87, 169, 226, -588, -465, -400, -544, 37, 342, 556]
4283E56K74j54k08k26l75j75k22q1N60p22J066J55j06L29k05J82m68r4l08l38
4303e60J95l41K93O86nM34l23k67po23N14k53m57j19K94N07L02J41L55r5r54K02
4325h1l35J08o54N12R0L27N44j84J98K55m10l48l98l15J01J26K34l3K39L79m90
4346a35O13J50l63n11o15K02L7M89%K6K62N76K05o44M6n13n33K6J33K5L71L12
4368A59K55K19k48J21k56l81J04k75m77L83J46J61J83K19L77k42j73j88k38m43
4388e94M13j56j51K61P69L0q5q4J48k09k00l82l59K09j94L12L84J22K39J02k87
4409B88l67M4j20p2m79R4M42J56L15K19l06L63k36k92n93J3J79k50O27j86L49
4430A88J15M34n9m49m07L95o75N7n50P03n1K0M55L33K43m26K79o03j39jl66l10
$$ y = [556, 830, 676, 468, 242, -133, -308, -530, -611, -51, -773, 293, 448, 342, 671, 466, 648, 180, 86, -222, -560, -365, -706, -413, 273, 268, 702, 379, 112, 105, -518, -4, -257, -714, -833, -539, -32, 270, 411, 766, 671, -283, -81, -416, -308, -962, -450, -360, -33, 511, 327, 525, 780, 370, 22, -376, -691, -590, -464, -230, -263, -24, 355, -135, 478, 628, 265, -246, -861, -659, -622, -133, -133, -107, 155, 731, 936, 292, 338, -175, -708, -682, -549, -524, -153, 159, 414, 633, 385, 506, 250, -131, -27, -302, -779, -396, -250, -89, 94, 313, 690, 448, 275, 87, -151, -594, -181, -337, -488, -227, 542, 572, 487, 403, 551, 342, 142, -240, -599, -390, -584, -272, 112, 234, 473, 575, 288, -79, -35, -155, -227, -706, -612, -170, -14, 301, 520, 214, 577, 341, 49, -544, -531, -352, -602, 25, -161, 188, 303, 737, 678, 229, -178, 217, -458, -401, -951, -248, -299, -279, 176, 509, 752, 326, 605, 2, -137, -138, -504, -814]
4452h14O06J64N36j14J74K37q42n4j92j74j54r2M31k34M97N39r7k98K12l20k57
4473b46j76m22J59M15K15k35P52J38r5K77p28l11j8k79j52J77K60j18N92K92J92
4494F89j53O3l96p14J09j90K55J18J1N50j06K84j87qk34k44l87K38m44M87k16
4515d75N22N07j49P3nj84n78Nm1k96K21L46j72M39J87kk00K33l85j57n19K3P7
4538e30L86l3K58K70O04m69K16n36m83j15j94K9M20L65J22K33j75N71o43Lp18
4559d19J72K00n21J3N5N34N27p3J35J50o78k97K15o45k00L30J76K68L6L79J1J12
4581D80p27K99l33k08R3NK42m3J85M58k1l73Q31n82m18k52l29o7J75K10J91N15
4603C31L94j07j52m67R1k31j98k41j72K27N60K48L11j03j5j76j66k79k96j06J1
$$ y = [-814, -208, -44, 492, 378, 552, 789, -53, -107, -299, -473, -627, -719, -288, -522, -25, 514, 417, 119, 331, 11, -246, -422, -844, -685, -270, -55, -290, 462, 600, 505, 782, 54, -257, -275, -554, -706, -529, -269, -387, 205, 497, 689, 536, 599, 203, -511, -402, -592, -337, -219, -208, 342, 236, 520, 333, 325, 91, -153, -540, -302, -746, -259, -475, 47, 554, 405, 478, 473, 289, -289, -284, -325, -621, -400, -54, -226, 213, 400, 398, 198, 431, 46, -111, -630, -607, -530, -144, -177, 81, 351, 955, 486, 702, 166, -317, -432, -626, -597, -177, 188, 310, 543, 368, 939, 296, 299, -419, -247, -47, -568, -555, -500, 34, 561, 488, 623, 773, 95, -202, 13, -632, -832, -502, -326, -58, -22, 357, 368, 480, -247, 52, -281, -489, -396, -391, -149, -192, -7, 451, 430, 57, 888, 306, -112, -364, -693, -760, -585, -375, -184, 331, 725, 618, 466, -1, 90, -141, -339, -580, -752, -525, 35, 283, 594, 491, 476, 300, 134, -145, -441, -547, -536]
4624e36k44O57J0K49M38M5r6l02l22m53r8L20k28M74j40O74J46r2M8l18m80k7
4646b75j58j4k87K68O71l3O51k96r1J73n81l40m9m63N53q0J23K00M28J61k08N1
4668D04k26n02l55l6J18N80l16L26M39j42L0L24p08r2j98L57k22n00M31K65jK29
4690B05L64j31j30l77l59j4k61J50K58k3O98J51j2l59M17k47l12k29m39K06lm81
4712i28Q28K96K28k37K40J15o83k07p0k96J36K70R9J84N36k01j90K64j05m40m85
$$ y = [-536, -780, -123, -113, 136, 574, 619, 523, 221, -101, -554, -652, -332, -560, -86, -226, 448, 594, 502, 550, 232, -248, -275, -433, -447, -734, -466, 205, 172, 823, 527, 436, 609, 28, -312, -361, -824, -271, -351, -228, -28, 400, 561, 353, 404, 178, -324, -679, -715, -597, -17, -333, -7, 432, 290, 320, 644, -64, -156, -354, 3, -219, -719, -288, -23, -24, 205, 569, 438, 308, -69, -428, -442, -703, -553, -295, -318, 380, 531, 519, 160, 577, 330, 18, -211, -650, -444, -447, -928, -100, 196, 424, 187, 427, 542, -141, -348, -418, -714, -578, -308, -209, -25, 511, 310, 120, 384, 279, -161, -646]
$$ [...]
8191h5
##END NTUPLES=NMR FID
##END=
