##TITLE=1H ikalashn
DE-77k
19.11.2024
##JCAMPDX= 6.0         $$ Bruker NMR JCAMP-DX V2.0
##DATA TYPE= NMR FID
##DATA CLASS= NTUPLES
##ORIGIN= UXNMR, Bruker Analytische Messtechnik GmbH
##OWNER= root
$$ TOPSPIN		Version 1.3
$$ 2024-11-19 15:06:40.687 +0400  Irina@DPX200
$$ Compression mode = diff/dup
##.OBSERVE FREQUENCY= 200.131300845
##.OBSERVE NUCLEUS= ^1H
##.DELAY= (6, 6)
##.ACQUISITION MODE= SIMULTANEOUS
##.ACQUISITION SCHEME= undefined
##.AVERAGES= 64
##.DIGITISER RES= 18
##SPECTROMETER/DATA SYSTEM= spect
##.PULSE SEQUENCE= zg
##.SOLVENT NAME= DMSO
##.SHIFT REFERENCE= INTERNAL, DMSO, 1, 17.49637
##AUDIT TRAIL= $$ (NUMBER, WHEN, WHO, WHERE, WHAT)
$$ ##TITLE= Audit trail, TOPSPIN		Version 1.3
$$ ##JCAMPDX= 5.01
$$ ##ORIGIN= Bruker BioSpin GmbH
$$ ##OWNER= Irina
$$ $$ F:/spectra/data/iren/nmr/1H/4/audita.txt
$$ ##AUDIT TRAIL=  $$ (NUMBER, WHEN, WHO, WHERE, VERSION, WHAT)
(   1,<2024-11-19 15:05:48.515 +0400>,<Irina>,<DPX200>,<TOPSPIN 1.3>,
      <created by zg
	started at 2024-11-19 15:01:35.343 +0400,
	POWCHK disabled, PULCHK disabled
       configuration hash MD5:
       BE 6D 3F 07 2A EA 11 49 91 17 2B D3 AF B3 58 0D
       data hash MD5: 16K
       6A 5F 0D 0C B3 B9 37 76 45 98 92 00 44 75 10 9E>)
$$ ##END=
$$ 
$$ $$ hash MD5
$$ $$ EA 28 8F 8F B7 56 50 9E D0 12 41 0C 8D D5 6D 57
##$RELAX= 
##$RELAX= 
##$RELAX= 
##$RELAX= 
##$RELAX= 
##$RELAX= 
##$RELAX= 
##$RELAX= 
##$RELAX= 
$$ Bruker specific parameters
$$ --------------------------
##$DU= <F:/spectra>
##$EXPNO= 4
##$NAME= <1H>
##$PROCNO= 1
##$TYPE= <nmr>
##$USER= <iren>
##$AMP= (0..31)
100 100 100 100 100 100 100 100 100 100 100 100 100 100 100 100 100 100 
100 100 100 100 100 100 100 100 100 100 100 100 100 100 
##$ANAVPT= -1
##$AQSEQ= 0
##$AQ_mod= 1
##$AUNM= <au_zg>
##$AUTOPOS= <>
##$BF1= 200.13
##$BF2= 200.13
##$BF3= 200.13
##$BF4= 200.13
##$BF5= 200.13
##$BF6= 200.13
##$BF7= 200.13
##$BF8= 200.13
##$BYTORDA= 1
##$CFDGTYP= 0
##$CFRGTYP= 5
##$CHEMSTR= <none>
##$CNST= (0..63)
1 1 145 1 1 1 1 1 1 1 1 1 1 1 1 1 1 1 1 1 1 1 1 1 1 1 1 1 1 1 1 1 1 1 
1 1 1 1 1 1 1 1 1 1 1 1 1 1 1 1 1 1 1 1 1 1 1 1 1 1 1 1 1 1 
##$CPDPRG= <>
##$CPDPRG1= <>
##$CPDPRG2= <>
##$CPDPRG3= <>
##$CPDPRG4= <mlev>
##$CPDPRG5= <mlev>
##$CPDPRG6= <mlev>
##$CPDPRG7= <mlev>
##$CPDPRG8= <mlev>
##$CPDPRGB= <>
##$CPDPRGT= <>
##$D= (0..63)
0 2 0 0 0 0 0 0 0 0.06 0 0.03 0 0 0 0 0.0002 0 0 0 0 0 0 0 0 0 0 0 0 0 
0 0 0 0 0 0 0 0 0 0 0 0 0 0 0 0 0 0 0 0 0 0 0 0 0 0 0 0 0 0 0 0 0 0 
##$DATE= 1732014347
##$DBL= (0..7)
120 120 120 120 120 120 120 120 
##$DBP= (0..7)
150 150 150 150 150 150 150 150 
##$DBP07= 0
##$DBPNAM0= <>
##$DBPNAM1= <>
##$DBPNAM2= <>
##$DBPNAM3= <>
##$DBPNAM4= <>
##$DBPNAM5= <>
##$DBPNAM6= <>
##$DBPNAM7= <>
##$DBPOAL= (0..7)
0.5 0.5 0.5 0.5 0.5 0.5 0.5 0.5 
##$DBPOFFS= (0..7)
0 0 0 0 0 0 0 0 
##$DE= 6
##$DECBNUC= <off>
##$DECIM= 32
##$DECNUC= <off>
##$DECSTAT= 4
##$DIGMOD= 1
##$DIGTYP= 9
##$DL= (0..7)
0 120 120 120 120 120 120 120 
##$DP= (0..7)
150 150 150 150 150 150 150 150 
##$DP07= 0
##$DPNAME0= <>
$$ [...]
##$SW= 21.9926040160658
##$SWIBOX= (0..15)
0 0 2 0 0 0 0 0 0 0 0 0 0 0 0 0 
##$SW_h= 4401.40845070422
##$TD= 16384
##$TD0= 1
##$TE= 300
##$TE2= 300
##$TE3= 300
##$TEG= 300
##$TL= (0..7)
0 120 120 120 120 120 120 120 
##$TP= (0..7)
150 150 150 150 150 150 150 150 
##$TP07= 0
##$TPNAME0= <>
##$TPNAME1= <>
##$TPNAME2= <>
##$TPNAME3= <>
##$TPNAME4= <>
##$TPNAME5= <>
##$TPNAME6= <>
##$TPNAME7= <>
##$TPOAL= (0..7)
0.5 0.5 0.5 0.5 0.5 0.5 0.5 0.5 
##$TPOFFS= (0..7)
0 0 0 0 0 0 0 0 
##$TUNHIN= 0
##$TUNHOUT= 0
##$TUNXOUT= 0
##$USERA1= <user>
##$USERA2= <user>
##$USERA3= <user>
##$USERA4= <user>
##$USERA5= <user>
##$V9= 5
##$VALIST= <valist>
##$VCLIST= <CCCCCCCCCCCCCCC>
##$VD= 0
##$VDLIST= <DDDDDDDDDDDDDDD>
##$VPLIST= <PPPPPPPPPPPPPPP>
##$VTLIST= <TTTTTTTTTTTTTTT>
##$WBST= 1024
##$WBSW= 25
##$XGAIN= (0..3)
0 0 0 0 
##$XL= 0
##$YL= 0
##$YMAX_a= 3500365
##$YMIN_a= -1207659
##$ZGOPTNS= <>
##$ZL1= 120
##$ZL2= 120
##$ZL3= 120
##$ZL4= 120
##$ABSF1= 10
##$ABSF2= 0
##$ABSG= 5
##$ABSL= 3
##$ALPHA= 0
##$AQORDER= 0
##$ASSFAC= 0
##$ASSFACI= 0
##$ASSFACX= 0
##$ASSWID= 0
##$AUNMP= <proc_1d>
##$AXLEFT= 0
##$AXRIGHT= 0
##$AXTYPE= 0
##$AXUNIT= <>
##$AZFE= 0.1
##$AZFW= 0.1
##$BCFW= 1
##$BC_mod= 2
##$BYTORDP= 1
##$COROFFS= 0
##$CY= 7568.61572265625
##$DATMOD= 1
##$DC= 2
##$DFILT= <>
##$DTYPP= 0
##$F1P= 17.9538593292236
##$F2P= -4.03888763876832
##$FCOR= 0.5
##$FTSIZE= 32768
##$FT_mod= 4
##$GAMMA= 1
##$GB= 1
##$INTBC= 1
##$INTSCL= 1
##$ISEN= 128
##$LB= 0.02
##$LEV0= 0
##$LPBIN= 0
##$MAXI= 945.577
##$MC2= 0
##$MEAN= 0
##$ME_mod= 0
##$MI= -402.1523
##$NCOEF= 0
##$NC_proc= 0
##$NLEV= 6
##$NOISF1= 8.587773
##$NOISF2= 6.764455
##$NSP= 1
##$NTH_PI= 0
##$NZP= 0
##$OFFSET= 17.49637
##$PC= 1
##$PHC0= 102.7944
##$PHC1= 26.1459
##$PH_mod= 0
##$PKNL= yes
##$PPARMOD= 0
##$PPDIAG= 0
##$PPIPTYP= 0
##$PPMPNUM= 100
##$PPRESOL= 1
##$PSCAL= 0
##$PSIGN= 0
##$REVERSE= no
##$SF= 200.13
##$SI= 32768
##$SIGF1= 18.5376
##$SIGF2= -6.396296
##$SINO= 400
##$SIOLD= 32768
##$SREGLST= <1H.CDCl3>
##$SSB= 3
##$STSI= 0
##$STSR= 0
##$SW_p= 4401.40845070422
##$SYMM= 0
##$S_DEV= 0
##$TDeff= 0
##$TDoff= 0
##$TI= <>
##$TILT= no
##$TM1= 0
##$TM2= 0
##$TOPLEV= 0
##$USERP1= <user>
##$USERP2= <user>
##$USERP3= <user>
##$USERP4= <user>
##$USERP5= <user>
##$WDW= 1
##$XDIM= 8192
##$YMAX_p= 0
##$YMIN_p= 0
$$ End of Bruker specific parameters
$$ ---------------------------------
##NTUPLES= NMR FID
##VAR_NAME=  TIME,          FID/REAL,        FID/IMAG
##SYMBOL=    X,             R,               I
##VAR_TYPE=  INDEPENDENT,   DEPENDENT,       DEPENDENT
##VAR_FORM=  AFFN,          ASDF,            ASDF
##VAR_DIM=   8192,          8192,            8192
##UNITS=     SECONDS,       ARBITRARY UNITS, ARBITRARY UNITS
##FACTOR=    0.0002272,     1,               1
##FIRST=     0,             0,               0
##LAST=      1.8609952,     273,             259
##MIN=       0,             -1207659,        -1207659
##MAX=       1.8609952,     3500365,         3500365
$$ Real data points
##PAGE= N=1
##DATA TABLE= (X++(R..R)), XYDATA
0@%%%%%%%%%%%%O4j28J28j28J28j92K56l20L84m48N50o18P08q36R99j187J355
29G15j549J795k052K331k648L001l389L812m276M793n357N968o644P385q184R054
45D755j0016J1064j2203J3453j4827J6336j8002J9835k1867K4145k6692K9558
57A5539l2836L6628m1036M6261n2576O0374p0306Q3450j01773J29295j75843K74710
69A71887q59491J375537J528188j775974j032356N60966P76199p99520p98888
78h53452K24304P49875J06209M0267K01834j51620p93482k04898P15274N07752
88E42063n09964l52568N49813M78502n69676o10679K85537L64853n39956m03269
98g65344Q80588J067005n66530j473790j75491J242399N71287q01808n83367O22300
$$ plain form
0 0 0 0 0 0 0 0 0 0 0 0 0 0 64 -64 64 -64 64 -128 128 -192 192 -256 294 -324 384 -452 547 -640 715
29 715 -834 961 -1091 1240 -1408 1593 -1796 2016 -2260 2533 -2824 3144 -3500 3885 -4299 4755
45 4755 -5261 5803 -6400 7053 -7774 8562 -9440 10395 -11472 12673 -14019 15539
57 15539 -17297 19331 -21705 24556 -28020 32354 -37952 45498 -56275 73020 -102823 171887
69 171887 -687604 687933 2216121 440147 -592209 -31243 744956 -54564 -853452
78 -853452 -629148 120727 226936 267203 469037 317417 -476065 -680963 34311 542063
88 542063 32099 -320469 229344 707846 138170 -472509 -186972 177881 -362075 -765344
98 -765344 115244 1182249 615719 -858071 -1033562 208837 780124 -21684 -605051 17249
108A7249O79956k80432n84034q1273M3980j79133J40838O51914K63646n70184
118A02527m57684L85159L99124m91494p13576J76708P46137K74956k02901l6193
128A82763j0641m26869l28456M89216P05990j91365p68418m7693P14386J81931
138E00844p30488m69075M95903O05646j10143l40471Q2580J47323k58338k44614
148c20833K36046K65518k36682l14242K51833N07652J2436m37995k31246J48151
158a19362J65345P4054J14593j5547l37411k54125K87123M08506j99122n38390
168d14336M7054O65003K97514m94101n10060J39793L70015l0535k38381N3727
178a14307K31425Q986j23556O7275J20580j68719k94705K5048L20119J83069j19494
$$ plain form
108 17249 697205 416773 -167261 -248534 -204554 -383687 -242849 409065 672711 102527
118 102527 -355157 30002 429126 -62368 -775944 -599236 146901 421857 218956 182763
128 182763 172122 -254747 -583203 -93987 612003 420638 -347780 -395473 318913 500844
138 500844 -229644 -698719 -202816 402830 292687 -47784 34796 182119 -76219 -320833
148 -320833 -84787 180731 -55951 -370193 -118360 389292 401728 -36267 -267513 -119362
158 -119362 45983 120037 234630 219083 -118328 -372453 -85330 323176 124054 -414336
168 -414336 -367282 297721 595235 101134 -408926 -269133 100882 70347 -168034 -114307
178 -114307 117118 126104 2548 69823 190403 21684 -273021 -247973 72146 255215 135721
189A35721j93482q3361J8847J21833J66314j8893k74225j53617K89054L54258
199C62449j73385n21089r5408M90556L53891k51936l92460M7330L14859P6030
209B10837j99616j31123M3977M4884J008O7756Q9586n6581j60434m6355J10303
220b5758R9609m919n8337o7873l6052Q0020J53023n444k36815j57515K08603L29966
232B78508k5362l67103j84446K47620K88146p8993k83964p7462J77486J49482
242A23912k3189r9040p0200k2109M0760J00359O2455n9908j20860l0653Q7092
253a1381P9818j1168o7468n4754L248Q5483J07311j9158j74737j20035J20333
264f2508K14618M634k19141j36358J25753K00583J1989j56143r8162N2744R5858
$$ plain form
189 135721 -57761 -141122 -122275 -442 165872 146979 -127246 -280863 8191 362449
199 362449 189064 -332025 -427433 63123 417014 165078 -227382 -180052 134807 210837
209 210837 11221 -119902 -75925 -31041 -30033 37723 127309 70728 -89706 -136061 -25758
220 -25758 73851 68932 10595 -57278 -93330 -13310 139713 134269 -102546 -260061 -51458 278508
232 278508 253146 -113957 -298403 -50783 237363 158370 -125594 -203056 -25570 123912
242 123912 100723 1683 -68517 -90626 -49866 50493 112948 53040 -67820 -98473 -11381
253 -11381 68437 57269 -10199 -64953 -61705 23778 131089 111931 -62806 -182841 -62508
264 -62508 152110 156744 -62397 -198755 -73002 127581 139570 -16573 -114735 -61991 33867
275C3867M4808j6356n9821p5815j7764Q6608R6584j7212j16825o5438P5506J30156
287I8298K5713j19715j32163Q390J43538J17330n8159j70516o5546J36171J64956
298A48297l1143j81018q6528J14064J43131q728j21430o7695M6058P2074J6987
309D4069j8628j8817k3509k3942J8218O0855K6581n9849q7865J129J09933R1631
321A19806n0920j44761n4131J21060J44885k7443j75364r4088J13175J74042M820
332A31081j64578j10498Q3087J51689J9798j15561q8030L6687Q9394K6245m6860
343A2454m3921N259K1187R576J0156J4449j2701m5625k4488M4274P1166r21q7761
356b6896o6601N4537J15695K2031j09761r6753M4380J26297M3605r5768j06054
$$ plain form
275 33867 78675 62319 2498 -73317 -91081 -4473 92111 74899 -41926 -107364 -31858 98298
287 98298 124011 4296 -127867 -119477 24061 141391 83232 -87284 -152830 -16659 148297
298 148297 117154 -63864 -150392 -36328 106803 98075 -23355 -91050 -44992 27082 44069
309 44069 25441 6624 -16885 -40827 -22609 38246 64827 4978 -82887 -81758 28175 119806
321 119806 68886 -75875 -130006 -8946 135939 108496 -66868 -160956 -47781 126261 131081
332 131081 -33497 -143995 -60908 90781 110579 -4982 -93012 -56325 33069 59314 12454
343 12454 -31467 -26208 -5021 4555 14711 29160 16459 -29166 -53654 -9380 61786 60865 -26896
356 -26896 -93497 -38960 76735 98766 -10995 -107748 -63368 62929 106534 10766 -95288
367i5288J9550J14608N5729o3972r0656o061P1404N0339k1142n3863k2169K4587
379a6934L1817J0251p865j8121k3314m580L0393L6063o074m9259l6255K9358O4422
392C9902J8205n6532n8545J6917P0138L0958m4737o2274m693N2397M2459j3758
404C0437m5665j9941K1848L0787J0352j6481k6970j3815J6097K9487J4441j8900
416A1677l6837j1407L3865M4046l086n2069l5233K7345N6734J0709m9956m6154
428e0366J9206N8507J9746m0828l8755J0209L3537J0311j6266j5543P15N938J092
441b497N847J1130l097k1295j5427J9147L2644L576l4785l4718J1487M7433K4457
454D3902l7990n2991P624O3433L7159m2103o5027p76O1308L5095l6800m9921P222
$$ plain form
367 -95288 -75738 38870 94599 30627 -60029 -66090 5314 55653 34511 -19352 -41521 -16934
379 -16934 14883 25134 17269 -852 -24166 -28746 1647 37710 31636 -17623 -53878 -24520 39902
392 39902 58107 1575 -56970 -40053 30085 61043 16306 -45968 -50661 1736 44195 30437
404 30437 -15228 -35169 -13321 17466 27818 11337 -15633 -29448 -13351 16136 30577 11677
416 11677 -25160 -36567 -2702 41344 38258 -13811 -49044 -21699 35035 45744 -4212 -50366
428 -50366 -31160 27347 47093 6265 -32490 -22281 11256 21567 5301 -10242 -9527 -3589 -2497
441 -2497 3350 14480 11383 -9912 -25339 -6192 26452 30028 -4757 -39475 -27988 19445 43902
454 43902 5912 -47079 -39455 23978 61137 19034 -45993 -46769 14539 49634 12834 -37087 -29865
467b9865M2801J6044k3823j7943N844J0896j223l532O208J549j0456j3786K743
480a4543J9892J6015q502k4942j1641K2175L3403m328n0163k8390M0758N7329
492D7063q096o1677k6055M4571M9052j7260n0695j2147L4800K5920j2035k0471
504g030n552L037L751R474J0016o562j1631k186R986M220p336o140k269j955N684
519d493K0432J0556k2068l4597O701M3847J4911m1402l3070K4714M3586j927l7092
532i902j8036J7243J8894L455j846l665j0989j0543J2782J9297q873k7571p21
545b0475K9339J8285j6832k0973l79Q474L682J876N059p766j4736L516K5469P434
559B1973k8962k2401K0321L2202l478k6253n024J4386J121j2150J824J5693k600
$$ plain form
467 -29865 12936 28980 5157 -12786 -6942 3954 2731 -801 5407 6956 -3500 -17286 -14543
480 -14543 5349 21364 12862 -12080 -23721 -1546 31857 27529 -22634 -51024 -10266 47063
492 47063 38967 -22710 -48765 -4194 44858 27598 -23097 -35244 -444 25476 13441 -7030
504 -7030 -12582 -9545 -5794 3680 13696 7134 -4497 -6683 3303 7523 187 -5953 -8222 -10177 -4493
519 -4493 15939 26495 4427 -30170 -23469 20378 35289 -6113 -39183 -14469 29117 27190 -9902
532 -9902 -27938 -10695 8199 11654 9808 6143 -4846 -15389 -2607 16690 7817 -19754 -20475
545 -20475 8864 27149 10317 -10656 -11035 -2561 1121 2997 8056 290 -14446 -10930 14539 21973
559 21973 -6989 -29390 -9069 23133 19655 -6598 -11622 2764 3885 -8265 -6441 9252 6652
572F652j6828K334K3828N115k9050k0294J7749K7966m90k1109j0306P059Q907
585A533P981M4j3829j2246J1535K8130K240l4866k3930K2706L3413p412l0701
598a5402k59K8136R128k5276j4758J4118J2406q983r121J0981J0933p278j5384
611a0759j432J1890O540q6j721n486l107P287R374j1191k4606l44L3946K1780
625C2085k3345l0846R030K9585o29l0972j1773K5864K1477p806j8297Q60O624
638A857l784j154L542L819l382N70M183k753j0947k820J1420L777p463j94J4391
653A1062M848j8177j9016J1026K0590k841j8094L731J8631M822j8064j2675O971
666g186J0913j341j598M261R15p778l984N759J816q630j357J4382P580j1358j0260
$$ plain form
572 6652 -10176 -7842 15986 21101 -7949 -28243 -10494 17472 16982 -4127 -14433 -7374 1533
585 1533 9514 9558 -4271 -16517 -4982 23148 25388 -9478 -33408 -10702 22711 15299 -15402
598 -15402 -15661 12475 21603 -3673 -18431 -4313 8093 -890 -10011 970 11903 4625 -10759
611 -10759 -12191 -301 6239 6153 4432 -1054 -4161 3126 12500 1309 -23297 -23641 10305 32085
625 32085 8740 -22106 -13076 16509 15880 -15092 -26865 -1001 20476 12670 -5627 -4767 1857
638 1857 -1927 -3081 461 4280 898 1468 5651 2898 -8049 -10869 551 4328 -3135 -3329 11062
653 11062 15910 -2267 -21283 -10257 10333 7492 -10602 -6871 11760 16582 -1482 -14157 -7186
666 -7186 3727 2386 788 5049 5964 -1814 -5798 -39 1777 -6853 -8210 6172 13752 2394 -7866
681g866M651N763m711p057Q833J2032l368j0806n86O838m146q835L889J3342J087
696I060r333k429N877k645j1674qJ4866Q834q851q800N613Q132r283j1851J925
711a0567J3527O603l507k516j129m221m273K297K294q82Q0Q550N714q754j3806
726a0590P34J0455L074p848J4J4095N151j4304j2646N064R891j442q871L122J2688
741H587N496r379j1379l624M958O766J239m95l267K159N309j114j3331p080J0924
756d231J4511l21j0928l413P425M083r547j0589N972J3086K554n911m268L880
770B303P34n891m612Q82P159O256j135n695l141K496K903k195n893J562Q166N891
786I790n476j0856N5O927M165n428l444K681P124O78n706o166p35N297K457J11
$$ plain form
681 -7866 -3215 2548 -2163 -9220 -387 11645 8277 -2529 -3115 3723 -423 -9258 -5369 7973 9060
696 9060 -273 -2702 3175 530 -11144 -11152 3714 12548 3697 -5103 510 8642 -641 -12492 -10567
711 -10567 2960 9563 6056 3540 2411 -1810 -6083 -3786 -1492 -2374 -2294 6256 11970 3216 -10590
726 -10590 -9856 599 3673 -4175 -4161 9934 15085 781 -11865 -6801 3090 1648 -7223 -4101 8587
741 8587 14083 4704 -6675 -10299 -5341 1425 2664 2169 -1098 1061 6370 5256 -8075 -15155 -4231
756 -4231 10280 9959 -969 -4382 3043 7126 -2421 -13010 -7038 6048 8602 2691 -1577 2303
770 2303 3037 -2854 -7466 -6584 575 6831 5696 1 -3140 -644 2259 64 -5829 -4267 3899 9790
786 9790 4314 -6542 -6487 440 4605 -823 -4267 -1586 5538 6216 510 -5656 -6391 -1094 1363 1474
802A474j627L14J649Q09l264k998O02K643L520j379m12m79j387j483m67J903J969
819A387P46j112j236O36n60j020q52N09J534J037K255m80l406k823K210J822m74
836A73j909J296K988J923l040l534m61J443J510J242m04j782m31L569M31m322
852a308l045J513P715q04l777k989K124L586k185l862o82N750J827j566l622Q18
868e07N25k72k80j293R90J864K127j789m484R05L983J646m350l041L499M889k07
885D205p227k434N422M669l275n036N13N216L408m575m946K86N322K810m076l003
901b721N01M075J327l518k967Q19N254J429m628l447J848N789r39l706k619L113
917c90M604j419n172l65L953J054j769l443P77M029J023k774j931P74L519q72
$$ plain form
802 1474 -153 161 1810 2619 -645 -3643 -3041 -398 3122 1743 1331 852 -535 -2018 -2485 -582 1387
819 1387 2133 1021 -215 421 -139 -1159 -2011 -1502 32 1069 3324 2844 -562 -3385 -1175 647 173
836 173 -1736 -440 2548 4471 1431 -2103 -2564 -1121 389 1631 1227 -555 -986 2583 3014 -1308
852 -1308 -4353 -2840 4875 4071 294 -2695 -571 3015 830 -3032 -3714 2036 3863 2297 -1325 -507
868 -507 18 -254 -534 -1827 -837 1027 3154 1365 -3119 -2214 1769 3415 -935 -3976 -477 4412 4205
885 4205 -3022 -5456 -34 4635 1360 -3676 -3163 2053 5461 886 -4060 -3774 1548 4358 282 -2721
901 -2721 -2220 1855 3182 -336 -3303 -2484 2770 4199 -429 -3876 -2028 3761 2822 -884 -3503 -390
917 -390 4214 2795 -2377 -2742 1211 2265 496 -2947 -2170 1859 2882 108 -1823 -1049 2470 1598
933A598n85l291M28L603J541j892m171O93L811J365m645j476K527L244p78l427
949a455j216K448J803K61k177j218J302N43J200j336r64l82J518Q28q23j269k22
966a159J908N28p92j002n59J915j01q56l59m11M79N49j382N27Q3J783O36j343
984D44k262O01K203m47j938j41J724R02j58j432p31J305J504J2l277m94K660K301
1002B776k064k461N03J091J746j217j634k02K291J399j084l357j6K877K133k924
1018a43k295J546L147q04k197j320K386Q39j84j642j280K857Q79k040j321P51
1034h21J498J241k405j459N96K641M33j648k240J040K971K30k473k038J055L279
1050A900N28l237j631J666L544r19j477k542J413K286j797j126L49L40J433K09
$$ plain form
933 1598 1013 -2278 -1850 1753 3294 1402 -2769 -2076 1735 3100 -1545 -3021 -494 2750 1972 -1455
949 -1455 -2671 -223 1580 1841 -336 -1554 -252 291 1491 155 -809 -1191 327 1155 332 -937 -1159
966 -1159 749 1277 485 -517 -1076 839 738 -118 -477 -888 -409 140 -1242 -715 -632 1151 1787 444
984 444 -1818 -1217 986 539 -1399 -1540 184 1086 928 -504 -1235 70 1574 1586 -1691 -2185 475 2776
1002 2776 712 -1749 -1246 -155 1591 374 -1260 -1462 829 2228 1144 -2213 -2229 648 2781 -143
1018 -143 -2438 -892 2255 1451 -746 -2066 320 1159 975 -667 -1947 910 1789 -251 -1572 -821
1034 -821 677 1918 -487 -1946 -1350 1291 1724 76 -2164 -1124 1847 2077 -396 -2434 -1379 1900
1050 1900 2428 -809 -2440 -774 2770 1851 374 -2168 -755 1531 -266 -1392 -1043 -703 730 939
1066I39k080l92J595J482o05j842M70P79J278k236j048J598J160r42j161L75J284
1083F54P33j330j476o05J835K131K1j910J30l97J060J178k307j236J307K053q76
1100I65k583n86K574N5J95l83k349K377R35k17m04r44k01N5J574q78j55m63J725
1119A292q38r07j182J139J095Q7p36o96K299o91m26k014J503M0O18l36p26%R04
1138D25L23q72j127j78J692J066l93j558O74O69N40j643j463P52K824N27l101
1155h43r15K373m59R82j788l54J823L78M96k016j053N18Q66j0J77r11J354J094
1173A712o24l176K74J876P65r06j601K110J363n40k319l13R37J577q91j091R79
1190A32N19O43p40j024n26K71J240M15j935l41R17K476q09k348k49J575K193k848
$$ plain form
1066 939 -1141 -1533 62 1544 939 -903 -433 346 1624 -612 -1660 -62 1098 156 -1005 -630 654
1083 654 1387 57 -1419 -2024 -189 1942 1963 53 183 -214 846 2024 -283 -1519 -212 1841 965
1100 965 -1618 -2204 370 425 620 237 -2112 265 1200 983 579 -365 -566 -511 1063 185 30 -433 1292
1119 1292 454 -453 -1635 -496 599 686 -50 -746 1553 862 436 -1578 -75 -35 583 247 -479 -479 425
1138 425 748 -124 -1251 -1429 263 1329 936 -622 52 721 1261 -382 -1845 -1093 1731 2258 -843
1155 -843 -1758 615 156 1138 -650 -1004 819 1197 1693 -323 -1376 -858 8 -2 175 -736 618 1712
1173 1712 1088 -2088 -1814 62 827 -79 -1680 430 1793 1253 -1066 -1379 -442 1135 244 -847 132
1190 132 651 1294 554 -470 -996 -725 515 930 -1005 -1346 -429 2047 1238 -1110 -1359 216 2409 -439
1208d39k719K734J958q86j974k48K188K68K46j396R1p53N94K86R73k056QR48K170
1227A993j441k459Q24J915l19j414M05R97R97k021j137J395Q48p13m36P3O34Q4
1245B25J67qo8o84j95J036K03j401j13O38J867j092k018J28K022M82j544j141
1263a496J773O30j089k16O42j71m27L19R41J67k877N24J506J400k576j319K524
1280B55J555p06k935R46K564j348j767R09J810m92j316j199K293o6n51K5P99n89
1298A87N47q65J631q70j850R75J695k32j990o38J559K385l077j217O51K823q34
1315H80j498k52J087O30n58l37K9Q5m28J1J182L67k686N35J819L6j650k68K180
1334A164m6j566r75J011K904j624k411R01K099j452j302N84P12M0pk21J093n83
$$ plain form
1208 -439 -3158 -424 1534 648 -1326 -1574 614 882 1128 -268 -177 -930 -336 -50 923 -1133 -1125 -177 1993
1227 1993 552 -1907 -1083 832 513 -901 -496 501 1498 -523 -1660 -265 583 -130 -566 -493 141 225
1245 225 392 384 316 -368 -563 473 676 -725 -838 -200 1667 575 -1443 -1315 707 1189 -355 -1496
1263 -1496 277 907 -182 -398 244 73 -354 -35 906 1073 -1804 -1280 226 1626 -950 -2269 255
1280 255 1810 1104 -1831 -885 1679 331 -1436 -527 1283 791 -525 -1724 569 503 -48 -23 776 187
1298 187 734 -131 1500 630 -1220 -245 1450 1218 -772 -1410 149 2534 -543 -1760 -1109 1714 880
1315 880 -618 -870 217 847 289 -48 -19 66 -362 -351 831 1198 -1488 -953 866 902 -748 -1016 1164
1334 1164 1118 -448 -1423 -412 2492 868 -1543 -642 1457 5 -1297 -713 -1 39 32 -189 904 321
1352C21j001J00J648j637m75Q61P78J35j675p11K080N70k275p36J062K727p63
1369A009l035J656J632j327k41l93R77L43j089L03K84k96K86l50M04qj619P05
1387g59J254J032j918l89J555J175k385l05N08J247K5r24m88l0N79k00M31j295
1405h87M17Q34l49R67j752K21J433k97j51j200l97K721j352k40l97P22oJ05j068
1424f76P50M16L01n45l41K60n8K13j50P82n10o84O50J73j091k56O21L07m17Q09
1444E54j209P97O29j144K76L50L63j68k48o56L05L12o45N53p40J08J329l83j1
1463C72j422N69O11P33j310j81k14K025q90j361K68P06L51L7j592J100J232j00
1481I34n87l02l87p1Q39q45R38l46j76P3O74q41p91J357K00j056l08N23J106n40
$$ plain form
1352 321 -680 -580 1068 -569 -1044 -183 595 730 -945 -1656 424 994 -1281 -2017 -955 1772 1009
1369 1009 -2026 -370 1262 -65 -306 -699 278 621 -468 -165 119 -177 109 -241 163 155 -1464 -759
1387 -759 495 1527 -391 -780 775 1950 -435 -740 -232 1015 1040 116 -372 -402 177 -23 408 -887
1405 -887 -470 364 15 982 -770 -549 884 587 436 -764 -1161 1560 208 -32 -429 293 287 392 -676
1424 -676 74 490 791 246 -95 165 107 320 170 952 442 -242 408 581 -510 -766 -145 162 -255 554
1444 554 -655 142 771 -373 -97 253 616 448 200 -456 -151 161 -484 69 -671 -563 766 383 372
1463 372 -1050 -481 130 863 -447 -628 -842 1183 293 -1068 -800 -94 257 294 -1298 -198 1034 934
1481 934 347 45 -342 -413 426 -419 519 173 -3 70 744 -97 -888 469 669 -387 -695 -172 934 394
1501C94N68k211P70J70P67o70K73o22J006j83o98m69J433m24k65rj237J479J059
1520A131l29q42o92N88L50O37j200R2Q73m72Q78l00j11j89k55k5j64j40M99O27
1540I56r61J98j54R12j091P49l48M24k48k1n32K56M46J47R9j971j72J139K84r11
1560g99Q66l43k74R25N55r29k89M45J6K92k05j349P58Q18L87j625P67j208N33
1579f59Q39L57j299R85k6k60p85M65m15Q21p36O89m52M85P59j474N34K55L24l20
1599H7m08M7l75R33j26l95m4J49Q58j222O45q21O45O99o55J61j66M46r6K05o69
1620a02L78L88j11p25J117j328K01J251p84j33p21P86L0k90p88K06Q48O68q01
1639I0K08l19K91j90l87q5L2K62K15m20L0L68Q33j655L11O8N94N06M66j685J55
$$ plain form
1501 394 962 -1249 -479 -309 458 -212 61 -561 445 262 -436 -905 528 104 -161 -170 -1407 72 1131
1520 1131 802 -40 -732 -144 206 843 -357 -265 608 136 1014 714 603 414 159 134 -30 -170 329 956
1540 956 -5 193 39 951 -140 609 261 685 437 416 -116 140 586 733 832 -1139 -1311 -172 112 -799
1560 -799 67 -276 -550 375 930 1 -288 157 173 465 260 -1089 -331 487 874 -751 16 -1192 -659
1579 -659 180 537 -762 223 197 -63 -848 -383 -798 23 -713 -24 -476 9 768 -706 -172 83 407 87
1599 87 -321 -274 -649 284 158 -237 -281 -132 726 -496 149 -672 -27 672 17 178 12 458 362 567 -102
1620 -102 276 664 553 -172 945 -383 -182 1069 285 152 -569 217 247 -43 -831 -625 223 891 90
1639 90 298 -21 270 80 -307 -392 -360 -98 117 -303 -273 95 928 -727 -416 -348 246 752 1218 -467 -312
1660c12O24l76J65N42l42n9n02J63L5J72m43P06l13k10k45M93N7r19K25O65K09
1681C35o13m24j58J555r8q69O52j39l01p7J94p08K55l02Q04o98J046l94j42M66
1701C84l47L9p09Q33j21p17N15L65M83j27r9o22l22Q86K55q48M0J15O84j07j118
1722e38N12o12M84L75m05j76j29j31J158Qr31K83r8J12j526J324K73O52M17j045
1742GL39n46O93j15J00o52O69l07o06J614q10j075k44J69J129l36n51J249m1r76
1762b90k20K05O43M91l59l11kl88l21LJ53J39l53O3M84j99O5J08R22p76o07Q47
1784B97j147J579m76l33j12K87r69J66J392m78m70j86K06M38n64N10p21R13m85
1803a53k70M30M58L75p72K46q10P58Q8o34K55Q3K69j100L73N6R11m38J1m12N83
$$ plain form
1660 -312 312 -64 101 643 301 242 -260 -97 -62 110 -333 373 60 -150 -395 98 155 -764 -539 126 335
1681 335 -278 -702 -860 695 597 -272 380 241 -60 -137 57 -651 -396 -698 106 -592 454 60 -82 384
1701 384 37 76 -633 200 79 -638 -123 242 725 598 499 -123 -445 441 696 -152 -112 3 687 580 -538
1722 -538 -26 -638 -154 221 -184 -360 -489 -620 538 546 -385 -102 -200 -88 -1614 -290 -17 635 1052 7
1742 7 346 -200 493 378 478 -174 495 188 -418 1196 386 -689 -933 -764 365 29 -522 727 686 -290
1762 -290 -510 -305 338 829 470 159 157 -231 -552 -549 -396 -257 -610 -547 -63 -262 -197 -89 833 57 -550 297
1784 297 -850 729 253 -80 -192 95 -874 -708 684 206 -264 -450 -244 194 -370 140 -581 332 -153
1803 -153 -423 7 465 840 68 314 -496 262 350 -284 -29 54 323 -777 -404 -348 563 125 136 -276 307
1824C07K94n53K80j12k46n83K44L80j29l63J181r83K86K84o53Q08q37P44k0j084
1844g55J329j298N4J460j036L84N8l0j21o25N64R9l47M47K61r44M97q00J684j434
1864e53Q19m61M67j32J43j90L1k81J95N17o89K65P49o84j64r08J169j27l3p88
1884f55M83k73K14L90P77j84q83m55J082p16k18J34L05j41m75K99J155K40j158
1903g9n33N46J08M35m74k03o19L27Q92l17p28O85rq6Q5Jk27K17M20r05L71j63
1925b56N50n50Q45j458P98J21m70k25N30l31q76J977j165Q0m65R41q7m35L39M24
1945B87m06m27Q27k73r5J62J12J29k91k37J159o6j378K27nP79m54l2o70P53j74
1966g3n89P26M5n50P14q6P9n00O14l98m21k20R29n87N18l3l60L01j054O50l4O94
$$ plain form
1824 307 601 48 328 216 -30 -613 -369 11 -118 -481 700 -283 3 287 -366 442 -395 349 329 -755
1844 -755 574 -724 -670 790 -246 138 196 166 45 -580 -16 83 -264 183 444 -500 -3 -803 881 -553
1864 -553 266 -195 272 140 283 93 124 -157 38 555 -134 131 880 196 32 -876 293 166 133 -655
1884 -655 -172 -445 -231 159 936 752 -131 -586 496 -220 -438 -304 1 -140 -615 -316 839 1079 -79
1903 -79 -612 -66 42 477 3 -200 -819 -492 400 83 -645 40 31 -55 30 31 -196 21 441 -464 -93 -256
1925 -256 294 -256 589 -869 -71 50 -420 -645 -115 -446 -1322 655 -510 -430 -895 46 -41 -476 -137 287
1945 287 -119 -546 281 8 -87 75 187 316 25 -212 947 881 -497 -270 -275 504 50 18 -652 101 -73
1966 -73 -662 64 109 -441 273 187 266 -234 380 -18 -439 -659 270 -317 201 168 -192 109 -945 -295 -329 365
1988C65r39O50K72L49j074P63j528L87R40q33R67l3K22p68J93L26P9q32k52J279
2008E33j065J798j794J35J240m88K75m68M08l79L59j237L54N88j20l87Q7k97J8
2027d40n26J285M1L54j116J225j503N13N98m43j36j2N55j77p77J428j339M80j0
2046@k78R01l00q16J393j80k3j01m5r91N5k20J370K21m41k29r07J240q2r93O22
2067A96L10o53N54j00K71k25q67P63J40j67q62K24l2J235r85q2R53r17Q41k38
2087C59j187K26K25m12O24k00M81K40m24J42M5m63j20O92J85q36J000o16m72K26
2107b85J74Q27j76q41J95P9k62J10j47j90O43j00M29k74O54p00j79J14P48p97
2127B2J28m92j27J353m94j21J57n11j95O57m2j61J61o7l57m86O61J119p09m49
$$ plain form
1988 365 -574 76 348 697 -377 386 -1142 -755 185 -648 319 286 508 -260 -67 259 338 -494 -746 533
2008 533 -532 1266 -528 -393 847 359 634 166 574 195 554 -683 -329 259 139 -248 -161 -458 -440
2027 -440 -966 319 360 714 -402 823 -680 -167 431 -12 -148 -160 395 218 -559 869 -470 10 0
2046 0 -278 623 323 -493 900 720 697 596 551 -440 -385 -605 765 986 545 316 -591 649 567 -426 196
2067 196 506 -147 407 307 578 353 -514 249 389 222 -640 -416 -448 787 -198 -280 673 -244 597 359
2087 359 -828 -602 -377 -789 -165 -365 116 356 -68 74 119 -344 -464 228 413 -423 577 -39 -511 -285
2107 -285 -111 716 540 -301 -106 -27 -289 -179 -326 -516 127 27 456 182 836 136 -43 71 819 22
2127 22 150 -342 -469 884 390 269 426 -85 -280 377 335 174 335 268 -89 -575 86 1205 496 47
2147D7N69K2l95pj1o5J59r86N69m59M18m10N6K89N31n25K71j09k87j48O45n35
2169c61J54K40j012J634o48M52K10m46L30O0K94r05q03O70N3L40n90M50q7m33
2189c98N20J9l15J80L15l30P8p92Q80k12J39j72R88q97L8N09l9p00J70l73P87
2210C95L7r66J049l58L60q73M03o6k58L07J82k8m37P05j10K0n06m25J077m38L42
2231D12k00n49j43M52m3N28K65L2n20p40k1M49j44R53r27k52J049l94o80n3P46
2252B20m75Q20p22L78j80J044n82j57Q3j101L65O66m21j28J53P14m74n19N02K84
2272D70l87k47p2N31n2m87R69J17Nj155l05l9N79N64j52m30M79m0q68R34L83o72
2294A25n83o42J749q97L60L67m56J72l22l91K68J70l45R20l06J44k75n30J261
$$ plain form
2147 47 616 638 243 236 225 160 319 -667 -98 -557 -139 -549 -493 -204 327 -198 73 -36 -323 -471 174 -361
2169 -361 -207 33 -979 655 7 459 669 223 553 613 907 2 -801 -131 -78 262 -328 122 35 -398
2189 -398 122 141 -174 6 321 -9 69 -723 157 -55 84 -88 900 3 41 550 511 -189 -19 -392 395
2210 395 432 -534 515 157 517 -356 47 -19 -277 30 212 184 -253 452 342 362 -144 -569 508 70 412
2231 412 212 -337 -480 -28 -71 457 722 754 234 -506 -527 -78 -222 731 -196 -448 601 207 -473 -526 220
2252 220 -255 565 -157 221 41 1085 503 346 429 -672 -307 359 -62 -190 -37 677 203 -316 186 470
2272 470 83 -164 -236 295 243 -244 725 842 847 -308 -613 -652 -73 491 339 -91 388 348 -520 414 797 125
2294 125 -458 -1100 649 -248 112 479 23 195 -127 -518 -250 -80 -425 495 189 333 58 -472 789
2313G89j514O38M43p28L5O90j49o24J086q30J71J105q36l43K22j238J531n74k93
2332d19P53k42p61J321j06p35J24k81j8l9J013q20M29m48j90k81Q86K91l31K59
2352D05l92k73l39O57L28m3o7j26j271M97M45j66K72r47R25l84L76Q8l97J02J166
2373H56K86j670m11N58K90r5J65N68n96q46J376k25m79O62q37P26K57r44J55N2
2393a52J32q7J96K07N0K70k56q24Q35r37R47j201N28Q67l59m12m89Q56j5P83p06
2414B33P88j269k68O55m39K58l84j42J405l59j453M95P74j39o51J395q79o13L23
2433b70K67L45J07o12m69L10NL55l2r8j96K86L23k97L65m55k22J051o91o6j6p00
2455g10Q16K69l4r18K23n4k95O24L44n67M23O06n72l37L74j097J180O3m30k67
$$ plain form
2313 789 -725 -87 356 -372 -337 353 204 -420 666 -164 7 1112 276 -67 155 -1083 448 -126 -419
2332 -419 334 92 -669 652 546 -189 -65 -346 -364 -403 610 -210 219 -229 -419 -700 186 477 146 405
2352 405 13 -260 -599 58 386 343 276 150 -1121 -624 -179 -345 -73 -1020 -95 -479 -103 -15 -412 -310 856
2373 856 1142 -528 -939 -381 -91 -186 -21 547 -49 -895 481 256 -223 439 -398 328 585 -359 -204 -152
2393 -152 -20 -107 89 296 346 616 360 -464 371 -566 381 -820 -292 575 216 -196 -685 171 156 939 233
2414 233 1021 -248 -516 139 -300 -42 -426 -568 837 478 -975 -480 294 155 -496 899 20 -593 -270
2433 -270 -3 342 449 -163 -632 -322 -317 38 6 -92 -288 -2 321 24 389 -66 -288 763 72 6 -10 -710
2455 -710 106 375 341 -577 -354 -408 -703 -79 265 -302 121 727 155 -182 192 -905 275 338 -92 -359
2475c59j62M03l9O83n32n49k4JP79m63n92J308n51j045J378J79j47p6Jl11M28
2496C10n01q21R72J92K97j005Q02l38p5m17R61K25m75P1L6L63k96j484R74O25
2516D16l83m6k71Q00p23N40O1K29o09Q66q69J09K53p1m6l00n0oj80p7m1q30J951
2539G23k004J698r17K29l29N88O49k77m32M75l17J65k57L4m98P93P67j375m54
2558g39P14M48j468P51R93p24J84P5O34j105Q87k14l70Q0j003J034p60J96O58
2577B71j47p3q5q80J582j34j231N11k99N63R19j500O87p10Q33k78N30j098O99
2596A60p52N62M16k28P66j402J268j974J261J66r01Q33K7J5j012J360q98k16%
2615e49R20j23K74q76j34K24M25k75J2L71l31L4j247R12Q20l92L97n13Q32n32
$$ plain form
2475 -359 -521 -118 -157 526 -6 -555 -579 -578 201 -262 -854 454 -97 -1142 236 415 268 192 193 -118 310
2496 310 -191 -1012 -40 152 449 -556 246 -92 -167 -584 377 602 127 198 234 597 301 -1183 -209 416
2516 416 33 -13 -284 516 -207 333 394 623 14 880 11 120 373 302 256 -44 -94 -100 -280 -357 -398 -1228 723
2539 723 -1281 417 -500 -271 -600 -12 637 360 -72 403 86 251 -6 28 -470 323 1090 -285 -739
2558 -739 -25 423 -1045 -294 699 -25 159 234 868 -237 650 436 66 146 -857 177 -583 -387 271
2577 271 124 51 -34 -914 668 534 -697 -186 -485 78 997 -503 184 -526 307 29 559 -539 160
2596 160 -592 -30 386 158 924 -478 790 -1184 77 243 -658 175 202 217 -795 565 -333 -549 -549
2615 -549 371 248 522 -354 -488 -264 161 -114 -102 269 -62 -28 -1275 -363 457 65 462 -51 781 249
2635B49k22J9j64N85r64Q09m11O66j032Q89m55l25n72J23J039n9q1j046N31J77
2655b44M04lp2K74o45P5J14j2n21L37N44M74j006J93l20M84m18J081K77j009J74
2676A81l86R03n88O5m87N88n40k48N29K28k44J65Q7l77mK10m62P63n1L81J08r52
2698a31K90m66k81Q86j95j20N26k15o98K75J36m41R97K14p19r6j3m76N29P20m05
2719C17P16j141K96M86j388Q89k54J27j55M69k55q7p3n69R84O84r48o63O64j3
2739H6K22L33j539mk85R34n90J171n61j18L31n5P8l43K7P18q75O71p69N81J67
2760A80o00J89J050p5j038R16q21l47J076j438O25M43L9j20O77l78P0j021L58
2779b15R99r37r66Q23m16j8L34L79N23n43J44q5k06m91K38L46N94j48l00j66R68
$$ plain form
2635 249 27 46 -118 467 -497 312 -99 567 -465 424 -31 -356 -928 -805 234 175 94 -952 -421 -244
2655 -244 160 157 85 359 -286 -211 -97 -109 -630 -293 251 725 -281 -88 -408 76 -342 739 1016 7 181
2676 181 -205 698 110 175 -312 276 -264 -512 17 245 1 166 253 -124 -128 82 -380 383 332 713 821 -131
2698 -131 159 -307 -588 298 103 -17 509 294 -404 -129 7 -434 563 777 58 -38 -51 -527 2 722 317
2719 317 1033 -108 188 674 -714 175 -79 48 -107 362 107 20 -53 -622 362 1046 98 -565 99 86
2739 86 308 641 -898 -902 -1187 -253 -843 328 -233 -351 -20 -75 3 -340 -313 405 -470 201 -568 13 180
2760 180 -420 -231 819 744 -294 622 -199 -546 530 -908 -283 160 199 79 756 378 448 -573 -215
2779 -215 784 -153 -1119 -296 -712 -730 -396 -17 506 -37 107 22 -184 -675 -437 -91 503 355 55 -111 857
2800H57j192P00J64K48m19p36N88k87k7N74m91j91q96Q93J281j227K1N9J25Q8
2820A32J29J7L39n01j3K1l64Q68o48q9N93m92J04n10J55N42n87J174p84Q49k07
2841G28m83o55N51M28j043J40j88O83l57J27L71o93M31K71M65p03J12N65j174
2860d24P72n60l00N74k68Q30j81P2n83k83N30L69P6m13k32L71m01Q10j007L21
2880G3j8j42j5J92k50j33R31p54L67m29Q15q79L37K58j89j236J732j375M67L14
2900F6j23N51o19k24j82Q21K75J36M29r03N1m99K28r4r47L94O02J37J36q47L91
2921b21N87j249J066Kr6k87M27p64K57J242m31M05k72j285M05o92J197n82J328
2940A037j257R56M49j162k55j076J282P36o60J95L38m92j11l10L75K67k45L53
$$ plain form
2800 857 -335 365 529 777 358 -378 210 -77 -104 470 -21 -212 -1108 -215 1066 -161 -140 -81 44 132
2820 132 261 278 617 116 103 124 -240 628 -20 -109 484 -8 96 -414 -259 283 -304 870 86 935 728
2841 728 245 -410 141 569 -474 -334 -522 161 -196 -69 302 -391 40 311 776 73 185 750 -424
2860 -424 348 -212 -512 62 -206 624 443 515 -68 -351 179 548 624 211 -21 350 -51 759 -248 73
2880 73 55 -87 -102 90 -160 -293 638 -116 251 -178 637 -242 95 353 164 -1072 660 -715 -248 66
2900 66 -57 494 -125 -349 -531 290 565 701 1130 227 278 -221 7 -87 -1034 -640 -38 99 235 -612 -221
2921 -221 366 -883 183 185 89 -198 229 -535 -278 964 533 938 666 -619 -214 -906 291 -291 1037
2940 1037 -220 736 1185 23 -232 -1308 -26 710 50 245 583 91 -20 -330 45 312 67 420
2958D20L86j083J291j313J41l3l6l51J020n98L19O69r55M25p54k96J128l32m08
2977c60J72L63l92L38k15K45o20Q02m08R54q44O61M13j057J82k73k73k50J085
2996E23o80P45k64j229L16L1O07l52P7Q31n18P86J76p19l15L43j047J100o69j22
3016c80K25N69m59K38K54n5m11J15m10jQ33q64K89M07m99J70P49n63K32j93l01
3037e5M7p49J59K91J95O39p88Q09Q8J07q44k77k4l65R63p10O52K39m30m7J031
3058I31j576KQ13j164J193l58j3M84n84K78l60N81j69K0j22k04Q67o47j85M04
3078A91k32L62J24q72P74r97Q91n17j41J431j557P31m51K01Q5r18J044M15n54
3097A0K49K36m26j88m35L52L57J8j85J31j136J494j58o76R53p37P22m2n64M16
$$ plain form
2958 420 806 -277 1014 -299 -158 -191 -227 -578 442 -156 163 832 -123 302 -452 -748 380 48 -360
2977 -360 -188 175 -217 121 -94 151 -469 333 -75 879 35 696 1109 52 234 -39 -312 -562 523
2996 523 -157 588 324 -905 -589 -558 49 -303 -226 605 87 873 1049 330 15 358 -689 411 -258 -380
3016 -380 -155 414 -45 193 447 392 -19 96 -314 -315 518 -346 -57 350 -149 21 770 207 439 246 -55
3037 -55 -8 -757 -598 -307 -112 527 -261 548 636 743 -101 -378 -402 -767 196 -514 138 377 -53 -100 931
3058 931 -645 -643 170 -994 199 -159 -172 312 -272 6 -354 227 58 78 -44 -248 619 -28 -213 191
3078 191 -41 321 445 -427 347 -650 241 -276 -417 1014 -543 188 -263 -62 23 -895 149 564 10
3097 10 259 495 69 -119 -554 -202 155 173 -12 119 -1017 477 319 -357 596 -141 581 539 -25 391
3117C91o56Q75p04l44O56n61p85J853j037J065j027N30m01L47j42Q21n82o31M52
3136A20k56N05m74L23o84O37l8j33m95K14m45L01Q22j150J004O7p94L37L95m55
3156a99P45k92j68L49o53L00J266j328J04NR7j049M80J367q03kl65n32j41J610
3176G91j410P07m76L72m88K78O07n60j43O41J45k87J54M51m29l90K17k16J96n4
3196A06M36q58j43K00P08k33R9o93K84O0o95M87J15k43N82K01K9N4j398J122k1
3217A99l02L17q34M52M90r5O78q81N5j335Q67O49pK25k79J38r05M86M10r56R15
3238B87J57l81m5P08o53R3o97J140K12m36l82L61o51M91k96J15k21K16M34m80
3258b8p61R93k12l11Q88l88m68J1J301r27p7M69J79j111m18Q15j32L91k58m21
$$ plain form
3117 391 -265 610 -94 -438 218 -343 -1128 725 -312 753 -274 256 -145 202 60 881 299 -332 120
3136 120 -136 369 -105 218 -466 171 133 0 -495 -281 -726 -425 397 -753 251 318 -476 -139 256 -199
3156 -199 546 254 86 435 -218 82 1348 20 124 129 226 -823 -343 1024 221 219 -146 -678 -819 791
3176 791 -619 88 -388 -16 -504 -226 381 -179 -322 319 464 177 331 782 353 -37 180 -36 160 106
3196 106 542 -316 -459 -259 449 216 315 -378 -94 -34 -729 -242 -127 -370 212 413 442 496 -902 220 199
3217 199 -103 214 -620 -168 322 227 905 24 79 -1256 -389 260 253 478 199 337 -568 -82 328 -628 287
3238 287 444 63 18 726 73 166 -531 609 821 385 3 364 -287 204 -92 23 -198 18 452 -28
3258 -28 -789 204 -8 -319 569 181 -287 -276 1025 98 21 490 669 -442 -860 -45 -177 214 -44 -465
3278d65K46M50L3k77L09l09L53l16K85k67k18j8N51j55j86K43m64j0M49Q5p56
3299d37R31m79K47j86j5k31N9O63p15L6l88j58J085r13n07M09J64p0N09J269j633
3320c60K38k41K17Q91o30o71M92P78m22q03R14j085Q39n18J27L44j310J475L61
3339F36m1j042J34k63k0Q12J68o2j26J92K91l11p36J55J04j019J351j261R93o49
3359f94Q85J83j304J369P5n22m63j64Q22m38J43q60M39P02m44l84R21p69L21K0
3379a62J41R55j190K62q1J87M34q97M99l73N09q63R81o99J18L9M85o85M57p26
3399f09Q01K2p92J239j272M67L92k6k62P7K99K2o23L05Q2m24K43L69m23k95R53
3420E45j008R79n76RO68r42k18N01M04k19j52p92J088m38J0O26q67P73k00j26
$$ plain form
3278 -465 -219 231 264 -13 296 -13 340 24 309 42 -176 -194 357 202 16 259 -205 -215 234 319 -437
3299 -437 494 15 262 76 61 -170 -111 552 -163 -127 -515 -673 412 -501 -1008 -599 -435 -505 4 1273 -360
3320 -360 -122 -363 -146 745 115 -556 -64 714 292 -511 403 -682 157 -361 -234 110 -1200 275 636
3339 636 595 -447 -313 -576 -596 216 384 322 196 388 679 368 -368 -213 -109 -1128 223 -1038 -45 -694
3359 -694 191 374 -930 439 514 -8 -471 -635 187 -251 -108 -968 -529 173 -271 -655 266 -503 -182 -162
3379 -162 -21 934 -256 6 -75 112 546 -351 148 -225 284 -579 402 -297 -179 -140 345 -340 117 -609
3399 -609 192 214 -578 661 -611 -144 248 222 -40 37 336 358 -265 40 122 -302 -59 310 -113 -408 545
3420 545 -463 516 -60 -51 617 -325 -543 -42 362 143 -9 -801 287 -151 -141 485 -382 391 191 65
3440F5J52m3pr7n62J006n56K0J70M8k16o78K41Q9L86L62n48n05O45n94Q57o6o83
3463e14K33pj90N28j75N78J3J39k01q66k41N04j60K02R79l51%l91j047M39N36
3484Hl97j03P94M9j003l94N64M88m38K76M68m90J23n12K225j689j03L72K31k49
3504B20K99k98o92R92k47o60Q21q51o7N94K36j103L26P15K84K05j214J16M90l7
3524A29R87r72j94n87L1K92J30P68k66l0o16L2J3O51q34L72n9p47M74K21L45m91
3546c51N60o06J68m18J36M77L74r87N56L55j042O59o1L38P4k85K74j017J365q04
3566b35M91k57N0k78K5j57P74K99r41N93j44m78J04J34M4J18k14l13K25m62L17
3587c05M86k73j23k38J84L89l92M25Jj061M93m1L79n90P98K81p10n12N96O05L40
$$ plain form
3440 65 217 174 167 70 -492 514 -42 -22 148 196 -20 -698 -457 -368 18 380 -168 -673 -28 -622 235 169 -514
3463 -514 -281 -288 -478 50 -125 453 466 605 404 -462 -703 -199 -359 -157 822 471 471 80 -967 -528 8
3484 8 -389 -492 302 351 -652 -1046 -482 6 -432 -156 312 -178 -55 -567 1658 -31 -134 238 469 220
3504 220 519 221 -471 521 274 -386 435 -416 -483 111 347 -756 -430 285 569 774 -440 -324 166 129
3524 129 1116 144 -50 -637 -606 -314 -184 584 318 288 -328 -296 -283 368 -466 -94 -153 -900 -426 -205 140 -351
3546 -351 209 -397 -229 -647 -511 -34 340 -647 -91 264 -778 -119 -180 158 232 -53 221 -796 569 -235
3566 -235 256 -1 49 -229 -204 -361 413 712 -229 364 220 -258 -154 -20 24 142 -72 -385 -160 -622 -305
3587 -305 181 -92 -215 -453 -269 120 -272 153 154 -907 -414 -455 -76 -666 132 413 -297 -809 -213 392 732
3608G32p32L8k74Q26o14M8N15o4L5n14m83J189o33L36q21M71P1m66J91K3n50K44
3630d32J407k33p13m0k31m26J247n17L64k21p20L18j1M87p01K21k75J413j072
3649a35p7k91J49M28l91J14N12k8k16K66j456M10J454o01m1o66J71J28Q05q10
3669b75O34N63j224Q97j056J287r66j99l39L73J95J69m67J023j31j45L25k27n01
3688f4L61m40M22p25O19J45N26q41m4J03K7l51O79j44r50J650n54j030K69m24
3708g66J360j30j119R05n79n10J213r17J086K16j352O19M14j295R47J23m26k13
3726d24r2N82j8m28O31O3m71o8j77L46m9n36j7R94o73P29j143K445j220R7o74
3747a03l33R52Q4j12q27o36O50Q21j092N82P02j062J251j233K05J2k89M59P01
$$ plain form
3608 732 0 38 -236 590 -24 24 539 475 510 -4 -487 702 69 405 -416 55 126 -340 -149 -126 -676 -432
3630 -432 975 742 29 -11 -242 -668 579 62 426 205 -515 -197 -208 279 -422 -201 -476 937 -135
3649 -135 -212 -503 -354 74 -317 -203 309 281 65 331 -1125 -715 739 138 97 -569 -398 -270 535 -275
3669 -275 359 922 -302 595 -461 826 -140 -339 -678 -305 -110 59 -408 615 484 339 664 437 -64
3688 -64 297 -143 279 -446 173 318 844 3 -41 62 89 -262 417 273 -677 973 419 -611 -342 -766
3708 -766 594 464 -655 250 -329 -839 374 -543 543 759 -593 26 440 -855 92 215 -211 -424
3726 -424 -516 66 48 -380 251 314 -157 -225 -402 -56 -105 -641 -658 336 -337 392 -751 1694 474 571 -103
3747 -103 -436 516 600 488 -339 -975 -325 496 -596 -14 688 -374 877 -356 -151 -139 -428 31 732
3766G32n32q57r0Q35O35j609J052P84q22K38l25J53o09J68N8K16j29j70P60j120
3786f32L77R45p85j00K46J66L3M12j076Q29q32O13N29q46lK41j31O33r43k5m06
3807g55K1J364K6m02n49j53J003k48k9k3j69jm23NM64k9m82R76o52l72K56L22
3829A50k60r24Q11J9J27L35o63M29k83K28p34Q69j83k4j3M33n51M82j31r0O42
3850F69K85j44m44m65M06m94J26J297j328N81O52j645J212n58K3k22L00J9no51
3870c86N60n76m6J104j309N59L81r40K22n85J387j86p5p55Q68n1o15L7N35K95
3890D24r73M58J85k35J98m53k10J033k61P1p7k32N0M53m91m04J84J64j47J068
3910H05j416l94Q32N95k09m13J90j73K4L61m07J44K64o75L39N66L7j231L78M18
$$ plain form
3766 732 200 -657 -747 88 723 -886 166 950 128 366 41 194 -415 -247 -189 27 -102 -272 488 -632
3786 -632 -255 690 -95 -195 51 217 250 662 -414 415 -417 196 725 -121 -124 117 -14 619 -324 -349 -755
3807 -755 -734 630 656 254 -295 -448 555 307 278 255 86 85 -338 -333 131 102 -380 596 -56 -428 -172 150
3829 150 -110 -1034 -223 -204 -77 258 -405 24 -259 -31 -765 104 -79 -103 -116 317 -234 248 117 27 669
3850 669 954 810 366 -99 307 -187 -61 1236 -92 489 1141 -504 708 150 173 -49 251 270 265 -386
3870 -386 174 -402 -448 656 -653 -94 287 -653 -431 -1016 371 185 110 -645 223 172 -443 -406 129 424
3890 424 -549 -91 94 -141 57 -396 -606 427 166 237 160 -72 -22 431 -60 -464 -280 -116 -263 805
3910 805 -611 -1005 -173 422 213 -200 -10 -183 -159 202 -205 -61 203 -472 -133 433 470 -761 -383 35
3930C5k40j08J39Q5l14Q19j427M79M61l10P89j020O11j204J697l89o36Q85j007
3949f55O22P65r14q3J22K32l0N49p50L42p42K89J414j163o92p8K36k74pL91j08
3970e34j64k30L69R98o02K48Q46r60K56o37J180o31k5m28M67j40N2N24r8q74J003
3991F20l6m33J099k007J243q20J64n75R11k88p1R65j252O41j81K5j89M74N33p05
4011A18j30k74r2J066k34l11R23p00p15P3K0N40q96J346j87r39k48R70n91L58
4031I7o67P39M80j128K33N66P6o76J25p21Q75l41L47J39N0k51J053r37j000N89
4051c52J103o44m05Q50l81p14P28O65j110QO19Rj322J282n23J48L95j561J626
4070D21o93K38M60j035K65L01l21K70p7N83J12j98k87m6J51r33J695j638P90l92
$$ plain form
3930 35 -205 -313 -174 -89 -403 416 -1011 -532 -71 -381 408 -612 -1 -1205 492 103 -533 352 -655
3949 -655 -33 732 -182 -265 -143 89 59 608 -142 200 -542 -253 1161 -2 -694 -772 -536 -810 -817 -426 -534
3970 -534 -698 -928 -559 439 -163 85 931 -29 227 -410 770 139 114 -314 153 13 65 589 491 -383 620
3991 620 584 151 1250 -757 486 -334 -170 -745 166 -122 -193 772 -480 161 -20 5 -184 290 823 118
4011 118 -12 -286 -378 688 454 143 1066 366 -349 -276 -256 284 -612 734 547 -392 -640 330 -261 97
4031 97 -570 169 649 -479 -246 320 396 -280 -155 -876 -1 -342 5 144 194 -57 996 59 -941 -352
4051 -352 751 107 -298 552 171 -543 185 850 -260 -252 367 376 -946 336 -187 -39 356 -1205 421
4070 421 -272 -34 426 -609 -344 -43 -364 -94 -171 412 524 326 39 -7 144 -789 906 -732 58 -334
4090c34m14J09K2N87N03n53J64L38l12k4k66J21j27n2L96L4m18m51Q14l61L35
4111A11L53l06N73k59N26j684J075k26o5J50q30R23q04L95l96M35m26J182j60
4130E67k03l34R39o59m74P29n54n20P16l56L27ln32m38P42J59K31l83K09r7J83
4151B49j09r32J153L73q47k13J069q84n4L08j59P04m80o97Q91n49o0l00J049j11
4171D01j62j38l28p10R70Nk45M38q87N52M92n86O29o71O82l60Q60j269M37Q0p82
4192e92P07K79J52m81j13j14j36N45o34P69K4j91l95R15k00M00m81o94P4j94K013
4213A653j429J00k24m65P38l90J09k58LM92J51j90o21M17P4j062J607j281k75
4232h51J014O00j3k22j346M65l6K39j9r3p3N61L6j77n75M15M96p88Q48m69k24
$$ plain form
4090 -334 -748 -639 -617 -30 473 -80 84 422 110 86 -180 -59 -186 -238 158 192 -226 -677 137 -224 111
4111 111 464 158 731 472 998 -686 389 163 98 248 -582 341 -463 -68 -464 -29 -455 727 567
4130 567 364 30 969 310 -164 565 11 -509 207 -149 178 175 -357 -795 -53 106 337 -46 163 66 249
4151 249 140 -792 361 734 -113 -326 743 -141 -195 113 -46 658 178 -519 372 -177 -237 -537 512 401
4171 401 239 101 -227 -937 33 38 -207 231 -656 -104 388 -198 431 -240 442 82 942 -327 110 190 -592
4192 -592 115 394 546 65 -48 -162 -298 247 -387 382 406 215 -180 735 535 935 454 -240 -166 -360 1653
4213 1653 224 324 100 -365 373 -17 92 -166 -163 329 480 290 -331 86 160 -902 705 -576 -851
4232 -851 163 763 750 528 -818 -353 -389 -150 -169 -262 -335 226 262 85 -490 -75 421 -367 481 12 -212
4253b12O23j58o11M70O73r58Q05r77N68J58k47k22K83p8n8L68L18n78jK3k33k82
4275c26K47J70J1p07P80J085o88j63K82p53N08p6j2m96J36k64N36l61j36j66M80
4296H7k15q32J071N9P99j097O91l25O46j089Q3J35R4L45q53N42m28J176j023M5
4316h9K11r54Q08k85N43L83p68K46l29J258K3p56r12M27L94L18K7o91J4j39n96
4337h67L72P20n26k09L77K83p34L9J64M98L93p3n80O29q84J164p25J97q12L80
4357a94M02m68R85Jm48j76j8o88R26k63m6l43k52N72Q61j185M20K09r15N39K67
4378A86n0M51o83N69P6J92m90P83l39p26N12l64O1K78j297N72k63K52l0K6O48
4399C64j632J784K86l90J9l01k30J048j070M46q4P5j6j32p46R43j069J63P85p54
$$ plain form
4253 -212 411 253 -358 112 785 -173 632 -345 223 381 134 -88 195 117 59 427 745 167 166 189 -44 -326
4275 -326 -79 91 102 -605 175 1260 572 409 691 -62 446 370 358 -138 -2 -266 270 -91 -227 -393 87
4296 87 -128 -960 111 170 969 -128 563 238 884 -205 -122 13 107 452 -401 141 -287 889 -134 -89
4316 -89 122 -832 -24 -309 234 617 -151 95 -234 1024 1047 291 -621 -194 200 518 545 -146 -132 -271 -867
4337 -867 -495 225 -301 -510 -133 150 -584 -545 -381 117 510 437 -143 486 -398 766 41 238 -574 -194
4357 -194 208 -260 725 726 278 102 84 -604 322 59 13 -330 -582 -10 851 -334 86 295 -620 -81 186
4378 186 136 587 -96 473 549 741 251 1034 695 -31 481 117 178 456 -841 -269 -532 -280 -310 -284 364
4399 364 -1268 516 802 412 431 130 -100 948 -122 324 240 315 299 167 -579 364 -705 -542 243 -511
4419e11M89K30n00K24N23K2l49O68j050J64K11m14K62K16k7O4n88Q4M46q33J21
4440e48L76N3k86P5Q11n6J33L88o20K18m66k59l98O30J08K85j164R97j38k9j037
4461i27J056j45l70M39j50J95q16J11O63r64Q65J121j069j58K67K25L24n37j02
4480B8n34m51R35p47l01J530m11J9m28k07K76M69O9m88p80J99P44j6p8q1k49j90
4502f92J241j36M1l46j87j055Q20k5M76k68l31O90K35k17m78M72J28J36l24n9
4522A21q20J98O84L51j85K68m72J06q13R55o5k24l9O9J61k4J328j525L57r31R46
4543D46q17P06M21o75K21n27K94L43j82n32l55J314j60K08n49j89m80M24L13K37
4563D61l07m77m71K6q2N64O30j050N15L35o37p4L56Q49o18J045q97q7Q76k79k92
$$ plain form
4419 -511 -22 208 -292 -68 455 477 128 796 -254 -90 121 -293 -31 185 158 222 -366 -282 164 -669 -548
4440 -548 -172 -119 -405 -330 481 425 558 946 326 544 78 -181 -579 51 159 444 -720 277 139 110 -927
4461 -927 129 -16 -386 53 -97 98 -718 -607 56 -908 -43 1078 9 -149 118 343 667 130 28
4480 28 -506 -957 -22 -769 -1070 460 49 68 -360 -567 -291 178 247 -241 -1021 -822 -78 -94 -172 -253 -502 -692
4502 -692 549 413 454 108 -79 -1134 -314 -339 137 -131 -462 228 463 246 -232 240 368 504 180 121
4522 121 -699 -501 183 534 349 617 145 251 -562 393 328 104 65 134 295 271 1599 74 431 -500 446
4543 446 -371 335 756 81 302 -225 69 412 230 -302 -657 657 497 705 156 -33 -513 -89 224 461
4563 461 154 -323 -794 -768 -850 -286 344 -706 -191 144 -493 -567 -211 638 20 1065 168 81 957 678 386
4584C86n72J89p06J242o82J11p24M82J80j48m0j3o18J221m92o95J324l17l45O08
4604C91r70l11J283l82m23Q47l34R7n42J339k264J322j086J356q91M27l62P0J176
4623G43q29P74j413P51n29R63k30q29O97n58j36P23j28J015m32J83J2j253M4J092
4643F60n64K62k55n49m1L43L05q24L57N65M07p15K99M40j208K18L48J195n59r25
4663b41K81R2K39P2m23l46R58j074j07M59J72p48K56J496r19o3p25O76M06k70
4683A91o83l14J142o72q59J336o48N15k50P46j025K42N09l71M38Q5j9j077J914
4702A200k78j218M07N57j533J227o35Q15j064J332j151L62P77k34k11j02l24k75
4720c48J771j175j066J293M10k36N0j224N55o09P57L83j67m25o92R39J76l70j58
$$ plain form
4584 386 -186 3 -703 539 -143 -32 -756 -274 -94 -242 -282 -295 -913 308 -184 -879 445 128 -217 391
4604 391 -579 -890 393 11 -412 435 101 198 -344 995 -1269 53 -1033 323 -568 -141 -503 -433 743
4623 743 -86 688 -725 26 -503 460 230 -599 98 -460 -596 127 -1 1014 582 765 777 -476 -432 660
4643 660 96 358 103 -446 -487 -144 161 -663 -306 259 666 -49 250 690 -518 -300 48 1243 684 -241
4663 -241 40 132 371 443 20 -326 632 -442 -549 -90 82 -666 -410 1086 167 104 -621 55 461 191
4683 191 -492 -806 336 -336 -1195 141 -507 8 -242 504 -521 -279 230 -141 297 382 363 -714 1200
4702 1200 922 -296 111 668 -865 362 -273 542 -522 810 -341 21 798 564 353 251 -73 -348
4720 -348 1423 248 -818 475 885 649 699 -525 30 -579 178 561 394 -31 -723 216 392 22 -136
4739a36L32m05j0M39K30p02J98L55o00R96o15p6K0o16Q82j038Q75q39R59L98n96
4760E1r5K95m99k81l7N12k23L57j161J576J82n27k75k47O21j10n64N07L33r9o71
4781c55R23r74N07L29r25k0P09l13J76k84o3L2o71Q10O70p79J40N32o24o09J115
4802C26j012N48N88k92P3m45O16l14m65N27j75J34j92M02j94K82N11o93q07J252
4822F70j215M0J83M44l05o28J80J54O69l49q5N08m01j18J027j88m98L17q46L7
4842d04J424q21N0l67Q53O5o88p55N21N3O67O4p17o46N75M23J56j217N32O91o63
4863b04m58O43L13j31p07P03K76Q6o91P28j082pM22o11Q82p45N87j191J093k53
4883c47k23J32J174nl80L63r93K03J35m53L58p3p6N89j32n17j24R17m27j29N85
$$ plain form
4739 -136 196 -209 -219 220 450 -252 -54 301 -299 697 82 6 26 -590 292 -746 129 -710 249 647 51
4760 51 -44 251 -248 -529 -566 -54 -277 80 -1081 495 677 150 -125 -372 249 139 -425 82 415 316 -355
4781 -355 568 -406 101 430 -495 -515 194 -119 57 -227 -290 -258 -929 -119 551 -228 -88 444 -180 -789 326
4802 326 -686 -138 450 158 231 -214 402 88 -377 150 -25 109 -83 319 125 407 918 225 -582 670
4822 670 -545 -505 -322 122 -183 -811 -631 -477 192 -157 -242 266 -135 -253 774 586 88 405 -441 -404
4842 -404 1020 199 249 -118 735 800 112 -643 -122 -69 598 662 -55 -701 -126 297 453 -764 -232 459 -204
4863 -204 -662 -19 294 163 -544 159 435 521 -170 558 -524 -531 -109 -720 162 -583 4 -1187 -94 -347
4883 -347 -570 -438 736 731 351 714 -279 -76 59 -394 -36 -109 -185 404 272 -245 -369 548 121 -8 577
4904E77l28K47l21j95o25j52J198j400J585R0p74m50J79O89n8m60O8k15O3Q3k15
4925d14R16L76m86M91j217N65k97m0j96M9j57R49p18K72n2J72P51n17L08p08L33
4946C80q01k9j07N55N37n09k0N3m50R83p25P73j313l23P54k87Q75p09L92J153
4966A182j406J359o03o06o71M54o48J088n12N00l38K78L99p64M8k4M32m57R9J16
4986g4o34N65j90L79j73N72K27n44J91o88Q37l86k74K3n82J529k75n34j37J85
5006A7j81N68l43k79N90p58k35O31O1j31m76R40P0n66n58O46j31J18P6j080R82
5027c9l06P52l25l01r55J489q3m57m9l31P59M5q1l66R38j420R58p4K32J65k24
5048C27k27j65N98n90J18M44J85p26K25l00j02O01p89J045n88p86J404m88J84
$$ plain form
4904 577 249 496 175 -20 -645 -797 401 -999 586 676 -98 -548 -369 320 262 -198 -130 -345 -282 -199 -414
4925 -414 502 878 392 883 -334 231 -66 -106 -302 -253 -410 539 -179 93 41 213 964 447 755 47 380
4946 380 -421 -450 -557 -2 535 26 6 59 -391 592 -133 640 -673 -996 -242 -529 346 -363 29 1182
4966 1182 -224 1135 532 -74 -745 -291 -939 149 -363 137 -201 77 476 -288 -240 -264 168 -289 -190 -74
4986 -74 -708 -143 -333 46 -127 445 672 128 319 -369 468 82 -192 -169 -751 778 503 -31 -168 17
5006 17 -164 404 61 -218 372 -386 -621 10 71 -60 -536 404 474 -92 -650 -4 -135 -17 59 -1021 -39
5027 -39 -345 407 82 -219 -1174 315 232 -225 -274 -605 154 199 118 -248 690 -730 228 154 386 551 327
5048 327 100 -65 533 -57 61 505 690 -36 189 -111 -213 388 -401 644 56 -730 674 186 370
5067C70m1n11N37K69J9o06Q40j830N70M22k43q22P97J36j73J28l40P46M1N2q57
5088d96l02Q36O06n39N87n68l02M70n68o5R03j648J231L86j335J019m96jk70n98
5108a150P79k60M42K17L23k03o33M25n90j34K71K46l56l09J533q31R6J95K95m17
5128f1l78Q97n12J66M60n18J98J90p94J383j052O94j002j00l47l27J278k74J60
5147F1km59n40M93J219j123L84n27J46R02o06O05j99m01j7P14j662J150M85p97
5167a74m53O54q1K73l16op0R8M67m01M6k51P30r97O49o23J035l59o12j43P31j42
5189E5j94K2L10m8L38k55J3L76k59n3l24M97j15j17r78L69J054o07O18n77K27
5210C52m41L45K7j14k87K75r81R79K7r4n55J365m07m09J78N80j245Q1mj73L14
$$ plain form
5067 370 329 -182 355 624 643 37 877 -953 -383 39 -204 -1026 -229 -93 -266 -138 -478 268 309 361 -496
5088 -496 -798 38 644 105 692 124 -178 292 -276 -341 562 -1086 145 531 -804 215 -281 -282 -552 -1150
5108 -1150 -371 -631 -189 28 351 148 -485 -60 -650 -784 -513 -267 -623 -932 601 -230 -134 61 356 -61
5128 -61 -439 458 -54 112 572 54 252 442 -352 1031 -21 673 -329 -429 -776 -1103 175 -99 61
5147 61 59 -400 -940 -447 772 -351 33 -494 -348 554 -52 553 354 -47 -64 650 -1012 138 623 -174
5167 -174 -627 27 -54 219 -97 -103 -173 -75 392 -9 37 -214 516 -481 168 -455 580 221 -391 -534 197 55
5189 55 -139 -117 193 145 483 228 241 617 358 305 -19 478 363 246 -732 -363 691 84 702 125 352
5210 352 -89 256 283 169 -118 157 -824 155 182 88 -467 898 491 82 260 840 -405 -324 -328 -501 -187
5231a87R1L15M65q27M80l18j08J31m61l32R61L69K11q20j99N15J68O3om74j57
5252a20j9LO01r79k23P17K45k5K14k38n31L24O80j002P4N23m25M92m25J40o30
5273f04M59lj025J723p25L25J69P15o38j068J669j127J22K62N52j206K20P25j543
5292i98J205kJ95J30p99N57j087N68O46q02P07k79j32j80M10N14p95k15Pm09M24
5313c35J04k29M29P56j176J33M17n13R02J99j126m3M1M82J71n63N00j114J000
5332C5L90p5j16n44m41L68R4O8m73K79k6R25K70j111K81k77k35L44L68M77j157
5353e56R73j132O77J046j226L32j88j8k45K37O11j042p6J412q24k68K35K91J34
5372C73m12j45J60m12L68M12m67l4M42o14R72r20L01k80M17q35R92o54N21p69
$$ plain form
5231 -187 -96 219 684 -143 337 19 -89 42 -419 -751 210 579 790 -30 -229 286 454 517 511 37 -120
5252 -120 -139 -136 465 -514 -737 -20 225 200 414 176 -355 -31 649 -353 -279 244 -181 311 -114 26 -604
5273 -604 -145 -148 -1173 550 -175 150 319 1034 396 -672 997 -130 -8 254 806 -400 -180 545 -998
5292 -998 207 205 400 530 -269 288 -799 -231 415 -387 320 41 -91 -271 139 653 -142 -357 -350 -759 -335
5313 -335 -231 -460 -31 725 -451 -318 99 -414 488 687 -439 -482 -441 41 212 -351 149 -965 35
5332 35 425 350 234 -310 -751 -383 -289 -221 -694 -415 -441 484 754 -357 -76 -353 -588 -244 124 601 -556
5353 -556 417 -715 -38 1008 -218 114 -74 -92 -337 -100 511 -531 -607 805 -19 -287 -52 239 373
5372 373 -39 -184 -24 -436 -68 344 -123 -157 285 -329 643 -277 24 -256 161 -674 318 -336 185 -584
5392e84J132r69j81K91o14J155r8J62q89L22O64n85J284j291r3N70l78K26j77
5411e3M73j26l80M32r76J795o03j035N16n66N71o85K68R5l81J086n70P07m16j08
5431D4O94p64M80q85N59R7L31l22n51l40K73N38K42k79j28l6k6j70K23R8n10L7
5453c95N1N37K35l66r00J317o13J77L35k33M71r25j039J211J02p70J137j63o45
5472d76J208r31Q9O23j116j25J66P83M14m78j004Q59J78m69Q07j140n1J427p91
5491b7j63K05J9q0J35m24m8J77N07n47L09j98o60j0J745r54m07R53p73N81n78
5512b38J006j419K05P77l45q6M85k43j044J526o11m75O20l45k81k98M93nK38K22
5532A82k9j69p90%M66L32j7L36n50O9K54O94m69p27L09O5k37O1M73o61M92L4P3
$$ plain form
5392 -584 548 -421 -602 -311 -925 230 132 294 -595 -273 391 -194 1090 -201 -294 276 -102 124 -53
5411 -53 420 294 -86 346 -630 1165 562 -473 43 -523 48 -637 -369 -274 -655 431 -139 568 152 44
5431 44 738 -26 454 -431 128 225 556 234 -317 -657 -384 154 396 117 -11 -47 -73 -243 -20 78 -432 -395
5453 -395 -344 193 428 62 -838 479 -134 43 378 145 616 -309 -1348 -137 -35 -805 332 169 -476
5472 -476 732 -199 -110 513 -603 -728 -562 221 635 157 -847 12 190 -279 528 -612 -663 764 -27
5491 -27 -190 15 34 -46 89 -335 -383 -206 301 -246 63 -135 -795 -805 940 -14 -421 532 -241 340 -238
5512 -238 768 -651 -446 331 -14 -100 385 142 -902 624 13 -462 158 -187 -468 -766 -273 -278 -40 182
5532 182 153 -16 -806 -806 -340 -8 -25 311 -239 -170 84 778 309 -418 -109 -44 -281 -220 253 -408 84 118 191
5555A91L14r4p96K80j65L58o60N79n72J463j083Q29r48n92K80O14m25J054q33
5574b06N49p29k03J412p41q6k17K06k10m1Q08l30q5M49p94L53j046R38O4n50K76
5595a83O85n82J044q90o08Q80q10P2Q35l17M31p47K56j64N1J47J75L21j372J506
5615G30P61j675m31J136r87n5M31O05p75j92O9O84r23J181l2j375J016o87Q97
5634C78r39N96n33R69m73L73n84l73J83L74k20P34o5L1J36l23o33O3J84n56Q28
5655A50o66P07r72R10K94l10l00L93m85j04j36K71m06R91j70p79J38R93q89L26
5675d4N9O55o51j44M96j18l83j33K2L22L29m69L57p05K49K92o60N13m65M78J34
5696A34J63l94j02L79l78M79n06K37N57j056kM80K50j30K24j27p22K91m17J353
$$ plain form
5555 191 505 411 -385 -105 -270 88 -572 7 -565 898 -185 644 -304 -896 -616 -2 -427 627 -206
5574 -206 343 -386 -589 823 82 -4 -221 -15 -225 -266 542 212 127 576 -218 135 -911 27 91 -459 -183
5595 -183 502 -80 964 74 -534 346 -464 -392 443 126 557 -190 66 -98 -47 100 275 596 -776 730
5615 730 1491 -184 -615 521 -466 -521 -90 515 -260 -452 -383 301 -622 559 527 -848 168 -519 378
5634 378 -561 35 -498 471 -2 371 -213 -586 -403 -29 -249 485 420 451 587 264 -369 -306 -122 -678 150
5655 150 -516 191 -781 129 423 113 -187 206 -279 -383 -519 -248 -654 337 167 -612 -474 519 -370 -44
5675 -44 15 670 19 -125 371 253 -130 -263 -241 81 410 -59 298 -407 -158 134 -526 -13 -478 0 134
5696 134 297 -97 -199 180 -198 281 -225 12 569 -487 -489 -9 241 111 335 208 -514 -223 -640 713
5716G13l77j70k52N21M63j061J98n25J325j621L65K17j23L96M72j014J146j371
5734f98L45M31k19L62m91J64p30J267O55r23J206j805M35K33k27j49m42K57O29
5753C00o30J63r22J224j13j9M12K04q66P58j56j34M08j030j61K79M29m77n21O21
5773b31r8o24Q20J08k11L73K39l7r74J480o59j87O86n54m7L84q96Q3J438j072
5793B1L90j94k73O77j003N02K18QL34j75p95J14p15M55J37J082l02j079K73K70
5813e5L21q68P40p4O52j386K49O1J21M93q9n08N79o19M87j6k25M9R69q22K84q28
5835d85O20m25P49j214K10J310k56p65O51r20L14j16L40O5M3m45p67Q4J96P66
5855d5J4Q26p51ML64n16o9M17J00L1r43L31M76J95q6R8j72l03k2m3M53n96L74
$$ plain form
5716 713 336 166 -86 435 898 -163 35 -490 835 -786 -421 -204 -327 69 541 -473 673 -698
5734 -698 -353 78 -141 221 -270 -106 -836 431 1086 163 1369 -436 -1 232 5 -144 -586 -329 300
5753 300 -330 -167 -1089 135 22 3 415 619 -247 511 355 221 629 -401 -562 -283 146 -331 -852 -231
5773 -231 -329 -953 -133 -25 -236 137 376 339 -635 845 186 -1 685 131 84 468 -428 -345 1093 21
5793 21 411 217 -56 621 -382 120 338 346 680 505 -290 -176 -891 -436 -299 783 481 -598 -325 -55
5813 -55 266 -602 138 64 716 -670 -421 -360 -239 254 165 -343 236 -383 104 88 -137 -88 881 59 343 -485
5835 -485 135 -290 459 -755 -545 765 509 -256 395 -525 -211 -327 13 78 121 -324 -1091 -1007 -811 -45
5855 -45 -31 795 44 48 412 -104 -173 244 344 375 -568 -237 239 434 348 446 274 -29 -51 -94 359 -237 137
5878A37n90N51l84M95q41K92P58k74K69m35P59m54l32m91K74M15R2M02n35n99
5898d91K39M08j87L03J88n05q46M70P19j6o04L71P6q15P27M44j33l05j80q8J177
5919I52r81p40J168l14m5n00J3K54l83N92J38J09o60Q09J14o14L51p10Q48j020
5939f19l27J085k85L97R5n27J061k38o97L36L8p03M62m09R88o37m26R66j042n10
5959i92J630r35L95m7k63J406p00j254P04L83N1o21N2n19P69L42o13o67N57m80
5979h02l08Q1J102l78j51L48o02J610r29j70M64p78n77J020L92K2j300R73L34
5998C51m91p4J82K53n07J260j565K51O09l20O64j088m09R44L89l98m46l73Q59
6017I1n60o9J255m88m21L86%l7q1O10j127N31Lk78L95n79O29KM9j66k82k09K54
$$ plain form
5878 137 -453 98 -286 209 -632 -340 418 144 413 -22 737 283 -49 -540 -266 149 241 643 108 -491
5898 -491 -252 156 -31 272 460 -45 -891 -421 298 282 -322 49 125 -690 37 481 348 43 -137 -225 952
5919 952 -29 -769 399 85 40 -460 -447 -193 -576 16 154 263 -397 412 526 -88 263 -447 401 -619
5939 -619 -946 139 -146 251 346 -181 880 642 -55 281 319 -384 78 -331 657 20 -406 560 -482 -992
5959 -992 638 -297 98 51 -212 1194 494 -760 -56 327 378 -243 -191 -710 59 401 -212 -879 -322 -802
5979 -802 -1110 -1029 73 -305 -456 -108 -710 900 -29 -199 265 -513 -1090 -70 322 344 -956 17 351
5998 351 -140 -214 -32 221 -286 974 -591 -340 269 -51 613 -475 -884 60 449 51 -395 -768 91
6017 91 -469 -538 717 229 -192 194 194 157 76 686 -441 90 93 -185 210 -369 260 262 311 145 -137 -346 -92
6040i2l44L73J09l41P37K72q35P83l38K68m46K20l26J31K96o71k71J185j86j90
6060C34n70n46N54J3l53LK53L30j74j37r4N64J16K93r94K65P17j249R03j033O46
6081a59L9O14r36j44R59l84K56k24P2j9k05j0J45r9L18p03R01p82j20K33j74N84
6103A62r19Q80n25P82p43j29J299j440P44N40K30m14n90k11o4N04L33J14m07m21
6123b75M35n62j97L52N92p58k89J467m60j373K72N48j01j88M68J17o95O91m27
6142c83K17q82J279j09p72N87k07K2j81N68K2J9j072P90j63j07L53m51L09N9M30
6163C28J43J60j139N62j00L46k46M45p84N74n81L42m9L51j031J341o48j86l26
6182d98L11j91L4J143j032L86k57K11O6q2l84O93p78N83M14k31j057N74J97N55
$$ plain form
6040 -92 -436 -63 46 -295 442 714 -121 662 324 592 146 366 40 171 467 -204 -475 710 524 334
6060 334 -236 -782 -228 -215 -568 -565 -312 18 -156 -293 -387 177 293 586 -408 -143 574 -675 228 -805 -159
6081 -159 -120 494 -442 -586 373 -11 245 21 93 74 -131 -141 4 -95 223 -480 421 -361 -481 -248 -422 162
6103 162 -757 123 -402 380 -363 -492 807 -633 111 651 881 467 -123 -334 -398 106 439 553 146 -275
6123 -275 160 -402 -599 -247 345 -413 -702 765 305 -1068 -796 -248 -349 -537 -69 48 -647 44 -383
6142 -383 -166 -1048 231 122 -650 -63 -270 -248 -429 139 161 180 -892 -102 -265 -372 -19 -470 -161 -102 328
6163 328 471 631 -508 54 -46 300 54 499 -285 289 -292 50 1 352 -679 662 14 -172 -498
6182 -498 -187 -378 -344 799 -233 153 -104 107 173 91 -293 400 -378 205 619 388 -669 -95 102 657
6202F57j212P13L9l7J26J47K06J4q33K66m49n45P90R13p12N06j056j272J654L76
6222B91O5k8l23N17k41q52Q64L9K31k53n51P79m73r37k48J200r81Q31n23L1R5
6243d67R9j48J109n47m98o06J532J29j097L49l7j34k33K09M16M03n07Q73j281
6262d36k34J246l69J29q32q7J297j130N39M56k59M84m14l16l05M61k65p16o63
6281a414M36J533p72O78o51k74L67q66Q00K28k28K75k15p24P32P1K65p83P71m91
6301b62P09O53r65n67N01j76k69N89p41L23k20M68j20O05m21k24K09N26j019J039
6321F38q77J84m9K54Q6o92L4l1N36P5k31m69Q60J42r56O13o68j30J05M80L43j02
6343A45P63j194o6J53M2j36P83pk41m81P69n16m88O48m43N49k14k31p7P04J67
$$ plain form
6202 657 -555 158 197 160 286 433 639 653 -180 86 -363 -908 -118 795 83 589 -467 -1739 -85 291
6222 291 356 328 5 522 281 -571 293 332 563 310 -241 538 65 -872 -1120 80 -901 -70 -593 -562 -467
6243 -467 -368 -516 593 46 -452 -1058 474 603 -494 -145 -182 -316 -549 -340 76 479 -28 845 -436
6262 -436 -670 576 207 336 -496 -583 714 -416 123 579 320 804 390 74 -231 230 -35 -751 -1414
6281 -1414 -978 555 -217 461 -190 -464 -97 -963 -163 65 -163 112 -103 -827 -95 -24 241 -542 229 -262
6301 -262 447 1100 135 -432 69 -107 -376 213 -528 -205 -425 43 -77 528 107 -117 92 618 -401 638
6321 638 -239 -55 -104 150 236 -456 -422 -453 83 158 -73 -542 318 460 -496 117 -551 -681 -576 -96 247 145
6343 145 908 -286 -352 -199 -157 -293 490 483 242 -239 530 14 -474 174 -269 280 66 -165 -242 462 629
6364F29q85L85q74O74l82O1J232j058N22o90L45K47j3K30l21J033j268K04N61
6383F32r79Q25J00q07K79L29k57L83m78L68L92j067J028m51K00p33R98r13o01
6402g52K53R4P40K32K66r19P47j144K76K45m40P13J05p29O33j170M38Q66j58m1
6422B55M2q39J394l87R0j020K89N3P66o03l32J005j188M95m64k54O16J74n37N53
6442A08L43m64M44k33K73p68o13O00K47J44l20l32K22P59l46k24L20o28P77k01
6462A08m64K4QL30k04J020q17m16j1M15o92O39k43l10J054j022L5P93j188J081
6482A40p54J742j125J0J24k24m61N91Q8P8L09l59K04J83Q4l14K59m68l25J426
6502A208j961Q60K46l82N90n30p3l4l22P42m28O10l88j014Q62p2N56r22P02n23
$$ plain form
6364 629 -256 129 -745 -71 -453 -392 840 -218 304 -386 -41 206 193 423 102 1135 -133 71 632
6383 632 -347 478 578 -229 50 379 122 505 27 395 787 -280 748 297 497 -236 762 -151 -752
6402 -752 -499 -405 335 567 833 -86 661 -483 -207 38 -402 311 416 -313 320 -850 -412 454 296 255
6422 255 297 -542 852 465 555 -465 -176 -123 643 40 -292 713 -475 20 -444 -698 -82 92 -445 108
6442 108 451 -13 431 198 471 -297 -910 -310 -63 81 -239 -571 -349 410 64 -160 160 -468 309 108
6462 108 -356 -332 -324 6 -198 822 5 -411 -422 -7 -699 -60 -303 -613 441 -581 -546 247 -941 140
6482 140 -614 1128 3 13 137 -87 -548 43 131 209 518 159 363 546 630 316 575 107 -218 1208
6502 1208 -753 107 353 -29 561 31 -42 -76 -398 344 -84 526 138 -876 -14 -86 470 -452 250 -273
6522b73m6L30J86K0l02KJ58M26p1j014J074k90L97l37r63J657q48J4k74J030q95
6543a9j7l5J68k1j141K081j313Q95o70P09j020L86K60j51l12M34j34R6k88n74
6563f66O45p0R55j875O58K26P95o33M2k8o54J045j003K11q7P31n37l9j22R28k48
6584B74o04k5Q88j70L51q31j17O22l05O23o54M04p05O53m95o33K72k69N35N76
6604C90n55N53o33N19m46N96k79o20O12m94J54L37N2R96r41L80o32L76J08j33
6624C40o33j59Q63N57p83j043R61K27p84j21k6L53j23l39P69O29l35m06N50p53
6644b56J22J91Q72o88M45p20j138L52J145o07K16L9m65Q72k79K14o21l9N42J69
6664C66N20j375K39L60l29n31K98J69N98L82r33l51J080j091M69J262r96l60l08
$$ plain form
6522 -273 -319 11 197 217 -85 -83 75 501 430 -584 490 200 597 260 -703 954 106 120 -154 876 -19
6543 -19 -36 -71 97 76 -1065 1016 -297 598 -72 637 -383 3 263 112 -200 234 100 196 -92 -666
6563 -666 -21 -91 864 -1011 -353 -127 668 35 77 49 -605 440 -563 -352 -439 292 -245 -284 -406 522 274
6584 274 -330 -355 533 363 714 -117 -234 388 83 706 52 456 -249 404 -91 -724 -452 -721 -186 390
6604 390 -165 388 -245 274 -172 424 145 -475 137 -357 -203 134 186 1182 241 621 -11 365 473 340
6624 340 -293 -452 411 968 185 -858 103 330 -454 -575 -601 -248 -371 -710 59 688 353 -53 497 -256
6644 -256 -134 57 929 241 686 -34 -1172 -820 325 -282 -66 -27 -492 380 101 315 -306 -345 197 366
6664 366 886 -489 -250 110 -219 -750 -452 -283 315 697 -236 -587 493 -598 -129 1133 137 -223 -531
6683e31L90K86L08j014N89P20n04m83m1j58J008m18k15O96l64l25K7L7N58j046
6703d80O39r5l01o5k42M01j34l66J64N27R03j056r4O28q28l8J429n65m25J44r4
6724E2k40L2M42J42L47j627l43J753k63p69L35m19M54J0K05q54P89L3R4j12n72
6745e11j8O28j109M36L56N22n84J81l15k30P36j224R48J195j329L50k23N26r58
6764f23P02m45O78m97m53J271j642Q12R91j100O02N7j112P46L99m64n24L05N71
6783B74L50p29J86K85r91K27P29K63n75r29J489j175J405q40N8N80n49j02L90
6802C46p95o24O13J11j03N82q83O43n34P18M5o71L44O98k30K57k67j96M25K9o64
6823a56R28K7q48m96J459j869L85Q56Qp94M31O44q66K03J3N96p64J37M1M36j562
$$ plain form
6683 -531 -141 145 453 -561 28 748 244 -239 -280 -438 570 152 -63 633 269 -56 -29 8 566 -480
6703 -480 159 64 -237 -302 -544 -143 -277 -643 -479 48 951 -105 -199 429 -399 -437 992 427 2 146 52
6724 52 -188 -156 286 428 775 -852 -1195 558 295 -474 -139 -558 -104 -94 111 -743 46 79 173 61 -511
6745 -511 -529 99 -1010 -574 -218 304 -280 -99 -414 -644 92 -1132 -184 1011 -318 32 -191 335 -623
6764 -623 79 -366 312 -185 -638 633 -1009 -197 794 -306 296 353 -759 -13 386 -78 -602 -297 274
6783 274 624 -105 81 366 -625 -398 331 594 19 -910 579 -596 809 -31 27 607 58 -44 346
6802 346 -449 -1073 -460 -349 -452 130 -753 -110 -644 74 119 -552 -208 490 260 517 250 54 479 508 -156
6823 -156 772 799 -49 -545 914 -955 -570 286 294 -500 -69 575 -291 -88 -75 521 -243 -106 -65 371 -1191
6844a191J231k14O30m72L10R4j042M76J041p29O48q58Q16j105N94J36K70j65j309
6863h39K98l01R1O76M32J65l86m0o9M32M66j237R06J47l3K27q85K79k44j90Q24
6884G19j290J35O39l47J90p21N65n32O14M40m79k0Nj61o8j98o25J131K87r1n67
6905c74j1M78j47k02Q31m57j44M39r23Q37k19l77j52K70j39K61j30K38P0P0r9
6926A20L43k05J17L52o3k96n73P6nN03n36L12Qn0l88L60O14L19j174o40J335p06
6948a77L59j96l67P1Q79q67M66K33j327J395m12K19n85M31O03r22M94K21j086
6967e68R86kl60j31L51j18N0K09j26o06N40l68p00Q12o5m31L19J148r88r1j09
6988b48o28P46L47k54M32l69j04pj1M64r2n77J166L96j691L43P84p26J23O1P6
$$ plain form
6844 -1191 40 -174 456 -16 294 388 -654 -178 863 134 782 -76 740 -365 229 365 635 470 -839
6863 -839 -541 -842 -751 -75 357 522 136 96 27 459 925 -312 594 741 708 935 50 329 85 -105 719
6884 719 -571 -436 203 -144 46 -675 -110 -642 -28 412 -67 -87 -82 -243 -311 -509 -1134 -3 284 193 -374
6905 -374 -385 93 -54 -256 575 118 -26 413 -510 327 108 -269 -421 -151 -290 -29 -159 79 149 219 120
6926 120 463 258 375 727 664 368 -205 -129 -134 369 -167 145 153 103 -285 75 689 1008 -166 -806 529 -177
6948 -177 182 -14 -381 -310 569 -298 168 401 -926 469 57 276 -309 122 725 -197 297 518 -568
6967 -568 418 416 56 -75 276 158 208 417 291 -315 225 -143 -843 -31 -96 -527 -208 940 -48 -139 -248
6988 -248 -876 -130 217 -37 395 26 -78 -85 -96 368 276 -301 865 1261 -430 -87 697 -29 94 155 231
7009B31l87L51L33k51K88k68K92M07j049k90M6P1P12N71p61N7K08n68P19K47j089
7030a30k63N43Nj289P85p7Q61l95J84J64n80O15l24o18p8K94O95r47r1Q10J96
7051C60n04jJ88K28k29M7r23J101O28j146O12l51l76P10l91K06P36r81j74M64
7071B04k41L64m30K58l47J074q37Q49o95o7l37J59q25R13n01J19J72k68J69R97
7091G30r83J146j575K84L94M66Q7l7m11m5o8p42L54m20J406j183R37m98M43n6
7111B29m90n23J517o47P0M1q7k12K70o01k2K95j13M13o99O73j739J349l52J000
7131C72J10n80M75j113J983r35o92K02Q0M89l85n04N36p75R03l33l72P05L93k32
7151C27r56R04j004J134M61p72l71O08o41j37R14o86R44n41j14n10q16J939p15
$$ plain form
7009 231 -156 195 528 277 565 297 589 996 -53 -343 -297 -226 486 1057 296 353 561 -7 712 959 -130
7030 -130 -393 150 155 -1134 -349 -426 435 40 224 388 -192 423 99 -519 -597 -303 392 -555 -646 164 360
7051 360 -144 -145 43 271 42 89 -834 267 895 -251 361 10 -366 344 -47 159 895 -86 -260 204
7071 204 -37 327 -103 155 -192 882 45 894 199 132 -205 -46 -871 42 -459 -340 -168 -436 -267 730
7091 730 -253 893 -682 -398 -4 462 549 512 101 56 -12 -754 -400 -820 586 -597 340 -158 285 229
7111 229 -261 -784 733 86 156 197 110 -102 168 -433 -455 -160 -273 140 -559 114 -1625 -276 -628 372
7131 372 482 -98 377 -736 1247 312 -380 -178 -98 391 6 -498 38 -737 166 -167 -539 166 559 327
7151 327 -629 275 -729 405 866 94 -277 331 -310 -447 467 -219 725 184 70 -440 -1256 683 -32
7170c2J76j8n63J016J05m07J45p02j17K37J28m73N15m61R5J35m7J279j433l51
7190g73J844j812N00Q43j186L28O61J63n99k84m7R15j007R34l36n90O56k74L80
7209C16j40M29k64j26l02Q5R9rm08L00M02o18j17Q36k65J93o38M47j23j09j12
7230a24k78M98K94K97j53n60Q76j320J130j13n52N94q18K09O86L51p10k63K03
7249B47m64N90q26k86P86k17O29o56J155j084k79R93n97k66N15l65L03j009L53
7268d78O75q65J006L87r05N75j258O22l78J409p30L0N7q26O37J17m31M88O61m89
7288C04l69j57l5o84N57M33K30k3J21P9l96Q3j52P80r51P7m27L15L09k17j65J2
7310b76J754j668M25l23R82m70o59K68Q3Q3M39p06K23L90j92k86O48m08q8L78
$$ plain form
7170 -32 144 126 -437 579 684 277 422 -280 -397 -160 -32 -505 10 -451 -356 -221 -268 1011 -422 -773
7190 -773 1071 -741 -241 602 -584 -256 405 568 -31 -315 -362 553 -454 480 144 -446 210 -64 316
7209 316 176 605 341 215 -87 -2 97 88 -320 -20 382 -236 -353 483 218 411 -227 220 97 -12 -124
7230 -124 -402 96 390 687 534 -26 850 -470 660 547 -5 589 -229 -20 666 1017 307 44 247
7249 247 -217 373 -453 -739 47 -170 459 -197 958 -126 -405 588 -9 -275 240 -125 178 -831 -478
7268 -478 197 -668 338 725 -180 395 -863 -241 -619 790 60 90 147 -679 -42 75 -356 132 793 304
7288 304 -65 -222 -257 -941 -384 49 279 256 377 456 60 143 -9 771 -180 -103 -530 -215 94 -123 -288 -276
7310 -276 1478 -190 235 -88 894 424 -235 33 116 199 638 -68 155 545 353 67 715 307 219 597
7330E97k152J522J70k38J097o33j100N71J54P2j10R32M9o57o01J33N32l75Q3j81
7350a35P9J46J69q09J389q36m74J86J74p18J030K03n5l40K33K56j77n7l05l74
7370d15L87n8K7N29j221N07L59J4j81j180K22J871p44J04k94j18J63q5P33M8r92
7391c24J492j363L1L69n21o44J621l52p60L76l94Q21n75m12L52M71M13r74P95
7410D22J62p53N77j087J111k29j12n50R68o01l01L37K88o46M16k75J02J6j1L31
7430A65j49M06n3o69K13lo1M24l53k55R93m43Kl6L7j12n93J220j087m89P43M20
7452C20M7o12P6M52o76L66j040J644o09j72K8l91R73m62K49P2j08L22k02O92n65
7473D04j341R75k87M72L17p92j96M62L4l88K77J21L08n50m47L55O45J1m78O85
$$ plain form
7330 597 -1555 -33 137 -101 996 363 -737 -166 -12 60 -50 882 931 274 -327 -194 338 -37 46 -135
7350 -135 -56 90 259 -550 839 3 -471 -285 -111 -829 201 404 349 9 242 498 321 264 -41 -415
7370 -415 -28 -86 -59 470 -751 -244 115 129 -52 -1232 -1010 861 117 221 -73 -191 -28 -113 620 668 -324
7391 -324 1168 -195 -164 205 -316 -960 661 309 -451 -75 -469 352 -223 -635 -283 188 601 -373 422
7410 422 584 -169 408 -679 432 203 91 -459 509 -92 -393 -56 232 -414 2 -273 -171 -155 -166 165
7430 165 16 422 369 -300 -87 -90 -151 273 -80 -335 658 215 217 181 218 106 -487 733 -354 -843 -100 320
7452 320 367 -245 -169 283 -393 -27 -1067 577 -32 -204 -176 -567 406 -56 193 265 157 479 277 969 404
7473 404 -937 38 -249 223 540 -252 -448 14 48 -340 -63 58 366 -184 -631 -276 369 380 -98 587
7493E87n4J31p93K31r8K09Q8n98L99l25K51o14M00P19O11j792R49n27N25K2q96
7514e75O35j69k43N31j17K64o68O79K37p75P17q30O16r14J013j17n58J83p36Q42
7534A5M37M43r47N98l79J36m23r9N17K57J61r60k80j75Q02L17K21n17M08k56l79
7555a03P73k012J729r78N20p0M89p90J033n30k96L94j17m34J049j049M49r2J5
7574b0m62j1k26J010J03J2j392M78L61m79J268o73j256J262q98J104l66O36O1
7593E12j4o14O29m21M76j070K13j84L6O46m51O90n66o72M05L86L71j97l77J181
7613I79o61m8j6l85R2P63j388R25L1o80p7M82m53o8O35O05k078J215l73J187k27
7634D60p94j42p5O68n81R00n21l03Q16M38o29J29n54M7n3PL96j17P8O4j79o61
$$ plain form
7493 587 533 664 -129 102 4 213 301 -297 102 -223 28 -586 -186 533 1144 -648 301 -226 299 321 -575
7514 -575 60 -109 -352 179 62 326 -342 337 574 -201 516 -314 302 -612 401 284 -274 -91 -827 15
7534 15 452 895 -52 546 167 303 -120 -219 298 555 716 -244 -524 -699 103 420 641 124 532 276 -103
7555 -103 670 -1342 387 -591 -71 -141 348 -442 591 61 -235 159 42 -392 657 -392 57 -35 -20
7574 -20 -482 -493 -719 291 394 406 -986 -508 -147 -626 642 -31 -1287 -25 -923 181 -185 451 512
7593 512 498 -116 513 92 568 -502 -289 -473 -437 209 -242 448 -118 -790 -385 1 372 175 -202 979
7613 979 318 270 254 -131 -39 724 -664 261 292 -388 -465 17 -436 -504 131 736 -1342 -127 -500 687 460
7634 460 -334 -476 -551 117 -464 436 -85 -388 428 866 237 366 -188 -141 -194 -187 209 92 170 234 55 -606
7656f06P24J49K45l68P2L11r46J652j798M32o98Q39J10j92k4R0R6N3q19O62P0
7677E4m35O13l00k84L5j39J46P51j418R70L02n74O14m70M05r97P46L60K83m89
7697A73j62L2l40O90k79o00M51J005j035N07nM7M50j190J188j048J30Q96L17q14
7717D13l95K99q25l18L05K01K99j24K81J06r96Q98k99M53J77n9k08M16o53P14
7737F85l95K09n2q71J267j204O8P2k76L25J80o63J51M65k68n25O42P26J78n46
7757A68M68l32l93J83j61J51n53R25m40k59K93j112J310K57J01n10Q68n46p81
7776c63L42J21O4p30L75n6J90K59n03j00J15M83K16m17l7L26K90j005k77J107
7796D00n80O59n77N78r07k5J159r04M29p84M21n0R71l51o78L64O5o19M31K39J3
$$ plain form
7656 -606 118 267 512 144 216 527 -419 1233 -565 -133 -831 8 118 -74 -98 -8 88 141 -678 -16 54
7677 54 -381 232 -68 -352 -317 -456 -310 441 -977 -7 295 -279 335 -135 270 -727 19 379 662 173
7697 173 11 43 -297 393 114 -486 -35 970 -65 442 437 484 934 -256 932 -116 14 910 1227 413
7717 413 18 317 -508 -826 -521 -320 -21 -145 136 242 -754 144 -155 298 475 416 208 624 -29 685
7737 685 290 499 447 -424 843 -361 -293 -221 -497 -172 8 -655 -504 -39 -307 -832 -190 536 714 168
7757 168 636 304 -89 94 -67 84 -469 456 16 -243 50 -1062 248 505 606 96 964 418 -363
7776 -363 -21 100 164 -566 -191 -247 -57 202 -301 -401 -286 197 413 -4 -41 285 575 -430 -707 400
7796 400 -180 479 -98 480 -427 -452 707 -197 232 -552 -131 -181 790 439 -239 125 190 -429 2 241 254
7817B54n29m85M12oO11O11j115O78K1q84J77j43k69L91N60r87J044L03q79j83
7837d18O49n3J69n45j93o82J593j153L75O33l98P1J113p18p12R95k23m11n15k10
7857f33J70M76J96L06q71J694o79p18j51j3P51j043K058j785j71r0Q22k02M70
7876E87m66N08m12N9J92o10q9j98J20l03J201p30N06o35L92K26m36n19M11M68
7896B72n42P67j084J107p32K90Q67j027O45q08L88L17o39K5K5J105p80m14J259
7915A041j513J412j93n90j98o02R68J75L9J001j678K38k27J41Q78p83m70P60m44
7934d5J61p30M75K82k09k57Q10k1o07N37p85O51j000M00k15L62J28j43R05p67
7954f8k90K73K95l30o23J107r7k43L54q76J0N04O55j089R44K97j492P6j57J359
$$ plain form
7817 254 -275 -760 -348 -354 257 868 -247 431 452 -432 -255 -398 -667 -276 284 -703 341 644 -235 -418
7837 -418 231 178 347 -198 -391 -1073 520 -633 -258 375 -23 48 1161 443 -269 726 503 92 -423 -633
7857 -633 -463 13 209 515 -356 1338 659 -59 -210 -223 528 -515 1543 -242 -413 -503 319 117 587
7876 587 121 629 217 276 468 -142 -231 -429 -309 -612 589 -141 365 -270 122 348 -88 -607 -196 272
7896 272 -270 497 -587 520 -212 78 945 -82 563 -245 143 460 -179 -154 -129 976 196 -218 1041
7915 1041 -472 940 747 157 -41 -643 325 500 539 1540 -138 100 -127 14 892 109 -361 399 -45
7934 -45 116 -614 -139 143 -66 -323 487 466 -141 396 -389 262 -738 -338 -553 -191 -63 -206 699 -68
7954 -68 -358 -85 210 -120 -743 364 267 24 378 -498 -488 16 671 -418 526 823 -669 -593 -750 609
7974F09j402J129r1K71n17r2Q48o34K38q97Q70p4J76k90n36rP95J75j259r6O91
7995i5L61r1q0j030Q87l05K30K28L38p05Q9L73j80L88o50Q54n59r27J071j272
8015a075L50J619j518J175o12L60r71N52L1O24L58q04N46n69j66Rl08J25R94n21
8035A99p60R02k56k37N82p37N23r41O99k67m3o49J324M4q16L23P89j008R95j98
8055D68j95J29l70J4k33M46m06O18j053J408q34m32J60J476j118j47M59q65J460
8074I85p47O99j384M20k33K73m5P36l31O77p27r80J265l69o31R04n3j391J391
8093D59m86r1Q85j7j123L34O74q76lP67j8m04j23M28j29n20M7J8N77k61K82o41
8115b21J56K48J35n04k99J026m05L29q03O43r5l50N21J57o25q08P85l41J61O39
$$ plain form
7974 609 -793 336 245 516 -1 -93 755 121 359 -538 332 258 434 144 -392 -401 394 569 -690 -786 -95
7995 -95 266 175 95 -935 -48 -353 -123 105 443 -262 -173 200 20 408 -242 612 53 -874 197 -1075
8015 -1075 -725 894 -624 551 -61 299 -672 -120 -89 535 893 89 635 66 -100 -91 -399 -274 720 199
8035 199 -561 341 85 -152 430 -307 216 -725 -26 -293 -336 -985 339 383 -433 -110 679 -329 666 468
8055 468 273 402 32 46 -187 259 -147 471 -582 826 -8 -440 -280 1196 78 -69 390 -475 985
8074 985 238 937 -447 -27 -260 13 -32 704 373 1050 323 -657 608 239 -392 512 459 -932 459
8093 459 -27 -118 767 750 -373 -39 635 -241 -244 523 505 101 -22 406 277 -243 -196 -178 399 138 420 -221
8115 -221 -65 183 318 -186 -485 541 136 465 -338 305 210 -140 381 538 -87 -895 -110 -451 -290 349
8135C49k77M88n92k65P83p76K88J75m48J91K37R2l46K42J78n26N92N71l38j765
8155a147J60P15M76k69j56j78o3J25M45M19m50J70l12N70K80j208O66r88R29m34
8175b50K25M6M03j92o87Q09q08K77LL96r60O58J242j164Q33n58
$$ plain form
8135 349 72 560 -32 -297 486 -290 -2 173 -275 -84 153 245 -101 141 319 -207 385 956 618 -1147
8155 -1147 -987 -272 204 -65 -221 -399 -462 -337 108 527 77 247 -65 505 785 -423 243 -745 184 -250
8175 -250 -25 21 424 232 -455 354 -454 -177 -174 222 -738 -80 1162 -2 831 273
8191B73
$$ Imaginary data points
##PAGE= N=2
##DATA TABLE= (X++(I..I)), XYDATA
0@%%%%%%%%%%o4J28j28J28j92K56k57L21m48N13n77P05q52J043j217J410j666
27h97J922k220K546k901L336l802M303m859N467o148O903p726Q616r593J0672
42E619j1849J3124j4522J6049j7716J9546k1543K3730k6148K8808l1748L5027
54A8377l8688M2808m7489N2847n9045O6332p5044Q5660r8945J16138j39368J72695
66I6278k24854L18735n40462K005389J845279l242522j314602N53617R09287r01865
76d95720o42573N27806J062700L3880k33270q1323j41172n98000K7463P37025
86A96816M00639o46781l87677N24287M48465n90682n29630M30276N55094l68289
96C2518l35907O74803O52737q67168j364642J70691J436870M69177r38091n44641
$$ plain form
0 0 0 0 0 0 0 0 0 0 0 0 -64 64 -64 64 -128 128 -129 192 -256 257 -320 385 -467 576 -641 769 -897
27 -897 1025 -1195 1351 -1550 1786 -2016 2287 -2572 2895 -3253 3650 -4076 4540 -5053 5619
42 5619 -6230 6894 -7628 8421 -9295 10251 -11292 12438 -13710 15098 -16650 18377
54 18377 -20311 22497 -24992 27855 -31190 35142 -39902 45758 -53187 62951 -76417 96278
66 96278 -128576 190159 -350303 1655086 3500365 257843 -1056759 -503142 406145 -495720
76 -495720 -1138293 -610487 452213 486093 252823 171500 30328 -567672 -540209 196816
86 196816 597455 -49326 -437003 87284 535749 -54933 -584563 -154287 400807 32518
96 32518 -303389 371414 1024151 156983 -1207659 -1036968 399902 869079 -69012 -613653
106f13653P21653O09268n00196p12829M1988L11265J9604J41778M89049P9590
116E87517o35365l99761M50787M10925m51817n61691L48970P52814N2030n21651
126C2758k49371J6495j96579p0844N80315N96884l35546p75521L4577P12174P9304
137D24646p64032l40928O48724O04463k53567m72438O1999K16142j71483j85555
147b32029K45365K29348k63895l00987K53078M10750j44991n00375j14559L50068
157f8227K76854R201l7456r0403k64220j30863L12037L25089k47370m57529J66704
168b06183O37393J18059o23812m45841L06334M52337p6811l10750L1398K35460
178A17584j5727j78293K1126J15920j07351j77958J33277L32972P8879k51917
$$ plain form
106 -613653 108000 717268 217072 -495757 -453769 -142504 -122900 18878 507927 587517
116 587517 -47848 -447609 3178 414103 -37714 -599405 -250435 502379 554409 32758
126 32758 -216613 -200118 -396697 -467541 112774 709658 374112 -401409 -366832 345342 424646
137 424646 -339386 -680314 -31590 572873 319306 -153132 -91133 125009 -46474 -232029
147 -232029 13336 242684 -21211 -322198 -69120 341630 196639 -303736 -418295 -68227
157 -68227 208627 217828 180372 89969 -174251 -305114 6923 332012 84642 -372887 -206183
168 -206183 431210 549269 -74543 -520384 -214050 238287 161476 -149274 -117876 117584
178 117584 101857 -76436 -55310 60610 -46741 -224699 -91422 241550 320429 68512
188F8512k31692j5485J02149J18458R1050o1128k14046n1963K96741K51661k52512
199A01745m64814K9940N15635K30289l83340l90044J46167L72058M0858k40175
209d1681j00277J25154R5383j4790P320K3069r3988j51502K613J56353R9918m3483
221F4089q0823l6070J5318Q0769Q6490o8479k18650p3523K44222K59679j21018
232A52004l61789p5526L33456K60471j64172l09574j5029K29774J19035j06560
242F2090j45237l7568M7466Q0567Q3597J4552r2777j05738J2765J06950N3723
253H0390n8388q4733k0831N0156Q6165N6565n7276j46017m3728J59341J69840
264A91484p1339k35708q0373J78191J78358n6888j84646n5826J12921J11653K072
$$ plain form
188 68512 -163180 -178665 -76516 41942 132992 71864 -142182 -194145 102596 354257 101745
199 101745 -363069 -333129 182506 412795 29455 -360589 -214422 157636 198494 -41681
209 -41681 -141958 -16804 78579 63789 71109 94178 190 -151312 -148699 7654 107572 64089
221 64089 -16734 -52804 -37486 43283 129773 61294 -157356 -230879 13343 273022 152004
232 152004 -209785 -285311 48145 308616 144444 -165130 -180159 49615 168650 62090
242 62090 -83147 -120715 -73249 7318 90915 105467 12690 -93048 -80283 26667 80390
253 80390 22002 -62731 -83562 -33406 52759 109324 52048 -93969 -137697 21644 191484
264 191484 120145 -115563 -195936 -17745 160613 103725 -80921 -136747 -23826 87827 89899
275H9899o4873o4308l9886K2321Q8012N9992n6138j10169k1417J07036J05930
286A16399k6433j34885q6549O6783J48654N7084j11358j56766p732J65101J26186
297A56484q3173j82246l1073J53951J25202o0935j42914l9671Q2195P7624m054
308E1390m6326k5893p218K743K8493M7185o12p1446o0984L7004J07111M6536r1055
321A6928j28717L179J46904J07375q1756j73132l3832J56041J43468n8312j83827
332h5681o4468J31488J42765k9819j44099o1306P9216R9781p11p2695m3201K3396
344b5334L6754Q771o168k670j5859l1498r95N1525M7294k6311q2506l1481P5982
357b496R4996j9863j20358o2617Q2210J17620j122j17632q0068O2211J17853K1573
$$ plain form
275 89899 25026 -39282 -79168 -56847 31165 91157 35019 -75150 -96567 10469 116399
286 116399 89966 -44919 -131468 -64685 83969 141053 29695 -127071 -134803 30298 156484
297 156484 73311 -108935 -140008 13943 139145 78210 -64704 -104375 -22180 55444 51390
308 51390 5064 -20829 -28047 -25304 3189 50374 49762 -21684 -82668 -45664 61447 107983 16928
321 16928 -111789 -108610 38294 145669 63913 -109219 -143051 12990 156458 98146 -85681
332 -85681 -150149 -18661 124104 94285 -49814 -111120 -31904 67877 67166 -5529 -48730 -25334
344 -25334 11420 20191 14023 11353 -4506 -36004 -36999 14526 61820 35509 -46997 -78478 -2496
357 -2496 92500 72637 -47721 -110338 -28128 89492 88370 -29262 -109330 -47119 70734 92307
369I2307r3871p8116K9296Q4361L1700m7341n7895l670M1339K9291m250k0473
381B678j7387q857J0875K9422K1336k0699m7688j7208M2408N3701n164o5287m1044
394f2914L9449P0393J0208o0780n2612J8938O1787K7870l5696m9948n518L6000
406b823L0838m597k6020k2017K381K5867K4647k685l1002k9424O759M0789L0336
419D3049k1614n0230j5508M4148M8286j0574n9163l1615L8444N5564j339n0997
431a1549l2741K8016L9889K353k5568j6147P540J1563Q69j118K777n882j5573
444a5571l878K4093K4332p762l5645j8587K3457M1528M466m5661m1077K3118O2159
457C4972J7247n4091n2950K2447O5450J9969n0197m6441J9892M7138L777l3579
$$ plain form
369 92307 -1564 -79680 -50384 33977 65677 18336 -39559 -43229 -1890 27401 23151 2678
381 2678 -14709 -23566 -12691 16731 38067 17368 -30320 -47528 -5120 48581 43417 -21870 -62914
394 -62914 -23465 46928 57136 -3644 -56256 -37318 24469 52339 16643 -33305 -38823 -2823
406 -2823 28015 23418 -2602 -24619 -22238 3629 28276 25591 -5411 -34835 -28076 12713 43049
419 43049 21435 -28795 -44303 -155 48131 37557 -21606 -53221 -14777 40787 39448 -11549
431 -11549 -44290 -16274 23615 25968 400 -15747 -8207 3356 4225 3107 5884 2 -15571
444 -15571 -19449 4644 28976 21214 -14431 -33018 -9561 31967 36433 -9228 -50305 -27187 34972
457 34972 52219 -1872 -54822 -32375 33075 53044 2847 -43594 -23702 23436 27213 -6366
469f366j7148J5240J6818r98n422K919J567j0412j1197P744J8527N730j6439k0178
483a9615j6K6017K4172j4420m4170j0446M6391M3151k5809o4448j1492N6650M1191
496D7156k9973n0757K024M6510K1571k5507k6046r91J0227O178N350L383q678
509D47j1311M241J4209J916r365o761J434K834N377R754n67k3422k1073J6614
523a5673M3568N366m2972k3591L2728L6838j6306m2537j1900K9703K2132n468
535A1888j0447m330l734k140J3040J2257j1819k3823L352K9889J0158k5212j9649
548b0570Q623J6836L888j294q01o378j1025N435J9252l63k8425j5453K7924L0784
562B8433j0825l0380k554J9376L370j3489J153J3481l919j5599L165K0606K128
$$ plain form
469 -6366 -23514 -8274 8544 7546 2124 5043 6610 -3802 -14999 -7255 11272 17002 563 -19615
483 -19615 -19631 6386 30558 16138 -28032 -38478 7913 51064 25255 -39193 -50685 5965 47156
496 47156 17183 -33574 -31550 14960 36531 11024 -15022 -16013 -5786 392 5742 9125 447
509 447 -10864 -6623 7586 9502 137 -6624 -5190 -2356 3021 12775 12208 -11214 -32287 -15673
523 -15673 27895 33261 -9711 -33302 -574 36264 19958 -22579 -34479 -4776 17356 11888
535 11888 1441 -2889 -6623 -8763 4277 16534 4715 -19108 -15756 14133 24291 -921 -20570
548 -20570 -11947 4889 8777 7483 6682 304 -10721 -5286 13966 13603 -14822 -30275 -2351 28433
562 28433 17608 -12772 -15326 4050 7420 -6069 -4916 8565 4646 -10953 -7788 12818 14946
575A4946k7231j0943K4923K4366q923k7968o499J2156J0377J991n417j0630m641
588a3493J5324K2384q011l2710j3540K8439L0462j4544l2785J492K9514N058k5854
601h264j1608J9433J5516j0247j1479R223P014j0679j4591M641J5586N080n319
614D306l598k221j008N951M583j0692j6240O991L0481J1382k9812k8076J6529
627a1424K9923m608k9136m347K8790J6331j8701k0930J788J1792J4k385N112L945
641F164l614r30J935l430r569K703J0647L432p929k502J1949J600j8406j2451
655b0401J6185K1267p471k0063L978J7290r16j8869q446J3353J3199j716n470
668A920K322o43p724k958P299K677p578K09J2207M317j2890j0492O447R653n611
$$ plain form
575 14946 -12285 -23228 1695 26061 17138 -10830 -17329 -5173 5204 7195 1778 -8852 -13493
588 -13493 1831 24215 16204 -16506 -30046 -1607 28855 14311 -18474 -16982 12532 17590 -8264
601 -8264 -19872 -439 15077 4830 -6649 2574 9588 -1091 -15682 -11041 4545 9625 4306
614 4306 708 -1513 -2521 3430 8013 -2679 -18919 -11928 18553 29935 123 -27953 -11424
627 -11424 18499 13891 -15245 -19592 9198 25529 6828 -14102 -12314 -522 -508 -2893 2219 6164
641 6164 2550 1620 3555 125 -9444 -6741 3906 7338 -591 -3093 8856 10456 -7950 -20401
655 -20401 -4216 17051 9580 -10483 -6505 10785 9869 -9000 -17446 -4093 9106 7390 1920
668 1920 4242 3599 -4125 -7083 216 2893 -4685 -4476 7731 12048 -842 -11334 -4887 4766 -845
683h45l849O557Q827o926j1817J24R386q31o786N893J2429j251j4532l095P192
698D76n82q641K566J4123N233j2183r881O839O905o931j0590P686J3670J950q266
713B374n566m08r49q92L951M508P81j343M298J95r984j0413M508J2262L949r154
729a883J160J0985M7j5660j1188J0331J3994k454r239K139J1069J153j2432j0334
743a2312K758J0381O790j870l571l541J134L412l562r932j305J3037J2056l618
757I857j4133l963R440L159r157n438Q399J2589o65j0228m432L792J420l587k977
772e924M741O970J768m873o375k190M470L269k577l575K822P936J539o844j0398
787i241K415Q540L683o090l118M387N841j479q026l609K809N804K538l226k107
$$ plain form
683 -845 -4694 1863 10690 3764 -8053 -7929 1457 626 -6160 -267 12162 10911 -3621 -6716 476
698 476 -106 -8747 -6181 7942 13175 992 -8889 -2050 4855 -2076 -12666 -4980 8690 10640 2374
713 2374 -3192 -3600 -4549 -5441 -1490 3018 3799 2456 6754 6949 -3035 -13448 -8940 3322 7271 -1883
729 -1883 -723 10262 10309 -5351 -16539 -6208 7786 5332 -3907 -1768 9301 10454 -1978 -12312
743 -12312 -9554 827 7617 5747 2176 -1365 -231 3181 -381 -10313 -11618 1419 13475 9857
757 9857 -4276 -8239 1201 4360 -4797 -10235 -1836 10753 10088 -140 -4572 -780 640 -2947 -5924
772 -5924 -1183 5787 7555 2682 -3693 -5883 -1413 1856 -721 -4296 -1474 6462 8001 1157 -9241
787 -9241 -6826 1714 5397 -693 -3811 576 6417 4938 -3088 -6697 -3888 1916 4454 1228 -879
802h79K76J712j338k153j710L063L793J570l027k534J389l69j716k2J585K657
818B297j448j372O68l20L81j518Q30O56J688N27m66j830k851j024L077K136l75
835A056j798J383J859q63k372k163P76K430K372l65p95k712N84K056j051l016
851b619j830M821M084nn471l283M423K792k205l688R76M649L238o306l126J948
867a602L090j175j151K5R83J917k47k898k165J293L676k53k696k087L510M528
883D748j626p775n41O798M085m574n894K198N684J447o057l990L556N463Q09m938
899f07l451K635L923P38l279l268J489M553J419n652k511K978L826J52o350k45
915c650M192L648l176m566P89M649J221l468k717K356K650N16l769j709L091J580
$$ plain form
802 -879 -603 1109 -229 -2382 -4092 -1029 2764 4334 1307 -1227 162 -207 -1923 -1945 -360 2297
818 2297 849 -523 145 -175 206 -1312 -482 174 1862 2389 1923 93 -2758 -3782 -705 1431 1056
835 1056 -742 641 2500 1637 -735 -2898 -2122 308 2680 2315 1520 -1192 -608 1448 397 -2619
851 -2619 -4449 372 4456 4451 -1020 -4303 120 2912 707 -2981 -2005 2644 5882 -424 -3550 -1602
867 -1602 1488 313 -838 -813 170 2087 1840 -1058 -3223 -1930 1746 1493 -1203 -3290 220 4748
883 4748 3122 -4653 -5194 1604 5689 1115 -4779 -2581 3103 4550 -1507 -5497 -1941 3522 4331 -607
899 -607 -4058 -1423 2500 3238 -41 -3309 -1820 2733 4152 -1500 -4011 -1033 2793 2945 -3405 -3650
915 -3650 542 4190 1014 -3552 -2763 1886 3107 -361 -3078 -722 1928 2444 -1325 -3034 57 1637
931A637O87k169k428J460K382J501l632j989R16M416n1l429k999L446L423k113
947A058k360j448K018K644q43j811q75J014J689m04j475J84n44J612J096j808
963b53j369J054J873o11j438k53O94J275r05j215J163o94J087m13k81p21P2J338
981D03N76j809L6J057Q41M31k273m22J158K008j986j940k85K912N35j067j897
998a722L31K641J006k700j986J434K289J69j704j248R58J453J215k733j428J567
1014d58J828N42k737l17L18L154l19k905r88J909J463r57j370k94J691J420k383
1031d03j358J286K169J87k265j571J553K579k53l563p28K180K444q68k497p10
1047a818K095J942o51l112o34J836K704o21l243p22K696J885j422k666M79R19
$$ plain form
931 1637 2324 155 -2273 -813 1569 3070 -562 -2551 -1635 2781 2730 -699 -3698 -252 3171 1058
947 1058 -1302 -2750 -732 1912 1069 -742 -1617 -603 1086 682 -793 -609 -1153 459 1555 -253
963 -253 -1622 -568 1305 694 -744 -997 -303 972 67 -1148 15 -679 408 -5 -286 -1007 -935 403
981 403 979 -830 -794 263 1104 1535 -738 -1160 -2 2006 20 -1920 -2205 707 1242 175 -1722
998 -1722 -1391 1250 2256 -444 -2430 -996 1293 1462 -242 -1490 -532 921 2136 -597 -2025 -458
1014 -458 1370 1912 -825 -1142 -824 2330 2011 -894 -1882 27 1490 533 -837 -1131 560 1980 -403
1031 -403 -1761 -475 1694 1881 -384 -1955 -402 2177 1924 -1639 -2367 -187 2257 1389 -1108 -1818
1047 -1818 277 2219 1568 -1544 -2178 -342 2362 1741 -1502 -2224 472 2357 935 -1731 -1252 -333
1063c33J061P4j980O1J744J325j806q02p3J527M56j541j318J338K037j159j487
1080h76L60R75O94j198j199N06P37J146p76p83P12m09O67J089k466j203J616K184
1098A776Q4j990j661J718M36n71n25PM21J163o66q90o64J177r32K039j073j86
1116c37j73J736L7j767j249J983K95N7j468Q62O43L00m98k235J839Q69q60L07
1134C41r30J196k85n60l30l61P20l45J847j388j093M47J663J155k945k106K811
1151a63K073Q20l656p29J527J154q83j462M23J556P19j115p05l48K38J394k75
1168E68k046P03P12J174r09k609R79J107K109j655j232J662J511j153k892R69
1184a002J212J573k068K90R35m95L52l57j189k6R76J309j61j374k33L3J449q96
$$ plain form
1063 -333 728 802 -1178 -1117 627 1952 146 -656 -729 798 1254 -287 -1605 -267 1770 611 -876
1080 -876 -516 459 1153 -45 -1244 -738 -1 1145 369 -414 298 -111 556 1645 -821 -2024 -408 1776
1098 1776 1860 -130 -1791 -73 363 -208 -733 -726 -305 858 192 -698 -1362 -185 -1117 922 -151 -337
1116 -337 -510 1226 1263 -504 -1753 230 525 582 -886 -24 619 919 421 -1814 25 894 34 341
1134 341 -589 607 322 -238 -568 -929 -209 -554 1293 -95 -1188 -741 922 2077 -868 -2974 -163
1151 -163 1910 2730 -926 -1655 -128 1026 143 -1319 -896 660 1379 264 -441 -789 -551 843 568
1168 568 -1478 -775 -63 1111 202 -2407 -1428 -321 1788 133 -1099 563 2074 921 -1971 -1002
1184 -1002 210 1783 -285 5 940 445 797 440 -749 -775 201 1510 1349 -25 -258 -225 1224 328
1202C28k277J139K652R86l219j063J429N85m64j374R9K650M10j374j477O81m25
1219g14J387L58j001n76J24J095M80j444j403P80K156Q12l519J334R41L76k303
1236a117K22O63J253q63L14o1L76q3k162J613L20p59L23N88P39j775p97J065J822
1255A681k566j030L88K426O80k270o51J740P45j679m40N03J476q77O94l16k62
1272B42j500J27K385n73j592O35M05J551j775j488J605J385j52k857P93J516J63
1289H70k496J26J856P28n81j269N64J228j266N70K2k56j279M22J987k41k722O24
1307a113J432J571k439k123K506J948n08j777n20Q15O64j708M97N90M19q96P60
1324A18J065j187m60r1K185l95j181L9R83k96j784k14J454K015j597k384P43L221
$$ plain form
1202 328 -1949 -810 1842 2828 -391 -1454 -25 560 96 -1278 -1179 1471 1881 507 -970 -289 -714
1219 -714 673 1031 30 -546 -422 673 1153 -291 -1694 -914 1242 2054 -1465 -131 810 1186 -1117
1236 -1117 -895 -232 1021 158 472 411 787 704 -1458 155 475 -284 39 627 1366 -409 -1206 -141 1681
1255 1681 -885 -1915 -1527 899 1579 -691 -1342 398 1143 -536 -976 -473 1003 126 820 504 242
1272 242 -1258 -1131 1254 681 -911 -276 129 1680 -95 -1583 22 1407 1255 -1602 -809 707 870
1289 870 -1626 -1500 356 1084 503 -766 -202 1026 -240 330 352 96 -1183 -761 1226 985 -1737 -1113
1307 -1113 319 1890 -549 -2672 -166 1782 1274 -503 -1023 -208 456 -1252 -755 -165 254 -642 118
1324 118 1183 -4 -464 -555 1630 1235 54 93 1076 780 -1004 -1218 236 2251 654 -1730 -987 2234
1342B234j017k339j07K158L09k478M38J547l56q15M07O99j087J93n91K545l36
1359A404k323j386K924M40k104k69J653J299j035j911P13J233j68j596J16K139
1375A129k4r02j81P13p20n00j98R64k66p94P05J214k68j891J8J231Q58r24j212
1394a048J029J491j98k584J017O70o09k76J216K13j439M64Q16k05m24j618J310
1411a75J751l10k538P25J631k66j867M04L49J477j312M8L02M74L12j914J162M80
1429G33q78PJ416j391L48j564K206j002r78O76O38Q35k77j198k40Q69J714k324
1447d10q42J595k59j02p17P80M94l94N74j238N66q01J029P48q47r90M46J015l46
1466C01j034K25Q73m79Q31j717L93J783n60o95m31L85K55N60j02o07L58J86l76
$$ plain form
1342 2234 1217 -1122 -1229 929 1238 -1240 -802 745 389 -426 -19 680 -407 -214 -805 1740 1404
1359 1404 -919 -2305 619 1059 -1045 -1314 339 1638 603 -1308 -595 638 470 -1126 -1010 1129
1375 1129 1105 203 22 735 15 -485 -683 281 15 -779 -74 1140 872 -1019 -1001 230 1088 164 -1048
1394 -1048 -19 1472 1274 -1310 -293 377 -232 -508 708 921 -518 -54 762 557 133 -1485 -175
1411 -175 1576 1266 -1272 -547 1084 818 -1049 -645 -296 1181 -131 -83 219 693 1005 -909 253 733
1429 733 -145 -138 1278 -113 235 -1329 877 -125 -1103 -427 211 1046 769 -429 -669 200 1914 -410
1447 -410 -1252 343 84 -18 -735 45 539 145 719 -519 47 -754 275 1023 176 -814 -368 647 301
1466 301 -733 -508 365 -114 717 -1000 -607 1176 616 -79 -510 -125 130 690 588 -19 339 525 149
1485A49l16J022j487j32P90n24j79K60J104n85J19m97L68M88j510O49K12n9N28
1504D00r49r15J050Q91p4m9j029O02M95K75K15j013l97P03Q95r93o64j86J081
1523C38M02n10o36N54K88J03o68J0P26l49Q38j076J71m69j77Q34o52Q56M0r95
1543c72Q17m8m61L17k62K13L28p81K59J16j80J88K62J16l3q0o17J4j7L99J60j79
1565A59p22J062K8k62j083L39O8J055k03J43k21o91N79N2nq90k60J385j25j362
1585i54N40J799j361l34m61M61N41o86Q27k43K84j84K53o32p01P62Q84k73r08
1604c86m18J561n70m62K1q08P80J000o29o40J127j27r8J59q57N66p84Q95r80p2
1624g22M29J08P18o60N8J35L21M14j145K10J06R23n15q47M54O64k00qr84K13m45
$$ plain form
1485 149 -167 855 -632 -764 26 -498 -677 -417 687 102 221 -276 92 580 -930 -281 -69 -128 400
1504 400 -549 -1464 -414 477 403 354 -675 -73 422 697 912 -101 -498 205 1100 107 -557 -743 338
1523 338 740 230 -406 148 436 539 -129 -119 607 258 1096 20 191 -278 -455 379 -273 583 623 -372
1543 -372 445 397 -64 253 -9 204 532 -249 10 126 -54 134 396 512 479 399 -218 -204 -221 178 338 159
1565 159 -563 499 527 265 -818 -479 -411 644 441 584 363 -328 251 303 298 -592 -852 533 408 -954
1585 -954 -414 1385 24 -310 -771 -310 231 -455 372 129 413 229 482 -150 -851 -89 795 522 -386
1604 -386 -804 757 187 -275 -254 -1062 -282 718 89 -551 576 449 351 510 -347 219 -565 330 -650 -722
1624 -722 -293 -185 533 -127 -69 66 387 801 -344 -134 -28 895 380 -467 -13 651 451 443 -541 -328 -773
1645g73J687j379jK68j44J472p75O31j636M95O26j33l22j60K19j17M01k22j039
1664i02R78O57j49m85p58R00j76J0o00L66m92P51P1q4l07k00J522j182k73M3L30
1685B0n58K13O45q12P19P02o80r79J742Q9r95l04Q05P55o97m78L63j08J56k35
1705C63M66l22p19O63J03p92l83P33o42Q09n2j337J392M86l81q2o86k12P40p39
1725e92L65j32J57K45R52j252k69k62R69L3N1j060J011J008j139k92n99L26N56
1744G6M78j805K740j081m79P07j158N19K01j100j8J013l07m3N83j01j42q9N68
1763E62N54j738j32K83J290n68k9Q0j42Q2J70k101J645L54j13p56O95j72l05N3
1783b88p1O02q10N76l68j02Q79jm60N32m88L42j132Q83om09M58o74P57l51j47
$$ plain form
1645 -773 914 -465 -466 -198 -342 1130 355 986 -650 -155 471 338 16 -144 75 -42 359 137 -902
1664 -902 76 733 584 99 -659 241 65 75 -525 -159 -651 100 171 87 -220 -420 1102 -80 -353 -310 20
1685 20 -538 -325 320 -492 227 929 249 -730 1012 1101 106 -198 607 1362 665 187 550 442 598 363
1705 363 829 507 -212 451 554 -238 -621 112 -530 279 227 -1110 282 768 387 305 -381 -593 147 -592
1725 -592 -227 -359 -202 43 995 -257 -526 -788 181 214 265 -795 216 1224 85 -207 -806 -480 76
1744 76 554 -1251 1489 408 -71 636 -522 -3 198 -902 -920 93 -214 -257 326 225 83 -6 562
1763 562 1116 -622 -754 -471 819 251 222 302 160 242 412 -1689 -44 310 197 -559 136 -36 -341 -288
1783 -288 -359 243 -567 9 -359 -461 418 417 -43 489 1 343 -789 94 88 -321 137 -537 220 -131 -278
1804b78j56N97J15J71m79k12R8l3P24l07j66L55J23r96K31M16J4k21k87l32k0
1825f43P4Q88q88N19q07J234o24n17P98p8Q4j060J659n81j33K00n06M53L64k34
1845B02m22J021l49j21l83R38q77M02n87L06k52M82N75j359K3J087o64m6PP6l83
1866c24K62Q32q20M2O9j95K89K03l88N91m47K03l03l90k9O39ok55L48j66J9o7
1888A07m39P88K09k39J28j425J44O37R9p69K05P19m24N04o7n8o7M3lL44M06j87
1910F55n44K94r52P29m77O29n08K51l02j28P42n42J46r08O66P32n11O66j858J954
1930G34q11q19J063m92P19k97n0M17j3l11j57r89J088r7R5k42j45q5K56m82J183
1951E65q95M94j06J23j038P89M39o50K88K40K42k0o87K32j095R98O88j418J471
$$ plain form
1804 -278 -434 163 278 449 -30 -242 -144 -177 547 240 74 429 552 -444 -213 203 217 -4 -291 -623 -643
1825 -643 -569 319 -569 -50 -857 377 -247 -764 34 -44 40 -1020 639 58 -75 125 -381 72 436 202
1845 202 -220 801 452 331 -52 886 9 411 -176 130 -122 360 935 -424 -401 686 22 -24 -17 59 -324
1866 -324 -62 770 -50 -8 61 -134 155 358 -30 561 114 317 14 -376 -405 234 228 -27 321 155 174 107
1888 107 -332 456 665 426 554 -871 -727 -90 9 -760 -555 164 -260 244 177 119 52 95 92 436 842 655
1910 655 111 405 -547 182 -295 334 -174 77 -225 -353 389 -153 -7 -915 -249 483 -28 638 -1220 734
1930 734 -77 -896 167 -325 394 97 47 464 451 140 -17 -1006 82 -15 80 -162 -307 -392 -136 -618 565
1951 565 -330 164 58 181 -857 -68 371 -279 9 249 491 471 -216 16 -1079 -81 607 -811 660
1970F60j081m66J864j467L10j04m30O58l20K24M92k35O51l81o90K22L24k25k39
1989b33m05J562k11j90q09M56o4m27Q01j209J277p61O98r19N91M48o90L69n31
2008b47N89qm01J29o55P19P58k26m66K27J44k49q38J26J16o9K37k87k81Q74j7
2029A75K95j371R47k12N5J0m04P35q4Jj177P00J187j374L15p22O87P06L1k11j62
2050A27n34R44L85J12j278J72q6j247J623l10k20k3j03L48P33r92n55J143o12
2069c73P88j164P84K16j40m25K43N90p77N58q47M94k56o4K64J44q7N74j09l14
2089I9N3r90J816j140O0j61O64k89k79P4j43M96m50N84q75P69l00O62j408J168
2109D10l6m02MM0N21J4p33m98q0J094j24q75k5k16J265p70P0O6NR98m21k48m52
$$ plain form
1970 660 -421 -887 977 -490 -180 -284 -714 -56 -376 -152 340 105 756 375 -315 -93 231 6 -233
1989 -233 -638 924 713 523 -286 170 106 -321 480 -729 548 -213 485 -434 157 605 -85 284 -247
2008 -247 342 334 -67 62 -593 126 884 658 192 419 563 314 -524 -398 -282 -351 -114 -401 -682 192 175
2029 175 470 -901 46 -166 -111 -101 -505 230 146 147 -1030 -330 857 -517 -202 -924 -237 469 500 289 127
2050 127 -407 537 922 1034 -244 -72 -158 -1405 218 -92 -312 -335 -438 -90 643 -349 -904 239 -373
2069 -373 415 -749 35 251 111 -314 -71 519 -258 300 -547 -53 -309 -373 -109 35 -52 522 413 99
2089 99 152 -838 978 -162 -102 -263 401 112 -167 -93 -236 260 -190 394 -481 288 -12 650 -758 410
2109 410 374 -28 -24 16 537 551 -182 -680 -760 334 210 -665 -690 -906 359 -411 -341 -275 -270 728 307 59 -393
2132c93J139o50K06q87N88j97l25P68m57k86O92o5l69l62Q6R72L2j134K23m03
2152h22P51L69j394J736M1p05j27K54R04q95L54o62L82k47N1L21r85P32r51Q50
2172d3O59n90K81k83m2o3l12L67n08N25M7k86L43Q12J64j412J08j8J4M5M02J37
2194C47m84Q7K08o80J49R83J02m4p25q27J679q39n96P18N18q68J99m12O69j07
2214G7K03m89m3K63K66o90Q6P56l60m39j32j50O46J0k96N07p89R41k37J64m09
2235a15J78n32k65J023p75J192k11j136J95J37n79J286q61o1n84R41J74k64L20
2254F3K19j022P16k02j33N42l24M99n61N52p3J45m37O97q69J92l17q3P02k67O11
$$ plain form
2132 -393 746 96 302 -585 3 -194 -519 249 -208 -494 198 133 -236 -598 -512 460 492 -642 -419 -822
2152 -822 -71 298 -1096 640 681 -24 -151 103 1007 112 466 -196 186 -61 -10 311 -674 58 -893 -43
2172 -43 616 26 307 24 -18 -81 -393 -26 -534 -9 38 -248 95 907 1071 -341 -233 -251 -237 -192 210 347
2194 347 -137 -50 158 -522 -373 610 712 668 -57 -884 795 -44 -640 78 596 -272 -73 -485 184 77
2214 77 280 -209 -252 11 277 -413 -327 429 69 -370 -502 -652 -6 4 -292 215 -574 367 130 294 -115
2235 -115 63 -469 -734 289 -486 706 495 -641 -446 -309 -888 398 -463 -524 -1108 -167 7 -257 63
2254 63 282 -740 -24 -226 -359 183 -141 358 -203 349 276 421 -16 681 -188 4 -313 -396 306 39 650
$$ [...]
8191B59
##END NTUPLES=NMR FID
##END=
