##TITLE=1H ikalashn
DE-77k TFA
19.11.2024
##JCAMPDX= 6.0         $$ Bruker NMR JCAMP-DX V2.0
##DATA TYPE= NMR FID
##DATA CLASS= NTUPLES
##ORIGIN= UXNMR, Bruker Analytische Messtechnik GmbH
##OWNER= root
$$ TOPSPIN		Version 1.3
$$ 2024-11-19 16:16:49.875 +0400  Irina@DPX200
$$ Compression mode = diff/dup
##.OBSERVE FREQUENCY= 200.131300845
##.OBSERVE NUCLEUS= ^1H
##.DELAY= (6, 6)
##.ACQUISITION MODE= SIMULTANEOUS
##.ACQUISITION SCHEME= undefined
##.AVERAGES= 32
##.DIGITISER RES= 18
##SPECTROMETER/DATA SYSTEM= spect
##.PULSE SEQUENCE= zg
##.SOLVENT NAME= DMSO
##.SHIFT REFERENCE= INTERNAL, DMSO, 1, 17.49637
##AUDIT TRAIL= $$ (NUMBER, WHEN, WHO, WHERE, WHAT)
$$ ##TITLE= Audit trail, TOPSPIN		Version 1.3
$$ ##JCAMPDX= 5.01
$$ ##ORIGIN= Bruker BioSpin GmbH
$$ ##OWNER= Irina
$$ $$ F:/spectra/data/iren/nmr/1H/4/audita.txt
$$ ##AUDIT TRAIL=  $$ (NUMBER, WHEN, WHO, WHERE, VERSION, WHAT)
(   1,<2024-11-19 16:16:27.781 +0400>,<Irina>,<DPX200>,<TOPSPIN 1.3>,
      <created by zg
	started at 2024-11-19 16:14:18.187 +0400,
	POWCHK disabled, PULCHK disabled
       terminated by command 'halt'
       configuration hash MD5:
       BE 6D 3F 07 2A EA 11 49 91 17 2B D3 AF B3 58 0D
       data hash MD5: 16K
       FC AE 07 2F F2 4D 95 9F D9 FE 7A 10 29 E4 AA E9>)
$$ ##END=
$$ 
$$ $$ hash MD5
$$ $$ DE ED C3 B3 41 10 78 3E D1 CB 9A 30 07 F8 2E B3
##$RELAX= 
##$RELAX= 
##$RELAX= 
##$RELAX= 
##$RELAX= 
##$RELAX= 
##$RELAX= 
##$RELAX= 
##$RELAX= 
$$ Bruker specific parameters
$$ --------------------------
##$DU= <F:/spectra>
##$EXPNO= 4
##$NAME= <1H>
##$PROCNO= 1
##$TYPE= <nmr>
##$USER= <iren>
##$AMP= (0..31)
100 100 100 100 100 100 100 100 100 100 100 100 100 100 100 100 100 100 
100 100 100 100 100 100 100 100 100 100 100 100 100 100 
##$ANAVPT= -1
##$AQSEQ= 0
##$AQ_mod= 1
##$AUNM= <au_zg>
##$AUTOPOS= <>
##$BF1= 200.13
##$BF2= 200.13
##$BF3= 200.13
##$BF4= 200.13
##$BF5= 200.13
##$BF6= 200.13
##$BF7= 200.13
##$BF8= 200.13
##$BYTORDA= 1
##$CFDGTYP= 0
##$CFRGTYP= 5
##$CHEMSTR= <none>
##$CNST= (0..63)
1 1 145 1 1 1 1 1 1 1 1 1 1 1 1 1 1 1 1 1 1 1 1 1 1 1 1 1 1 1 1 1 1 1 
1 1 1 1 1 1 1 1 1 1 1 1 1 1 1 1 1 1 1 1 1 1 1 1 1 1 1 1 1 1 
##$CPDPRG= <>
##$CPDPRG1= <>
##$CPDPRG2= <>
##$CPDPRG3= <>
##$CPDPRG4= <mlev>
##$CPDPRG5= <mlev>
##$CPDPRG6= <mlev>
##$CPDPRG7= <mlev>
##$CPDPRG8= <mlev>
##$CPDPRGB= <>
##$CPDPRGT= <>
##$D= (0..63)
0 2 0 0 0 0 0 0 0 0.06 0 0.03 0 0 0 0 0.0002 0 0 0 0 0 0 0 0 0 0 0 0 0 
0 0 0 0 0 0 0 0 0 0 0 0 0 0 0 0 0 0 0 0 0 0 0 0 0 0 0 0 0 0 0 0 0 0 
##$DATE= 1732018585
##$DBL= (0..7)
120 120 120 120 120 120 120 120 
##$DBP= (0..7)
150 150 150 150 150 150 150 150 
##$DBP07= 0
##$DBPNAM0= <>
##$DBPNAM1= <>
##$DBPNAM2= <>
##$DBPNAM3= <>
##$DBPNAM4= <>
##$DBPNAM5= <>
##$DBPNAM6= <>
##$DBPNAM7= <>
##$DBPOAL= (0..7)
0.5 0.5 0.5 0.5 0.5 0.5 0.5 0.5 
##$DBPOFFS= (0..7)
0 0 0 0 0 0 0 0 
##$DE= 6
##$DECBNUC= <off>
##$DECIM= 32
##$DECNUC= <off>
##$DECSTAT= 4
##$DIGMOD= 1
##$DIGTYP= 9
##$DL= (0..7)
0 120 120 120 120 120 120 120 
##$DP= (0..7)
$$ [...]
##$SW= 21.9926040160658
##$SWIBOX= (0..15)
0 0 2 0 0 0 0 0 0 0 0 0 0 0 0 0 
##$SW_h= 4401.40845070422
##$TD= 16384
##$TD0= 1
##$TE= 300
##$TE2= 300
##$TE3= 300
##$TEG= 300
##$TL= (0..7)
0 120 120 120 120 120 120 120 
##$TP= (0..7)
150 150 150 150 150 150 150 150 
##$TP07= 0
##$TPNAME0= <>
##$TPNAME1= <>
##$TPNAME2= <>
##$TPNAME3= <>
##$TPNAME4= <>
##$TPNAME5= <>
##$TPNAME6= <>
##$TPNAME7= <>
##$TPOAL= (0..7)
0.5 0.5 0.5 0.5 0.5 0.5 0.5 0.5 
##$TPOFFS= (0..7)
0 0 0 0 0 0 0 0 
##$TUNHIN= 0
##$TUNHOUT= 0
##$TUNXOUT= 0
##$USERA1= <user>
##$USERA2= <user>
##$USERA3= <user>
##$USERA4= <user>
##$USERA5= <user>
##$V9= 5
##$VALIST= <valist>
##$VCLIST= <CCCCCCCCCCCCCCC>
##$VD= 0
##$VDLIST= <DDDDDDDDDDDDDDD>
##$VPLIST= <PPPPPPPPPPPPPPP>
##$VTLIST= <TTTTTTTTTTTTTTT>
##$WBST= 1024
##$WBSW= 25
##$XGAIN= (0..3)
0 0 0 0 
##$XL= 0
##$YL= 0
##$YMAX_a= 545142
##$YMIN_a= -721397
##$ZGOPTNS= <>
##$ZL1= 120
##$ZL2= 120
##$ZL3= 120
##$ZL4= 120
##$ABSF1= 10
##$ABSF2= 0
##$ABSG= 5
##$ABSL= 3
##$ALPHA= 0
##$AQORDER= 0
##$ASSFAC= 0
##$ASSFACI= 0
##$ASSFACX= 0
##$ASSWID= 0
##$AUNMP= <proc_1d>
##$AXLEFT= 0
##$AXRIGHT= 0
##$AXTYPE= 0
##$AXUNIT= <>
##$AZFE= 0.1
##$AZFW= 0.1
##$BCFW= 1
##$BC_mod= 2
##$BYTORDP= 1
##$COROFFS= 0
##$CY= 7568.61572265625
##$DATMOD= 1
##$DC= 2
##$DFILT= <>
##$DTYPP= 0
##$F1P= 17.9538593292236
##$F2P= -4.03888763876832
##$FCOR= 0.5
##$FTSIZE= 32768
##$FT_mod= 4
##$GAMMA= 1
##$GB= 1
##$INTBC= 1
##$INTSCL= 1
##$ISEN= 128
##$LB= 0.03
##$LEV0= 0
##$LPBIN= 0
##$MAXI= 945.577
##$MC2= 0
##$MEAN= 0
##$ME_mod= 0
##$MI= -402.1523
##$NCOEF= 0
##$NC_proc= 0
##$NLEV= 6
##$NOISF1= 8.587773
##$NOISF2= 6.764455
##$NSP= 1
##$NTH_PI= 0
##$NZP= 0
##$OFFSET= 17.49637
##$PC= 1
##$PHC0= 317.863
##$PHC1= 9.501862
##$PH_mod= 0
##$PKNL= yes
##$PPARMOD= 0
##$PPDIAG= 0
##$PPIPTYP= 0
##$PPMPNUM= 100
##$PPRESOL= 1
##$PSCAL= 0
##$PSIGN= 0
##$REVERSE= no
##$SF= 200.13
##$SI= 32768
##$SIGF1= 18.5376
##$SIGF2= -6.396296
##$SINO= 400
##$SIOLD= 32768
##$SREGLST= <1H.CDCl3>
##$SSB= 3
##$STSI= 0
##$STSR= 0
##$SW_p= 4401.40845070422
##$SYMM= 0
##$S_DEV= 0
##$TDeff= 0
##$TDoff= 0
##$TI= <>
##$TILT= no
##$TM1= 0
##$TM2= 0
##$TOPLEV= 0
##$USERP1= <user>
##$USERP2= <user>
##$USERP3= <user>
##$USERP4= <user>
##$USERP5= <user>
##$WDW= 1
##$XDIM= 8192
##$YMAX_p= 0
##$YMIN_p= 0
$$ End of Bruker specific parameters
$$ ---------------------------------
##NTUPLES= NMR FID
##VAR_NAME=  TIME,          FID/REAL,        FID/IMAG
##SYMBOL=    X,             R,               I
##VAR_TYPE=  INDEPENDENT,   DEPENDENT,       DEPENDENT
##VAR_FORM=  AFFN,          ASDF,            ASDF
##VAR_DIM=   8192,          8192,            8192
##UNITS=     SECONDS,       ARBITRARY UNITS, ARBITRARY UNITS
##FACTOR=    0.0002272,     1,               1
##FIRST=     0,             0,               0
##LAST=      1.8609952,     124,             -21
##MIN=       0,             -721397,         -721397
##MAX=       1.8609952,     545142,          545142
$$ Real data points
##PAGE= N=1
##DATA TABLE= (X++(R..R)), XYDATA
0 0 0 0 0 0 0 0 0 0 0 0 0 0 0 32 -32 32 -32 64 -64 64 -96 97 -128 160 -190 221 -254 288 -320 382 -417 481
32 481 -545 622 -705 798 -895 993 -1118 1244 -1379 1537 -1701 1887 -2085 2305 -2541 2804
48 2804 -3091 3403 -3746 4131 -4551 5027 -5552 6151 -6829 7607 -8516 9592 -10878 12463
62 12463 -14466 17088 -20684 25942 -34384 50168 -89714 399164 399381 -721397 -484956 360688
74 360688 484956 -309445 -453039 208097 545142 -26737 -416213 -83360 274035 -4446
84 -4446 -266209 5271 322130 64072 -287284 -145231 194729 91103 -219930 -161411 176757
95 176757 216298 -21076 -79653 75829 34667 -180341 -146485 151493 217121 -57866 -203385
106 -203385 14588 186897 4802 -225377 -123537 131742 158883 -9271 -67202 13526
116 13526 21151 -69369 -75684 22461 54999 -9820 -10627 92622 129801 4482 -135977 -123301
128 -123301 2401 79404 48567 -13491 -30340 -7122 12698 4588 -20997 -31489 -1681 49526
140 49526 67371 23683 -44166 -68159 -25750 34803 48211 10814 -13359 11672 39855 20036
152 20036 -22075 -34451 -24015 -25707 -20875 22541 56558 8274 -77629 -72910 27811 74559
164 74559 -3801 -75222 -15964 81703 62729 -43196 -80071 -15179 39905 28050 8828 18997
176 18997 16095 -13080 -16979 13214 10818 -37302 -50799 5931 54924 33859 -9815 -17949 -12260
189 -12260 -18584 -6195 31866 31703 -25746 -48720 18058 74105 14896 -77772 -52173 61092
201 61092 88758 -5834 -75223 -31657 31941 19790 -23361 -19911 8766 9665 -2412 11043 24146
214 24146 -1581 -34356 -22411 14586 22032 1942 -6511 -2415 -4745 -784 18994 18028 -23093
227 -23093 -45706 -648 54568 26962 -53219 -66861 10239 63503 20446 -44239 -33737 22934
239 22934 39097 5950 -18328 -10683 1561 5484 11184 16493 5932 -12257 -11380 7108 15231
252 15231 4753 -7185 -8283 -4502 3068 13158 7957 -19287 -34037 -4692 36970 29720 -21177
265 -21177 -43515 -5237 38498 26694 -18801 -32600 -2882 23871 16466 -5423 -15214 -10721 -199
278 -199 9765 11751 1143 -12875 -13153 2064 14912 8651 -9815 -19118 -8053 12815 22395 8026
292 8026 -16559 -21856 1951 25703 15853 -16608 -27910 -3299 24505 19659 -8404 -22597 -7690
305 -7690 13427 15845 1636 -9937 -9616 -1576 7332 10341 4005 -6952 -9785 1253 15628 16129
319 16129 -1927 -19217 -13279 10252 21544 4172 -20706 -20999 4330 23137 10412 -17318 -23764
332 -23764 -1849 17509 10922 -9907 -17458 -4359 10101 10134 -422 -5960 -3228 837 3089 4698
346 4698 4896 -910 -8708 -7009 5994 15071 5554 -13520 -15989 4023 21137 10257 -15727 -21263
360 -21263 1187 22558 13437 -12211 -20615 -1226 19036 13544 -8066 -16110 -2551 11667 9262
373 9262 -3847 -8911 -1545 4964 2371 -2627 -699 2336 -998 -6490 -3020 7601 9207 -3191
387 -3191 -13092 -4968 12352 13946 -4033 -18093 -7985 12573 15432 -2720 -17391 -9530 9495
400 9495 14537 -524 -13895 -9138 5266 9800 1042 -8034 -6366 2300 6424 3172 -436 -131 719
415 719 -202 103 3061 4589 182 -5371 -3117 5839 9289 477 -9006 -6142 5492 9417 157 -9789
431 -9789 -7933 1926 7342 2457 -4680 -5645 -369 4509 4570 -485 -4516 -4351 257 3184 2266 -940
447 -940 -3238 -2530 978 4556 4017 -2048 -7233 -3567 5031 7284 -1156 -9193 -5003 5644 7886 -212
463 -212 -6658 -2802 3998 4348 340 -2068 -2306 -1475 -172 2180 2659 -326 -3461 -2258 2571 4102
479 4102 1556 -2442 -3692 -1260 3750 5909 645 -6624 -4844 5997 10876 1762 -9385 -6170 5654
494 5654 7933 -1868 -8896 -2923 4562 3351 -2078 -2228 79 -847 -2237 -14 1913 -121 -3872 -3243
510 -3243 406 2675 1472 -247 -1609 -1676 2029 6782 3840 -6236 -9533 1133 10858 3897 -8960
525 -8960 -8042 6022 11441 194 -9710 -4887 4892 5410 -1298 -3069 387 814 -556 98 1269 -244
541 -244 -1660 652 2975 1156 -1404 -1260 -176 -3070 -3441 3469 7003 282 -7703 -2626 7600 5765
557 5765 -7198 -9778 2217 10302 3285 -6512 -4858 2627 3829 -69 -1686 -443 -792 -630 2115
572 2115 1938 -3256 -6148 -1225 4257 1641 -2931 -644 3590 1433 -3576 -1951 3167 1795 -3993
587 -3993 -2028 5813 5780 -2690 -6237 644 6390 1869 -3624 -1025 2634 821 -2386 -896 886 -1822
603 -1822 -3196 1684 5546 1054 -4633 -2595 3068 1872 -3411 -2446 2400 2375 -1277 -901 2074 161
619 161 -3794 -1516 4497 3473 -3633 -5136 1684 4592 -1645 -5440 311 5118 1472 -2729 -559
634 -559 3381 172 -4263 -1828 3432 2500 -1667 -1135 2598 1644 -2063 -1841 1147 80 -2334 563
650 563 4062 728 -5020 -2830 4281 4356 -2994 -4141 3698 6954 92 -5832 -1112 4167 1464 -3645
666 -3645 -1621 4156 2750 -2006 -2302 582 582 -1888 -1062 1206 -228 -1793 178 2503 -557 -4536
682 -4536 -1001 5337 2693 -4469 -4089 3826 5402 -2206 -6245 165 5580 1684 -3988 -1660 3214
697 3214 1759 -2854 -2124 1157 1069 -879 -776 1561 305 -1608 315 2489 94 -2760 -76 3662
713 3662 1179 -4328 -2564 3986 4322 -2336 -4604 850 4833 248 -4413 -1704 3013 1978 -1532
728 -1532 -1070 794 489 -1325 -394 1705 152 -1558 288 2669 1124 -2613 -1946 1155 993 -2172
744 -2172 -1448 2196 1943 -2155 -2856 1004 2260 -1092 -2812 400 3041 804 -2203 -929 1622 764
760 764 -1271 -62 2019 888 -885 9 1531 448 -2380 -1390 1935 1890 -689 -1283 829 1177 -556
777 -556 -1466 -163 557 -673 -460 1053 810 -1245 -1419 790 1582 -482 -1960 -16 1932 280 -2057
794 -2057 -1155 1110 644 -1117 -437 1216 1021 -929 -1410 -118 748 -77 -658 -10 318 37 178 593
812 593 -356 -1143 -72 1546 746 -1651 -1296 1382 1928 -410 -2208 -258 2245 1531 -1078 -1589 524
829 524 1500 235 -840 -101 652 792 566 -312 -695 -275 778 534 -1007 -1054 397 1221 -281 -2111
847 -2111 -959 1248 998 -1023 -1970 247 1816 53 -1832 -1160 1089 1340 -3 -1084 -481 728
863 728 1066 -223 -1064 -552 527 1226 624 -1156 -1130 481 1550 161 -1693 -580 1562 1336 -436
880 -436 -1271 190 1448 402 -844 -535 649 804 78 -473 -365 285 313 -72 -224 -461 273 445 246
899 246 -885 -690 368 967 -115 -489 -408 832 629 -469 -687 48 628 -21 -451 -532 39 405 158
918 158 -178 -530 -445 106 288 192 -424 -478 152 539 247 -345 -154 547 620 280 1 -13 -42 286 389 102
940 102 -186 -147 438 225 -112 -542 -82 299 152 -533 -390 152 422 -224 -301 -33 662 172 -249 -344 -66
961 -66 726 -117 -589 -630 338 743 -308 -644 -417 416 602 199 -784 -548 317 521 -170 -933 -189 1018
981 1018 940 -256 -790 -5 781 525 -623 -785 96 492 193 -482 -530 481 745 24 -472 -136 528 591
1001 591 -561 -666 62 888 744 -342 -833 54 1122 525 -721 -998 481 964 174 -893 -931 125
1019 125 657 -41 -893 -448 310 698 399 -591 -562 656 577 88 -503 -133 556 776 -296 -351 20 392
1039 392 385 -224 -383 127 670 -328 -365 -260 299 561 -33 -396 -105 215 448 -103 -533 -150 138 334 -144
1060 -144 -513 -149 298 305 -347 -676 -330 529 608 222 -328 -78 299 157 -219 -213 -181 359 64 335 -225 -40
1082 -40 -81 137 8 -195 -280 -41 117 56 -111 -223 165 122 -142 -36 -61 48 18 -439 11 33 455 188 196
1105 196 -63 -70 363 -73 145 -425 -184 491 439 -165 -460 135 455 129 -511 -200 433 556 -118 -454 -228
1126 -228 156 345 20 -392 64 252 336 266 -395 -323 89 521 21 -483 -390 563 323 -394 -658 1 309
1147 309 270 -585 -294 362 582 -176 -419 73 309 207 3 -223 -68 119 -124 -85 -106 -168 226 331 -477
1168 -477 -604 20 476 454 -400 -380 439 762 252 -704 -334 451 672 -111 -167 181 525 255 -190 -274 -155
1189 -155 -113 290 415 -31 -36 17 107 -173 -295 -230 262 486 -428 -236 283 64 -399 -466 -33 605 491 -94
1211 -94 -279 212 12 -262 -408 -216 65 261 546 180 -57 -404 13 -25 330 -117 -192 485 527 55 -375
1232 -375 -88 245 135 -53 -23 149 -169 -332 -279 96 22 64 124 349 452 -104 -278 154 -182 -437 -94 360
1254 360 252 -279 -254 248 174 -188 -561 -85 350 317 67 -293 -168 158 -16 212 -307 -114 -39 483 199
1275 199 -435 -340 -331 364 136 -247 93 295 408 -332 -432 -36 234 240 8 9 243 217 -181 -117 -415 -88 36
1298 36 241 24 -206 -200 362 -270 -505 -291 198 637 157 -706 -446 -60 252 -248 -358 326 608 199 -317
1319 -317 -560 -159 90 249 172 -12 -59 581 77 -223 -478 -50 277 180 -91 -206 176 195 -365 -721 -92
1340 -92 448 450 23 129 183 116 -361 -295 -107 270 65 250 288 -101 -207 -236 46 -99 -422 100 377 35 -281
1363 -281 -426 -140 -122 -223 -270 1 425 227 -113 -329 -83 -46 71 171 256 201 124 15 -88 52 -220 -155
1385 -155 327 87 -5 128 94 297 -137 -321 20 451 99 156 119 -22 -29 -225 -180 -40 3 44 -8 82 -113 -9
1409 -9 -331 -266 -182 -167 -122 108 131 -307 -195 15 131 36 -193 53 131 -57 -181 -506 -282 136 228 -130 149
1432 149 39 -70 212 132 -269 -185 373 237 -97 153 -142 11 154 -40 116 64 331 458 -68 -45 -14 93
1454 93 -31 -256 -6 219 85 10 4 -10 151 153 57 56 -242 232 273 25 -215 -36 185 242 -203 114 14 333
1478 333 63 26 -253 -38 147 144 18 115 -113 140 -109 -74 -345 -14 137 2 -200 85 247 147 -181 -136
1500 -136 248 99 273 -159 -200 170 -59 -111 -137 -381 165 103 -151 -120 -226 -74 25 104 -82 104 -173 25
1522 25 177 -165 -95 15 -73 136 38 -36 -45 163 -71 -295 -23 -3 -99 -88 -21 36 309 -36 -208 119 65 -83
1546 -83 -149 -62 54 241 17 -33 -85 -35 210 384 -197 -70 75 150 142 -17 7 -63 -147 325 35 -55 -164 256
1570 256 49 39 98 -138 44 161 -147 39 -218 150 40 110 -204 -37 -339 131 246 -132 -135 254 167 8
1592 8 19 -268 191 5 329 -188 80 171 -154 -151 -189 116 168 329 -151 6 259 0 -30 -192 -76 -93 -117 -105
1616 -105 -147 -215 -171 126 103 -297 -33 -99 278 -26 -28 -100 44 64 53 -3 11 377 347 -101 -163 92 338 -45 -70
1641 -70 -34 -19 50 21 45 -232 106 82 -190 -94 183 302 285 -192 -269 372 185 62 -222 -137 -52 24 -106 -165 -203
1666 -203 -109 187 237 -171 -80 -153 303 15 30 -55 156 123 112 -26 -110 321 48 57 -103 70 12 45 53 85 -111
1691 -111 169 260 -128 -128 152 76 -94 -161 -141 -10 135 22 68 110 -57 -123 81 117 -24 -328 100 -64 -91 -203
1715 -203 92 -13 -23 173 -163 177 345 -88 7 9 1 354 -161 -174 30 232 -16 310 -155 87 222 -181
1737 -181 -39 165 -116 136 -138 -126 194 -42 -120 -3 -92 136 -42 15 -61 -84 -260 357 75 -40 -259 2
1759 2 29 12 121 -36 -194 -141 -103 -47 -248 -62 101 14 -364 -56 -144 77 25 134 -251 -27 -111 40 48 -53
1783 -53 169 37 34 -137 -9 -123 114 -79 -59 -153 198 261 -122 -183 52 335 83 45 14 27 52 57 -177 106
1807 106 -52 -102 112 -165 -44 -95 -146 19 -40 -49 -78 44 172 -175 -134 137 163 189 -1 -102 1 -133 -95 -196
1831 -196 54 109 134 -255 94 -43 222 162 -48 -82 114 208 286 81 41 75 11 -179 -34 -101 -205 76 -381
1854 -381 -84 40 88 -52 -62 -131 19 99 336 -156 -110 24 104 -23 28 -101 -128 220 77 61 21 208 -205
1877 -205 -132 22 31 -82 1 -11 -198 -264 -51 -163 37 186 -63 132 120 -126 -32 34 101 -172 99 -28 -17 -141
1901 -141 59 -31 -177 184 -141 140 -57 115 -213 64 125 103 26 -147 -55 181 -284 104 -92 -35 -13 -99 -52
1924 -52 -87 -11 63 -70 276 -61 170 97 127 40 -57 49 -25 -36 -145 -80 76 138 -207 4 2 171 -117 -241 -174
1949 -174 14 62 145 43 -156 124 -46 -198 4 51 34 -140 -83 -57 -215 246 -31 -123 -14 55 140 -163 -173
1972 -173 -13 356 -15 68 -268 -17 24 -110 -11 93 -308 -55 -190 56 97 -2 111 -271 191 -272 221 26
1994 26 56 149 126 134 258 140 -246 -44 127 40 -16 115 73 78 -4 -218 -59 99 276 161 92 -42 -168 -50
2018 -50 55 -301 1 -75 -115 -79 -104 -174 21 71 -35 227 40 -110 -53 -22 -49 178 0 -75 -30 -11 -50 259 -20
2043 -20 -90 -10 -200 17 23 -18 94 -274 15 -17 -227 -40 51 39 157 -111 -250 -292 51 516 -125 -40 -176 -18
2067 -18 -10 -130 67 18 -3 -216 -71 -201 -285 48 -81 78 -7 137 120 40 -7 -217 241 94 -99 -123 8 207
2091 207 -38 91 20 42 164 -71 149 -48 -152 62 181 -19 -292 -10 143 158 253 -245 -268 -186 332 65
2113 65 -137 -193 170 243 -76 -144 -189 -130 -3 129 -426 -60 410 47 -240 -69 81 -117 -42 188 235 24 -93
2136 -93 11 -112 -38 97 77 20 56 135 162 86 132 -180 183 -21 -88 -85 42 118 28 79 19 143 110 221 -108 87
2162 87 93 -1 -331 76 -137 43 76 -102 -62 -164 -217 92 210 -279 -60 168 -126 7 159 -127 -175 -76 289
2185 289 112 -108 -287 23 70 235 93 -32 147 -103 43 -1 -233 -87 -9 361 -137 144 66 191 -88
2206 -88 171 85 54 -87 -207 127 -52 -251 89 -120 -194 -252 109 9 83 113 158 5 -106 -242 180 154 -125
2229 -125 29 -301 -77 -76 -176 51 -61 -232 204 -90 162 224 30 -166 45 71 207 54 -98 -76 -184 11
2251 11 38 -245 191 -79 -202 99 233 71 206 -213 -46 -95 -300 -110 32 28 82 22 -50 -12 -185 345 -76
2274 -76 -40 -2 -55 -33 252 -39 174 -214 -85 -52 -3 9 -188 -229 71 175 -37 -33 41 -172 -23 86 216 -113
2298 -113 30 -120 374 160 265 -76 -37 -156 -38 -84 -268 -92 -52 -85 -265 -297 -102 -2 -63 98 -135 -187
2320 -187 -228 39 -92 -208 -45 -336 -134 -63 -169 132 63 -327 4 -7 92 -30 59 -68 163 122 83 -20 -340
2343 -340 -91 -133 -10 -24 -13 141 184 -183 -77 -9 163 0 -35 127 24 -78 113 -118 97 -105 -219 -19
2365 -19 -44 -165 57 107 94 -91 -219 -265 69 -219 44 -93 -46 -161 -7 -315 -71 -9 -268 -44 184 -273
2387 -273 -106 -73 94 -246 -150 -99 60 -244 -105 194 148 139 23 93 79 -330 -56 -41 -73 -98 128 -129 -11 -15
2411 -15 86 -16 73 359 133 -115 -100 291 44 325 104 30 -381 -20 61 -5 -87 -116 60 -304 30 221 -119
2434 -119 -339 -221 -127 25 124 -85 110 121 193 176 -10 -255 -312 159 -116 -275 71 -152 66 -82 -47 207
2456 207 103 61 -56 159 29 -40 -98 1 273 336 -106 56 -70 -112 203 61 -438 84 -57 -180 -16 -88
2478 -88 -124 14 -35 51 12 -49 248 -124 3 -102 -115 -96 -116 261 79 204 100 -157 63 -122 262 -220 120
2501 120 58 -329 362 134 298 160 126 100 -68 141 47 218 95 -160 -29 -132 -80 37 -206 -382 -100 -189
2523 -189 -46 -7 -54 -136 -186 45 -95 -157 -51 -96 14 21 -9 -261 -105 1 -84 290 -53 -34 162 55 114 -109
2547 -109 19 -105 74 -26 188 106 74 291 -345 158 -145 -193 69 -30 -155 38 5 -94 -297 57 -13 26 81
2570 81 128 162 -95 -125 -52 -141 -38 -31 1 -146 220 139 205 175 -183 -125 23 151 -36 -121 -56 -194 -380 -274 -121
2595 -121 -18 154 30 -223 33 67 -290 -153 27 311 212 126 -5 74 100 -203 -65 32 50 -78 117 -115
2617 -115 -224 -135 220 56 -8 -218 -116 -28 -72 52 -10 146 -275 -29 11 -170 -102 112 43 -51 -182 44 -177
2640 -177 169 57 -14 -65 -177 -40 -224 -55 -147 -196 -19 461 -95 -26 186 95 35 2 167 -153 -79 -85 -69 93
2664 93 -44 -112 91 38 100 19 21 -165 -110 56 23 189 -87 -70 2 -124 7 -197 101 51 -250 -179 -69 182
2688 182 111 -241 -144 124 203 40 -259 42 -32 -180 81 51 284 -55 -154 -134 45 145 -39 -87 116 37 -24
2711 -24 147 101 -122 -48 -191 -152 -20 83 234 177 2 107 90 234 -15 135 -117 -46 79 19 234 -20 -117
2734 -117 129 -57 -160 -215 -111 -211 107 36 180 -212 -19 248 -156 102 -7 -44 263 102 131 123 -23 47
2756 47 71 -24 234 -116 56 125 -30 192 -4 -98 201 -135 11 -3 258 -55 -18 -95 167 43 -106 -47 -3
2779 -3 -10 6 69 -9 345 -216 114 -35 -21 160 64 -82 -177 93 133 9 -22 -144 10 76 -56 -300 -98 60
2803 60 251 49 131 71 26 129 32 129 -71 -140 53 -37 106 36 -167 62 93 224 -413 -145 166 -3 -51 -130
2827 -130 3 -3 -69 107 59 232 -295 21 -56 -95 -125 28 168 46 -9 -192 52 7 30 24 88 22 -259 -58 303
2852 303 26 43 -45 -10 53 -60 -131 45 -106 -11 111 -113 -14 -123 197 -156 116 201 149 -71 18 -5 -244 -123
2876 -123 -108 225 88 -57 -34 295 -77 134 53 90 -14 4 28 116 17 70 -32 -66 18 -40 -123 -116 192 -46 122
2901 122 -76 -159 109 -179 -2 138 -100 186 -83 87 209 101 87 -86 -154 135 -25 276 59 -203 -86
2922 -86 67 -225 -174 -10 -26 60 236 89 38 6 -21 -61 -10 -146 28 -142 -102 0 -10 -5 -380 206 45 21 -68
2947 -68 -243 67 276 33 183 57 110 136 21 -210 207 121 -175 466 -12 102 187 58 111 21 122 263
2969 263 -63 285 112 329 173 47 -142 -176 205 157 66 56 -53 188 -125 117 -98 -74 -72 2 -258 -56 -66
2992 -66 -213 -116 -7 49 -289 81 167 47 162 -81 107 -143 -146 -48 73 87 -144 69 68 85 124 253 -89 159
3016 159 -98 -200 32 315 156 -38 -10 -80 -208 54 33 33 14 161 187 200 -68 -174 -293 -126 219 -109 -168
3039 -168 157 217 -109 -139 120 60 -117 9 -232 81 -2 -219 -193 45 -68 21 75 -202 186 30 -118 99
3061 99 -86 20 226 122 19 22 -179 -112 50 79 71 89 -148 -187 -78 -3 45 -54 -103 -39 149 -103 18 101 -101
3086 -101 151 -230 18 -83 -97 -15 -74 -87 -103 -157 37 -9 -134 -117 -82 -218 -115 92 -180 123 274 -64 107
3109 107 50 -46 159 -221 -248 -183 -27 84 177 32 -84 -129 205 -70 28 -102 19 -71 129 -10 -101 -49 268
3132 268 59 37 -157 103 -58 -127 -93 301 10 -70 -182 162 -227 -46 -7 -79 -90 -64 116 -81 -86 50 -167
3155 -167 -8 202 81 191 -55 19 8 -114 8 78 394 237 29 162 150 -50 -41 139 5 220 -17 -231
3177 -231 48 104 117 12 -21 66 56 123 248 181 60 -6 -81 -44 -52 -15 75 10 43 -60 46 -179 -36 -28 -24 93 -114
3204 -114 -146 -165 230 -155 57 201 -194 337 28 249 -128 145 -238 -6 -70 -1 0 2 78 -204 198 193 41 -185
3228 -185 256 174 -143 40 -120 -3 -20 -92 48 -13 -322 251 -191 -67 24 -67 9 6 48 -69 -52 -5 -38 -152
3252 -152 -153 13 -108 -55 43 -66 -74 224 21 98 -84 -99 59 61 140 73 -63 -106 -329 -31 11 -145 37 -270 360
3277 360 13 94 -24 -178 -131 0 66 -107 118 19 -197 -31 117 -52 -82 142 -99 108 -79 -232 80 -185
3299 -185 -303 6 -84 112 -23 -74 -39 168 67 31 -115 -57 -60 -6 332 259 -116 139 -39 34 -19 -23 -29 -135 101
3324 101 -290 16 172 -3 -32 23 147 287 8 -54 102 50 -78 -24 -23 86 100 -238 -151 -252 -56 115 -74
3347 -74 -27 -250 41 62 -261 10 63 -91 87 82 133 -69 -51 45 -16 -41 8 -35 -104 461 -55 -88 -58 100 219
3372 219 -97 -289 -151 25 -80 -204 91 64 -118 17 -161 -5 111 -233 8 56 27 61 -139 -138 37 -35
3394 -35 28 -173 -27 -101 39 -94 -93 60 -23 -198 -157 -4 -313 150 -164 22 -66 -23 111 29 37 52 153 9
3418 9 -52 -317 -87 275 98 129 35 -79 181 -99 85 -56 331 9 -182 -20 284 42 -54 140 -239 82
3440 82 143 161 -239 -210 -121 -95 -76 7 -75 -195 51 63 -119 -150 -18 -134 43 -210 144 -324 -358 33 -14 124
3464 124 -97 -54 -76 -272 96 -106 -107 114 -51 276 -39 237 -103 -134 -31 40 -154 -100 -87 -71 -94 195 7
3487 7 153 -90 -45 -100 -123 20 6 321 74 -15 -43 29 -84 162 22 -187 -37 70 -13 -128 -67 137 15 43
3511 43 68 159 83 -27 41 17 107 -61 86 -194 152 168 -163 26 -62 -27 67 53 -174 -256 -38 -57 209 211 43
3536 43 -112 107 -15 -123 41 -143 -112 50 68 -101 -35 -187 -241 -136 -176 -174 110 -243 -299 155 -116 -186 -94 118
3560 118 175 39 90 -103 40 -12 80 -39 -106 -74 18 75 24 78 150 104 -8 263 28 43 -10 -25 38 -105 -11 76
3586 76 191 64 -37 45 26 -44 -128 -158 -55 326 -187 -171 -252 66 -23 43 -82 120 16 5 -30 -172 -18 0
3610 0 14 -258 -47 185 154 101 -151 32 -118 -79 -151 167 113 224 -16 155 146 -6 115 -94 -200 67 30 -85
3634 -85 72 26 -60 -76 -57 -255 -11 -21 -65 102 66 -26 78 -84 -43 -107 347 -19 241 -91 -84 -50 132 -120 180
3659 180 11 -183 21 -92 52 17 -399 24 -103 -9 -4 -228 24 -86 79 25 -137 -140 56 15 -166 44 85
3682 85 -24 -237 -175 -15 -129 -211 -26 -53 261 8 -41 -101 164 -240 -157 20 -62 -234 -165 17 -166 -53 95
3705 95 -250 -229 72 67 3 -257 -254 -202 -127 -88 -21 -217 138 -103 181 -14 15 8 -19 22 -41 271 -64 127 -146 230
3731 230 152 28 105 380 -167 -82 187 109 96 -444 3 -115 6 -5 -108 -86 -63 -189 -87 -64 124 -24 156
3754 156 -26 147 76 -194 -195 127 168 103 -33 -95 115 69 24 -105 -22 186 341 43 89 27 -181 44 96 150
3778 150 -65 -56 -163 139 154 -53 -354 70 14 229 223 109 -149 -127 -90 -140 -18 -82 89 -75 -30 -101 -40 85
3802 85 -95 206 -105 28 182 143 300 -61 -43 -115 -217 121 -176 207 33 -331 200 -429 156 -45 -24 -84
3824 -84 -102 96 43 35 -168 27 211 229 -29 -235 -55 146 55 -91 -35 187 70 213 278 183 -24 69 -226 -85
3848 -85 60 -92 -156 -441 -53 5 26 68 -80 -241 -125 150 112 -230 -139 -41 -28 9 -212 263 131 -15 -185
3871 -185 377 -137 -177 -120 20 -277 -147 -44 119 129 -230 44 164 -21 -138 114 -316 -170 235 53 175
3892 175 7 9 20 6 65 -239 -65 -104 68 172 65 117 77 -97 311 -40 99 -18 198 128 -2 -64 59
3915 59 90 208 -255 -55 -178 251 54 -66 21 -11 -91 258 143 131 196 -241 148 279 -64 79 256 -2
3937 -2 94 -58 112 130 -100 216 -90 92 -39 -16 73 48 -45 125 -203 131 -59 -170 -156 -151 61 126 -207 -10
3961 -10 69 -179 100 2 -45 24 -80 -101 -29 -81 134 -145 -4 -87 -86 -119 -49 -78 -50 199 289 55 -17 116 231 -154
3987 -154 -55 -33 61 87 -322 51 -47 97 -177 111 72 -247 -17 48 -126 -33 -187 187 75 90 -68 -8 -56 96
4011 96 -159 -144 -98 -59 -124 122 19 -23 44 81 152 -174 -81 -133 179 60 283 218 -195 171 -9 50 -15 45 132
4036 132 -108 128 -41 -78 147 46 144 -206 -72 10 -210 -26 184 -63 290 -19 -126 -15 -63 29 -150 -70
4058 -70 68 76 -104 48 94 -164 88 -381 -45 206 28 128 -18 -231 42 275 -34 55 49 -34 -9 78 -245
4081 -245 62 -60 -41 53 61 -26 -135 52 -121 -60 92 -308 19 17 -5 -59 -134 59 202 -128 -33 43 169 -46
4105 -46 -98 129 -81 -144 60 251 -67 115 -188 -43 211 -13 86 -327 -137 18 -161 -15 249 -88 37
4126 37 -233 51 130 176 -386 61 -72 41 -49 15 -82 232 67 43 114 39 76 -100 -3 -145 192 128 52 112 159
4151 159 -212 195 58 -44 17 -22 -293 -136 -430 -133 -14 -129 -107 59 -182 -138 -6 137 158 155 231 -94 -193
4174 -193 -31 55 230 -172 33 302 82 -113 170 53 -134 76 58 63 -141 266 25 -40 30 -176 -140 7
4196 7 -148 40 -130 -183 45 -48 182 125 -92 150 160 10 -287 -48 6 -20 0 -22 -108 -145 17 -113 73 66 -54
4221 -54 -312 -105 179 26 86 -46 198 161 73 -61 6 -240 -376 -4 45 -240 -23 -57 29 540 -111 -103 -30 62
4245 62 192 157 -1 -88 -53 222 117 95 164 79 239 157 216 -104 15 66 -149 -114 150 -156 -92 110 33 116 38
4270 38 66 25 26 -212 168 250 -13 145 49 -104 30 96 69 64 -123 91 46 71 -13 -75 -57 244 38 -58 62 41
4296 41 47 103 -87 21 134 34 -64 62 -138 53 -105 -16 -95 55 10 -43 21 -112 -187 -188 9 -168 19 48 -200
4321 -200 29 38 13 67 158 167 13 -300 70 37 -95 239 183 115 -14 92 -74 22 10 -316 50 -21 297 -200
4345 -200 2 -89 37 30 -135 132 -144 -239 190 155 -110 -129 144 -128 -233 -66 -50 140 -265 -148 28 -145
4367 -145 -305 135 209 286 9 31 -29 -52 32 -230 -83 -166 264 -6 -25 94 -41 80 -65 367 118 -29 215
4390 215 -200 -41 -203 219 31 137 -38 -40 -29 144 201 87 94 273 77 179 -240 27 315 -96 92 -26
4412 -26 47 39 94 63 -86 -166 -143 -26 -43 67 74 -29 55 119 130 58 -6 109 -104 78 18 94 -232 -79 168 78
4438 78 -58 -107 148 -209 171 -100 154 39 -142 -48 95 -65 256 -132 104 129 -62 -59 -222 -31 52 15 166
4461 166 -197 81 -30 -20 -14 -161 87 -189 -58 -168 39 140 -256 -150 12 -214 79 -78 -186 163 74
4482 74 133 -17 -4 -235 -125 139 -295 -47 74 90 28 179 70 -23 69 -147 -64 -195 -292 156 152 18 -232 -95
4506 -95 -90 -9 115 -188 -24 102 51 8 6 160 243 -94 -56 -26 -137 -23 74 -90 -154 267 -146 -48 110 227 -24
4531 -24 -108 287 231 -52 -77 169 167 -47 241 108 6 -1 -221 -94 -205 150 -11 30 74 279 -16 -114 -189 124
4555 124 18 -25 14 10 -52 -146 183 45 -116 113 -3 -220 132 -93 -85 -198 52 147 -29 113 145 -25 -30 -131
4579 -131 13 -171 -72 130 -32 118 -12 -17 363 127 155 119 33 38 -147 255 172 31 -169 56 127 -131 -165 -23
4603 -23 127 98 82 -110 -168 -97 -282 -52 63 -31 24 -83 114 -64 -209 84 199 168 54 -63 28 -139 -290
4626 -290 137 -48 104 83 169 -107 77 -106 140 -13 227 268 -60 122 81 29 112 -167 225 67 -96 31
4648 31 -43 219 195 -12 87 111 -33 -114 -80 -243 -308 233 -4 90 129 16 -70 -308 301 60 -33 -6 -33 -30 -172
4673 -172 -146 -15 -132 -116 -164 44 -63 260 -73 226 18 -34 -42 -453 153 -279 -179 196 155 -6 5 72 118
4696 118 30 157 58 199 175 34 63 -3 -23 54 76 -72 -55 -153 -28 111 143 -14 4 -106 39 71 -31 -90 -130
4721 -130 16 11 -191 24 -60 37 69 -45 16 -70 71 210 -21 -7 156 -140 -501 -16 64 -19 96 275 -266
4744 -266 45 -248 -126 296 -129 110 -70 -59 -39 8 50 8 -157 245 -105 16 -103 -45 16 -141 57 -198
4766 -198 -105 111 -102 -206 81 -114 -67 -101 -264 9 137 -50 -102 79 9 79 10 104 -57 -96 18 -82 70
4789 70 0 215 26 332 -51 -72 -318 107 240 -230 -214 98 -72 -161 -34 -53 41 51 69 -33 -82 77 -21 26
4813 26 -52 42 -45 -249 -233 387 -104 -246 -130 76 56 -212 -59 -336 1 -110 -100 -52 -69 -52 -199 40 -280
4836 -280 -178 -86 -66 43 -214 43 -147 -61 113 -109 366 -34 -172 -27 343 266 29 -40 -64 6 61 65 -76
4859 -76 40 92 265 45 -43 31 -55 46 62 -18 -97 18 -140 -38 -29 100 -134 -74 24 25 -126 82 142 -125 102
4884 102 -257 2 -66 -24 42 -64 347 -44 -37 155 -23 45 169 -244 136 -77 -125 -150 131 -95 -31 -249 -148
4907 -148 89 277 -78 -182 -138 130 116 184 -48 -105 91 -57 88 4 -30 -117 138 -193 -114 81 238 83 46
4930 46 -143 246 101 -210 154 11 -16 -114 27 167 133 -192 104 266 -136 92 62 -269 19 330 125 -186
4952 -186 324 78 -104 98 180 64 -262 13 -18 219 78 49 45 240 179 167 118 65 -189 -253 -51 -103 32 0
4976 0 270 178 18 12 -90 -136 -7 81 78 234 -66 -107 -217 49 31 -15 103 74 282 35 -184 39 -14 81 108
5001 108 45 -186 -25 -9 144 75 50 -239 -96 144 20 -126 188 164 266 134 77 130 -51 31 -153 -146 -119 -6
5025 -6 -149 -141 -146 0 23 -179 -84 -161 5 -20 50 -67 -103 -283 -38 -78 170 86 -113 48 -232 47 -44 127 139
5050 139 104 134 27 167 45 -297 78 100 -85 21 -108 -145 -31 96 146 139 58 67 83 -49 109 -179 -125 182
5074 182 72 168 121 1 -129 -46 8 32 13 -21 -78 -119 -237 -166 -184 49 19 182 -176 66 83 -61 49 -70
5098 -70 122 -160 -144 -76 5 246 -199 -136 -1 43 11 242 -17 197 20 222 -247 -23 128 159 -159 -144 -3
5121 -3 132 -241 70 -140 -163 -10 -58 -68 -175 -167 -101 -155 -53 -211 167 238 98 197 -53 108 -232 -171 18 -426
5145 -426 25 176 -115 61 22 -21 -106 -46 -62 -58 9 71 82 -93 8 -94 -139 -126 79 -42 -126 -40 5 -91 -284
5170 -284 13 51 0 -10 -77 -142 -70 86 -46 3 -18 -117 163 -127 -154 4 -93 -302 -72 -331 51 -115 4 145
5194 145 -67 -14 -33 190 43 64 23 240 -207 -295 72 -124 312 152 184 -21 295 -17 20 167 211 91 -39
5217 -39 -3 -103 -19 165 -41 -155 87 2 185 -328 19 122 37 -42 -190 37 -77 -23 -110 -119 36 19 100 13
5241 13 -96 136 45 66 125 -22 35 117 -20 125 241 -31 29 -13 82 10 -62 233 -150 146 45 26 40 -171
5265 -171 12 154 156 150 -230 -188 -23 -87 52 -215 -196 53 100 81 1 87 -113 22 -118 37 -4 -28 -120 99 177
5290 177 122 -144 -32 -184 246 38 -119 130 -52 -41 28 -163 -30 -22 -97 -144 -97 111 -104 87 127 -69 138
5313 138 195 0 154 30 119 -149 393 136 110 65 -156 -186 19 14 -237 85 -36 -82 -70 -240 89 -31 1
5336 1 -70 29 -24 -15 38 85 70 -19 75 67 62 -269 -62 -126 -127 -32 180 23 -5 -122 156 99 149 45 9 54 -46 83
5364 83 -81 -13 -53 83 181 258 -59 143 97 318 -4 200 -55 -13 -149 -79 -110 14 -44 -49 -287 -222 -196 -67 -64
5389 -64 93 -185 -13 55 53 -292 -60 -14 102 71 -156 142 65 31 229 53 -1 214 117 79 -179 199 -4 45
5413 45 -132 146 -64 -15 160 87 19 195 173 -125 153 -92 115 -130 294 311 -232 -183 -140 -72 -46 -146 -60 -20
5437 -20 331 -93 84 -34 -230 80 25 -12 9 -124 139 37 -62 -68 114 111 182 -2 136 -166 394 142 178 0
5461 0 113 100 36 319 -93 -97 -57 61 153 -73 85 1 -238 66 -149 16 155 24 -182 -69 -31 -114 -55 -226
5485 -226 -86 -167 -400 -287 18 20 12 -191 -111 -38 -57 -213 -11 -109 -44 -12 -76 31 157 21 -104 38 -122 30
5509 30 -3 100 155 -90 -12 57 -35 76 138 -180 118 -78 -248 278 -37 -165 -205 -58 141 -86 126 -104 160
5532 160 -24 -133 38 -33 -6 34 -139 -104 126 -23 -51 -93 30 -151 -45 -54 134 98 10 313 273 81 -240 -75
5556 -75 -76 -24 -21 -96 301 36 319 238 132 10 19 126 11 99 -81 -6 -58 -13 132 149 -1 -19 -19 30 -52 -49 -12 -81
5584 -81 -132 -64 -189 116 237 110 12 78 -135 147 -20 -98 -54 52 -13 -156 116 142 14 -272 61 68 43 144
5608 144 43 7 42 -121 -251 -189 151 -54 11 61 147 -180 -124 173 -45 181 -57 -1 -75 -3 -62 -120 -104 -159 98
5633 98 207 -50 84 61 -123 36 112 -25 -48 -30 62 -11 -200 -195 38 15 41 72 -37 196 -129 -55 397 1
5657 1 269 -182 -12 -7 186 44 54 -206 171 -108 -22 209 -113 147 -64 355 -44 83 145 -17 -198 -26
5679 -26 -15 -132 -28 -60 -43 72 92 58 76 227 55 -69 -22 204 7 54 -50 76 -59 -135 79 -88 -206
5702 -206 -46 -275 -17 35 -32 206 -39 59 77 -48 -12 -58 102 -58 -58 14 25 -319 -62 -20 -170 202 -117 -151
5726 -151 127 -229 -187 -6 115 165 32 26 10 -65 -116 -11 79 -27 26 -113 -85 -172 -157 196 -164 -179 106 227
5750 227 21 -104 -58 229 37 43 -126 209 -85 37 67 61 -39 -42 -33 192 69 27 19 -90 -220 -143 115 -218 10
5775 10 -127 -72 -114 -52 154 -197 -8 -35 146 312 36 -60 -134 -2 -173 87 -194 144 -46 -118 -280 17 50
5798 50 -168 -138 -118 -67 -99 8 -140 -75 82 -183 22 -17 132 95 70 104 -69 -132 -5 160 -286 5 -13 -54
5822 -54 45 96 -39 158 312 33 -45 -41 57 98 105 92 92 -139 68 -66 -112 -104 78 -179 -44 75 -59 -94 -142 -68
5848 -68 135 4 -193 -34 75 114 79 -24 213 142 1 -32 117 -94 -85 113 -91 -237 -27 235 166 306 135
5871 135 -30 -52 -195 297 -63 44 -212 -10 -123 39 248 -144 124 38 -4 40 45 -216 96 309 -97 -198
5893 -198 -84 -121 18 1 231 -70 -225 214 100 -5 -22 -35 9 97 -68 237 164 34 -123 7 -96 82
5915 82 35 -119 189 -60 -199 -183 44 -96 113 -75 -84 -198 77 99 110 -203 34 137 71 10 187 -147 -132
5938 -132 57 -3 43 42 -31 53 -225 -86 -137 -105 -18 -133 -2 -31 38 11 -89 21 39 -117 34 153 192 107 24
5963 24 -15 38 -33 219 -102 38 -91 208 196 248 91 -59 79 23 100 -271 -265 -124 21 121 41 -52 81 235
5987 235 -50 -68 200 -48 -158 -114 -74 281 121 13 -244 -330 -46 86 -112 -50 51 57 -27 -68 -139 -42 50 -212
6011 -212 149 -65 56 142 30 106 -32 -78 -14 119 -63 73 -30 23 39 12 13 233 -56 52 202 -74 -5
6034 -5 128 -138 -130 186 44 13 137 77 -342 -167 17 157 -363 -245 -128 -84 -241 -82 159 -223 -197 45 -124
6057 -124 135 195 -71 59 -8 29 62 -56 288 -178 -28 -14 -9 153 82 -141 176 61 78 99 156 -144 -44 -82
6081 -82 -47 -6 116 126 56 17 -100 129 -47 -13 -130 -42 59 -10 -122 -103 35 3 -244 94 -1 -189 -144 -164 53
6106 53 -39 -24 156 9 186 -23 -39 -234 152 107 -73 163 55 176 135 190 175 -64 107 0 228 -14 52
6129 52 -211 21 -23 324 75 -9 242 -79 5 -3 0 -34 12 -95 173 -46 -356 -301 71 10 -218 41 -53 55
6153 55 -205 70 -88 32 113 -74 170 77 -66 54 -91 -154 37 -13 -126 102 -7 -118 322 -289 297 -7
6175 -7 161 -228 -9 -114 28 184 333 148 -232 -206 -54 -104 128 -5 -26 -204 -69 -6 -10 -34 -32 74 -156 109
6199 109 -29 -286 -130 -204 14 -69 21 -36 -68 -70 -185 -79 -66 -2 -274 -110 212 9 -29 38 95 -118 155 163 -124
6224 -124 -52 96 -28 267 69 35 -109 -162 104 142 -26 15 138 -90 7 -181 -237 127 32 -22 -112 -128 -6 -251
6248 -251 91 170 -67 -250 -2 -219 -33 -57 99 126 93 100 70 -41 -209 -34 -71 2 -153 20 25 106 28 27 94
6273 94 -33 88 132 -85 177 -29 55 217 -262 32 -187 138 -44 -28 7 -131 18 -25 175 59 -505 32
6295 32 -178 -89 -32 58 -118 9 59 -67 42 -119 91 59 105 236 -80 -216 37 -49 100 152 -26 -93 -22 -97
6319 -97 133 -176 -19 -11 39 -62 -73 -237 100 -229 77 99 186 133 120 45 9 -50 56 287 -43 71 157 43
6343 43 -202 4 -28 190 -58 -242 -115 9 68 -64 5 32 20 28 -262 -36 70 257 80 -49 -11 -143 -183
6366 -183 -2 18 47 -54 145 -31 -50 -27 -65 98 -148 -67 87 81 -24 2 75 19 -2 -133 8 -51 205 -212
6390 -212 43 29 -39 0 -13 -115 -60 -62 -187 -192 17 -192 -125 41 16 -91 -171 -118 -3 66 -75 -142 72 -139 176
6415 176 120 -178 168 -251 -26 225 258 93 -50 -158 58 40 258 -12 123 78 -26 47 -26 -18 310 33 -95
6438 -95 -47 -48 -11 301 -206 68 77 -204 51 -9 59 -179 212 44 -221 -46 -118 -84 1 71 -191 52 -36 89 -147
6463 -147 -129 0 -117 -118 54 144 100 -48 423 223 -70 -64 -110 49 -20 -116 -105 229 -111 -101 211 -123 89 -9
6487 -9 173 27 166 59 89 -112 -159 72 -365 -221 -118 -114 6 214 -107 -15 -9 149 -69 -62 3 -310 -157 147
6511 147 -145 -157 18 10 -101 -121 93 3 52 91 109 -139 -271 0 -49 190 -19 -59 93 7 159 -29 -142 -2
6535 -2 58 139 103 41 126 -88 44 147 25 6 37 -204 228 -58 255 49 75 -132 -137 289 -386 -311 263 -205
6559 -205 -162 -26 -334 -118 -47 23 -4 93 -93 -189 43 44 155 179 -97 10 22 70 -55 -179 300 94 -38 -52
6583 -52 45 -10 -70 -5 128 -2 78 -10 -91 148 181 -63 165 92 -220 -148 -154 4 -11 253 84 86 28 -11 -21 119
6609 119 -42 -67 -129 60 -254 118 -112 -72 -48 39 74 -49 37 -156 25 -92 68 -29 126 273 -113 42 145
6632 145 -22 125 -226 6 51 -1 121 -69 -28 -108 11 111 -93 51 168 -60 56 -39 -178 -66 114 -145
6654 -145 -133 -240 27 14 84 103 -85 -43 -95 157 -9 -64 -237 -106 95 -76 77 -133 -261 -87 -67 53 285
6677 285 -143 115 -217 -43 201 -59 -78 34 59 -227 162 347 103 -19 -36 -106 -46 -176 47 -35 -54 -39 -196
6700 -196 61 -112 55 -128 -61 -45 -29 -167 31 -11 -66 -130 -101 -204 27 74 -193 -61 -35 221 83 186 124
6723 124 177 97 131 -133 46 -127 -179 107 73 -353 -202 140 -151 -4 155 -62 15 -143 270 286 -48 88
6745 88 -11 -58 -50 -2 73 28 -155 55 7 77 173 48 -197 108 -169 -298 33 -171 -109 -109 -105 -43 -55 -110 -137 -217 135
6772 135 -14 36 -20 -74 82 -224 -72 -1 -121 330 -159 35 41 -86 -93 -35 75 47 67 -43 125 41 10 17 94
6797 94 210 -87 -82 141 -33 82 -6 -250 -131 -31 -45 39 89 71 8 -110 55 -112 22 118 -30 294 42
6820 42 0 151 265 228 40 -177 -84 -80 163 155 235 94 36 165 -5 93 -121 86 -187 109 75 -115 -149 182
6844 182 146 -211 -94 203 -40 -187 88 -113 -80 43 -33 -108 -115 -73 53 -177 -179 -73 162 3 -176 43 -91
6867 -91 7 130 76 -114 14 -35 -263 149 -126 -112 -146 288 15 -74 4 -112 55 59 57 -261 -106 135 188 45
6891 45 29 -149 9 55 33 -143 27 -53 -104 238 16 -64 74 -5 150 -40 186 -10 -140 287 124 34 78
6914 78 375 45 -132 50 -119 -134 59 58 -235 67 -118 -45 91 -193 -91 110 -144 86 99 -14 188 3
6936 3 -16 185 -95 -96 -72 243 90 -1 -134 -196 21 -108 281 -12 25 231 -367 11 163 142 -211 -52 -206
6959 -206 -216 -96 51 59 12 -11 -92 -147 -328 45 143 -85 -26 -282 -72 77 -115 -60 56 -121 277 23 -47 -84
6983 -84 199 -82 -102 -226 49 316 -175 -96 56 157 98 19 159 -48 -297 -74 -163 -6 22 -54 85 -174 -329
7006 -329 -116 -32 159 -129 261 -228 120 -113 -132 -172 47 -41 -279 -4 8 -108 24 98 -52 207 -163 13
7028 13 177 77 -53 108 25 -102 137 94 142 -73 30 9 89 164 51 -8 79 -44 31 83 -212 -9 90 -168
7052 -168 151 310 -85 119 -278 -131 63 203 74 -110 -16 118 -189 -314 122 -162 79 160 -14 -16 103
7073 103 -79 47 -88 -115 34 16 166 -50 139 8 -5 -84 -112 -65 -54 10 22 -94 -3 29 -126 -99 62 -23
7097 -23 93 184 -203 199 -137 79 46 -63 -235 -89 92 -101 -127 81 -4 -113 59 21 -53 23 -15 -144 -123
7120 -123 15 -114 -50 251 -40 -293 76 -32 -21 -47 -137 51 2 -95 56 1 -76 102 67 13 -109 -98 -96 340
7144 340 -211 -67 100 -161 -129 -11 -114 23 -402 293 8 117 59 33 149 -55 61 51 -50 48 -248 245
7166 245 83 159 -24 -42 38 -12 230 -217 90 -61 -113 -411 -2 95 -70 71 196 70 174 28 76 46 53
7189 53 -228 -12 167 -33 -33 222 134 151 34 -63 -251 153 246 -202 94 -114 -90 -8 -13 -42 -426 137 -93 -35
7213 -35 -34 8 308 -75 132 130 -23 156 364 22 -104 59 -122 -25 -10 -100 -25 -92 46 48 -125 -215 -155 -93 22
7238 22 -97 -37 -39 132 -80 61 36 84 -74 85 81 98 122 28 76 28 59 25 -3 -81 164 101 86 -75 -65 -5 71
7265 71 307 20 -170 24 -180 -167 36 -155 -192 -147 -276 -50 -32 75 188 66 135 243 40 187 -1 14
7287 14 187 -143 105 15 83 -242 -129 74 -75 179 139 -45 48 58 101 143 -91 77 -197 -97 -1 190 224
7310 224 -16 -14 57 28 65 12 -71 -111 -79 -11 -169 -64 -194 -9 -97 -128 -71 -168 -162 97 -103 -20 163 -130 229 -92
7336 -92 55 191 73 90 157 -26 256 -280 -24 156 -47 -9 -265 -347 319 -91 -168 -96 231 15 -72 -110 -16
7359 -16 135 115 -37 168 -266 192 75 -166 160 35 -192 -206 -43 -130 106 -29 61 -97 41 -261 -71 3
7381 3 -6 -43 -172 182 48 113 -38 149 -12 -128 286 -110 50 188 38 -70 -253 123 30 120 48 -152 19
7404 19 -26 -20 55 239 -44 46 -69 76 81 99 82 1 -107 -341 -165 -43 -178 -136 142 3 6 -154 -303 12 -126
7429 -126 9 -265 -121 -145 134 216 146 -99 -108 44 431 100 19 11 -111 -3 -258 -97 134 83 -2 -268 -276 109
7453 109 84 157 -391 151 76 -320 241 116 -227 -74 313 12 103 -68 -92 -83 78 70 1 -8 -80 9 -94 -27 -71
7478 -71 43 200 152 -42 85 -37 -267 -24 -249 110 -106 -16 77 380 -54 -151 109 45 -244 -37 241 171
7500 171 200 61 155 272 -46 -29 129 -206 -28 78 -186 -27 -158 -215 -98 -171 -262 -9 -63 -111 189 -61 153
7523 153 -47 52 4 159 32 -109 7 -39 -97 117 -68 -80 -125 54 38 -145 196 -45 -146 251 34 33 -25
7546 -25 184 37 41 -78 -276 108 64 105 100 -148 -144 27 22 45 9 50 -2 81 -168 -215 15 -41 -125 -1 -143 -262
7572 -262 -76 98 266 232 -104 -171 145 -31 213 27 -115 -179 136 186 -136 67 101 174 87 -121 -328 132
7594 132 113 -208 -47 -29 -18 -42 73 74 101 8 24 -164 98 -80 -24 239 0 156 -39 27 -59 -55 15 -77 -73 160
7620 160 112 103 69 131 -111 -67 -150 -113 -75 232 4 -187 274 -168 -111 -34 -59 -73 -83 -68 -307 22 105 -10 -84 92
7646 92 26 -71 -17 148 -121 122 -84 132 151 -76 -109 100 217 -21 61 -16 200 -33 -118 -204 -67 -256 -158 -3
7670 -3 -183 82 226 66 -219 2 -123 32 85 -164 -111 -245 -198 104 -81 -1 140 -100 -217 -189 128 31 34
7693 34 -99 -82 81 -8 -146 3 -8 -115 -253 119 125 104 122 -81 -129 -64 -55 156 -116 102 -340 147 144 271 -27
7718 -27 216 -36 -15 132 -171 122 -160 -125 122 -22 -83 287 -70 -189 129 98 -137 -30 -211 -401 -160 -46
7740 -46 -145 42 -64 -12 -217 60 210 -104 -82 -49 143 224 95 -47 -13 107 101 -202 6 70 -69 199 -62
7763 -62 15 73 222 -368 50 -183 -53 46 36 -97 -36 113 -39 -13 -136 -140 93 85 130 73 -68 -84 -78 -110 -125 64
7789 64 -90 174 -116 391 -187 97 1 148 68 52 -9 100 39 236 64 -149 168 -6 73 -139 132 49 13
7812 13 -8 -123 46 28 -211 -69 38 -297 184 21 31 -139 -221 -60 -134 -235 -263 -100 168 -1 -159 72
7834 72 23 136 247 100 175 161 -337 -75 24 -264 13 57 216 8 -255 -125 -26 242 -9 -120 -17 -22 62
7857 62 -8 96 -252 282 84 -15 103 -167 122 3 29 106 -149 -7 50 -109 266 134 79 -201 -10 9 212
7880 212 133 -179 33 -169 61 -38 -43 23 -161 90 -353 87 -333 -68 -265 46 -43 102 60 143 -190 -137 -99
7903 -99 -2 24 -218 143 53 88 177 -13 31 168 104 -136 -230 55 -37 70 -28 35 69 -142 -36 -48 -111 231 142
7928 142 -120 -173 22 -117 -105 -283 -50 -124 -22 86 21 -137 -178 91 -97 126 -128 131 53 244 18 103
7950 103 80 -271 -220 124 338 45 -54 151 9 42 -228 1 -54 33 -34 107 -186 -319 -155 332 16 5 127
7973 127 -21 -84 118 -203 -95 57 -196 110 -79 283 -210 -169 1 62 156 -19 -85 -183 26 -231 -95 29
7995 29 44 -38 -28 29 -145 -10 -213 83 74 105 73 -182 -28 76 54 202 146 -22 -25 192 -255 -277 145 -7 -262
8020 -262 -74 -139 91 96 157 -52 64 125 -79 -33 -57 129 -106 76 -171 -90 -22 71 129 -86 -97 57 -87 -74
8044 -74 -214 76 90 -263 303 -12 145 183 -1 135 261 115 -96 -34 55 70 65 -30 -6 -83 -8 202 -9 -136
8068 -136 66 60 163 192 132 -134 53 -275 -58 49 -40 86 -182 -37 -129 200 183 21 87 228 -171 -156 -77
8091 -77 -116 163 -329 39 -271 237 -65 13 -94 120 35 -49 254 101 213 -3 -192 -166 -7 -37 -131 -219 71
8114 71 -105 -141 78 34 42 3 -142 109 -177 126 -3 -331 113 -250 64 -27 60 -12 102 302 -32 58 -192
8137 -192 -115 62 117 1 -65 -165 -20 47 -87 239 -247 -60 167 345 -101 -104 21 -8 110 -121 280 161
8159 161 279 -9 347 -77 -269 -25 -53 -16 69 148 -57 -70 29 -16 -37 229 -25 -127 -120 -80 -43 54 -62 219
8183 219 257 -38 66 -32 -50 -143 -148 124
8191A24
$$ Imaginary data points
##PAGE= N=2
##DATA TABLE= (X++(I..I)), XYDATA
0 0 0 0 0 0 0 0 0 0 0 0 0 0 0 -9 32 -32 32 -32 64 -64 64 -96 96 -128 130 -160 192 -224 256 -289 332 -385 433
33 433 -487 553 -623 703 -789 880 -982 1093 -1213 1348 -1493 1650 -1824 2014 -2216 2442
49 2442 -2692 2968 -3268 3605 -3977 4392 -4863 5400 -6010 6724 -7565 8574 -9810 11366
63 11366 -13396 16165 -20178 26572 -38349 67357 -286586 -244413 307860 -45901 -219342
74 -219342 128500 447075 64775 -255663 -6514 291015 -61020 -423509 -101032 442081
84 442081 257149 -296872 -275804 244709 278246 -213789 -337691 135191 328790 -73020
94 -73020 -308579 65571 324775 -51104 -421918 -98284 399066 269963 -209865 -221137
104 -221137 153345 187069 -164271 -244117 65910 197575 -21624 -99389 124318 174762 -127825
115 -127825 -278378 -9155 208494 7514 -217569 -40156 233202 129954 -150230 -135622
125 -135622 74277 67208 -87578 -19321 181127 106763 -174430 -192224 82381 169244 -66859
136 -66859 -182489 45203 225566 52567 -174793 -106522 75351 45740 -81900 -31108 103243
147 103243 58820 -80691 -49463 96915 84662 -71413 -95983 51140 116720 10976 -70396
158 -70396 -22112 14003 -33987 -35860 50951 69902 -32797 -75167 27621 87642 -29106 -142981
170 -142981 -60523 94293 89776 -33412 -61149 25385 55570 -12506 -42693 8143 29895 -16622
182 -16622 -28293 31275 54435 -13881 -74301 -38640 32551 44480 7250 -14402 -10076 -3389
194 -3389 6999 16915 -3438 -42620 -29928 42012 73335 6044 -66804 -38882 42471 55187
206 55187 -7016 -42105 -8114 28017 13412 -15488 -13726 -1272 -7634 -13314 6613 28854 20222
219 20222 -11229 -25781 -8235 18453 20347 -6821 -31192 -14404 31266 46883 3485 -47612
231 -47612 -36950 23122 48439 2867 -49401 -38454 12690 32823 3198 -27682 -22253 5557
243 5557 21993 14648 -2391 -12028 -10192 -2077 5430 8806 7702 2052 -3979 -1018 13123 20547
257 20547 1870 -27729 -24367 15003 38528 8222 -36420 -33301 13298 39886 13883 -24924
269 -24924 -25859 4818 23920 11531 -11592 -20391 -9443 9475 18709 9248 -8213 -13293 -2007
282 -2007 10301 9754 -2152 -13190 -14725 -3236 13132 17782 232 -21994 -18480 12028 29257
295 29257 7113 -25703 -23618 9585 27473 8635 -19118 -20190 1590 16964 11282 -4125 -12017
308 -12017 -8935 622 8959 7330 -3508 -12277 -7287 6813 14957 7717 -8259 -15112 -3338 16774
322 16774 20217 416 -19693 -13041 13632 26137 5770 -21685 -19409 7904 22523 6361 -16404
335 -16404 -16768 1586 12552 5694 -6465 -9686 -3688 940 2378 3070 1258 -4480 -8177 -1944 10065
350 10065 12368 -1334 -15374 -10337 9984 19185 2708 -19740 -17185 8239 23361 7382 -17746
363 -17746 -18891 5348 21869 8710 -14479 -16755 2489 15414 6697 -8050 -9115 1895 8436
376 8436 3114 -2759 -1136 2062 -1040 -4604 -160 6862 4763 -6363 -11003 367 13915 9881
390 9881 -8330 -15759 -1163 16452 12710 -7432 -16963 -3884 14311 12878 -4840 -14914 -4913
403 -4913 9588 9432 -3416 -11143 -5626 3562 4906 -851 -4488 -2525 -136 -245 153 2367 2546 -1531
419 -1531 -4968 -904 6346 6899 -2182 -8416 -2479 9156 9726 -1134 -8906 -4016 6106 7869 200
434 200 -6861 -5373 1712 5322 2914 -1921 -4422 -1987 2913 4470 1362 -2712 -4009 -1719 1791
449 1791 4207 1623 -3820 -5593 -21 7228 6122 -3653 -9214 -2885 6964 6168 -3605 -8160 -1809
464 -1809 5592 4348 -1062 -2952 -1580 126 976 1932 848 -2372 -3718 -957 3169 3358 -607 -3510
480 -3510 -2531 565 3699 3005 -2651 -7684 -3382 6805 8661 -1984 -9814 -2819 9302 9027 -2630
495 -2630 -7844 -255 7250 3519 -3399 -3111 992 1278 -282 889 2561 -100 -3399 -2698 1165 1434
511 1434 -824 -2744 -2506 -940 2155 4558 944 -6419 -6332 4407 10721 1728 -10425 -7158 7242
526 7242 9728 -3083 -10922 -2672 8256 6130 -2175 -4337 22 1109 -1258 -995 631 -467 -1384
541 -1384 1299 3348 929 -1805 -842 303 -1053 -1031 3693 4756 -2419 -8141 -1449 8165 4628 -7475
557 -7475 -7573 5237 10853 694 -9524 -5250 3679 4459 -718 -2341 505 1775 1244 2575 1611 -3166
573 -3166 -5116 401 4614 313 -4357 -2320 2283 485 -3691 -1768 3174 1241 -3826 -2243 4403
588 4403 3202 -5632 -6700 1991 7054 1668 -4106 -222 4546 1824 -1830 -1152 1162 -702 -1947
603 -1947 1633 4373 -388 -5098 -1735 4219 2531 -3026 -2130 2673 2322 -2263 -2070 1047 435 -2437
619 -2437 -82 4843 3455 -3867 -4852 2151 4357 -2375 -5436 668 5124 571 -4106 -1257 2937
634 2937 91 -3925 -713 4202 2339 -2643 -2341 1670 1303 -2167 -1448 1854 1579 -992 534 2802
650 2802 -771 -5741 -2567 3991 3105 -4011 -4377 3311 5644 -1403 -6347 -676 5336 1873 -3448 -1047
666 -1047 4425 2534 -2552 -2314 1739 2000 -475 -85 1900 800 -1472 -235 1428 -1125 -4056 -566
682 -566 4383 1205 -5039 -3561 4408 4678 -3351 -6216 1163 6081 759 -5080 -1810 3612 2151 -2619
698 -2619 -1919 2142 1872 -953 -1181 727 25 -1894 -441 1926 -4 -2343 117 3591 973 -3764
714 -3764 -1862 4092 3356 -3169 -4494 1504 4673 -245 -4627 -612 3931 1908 -2257 -1665 1039 493
730 493 -1280 -622 1551 613 -1131 408 2490 255 -2495 -1387 2292 1780 -1642 -1025 2051 1841 -2204
747 -2204 -2676 1202 2356 -1208 -2990 564 2628 -107 -3232 -1410 1397 440 -1491 -405 1653 619
763 619 -1132 -223 1476 290 -2096 -541 2518 2070 -917 -1540 933 1084 -705 -1386 321 857 -232
780 -232 -473 940 705 -1401 -1397 1122 1906 -503 -1788 571 2176 201 -2110 -1174 1183 896 -880
797 -880 -709 1160 594 -1030 -1211 377 981 -74 -742 -149 435 5 76 150 -536 -600 268 1454 348
816 348 -1893 -1212 1622 1571 -1428 -2329 -155 2262 499 -1973 -1641 761 1425 -382 -1188 -154 812
833 812 422 -288 -793 -513 494 1251 639 -201 -432 689 1347 -17 -1546 -508 1518 825 -1396 -1465
851 -1465 778 1593 -228 -2198 -840 1325 1002 -649 -1487 -322 841 691 -385 -785 -184 806 1162
868 1162 -5 -1282 -621 948 1570 -621 -1661 -137 1781 1319 -977 -1287 470 1639 -143 -919
884 -919 -343 765 805 -99 -605 -155 305 433 -177 -418 -234 261 416 -146 -654 -484 729 769 -248 -831
904 -831 65 998 580 -551 -683 482 831 44 -529 54 206 587 165 -98 -158 -156 179 405 -181 -677 -685
925 -685 -53 366 -134 -713 -283 352 173 -199 -360 -91 178 208 -62 -246 -134 16 194 91 -192 -97 171
946 171 594 8 -386 -384 601 401 -268 -632 29 295 71 -628 -446 295 638 -141 -450 -196 558 574 -273
967 -273 -502 -57 490 807 -228 -688 -395 800 854 -541 -1020 -167 718 640 -556 -907 219 718 269
986 269 -453 -325 279 752 20 -598 -428 420 405 -425 -715 10 302 352 -140 -807 -187 826 479 -358 -650
1007 -650 500 1006 151 -659 -687 584 1277 164 -822 -534 566 922 -114 -841 -395 586 628 -170 -699
1026 -699 -559 277 607 -391 -845 -73 620 412 -442 -701 45 387 189 -312 -413 236 322 -213 -401 -133
1046 -133 258 467 -295 -495 -60 509 401 -402 -435 -65 447 477 -307 -577 -43 359 420 63 -403 -31 673
1067 673 289 -290 -477 -53 521 63 -296 -331 -192 305 222 -86 196 -68 203 2 185 35 -413 38 351
1088 351 -56 -193 -140 64 331 -185 -538 51 58 -60 -411 -253 -72 -82 64 -107 -488 -83 276 -53 -142 -324
1110 -324 62 600 394 -115 -591 491 706 190 -523 -228 594 437 -189 -579 -31 261 325 -95 -191 208
1130 208 230 225 -288 -294 -181 99 402 -262 -713 -353 380 171 -195 -541 270 737 163 -646 -383 369 329 -386
1152 -386 -643 58 471 455 -67 -316 -195 248 6 -116 -331 159 394 -45 -189 -592 158 335 564 -493
1172 -493 -486 453 756 -219 -795 -275 911 753 -148 -337 -31 472 38 -309 -25 315 57 444 277 -113
1192 -113 -392 -133 284 -127 -445 -44 647 261 -305 -567 -80 174 -136 -544 -21 944 618 -253 -585 -54
1212 -54 224 -102 -186 129 412 168 -116 -150 -302 -348 52 293 244 103 -106 181 616 -342 -788 -203 308 318
1234 318 -287 -120 97 -61 48 -274 148 -29 -109 56 134 -52 -521 -67 148 -46 -122 -160 279 6 -250
1255 -250 -553 189 171 -1 -477 258 442 384 -309 -416 127 55 22 94 -103 -50 108 -233 -14 -447 -295 177
1277 177 515 248 -467 22 477 -266 -170 -403 406 467 478 113 -64 50 -32 -242 -233 -5 121 391 69 -153
1299 -153 -408 -245 -61 -5 -419 48 501 658 -350 -472 -142 438 294 -135 -43 101 444 -27 -586 -516 74
1320 74 183 113 447 -22 -3 -168 54 -465 -481 166 571 454 -67 -258 199 118 -154 -200 -172 560 287 5
1342 5 28 119 212 -194 -138 -202 498 100 3 -6 -137 -198 -151 183 160 -88 284 630 234 -23 -229 66 96 69 -69
1367 -69 32 460 380 -122 -543 -105 93 -116 -62 136 143 52 45 -36 -108 -293 121 95 41 -285 -242 136 180 -315 -79
1392 -79 -140 347 -57 -387 -95 23 -163 -114 57 -150 261 140 -127 150 -195 -13 188 92 36 -202 -56 82
1414 82 51 -172 -224 50 -60 -14 39 -18 270 -66 -50 -41 28 398 75 294 126 -45 83 52 -3 22 60 229 221
1439 221 52 -93 -154 246 -119 -64 -88 65 249 -143 -156 -22 -89 153 -172 -2 90 203 -9 -121 -300 143
1461 143 108 260 9 -81 287 187 287 -275 -22 249 161 135 -90 -53 -60 406 -53 -184 -201 35 0 -135 -47
1484 -47 -116 39 127 211 -392 279 300 197 -4 -311 96 -32 35 -10 -25 -137 20 58 0 -215 171 44 -123
1507 -123 79 115 59 -9 97 -267 41 249 77 61 -152 139 61 218 11 -142 -113 116 153 -91 -59 90 21
1530 21 95 -120 -115 -146 289 133 -13 -93 90 129 -187 -129 -219 -219 -128 6 152 -88 193 -172 -245 -19 137 14
1554 14 -190 83 91 -303 153 159 -190 -138 -311 47 220 16 82 0 118 -89 -294 38 -73 32 -120 -78 32
1577 32 79 190 143 -210 116 -149 -184 -118 -1 32 314 164 61 52 -284 92 191 -22 -168 162 300 129 136 -15
1601 -15 -70 -11 452 -310 213 -143 -37 -4 -221 18 -133 14 187 218 -181 79 196 165 2 195 211 349
1623 349 -62 -229 -32 167 268 -288 8 -78 10 204 3 -67 -90 103 131 77 -139 -144 351 -144 -112 -31 107
1646 107 171 353 -99 -159 -13 -6 -161 -17 -172 222 154 -48 -342 -186 93 -49 152 -195 -183 141 -86 -199
1668 -199 142 -223 -33 107 -325 -82 51 -2 4 0 -163 -43 -232 -66 145 112 140 91 48 14 -178 249 96
1691 96 -76 -103 -67 -145 163 308 -290 29 97 110 -138 -169 150 -76 -201 -129 -53 65 243 -5 -154 -87 -172 51
1715 51 -218 13 106 -7 25 75 9 -119 -349 -31 15 -174 46 -48 -286 115 -120 -83 113 376 -150 -2 -27
1738 -27 -47 113 242 157 174 30 -297 250 -118 -104 18 -163 -154 6 -80 70 -229 -195 -313 -78 -66 15 -62 -88
1762 -88 -266 91 142 -163 27 15 230 122 40 -228 -9 -48 126 -155 32 120 216 146 -20 -229 -33 169 -62
1785 -62 -40 -134 160 255 -78 -5 -129 63 93 19 -105 52 -56 113 -39 87 -35 304 96 80 33 225 -14
1808 -14 -240 -101 -118 -175 -155 -237 -120 30 65 -3 95 -243 196 -72 162 66 -23 140 134 302 -99 -49 16 386 65
1833 65 62 -241 113 73 -147 -286 24 -194 21 -32 -56 -74 -202 230 46 22 97 110 84 -13 -157 -190 -24 75 -83
1858 -83 -220 171 -81 -3 -171 41 69 -121 -77 -35 -55 344 205 -59 -9 -59 -62 67 249 84 -148 75 107 -329
1882 -329 -110 -21 66 63 238 -182 -52 43 52 81 -104 -197 153 10 200 70 -185 56 49 152 -123 -300 -156 15
1906 15 76 4 2 119 -28 -163 -31 46 31 -1 -100 -69 -113 84 -174 124 175 -43 188 53 -72 -24 -60 282 153
1931 153 138 -340 135 -21 66 -171 14 36 208 237 -216 123 84 253 -167 -95 -149 -143 286 12 -141 93 150
1954 150 -71 -22 -294 -78 41 32 -52 4 -27 93 -148 66 28 286 2 250 110 -172 57 388 -279 -108
1976 -108 25 50 77 -93 -59 86 75 -180 -144 -90 -50 72 316 -34 225 83 -65 15 -13 -83 -138 -22 210 -29
2000 -29 221 239 -43 -285 -255 20 -107 -94 -126 -248 -87 -1 -31 -201 -70 -47 65 147 324 -111 -259 6 -217
2023 -217 -127 106 20 11 67 180 46 160 -211 445 -310 -132 -60 17 260 121 -48 -88 34 -78 -39 -128 146
2046 146 222 58 -150 -40 202 60 -1 -323 123 185 43 104 -96 -201 -203 2 -68 -231 65 81 -49 202 -110
2069 -110 -199 45 61 30 -51 43 77 -26 105 -1 77 245 -60 -216 139 252 20 -100 -15 -44 75 163 193 -167
2093 -167 12 41 334 -220 -56 -69 198 121 228 -67 -61 -50 120 -89 -161 -145 -98 1 -119 -201 -145 -105 -23 31 -61
2118 -61 93 -229 142 -70 191 147 0 -145 30 -87 -53 -60 168 -68 -308 196 -14 -104 21 84 27 31 -3 -97
2142 -97 -156 149 420 5 -103 -21 -23 75 -42 -255 -139 -146 101 165 -60 30 40 90 -27 56 -165 68 64 -87 -136
2167 -136 -109 -97 28 -466 -80 -74 -53 -3 -234 42 86 72 147 38 125 177 2 285 -44 134 -49 60 126 -91
2191 -91 -77 -166 -69 160 -104 -83 29 44 -156 167 119 -59 93 -215 123 332 102 43 -197 33 164 202 -121
2214 -121 -124 184 40 117 -59 31 18 -146 2 -256 66 -12 19 300 106 105 -192 157 -58 -92 -144 124 187 -48
2238 -48 -114 54 151 0 69 15 97 193 145 -235 -34 -63 105 288 92 80 56 89 79 -60 37 -114 311 -21 159
2263 159 -38 -83 161 -125 38 52 -107 50 428 -237 -156 1 24 -149 364 53 -10 157 -132 47 -153 63
2285 63 106 -87 -75 -52 131 134 -103 -85 -150 169 -52 14 104 -20 -183 -199 60 188 115 -69 61 156 -199 -212 26
2310 26 -88 282 -102 -79 -38 -113 -82 -77 -44 -172 65 -156 38 -51 172 43 -291 32 110 -28 6 48 -219 12
2334 12 150 183 75 114 194 96 147 221 107 -34 -233 85 235 9 -261 -77 84 -137 -289 303 -159 264
2356 264 -161 -59 -62 -298 118 -14 -126 -281 30 112 -10 7 -169 108 -57 -347 25 82 -14 -22 1 -4 24 114
2380 114 21 -275 94 -102 0 95 -109 94 81 1 63 388 -148 46 -2 -52 -8 -172 58 208 -102 -103 110
2403 110 2 76 173 10 -86 -179 12 -76 -53 -272 -242 226 184 97 -19 8 126 -29 -35 98 -126 -162 124 59 -103
2428 -103 60 -118 77 7 24 153 -115 -23 123 280 -108 61 109 127 -3 -259 -127 -79 262 129 -21 9
2450 9 -1 17 22 91 59 253 -56 -49 207 -41 -359 64 62 -50 176 -79 69 1 -166 75 -36 -396 35 -64 -105
2475 -105 270 -83 -43 -71 31 205 -124 81 -200 46 -22 71 2 -70 118 114 17 28 5 128 13 -118 -137 27
2499 27 -54 167 148 -112 -273 -89 -102 151 -224 -101 121 -167 7 7 -1 -31 -36 -80 -24 35 -153 -81 26 23 8 -16
2525 -16 -269 -2 -121 -186 91 48 85 -43 -223 -180 74 -81 96 -126 -3 -77 -16 -36 -91 38 86 -298 81
2548 81 -15 30 219 167 135 160 169 -47 -165 52 248 29 -157 -112 36 -77 -107 -154 -214 57 -189 -78 -99 -35 159
2573 159 178 -95 36 -203 -125 24 -19 -121 -122 53 43 67 -10 -264 32 170 -17 -170 -38 28 99 50 128 34
2597 34 -93 -106 -29 171 36 -193 27 135 149 143 -216 -80 204 -109 -17 -41 71 177 -40 -237 -159 179 -32
2620 -32 -57 128 -178 125 -34 84 143 -103 -227 -222 165 18 -47 -87 129 91 331 -445 64 -218 66 48 25
2643 25 -244 140 -118 36 -198 -108 -199 36 282 152 190 14 -43 197 98 151 50 46 -66 -10 72 -44 -30 11
2667 11 -73 37 99 -210 -392 -63 -31 -253 -18 -219 59 108 -117 -108 -15 94 149 -161 115 -4 -47 -112 -239 63
2691 63 88 -20 40 -22 11 7 -85 -118 -27 146 -162 179 120 -245 91 16 61 -168 -34 153 166 -2 -159 180 -99
2716 -99 91 -179 -236 41 -33 242 32 -84 -26 85 -132 97 119 -212 -39 -75 41 -5 -399 26 151 -11
2738 -11 -113 -51 160 -46 179 17 135 114 74 171 -103 -63 8 87 -161 86 -57 -182 -101 -255 -63 88 -87
2761 -87 68 -5 242 -87 26 47 11 -104 60 -216 -48 -150 -81 -60 -92 -132 -55 69 176 -45 -83 -25 -24 -45 -11
2786 -11 -85 -401 26 -22 64 34 72 -3 -20 144 -351 -56 82 24 -58 93 173 268 93 -43 -105 94 8 -157 -133
2811 -133 46 35 -51 63 225 -292 36 -57 -1 -27 -55 -151 123 37 -18 49 -161 226 -39 -171 -200 197 -216 61
2835 61 -154 217 -325 119 178 -246 15 34 111 -235 -128 -18 127 177 7 96 122 -149 57 108 -103 239 37
2858 37 -55 34 176 -12 127 319 -86 176 40 100 21 222 -32 -17 -99 -61 71 12 46 -13 128 104 34 -232
2882 -232 -23 233 -234 -136 -148 7 -271 124 112 191 100 -137 -138 21 163 210 80 -123 398 -78 254 126 -36
2905 -36 76 -112 90 -280 -138 -25 8 286 9 56 88 34 174 -117 79 184 78 3 -70 8 66 33 -103
2928 -103 55 31 138 -95 173 86 -121 8 260 -208 -230 34 -64 -222 96 38 -156 -38 -154 185 -11 48
2950 48 177 20 34 89 215 198 337 -74 104 10 114 175 -8 70 -87 143 -2 -48 -150 237 128 197 162
2973 162 -67 -28 -66 82 60 24 13 -115 84 220 -278 94 -128 -26 5 -139 -28 -92 406 -58 -49 -86 113
2996 113 -90 0 -35 54 4 -164 112 -89 -127 83 206 -26 -18 26 56 255 45 -137 212 -168 156 242 139
3019 139 269 -199 -143 139 -62 35 -102 -103 39 229 -208 -178 -13 -106 -71 -286 220 43 84 -110 198 -23 -49
3042 -49 -21 85 -72 -187 -92 102 -86 -9 -186 -50 102 -132 166 231 106 -175 -32 7 48 228 224 49 63
3065 63 25 -18 38 253 -196 -137 53 -246 -33 81 52 -243 122 33 75 -92 -221 138 97 46 -107 94 54 320
3089 320 -83 2 213 -130 -42 239 40 -12 -34 -133 101 75 69 1 -13 -192 153 38 136 238 -120 -19 -104 -69
3113 -69 -90 -335 158 -12 70 76 123 -68 178 29 21 98 94 -149 127 169 -187 -14 81 128 19 47 154 -62 16
3138 16 186 116 -7 99 181 43 39 -148 -149 155 -13 77 -134 -20 -39 0 -115 -55 -80 -47 -324 24 213 3
3162 3 -132 -211 -98 175 -157 210 -61 -55 -65 -4 34 58 -69 43 -112 -250 67 183 28 -31 141 133 -223 131
3186 131 169 -35 -138 -177 -111 -10 -298 -36 -32 -58 -218 -17 51 -147 143 60 132 -91 48 80 -207 76 11 -240
3210 -240 -91 146 62 15 -111 -70 19 20 152 5 51 -45 62 115 -110 -91 207 -8 126 59 -315 -20 -25 21 -70
3235 -70 -58 24 -3 101 251 148 10 244 -248 182 -189 274 -97 -230 12 93 76 -96 -315 -23 -26 33 -89
3258 -89 -56 113 25 126 15 399 -243 115 53 245 296 -122 64 29 296 -54 70 -31 -93 34 198 -95
3280 -95 36 -257 -180 -108 -50 -215 -6 -98 -178 200 342 -190 38 36 -42 -133 85 -65 -150 26 -197 -128 92 -164
3304 -164 49 -69 170 14 220 87 -117 131 115 22 85 89 -85 9 -53 133 -61 -182 -143 67 -13 -66 -46 -256
3328 -256 43 226 104 163 -288 -52 65 -221 -104 59 12 18 -186 -387 43 90 125 45 -55 -133 -12 -9 133
3351 133 52 227 -172 -237 165 -3 52 -19 -101 50 -70 -18 216 60 44 -122 162 -29 114 -29 -100 -127 -169
3374 -169 -40 -182 -284 -128 193 -129 157 42 -59 -81 96 8 -96 29 -53 -15 169 202 27 -48 -151 90
3396 90 -9 69 120 14 5 -42 67 -17 163 0 126 -127 1 -260 -166 -141 -25 36 146 77 -17 -122 190 -87
3420 -87 -5 79 -104 -4 -105 -7 -167 -100 -129 8 5 -224 160 56 186 -103 231 -46 10 -211 -240 155 -42
3443 -42 8 -204 27 96 32 -181 -47 72 125 315 -171 142 3 -9 -46 -299 140 -138 43 203 -152 -91 11
3466 11 105 52 71 41 66 -171 -76 -43 152 171 -30 -70 110 220 242 -56 -115 88 -73 105 -146 -16 -165 -227
3490 -227 -7 -118 142 -47 -45 -64 129 77 -99 107 108 -266 -207 100 341 213 126 73 -23 27 73 144 -113 -97 65
3515 65 126 -61 41 184 -119 33 153 -48 -227 112 -137 -36 -66 -106 217 -82 -58 -128 -187 -155 252 40 -34
3538 -34 11 -67 49 -5 -176 76 -152 -218 47 -112 80 -78 -50 26 214 -135 -93 -80 -86 100 45 75 228 55
3562 55 -1 4 -111 -90 35 90 -48 71 47 -105 174 -39 8 -17 90 -40 70 -156 0 -58 -129 -140 60 -48
3586 -48 -14 159 -44 28 17 -20 -91 -110 -141 -54 -143 -18 62 49 -6 -199 162 65 65 228 -32 240 17 -21 23 -132
3612 -132 -23 -76 -43 -86 -77 88 -63 183 384 -138 88 33 81 -65 -78 46 189 41 120 -119 19 169 -45
3635 -45 65 -117 -44 88 -117 -180 -61 57 104 -144 120 73 -46 223 -239 172 -127 -134 3 -128 50 83 178
3658 178 210 94 4 29 19 -8 -84 -13 -79 101 207 -17 -39 358 -172 182 40 23 -70 -43 124 8 102 -126
3682 -126 -326 -82 -197 67 -221 25 129 29 -63 37 -224 -205 92 -64 244 -200 16 0 161 42 -80
3703 -80 15 -2 161 -4 -24 70 37 7 -124 48 -71 9 312 -4 80 68 -118 -21 174 -82 -22 -104 -32 145 -42
3728 -42 -65 0 -35 -55 85 -190 -31 371 -43 -53 -83 -2 -87 78 -66 104 390 -23 191 -187 47 -33 -84 221
3752 221 126 -99 26 126 3 49 326 15 -39 -118 71 24 140 17 -24 39 -42 92 93 127 89 2 117 81 -226
3777 -226 44 144 210 -18 59 -8 -151 -15 122 -192 -299 146 -160 -102 139 51 -104 -171 -178 123 104 193 -75
3800 -75 135 -77 318 -43 -63 -28 -126 -160 -44 192 -85 -10 208 -183 128 91 -135 -82 -63 92 16 -40 18 -118
3824 -118 110 31 -96 -332 -47 128 -292 41 78 -212 48 21 -99 6 -4 -164 -28 -238 -144 29 -49 -110
3846 -110 -131 -239 -120 21 -65 -46 126 31 40 88 -112 -85 -13 102 -37 -44 -38 94 -125 -41 4 83 86 59 -197 10
3872 10 -151 -3 180 -117 -39 -186 -28 161 3 170 -73 -186 -123 216 129 -21 39 211 -154 12 -180 -90
3894 -90 97 -79 -254 -221 -127 -130 -192 -178 28 21 -117 118 -166 -125 42 244 97 21 -121 48 234 98 -337 90
3918 90 14 -83 110 54 -14 55 232 165 -238 -222 50 -178 234 113 -234 194 57 -91 -186 -156 -72 -172 -51 239
3942 239 269 28 -3 -58 119 36 22 37 48 110 -62 -64 37 -175 137 64 42 -101 -150 102 -16 103 -74 65
3966 65 54 75 112 100 -68 88 -12 119 49 250 250 -86 127 -168 -62 -130 -2 -1 -123 -107 250 290 272 -178 166
3991 166 -158 -75 -94 -40 -3 -23 110 46 -88 155 176 20 -48 -43 37 256 -15 249 23 79 14 -203 -69 -179
4015 -179 -179 63 -201 153 -56 107 -17 23 301 -11 163 65 122 -33 70 -30 145 167 20 85 106 -184 166
4038 166 -254 39 -176 -66 -9 -98 174 -73 -25 -316 -69 -121 87 70 -3 84 -29 33 -44 -127 176 -3 -75 -10
4062 -10 -6 54 -34 -51 -24 141 80 -21 93 -285 -4 172 -283 -12 -12 87 -112 6 39 222 155 277 -2 -77 -101
4087 -101 95 -49 184 192 -150 48 101 272 -104 -32 -181 68 41 -44 79 -51 -94 84 -237 -216 -11 -198 -260
4110 -260 -35 -88 -6 -86 -145 105 198 88 -69 39 -29 105 34 -334 138 132 -244 -51 -211 124 323 71 -193
4133 -193 58 30 20 -166 -28 39 240 125 12 104 244 126 148 -122 -64 82 -53 283 313 104 111 -186 163
4156 163 10 20 76 25 128 -8 -271 207 -37 -64 24 -138 36 -319 28 98 95 102 -112 -194 141 -71 -251 -89
4180 -89 26 -124 10 -95 -46 -253 -61 -143 -26 -123 32 -44 158 117 3 -116 51 -77 -179 -82 -266 -48
4202 -48 -6 -48 38 91 -139 -86 223 123 100 -134 -59 -39 93 -93 -133 77 -136 -9 61 187 -21 27 -200 4
4226 4 -27 5 -70 97 18 156 -74 490 29 39 55 5 -53 -141 132 99 273 35 135 -218 -88 -135 -189 73 -51
4251 -51 -4 -37 -329 -121 16 -98 89 -183 78 95 -76 98 -71 6 115 29 -124 86 -17 -84 6 -148 -24
4274 -24 137 -212 120 200 212 -109 -72 176 144 -242 0 -13 1 171 34 -236 3 172 2 -59 -92 -187 36
4297 36 216 -80 95 -139 13 25 67 22 4 18 -232 -5 69 -65 12 -86 -255 -186 -56 74 -100 -249 -183 -32
4321 -32 -60 -141 -71 -68 13 -38 -196 -114 160 -29 -71 160 -145 20 -211 60 -172 -159 46 -66 -69 -95 -180 -147 -22
4346 -22 -12 108 136 -61 158 236 65 170 141 -34 374 114 169 13 48 -76 -56 18 -64 142 -19 -147 -168 93
4370 93 -90 4 96 -25 -27 -60 143 8 41 225 -183 -128 -104 -156 -131 142 333 -53 -226 -251 17 213 -16 79
4394 79 23 128 -76 -94 92 -66 11 -240 -271 3 44 64 -177 -141 -247 199 -106 -208 8 41 -179 17 -133
4417 -133 134 158 -202 240 -24 23 -288 216 166 61 -71 -327 -116 192 196 -56 -34 -54 -30 -115 -67 -58 229 150
4441 150 -76 -22 -118 66 -56 37 42 113 12 -112 -337 -179 -165 19 -108 -172 65 -151 -35 -278 -3 -244 67
4464 67 -66 34 191 8 -22 88 -17 168 28 4 172 -4 306 -28 268 248 -189 -148 -42 -4 -109 117
4486 117 -115 -187 66 40 3 202 64 67 -107 -39 -33 -136 247 11 248 -177 -119 -116 -61 98 -91 116 37 -6 7
4511 7 -25 94 -37 68 42 -364 127 54 -48 -274 33 -250 -180 193 124 25 -43 250 36 0 -176 170 74 105
4535 105 -79 -117 256 -89 -179 71 -38 -94 -4 164 -119 83 89 -109 2 -97 -124 54 34 -23 54 -179 126 66
4559 66 -222 -42 -211 -139 18 80 79 -138 -167 114 -197 -21 140 -34 49 -142 -183 -17 -202 232 138 -48 205
4582 205 163 -71 -68 -105 78 -15 135 4 -81 -226 -229 -76 -36 -80 110 134 245 -162 -21 85 -5 -36 -252 -323 43
4607 43 -104 -354 -32 26 62 -192 120 -79 -44 34 -154 -117 -16 -186 105 38 -46 81 174 -18 -190 -21 50
4630 50 -4 106 271 217 -7 70 -106 120 101 -141 -175 80 103 -112 224 137 -21 -53 173 -204 -49 101 48
4653 48 7 -183 18 174 -125 94 -253 -32 -51 -233 201 85 31 23 -21 -80 -179 179 272 -76 69 73 75 155 -57
4678 -57 -180 10 90 -173 174 -105 -197 24 -100 164 23 -7 -225 45 264 -110 -87 -71 -114 -154 12 213 -5
4701 -5 -83 -4 119 -69 -232 -1 126 80 -207 80 -157 189 138 -181 35 153 0 -49 -79 -34 76 -296 140
4724 140 15 -45 157 77 -18 -183 -134 103 69 -283 124 264 179 -33 -42 44 -10 189 196 -53 -141 -160 -166 -48 180
4749 180 -299 146 -68 77 -265 10 124 75 -33 35 17 73 -49 -284 51 16 -295 -32 -115 -126 117 91 97
4772 97 1 71 -183 -17 -94 77 -69 304 -3 -78 277 58 49 12 16 46 83 -14 -51 -182 -140 11 109 175 -186 -26
4798 -26 37 -7 -109 22 99 -285 -42 -67 -181 -86 9 -8 127 159 -230 70 266 -97 31 93 23 -59 -30 -35 161
4823 161 -167 -79 -117 75 -297 -104 33 -41 138 -76 18 -111 135 109 -173 -17 27 68 210 -126 -82 -125 -18
4846 -18 163 -104 138 7 398 -24 272 -62 -332 -30 -124 39 145 248 -69 -43 31 -72 63 -84 -98 -14
4868 -14 -185 -126 -335 317 2 72 -1 140 -79 56 -78 182 115 264 320 -310 -19 11 21 40 -102 252 -40
4891 -40 13 110 96 7 144 148 19 30 -6 147 -42 3 96 112 -67 -190 -46 79 -329 116 212 -126 -4 -104
4915 -104 172 -26 189 113 -219 -234 -100 -157 -124 83 116 83 -22 -117 14 164 -10 -2 -16 13 234 -13 29 -57
4939 -57 95 131 -172 327 42 57 178 50 59 -104 -8 -188 -107 158 -62 -76 -2 -275 -271 -147 146 67 -57 -6
4963 -6 4 -4 -276 -80 -110 -172 173 -68 96 -167 -103 104 31 -290 87 68 -47 91 -164 -18 -9 164 165 25 83
4988 83 166 141 1 29 104 -53 89 -113 352 -6 -261 -79 161 62 -279 84 -111 11 139 -34 -158 -119
5010 -119 150 86 205 -84 -176 -208 -4 -24 -20 42 -24 53 10 -73 -49 -146 -31 135 64 -226 13 -70 -144 -43 -189
5035 -189 -204 105 -91 27 -215 -200 16 -78 41 54 -208 -56 -208 -373 -16 39 -153 198 30 -4 -60 -5 -131
5058 -131 38 -43 48 116 -8 112 -151 -7 64 90 -243 32 -9 -71 -212 -91 -45 112 -101 -30 -68 -258 -226 -54
5082 -54 89 -185 -39 -262 26 -14 -16 -57 -252 127 4 -4 42 94 56 -81 -109 -167 -78 -272 -28 -118 43 59 170
5107 170 67 -112 31 -44 -103 -21 97 -143 53 29 -150 -309 -155 121 10 106 -61 -94 -182 243 22 36 142
5130 142 44 -71 -75 -297 -45 -120 -194 275 85 199 -126 173 70 -108 -160 -47 -45 38 -27 242 -61 128 28
5153 28 56 -99 145 203 119 105 -3 99 -24 25 -267 209 -25 100 10 8 1 -21 123 0 -192 35 110 -171
5177 -171 -85 -77 83 -159 99 61 -173 -184 -111 17 62 93 72 -117 -24 116 -296 -129 -53 -78 306 108 291 83
5201 83 -112 26 -61 -68 107 -92 44 70 -218 147 -201 55 24 -92 -151 -75 -222 -301 -162 -239 -38 34 -20 -5
5225 -5 106 35 94 -68 119 2 35 69 102 -422 43 -142 16 21 38 250 -7 45 115 87 37 58 13 -222 192
5250 192 -152 -155 45 62 290 -122 -57 -91 158 115 -126 -88 -53 -114 60 -108 -152 24 -143 -260 -5 152 -230
5273 -230 116 -21 -31 86 -159 112 101 179 -165 -105 -37 -40 13 116 -24 -3 -151 -84 -116 -14 26 -48 187 -40
5297 -40 81 74 99 203 148 397 120 -250 -147 18 -244 51 -95 48 13 35 13 34 353 -270 186 256 -171
5320 -171 -42 -51 -97 41 -97 201 193 68 -172 221 -39 31 43 -162 379 -94 152 159 45 -163 279 133 2
5343 2 -174 172 338 -220 5 -12 -146 -40 0 -41 319 100 5 40 -34 -142 -91 140 27 231 144 176 -67 220
5367 220 120 54 37 -83 -123 64 -141 135 16 -126 74 -181 -148 116 -169 -45 200 -246 -107 -142 -92 315
5389 315 125 20 -12 -97 -316 -122 -119 17 -65 -116 288 226 -29 156 106 12 72 352 -134 -18 -119 -52 43 93
5413 93 -200 -72 177 -108 55 -205 -108 -49 -90 -35 -30 109 311 74 -139 150 -61 43 -16 -35 51 -172 -54
5436 -54 -189 105 76 61 106 -35 53 130 -50 -133 50 -16 126 176 -156 73 229 -44 3 -150 -83 23 -169 -20
5460 -20 160 -203 -72 -45 -135 175 47 -146 192 47 137 -216 35 58 -70 68 92 -254 -227 -184 46 -168 -46
5483 -46 85 -195 48 9 -16 49 237 121 -23 -207 -30 102 9 -79 -31 204 76 113 -57 -26 -163 77 361
5506 361 31 71 91 -68 182 157 -70 29 -135 -65 24 -108 -99 -268 -32 19 69 93 -452 -136 -33 -96 -84 -93 -232
5531 -232 95 7 30 -12 -64 11 59 74 -147 -175 -28 -44 -126 247 43 115 -151 -122 138 276 30 184 -128 95
5555 95 100 -234 -96 -31 88 219 264 -101 42 -265 -61 -135 -75 183 -189 176 22 -74 72 -86 -166 -57 -33
5578 -33 104 -78 -212 295 -197 -79 198 192 168 -143 31 108 266 28 -75 51 0 -6 39 -20 254 -97 214
5601 214 -7 -132 141 263 82 193 -231 145 -1 -217 71 -265 107 -104 -156 201 26 -93 127 -60
5621 -60 -167 -92 45 249 138 -249 66 218 108 -119 -358 -7 -87 8 68 -142 -203 -101 -218 -130 -12 -264
5643 -264 189 62 -159 32 -116 59 91 12 -252 -289 102 -112 -145 84 230 -133 46 33 -117 -74 144 94
5665 94 34 -19 19 162 156 -65 -91 64 -341 -101 -126 182 -36 -120 122 -107 115 -48 -51 52 246 -235 148 -36
5689 -36 -72 -4 42 105 152 -51 26 273 -65 -258 -114 -7 -269 126 -197 33 61 193 159 -31 -32 -230 -93 -203
5713 -203 -126 239 -138 -53 105 42 -124 -327 -12 42 -33 -113 -42 -157 -9 140 46 -40 -144 90 -20 35 68 -78
5737 -78 118 -191 25 -135 8 15 82 -145 73 -258 70 -132 -44 113 79 6 25 358 -19 234 113 -76 -106
5760 -106 15 79 214 4 128 31 -258 51 23 128 137 103 63 110 -204 -63 119 49 -74 -232 -287 125 -31
5783 -31 45 111 -179 -165 -434 -16 -174 219 62 -1 -232 85 -114 -105 39 -264 145 -244 -173 -223 -163 15 -39 -13
5807 -13 168 382 -230 -66 224 -153 463 314 -47 -3 -204 -34 -250 -67 -9 38 210 81 -296 -167 169
5828 169 -28 -106 39 106 194 167 -3 -49 228 -169 -101 108 -128 -70 -71 -65 138 -37 12 86 -63 -277 -100 -57 22
5853 22 84 99 65 303 -60 -17 214 109 228 -280 68 168 -222 -5 1 59 18 -2 -7 -73 206 -68 -29 152 -94
5878 -94 -113 135 90 -15 133 -108 93 7 -124 310 274 -89 323 -118 -174 -13 49 -86 -142 259 -9 -31 -49
5901 -49 -138 210 -120 11 -172 -130 -6 45 104 -156 -232 45 335 87 -77 33 -126 174 -142 -26 18 210
5923 210 41 128 42 -141 100 201 -11 57 -371 -6 -47 -81 -41 -128 -152 59 164 -146 -91 -84 38 225 1 132
5947 132 -4 139 144 94 164 38 66 87 97 19 94 57 150 165 95 -140 33 208 -64 -77 148 -172 -34 16 89
5972 89 6 -8 -26 11 -56 -1 33 -79 -75 -54 -12 57 65 -39 96 2 -279 9 124 204 -29 -150 -157 -86 161 72 104
5999 104 107 -61 316 8 184 64 80 50 169 -426 208 -149 41 44 61 11 -50 -133 -150 155 74 57 -81 20
6023 20 -207 97 36 120 -130 -46 133 154 -169 -148 57 98 -38 -179 -61 -73 7 170 -136 142 -116 -20 -46 -54
6047 -54 -7 -73 -186 -44 21 -97 42 313 28 -46 3 -85 86 46 12 -149 -22 -107 -165 114 63 -140 26 -10
6071 -10 11 -73 83 55 -69 174 -146 -35 10 3 -15 -155 304 -268 -214 -120 -5 -4 -226 -95 61 -66 -159 282
6095 282 -109 -161 33 -19 19 59 -65 148 -176 -103 134 -188 292 -38 -140 14 -148 69 -106 -24 -92 51
6117 51 -63 68 -210 35 111 -84 -48 197 -25 -51 57 138 -47 28 296 -83 117 99 163 -190 -68 135 -50
6140 -50 23 90 -87 -31 6 261 109 30 -102 173 -235 -104 -74 322 20 193 -278 -141 143 125 119 -138 143
6163 143 131 -72 74 86 -79 220 152 118 185 -292 -5 -10 -213 -72 187 78 63 101 16 -159 -193 -178 54 -81
6187 -81 -39 -23 -164 -138 -28 243 -121 -49 -29 130 78 -27 118 57 116 -118 29 -190 -88 64 -31 100 60 -166
6211 -166 -91 -78 338 -23 172 179 22 342 1 26 -11 6 18 115 -170 38 65 70 16 32 7 -22 -208 -257 96 68
6237 68 -63 -220 195 -249 149 27 -80 -202 18 80 49 -44 91 -95 75 87 157 240 -6 -4 -136 183 -68
6260 -68 -74 96 14 72 57 242 -83 -8 -236 -107 -217 198 -181 221 40 6 252 -217 -64 -10 30 -49 -170 -26
6284 -26 -37 22 -67 -119 -103 116 -222 75 -80 143 -196 -321 -5 -196 -47 -237 183 -238 -20 -70 40 244
6306 244 -179 90 11 33 -149 -258 75 -71 33 7 216 107 -84 312 180 157 11 -15 11 43 -65 100
6328 100 -179 391 105 -222 7 8 -64 -29 30 51 -79 215 137 -182 321 30 57 -38 283 142 100 96 -130 -53
6352 -53 12 9 -153 303 125 -146 -14 59 -26 68 135 -84 -122 51 96 -28 -38 -127 24 178 3 113 114 -32 132
6377 132 -161 -98 97 219 -157 43 -137 -93 40 88 83 66 72 -52 -79 -15 23 228 -160 -145 169 60 147 92 -135
6402 -135 190 111 167 -65 1 11 -83 228 -77 38 -10 -4 270 -129 -72 159 164 102 196 -8 -41 -2 -157 149 145 -99
6428 -99 -39 112 80 27 2 276 -104 -4 195 -202 -58 -150 29 200 -49 -184 -126 -6 -150 15 141 -31
6450 -31 -73 -159 -204 -104 -113 -7 100 201 85 -107 37 69 -38 22 113 174 -180 39 -194 18 302 262 -179 56
6474 56 -80 -285 -312 111 -91 -209 4 112 50 90 -16 90 15 -3 -130 -110 -33 -32 79 56 -27 -432 -74 -86
6498 -86 -127 -28 42 -43 30 -101 98 -123 -38 -7 -160 57 245 130 -26 -22 -55 -26 -41 90 -131 -80 -120 35 -29
6523 -29 126 82 46 77 231 -211 43 -52 53 201 75 64 -124 -121 107 -167 152 94 -165 164 169 52 -129 -114
6547 -114 175 2 45 73 29 84 -14 -4 15 -297 -15 82 20 -214 10 80 -20 287 -12 53 -104 -108 -155 69 -201
6572 -201 -18 16 294 -253 -35 -73 8 216 260 -52 -69 -134 -226 -31 165 168 -90 151 -72 75 70 -203 -6 -120
6596 -120 19 32 95 59 -219 -74 161 -54 -109 39 -40 -193 -153 -109 -4 -51 -20 67 252 140 215 243 -63 82
6620 82 -64 222 -32 -45 120 107 -60 97 52 -134 -10 107 -196 -38 -232 155 -19 36 -148 -120 92 37
6642 37 -120 91 168 -90 161 168 -18 -134 134 5 -190 -71 85 -17 -111 -421 235 1 -61 71 -8 -134
6664 -134 168 92 335 -57 139 -144 -152 -177 -113 11 104 5 -209 149 36 -122 75 -57 150 236 -102 -168 -224
6687 -224 -32 107 -195 -33 -184 -98 79 7 -60 137 -93 -192 148 157 -41 -262 -119 170 -92 32 165 126
6709 126 19 218 50 -318 -53 -173 167 -151 -52 -126 2 -77 21 96 38 -35 -18 75 135 172 -65 131 -26 19
6733 19 176 257 -67 71 21 16 -11 183 -76 -133 185 127 -79 40 -72 -22 -9 -109 -21 -135 -117 -37 117 203 300
6758 300 40 -108 90 -120 6 0 54 -36 -27 178 185 -225 -1 -9 -155 -19 -122 -39 -171 -84 25 -260 84 -162
6782 -162 26 257 46 -124 199 -4 159 -395 120 43 69 170 101 -126 26 -150 -145 173 -97 198 -33 1
6804 1 4 -156 124 192 19 -37 -64 -336 -139 142 148 91 43 25 -14 44 217 -106 40 182 238 51 -113 127 170
6829 170 48 -141 -37 190 0 -5 -372 58 -87 172 95 94 -213 306 -93 24 -64 -36 -96 -91 123 103 -35 116
6853 116 51 -66 -209 91 78 -69 -15 -100 -74 51 -26 -215 -65 -161 -62 -95 84 301 -216 128 -158 60 -55
6876 -55 127 119 98 286 -78 -142 -23 -188 -121 226 14 -186 -126 145 155 -89 -93 -17 -401 12 -257 190 -77 117
6900 117 -43 -4 -116 197 24 -66 -106 99 50 -10 140 -189 -1 47 99 114 234 -146 124 -6 115 240 -81
6923 -81 -66 -234 47 146 106 70 65 267 51 110 81 87 64 2 9 -149 49 -58 75 -50 140 -17 137 -24 104
6948 104 -120 17 113 -219 -72 29 153 -80 -47 -26 -2 -348 22 -20 154 140 -111 89 158 174 101 -244 -75
6971 -75 -74 104 -31 12 59 55 17 0 -13 41 -168 65 -152 165 92 -116 87 207 161 158 157 -29 -114 126 -43 -127
6997 -127 19 89 165 169 -92 -132 -55 63 -98 -200 -13 -33 -30 48 -140 181 7 -183 170 271 -4 30 -138 -29
7021 -29 -65 -77 272 -207 -49 234 -217 402 -35 -2 -105 61 -87 82 -75 129 -47 -121 -40 -58 -106 43 186
7044 186 -56 32 -22 165 119 58 92 150 -5 -116 175 -250 -205 -29 -209 -11 140 -111 96 -25 97 -75
7066 -75 -37 -4 -49 63 219 373 39 -15 9 76 99 -176 -108 178 -143 200 -196 -256 -64 29 -158 -52 -78 -82 118
7091 118 55 -48 88 17 -1 157 -35 128 120 -57 6 -334 65 -15 -46 -11 4 153 -40 -31 86 32 55 63 -73
7116 -73 13 22 -304 39 -41 -164 -48 -35 -43 -41 -80 50 -167 -112 29 -35 101 71 181 -5 -52 22 -147 248 30
7141 30 171 -64 170 -4 -304 220 -33 -40 -38 57 21 -136 221 -36 -303 138 38 -135 -68 -126 153 -10 -11 -204
7165 -204 65 -52 62 -147 100 105 -72 60 -16 194 15 181 -4 -51 98 -101 -48 -172 -319 -15 -48 79
7187 79 -5 121 24 57 -119 -17 -88 -209 -174 -276 -54 94 -226 -35 -114 -92 -375 44 224 -28 60 -114 154
7210 154 -64 -115 2 -185 -188 -79 -30 -82 253 -152 -180 72 -50 24 46 -122 10 34 -78 -8 -81 176 -159 188
7234 188 54 210 56 -168 7 -52 -39 14 43 -12 -266 127 -173 18 161 -227 36 253 223 87 12 -13 -140
7257 -140 118 -207 -138 -19 -49 -47 -237 -146 -51 -23 281 -127 171 253 -41 29 -126 -56 -35 34 -201 127 136 -57 -96
7282 -96 -125 -121 133 157 25 -95 -79 250 -144 71 -49 71 -226 126 298 -257 -39 -120 142 -105 -91 -26 -213
7305 -213 95 48 70 71 -77 -23 21 -155 145 -134 -14 -25 89 99 -60 -244 -44 59 -80 254 -53 100 160
7328 160 50 -39 193 96 81 -45 -83 -45 -102 19 106 52 -5 1 -277 37 184 -47 60 -111 -43 -82 -79 56 27
7353 27 -158 -97 -147 -186 144 42 145 128 -84 -134 123 54 53 -160 171 44 121 -133 40 -133 -49 -11 -173 -146
7377 -146 137 -100 107 -139 -180 118 55 -128 89 -35 -95 55 34 -44 -180 314 -16 -24 27 21 -90 -71 157 -328
7401 -328 -103 132 -10 249 51 17 -14 -41 -107 -51 105 28 85 -108 206 85 121 83 -12 169 258 46 155 167
7425 167 -65 62 -35 -77 -152 190 53 117 116 -42 32 319 29 -142 -30 -44 -206 -250 -53 238 0 -207 105
7448 105 41 25 -241 -87 -216 13 -48 -141 -35 -144 169 128 283 -121 175 249 63 -7 -26 -63 -125 231 -161
7471 -161 -117 -72 42 -134 65 -207 -95 -14 77 -212 37 45 -156 176 23 102 -235 -212 256 -317 130 41 -75
7494 -75 -45 -2 -73 -3 -8 146 63 -328 -79 6 76 18 -89 -318 -22 -213 147 -202 -137 28 6 -50 35 -163 274
7519 274 -107 -96 -180 -312 256 -143 137 -62 193 156 56 -168 165 78 134 67 115 35 1 140 -119 49 -46
7542 -46 303 -39 107 -148 -213 167 -281 17 38 -127 -120 -38 -102 -32 101 -118 83 202 203 -67 196 -158 -188 -93
7566 -93 129 -137 26 169 -43 28 -129 -92 57 69 65 50 126 -229 13 93 -98 204 149 55 -25 4 117 -119
7590 -119 -120 81 132 36 -116 94 0 93 -140 -160 48 -169 -116 -190 93 -211 -63 114 -224 -158 -103 299 44 43
7614 43 -102 47 102 9 15 243 116 160 65 62 133 -46 -50 126 -118 172 -43 34 218 54 96 -77 143 32 -92
7639 -92 -228 -29 31 172 23 -199 -157 -126 36 -50 -179 -238 -69 -40 194 86 52 29 -93 83 -15 -91 140 -26
7663 -26 -34 103 -14 102 -32 -39 351 -45 -113 -80 -112 40 -25 163 54 -321 276 -321 -152 -22 -171 75 -45
7686 -45 267 14 -134 2 300 -44 120 129 -7 -131 -117 -35 197 75 194 -140 -321 -29 39 -48 12 -215 -60
7709 -60 151 -167 14 122 61 -261 -1 4 -36 -174 14 -118 253 -165 -26 139 33 4 186 16 -237 -70
7731 -70 199 176 -23 36 27 -183 89 69 109 -154 299 114 -41 206 -58 -54 283 315 -181 46 123 24 198 -194
7755 -194 136 -42 -19 57 203 -47 80 -162 -284 -83 67 188 -121 -99 -301 94 -63 13 151 139 -196 -15
7777 -15 -253 54 136 102 -44 49 157 66 22 80 119 57 57 105 2 160 119 406 -2 199 -160 -143 -10 -45 -218
7802 -218 -121 -66 86 -92 -196 -55 -240 116 -53 -158 -65 -83 24 -9 -59 -127 -156 -149 -95 -129 82 -54 -104 36
7826 36 -160 -68 -128 42 -95 -66 -66 62 120 189 248 -198 -104 -36 -18 13 155 -27 202 -75 3 -26 178 100 32 35
7852 35 -35 39 59 -67 35 -88 -182 -60 -113 78 -143 290 -192 -89 -22 -95 -11 16 256 7 -123 34 -175
7875 -175 26 161 14 287 -94 176 -13 -121 116 -8 -164 9 16 -127 -279 11 -126 -94 114 92 59 -60
7897 -60 56 62 64 6 151 162 71 142 94 39 50 -3 -25 -31 258 -214 -80 73 124 12 -191 103 -174 105 -41 4
7923 4 -126 -23 -196 18 -212 -232 -134 -123 -342 -184 133 -152 26 -34 8 -90 307 -22 -173 75 146 20 -131
7946 -131 237 -97 47 -47 233 69 -105 -18 -124 -193 -47 114 -90 84 6 -233 -97 192 -11 202 2
7967 2 114 -125 320 154 132 91 -38 139 79 -17 -38 42 -99 -59 -172 -23 259 48 9 199 181 243 81 36
7991 36 316 251 23 134 -71 74 -38 -52 209 -137 -2 180 33 5 -172 63 -7 47 72 -58 95 97 -334
8014 -334 -141 161 -101 -140 -205 192 119 72 -122 139 -239 -138 245 53 -42 -122 2 171 240 37 -168 81
8036 81 46 216 106 -96 105 89 -153 -135 -405 70 -10 348 49 -54 39 165 -233 -216 220 64 -147 1
8058 1 -72 -60 -82 128 -85 80 -245 56 89 -206 -99 23 -44 -225 -9 218 -56 -63 14 158 102 77 82 25 337
8083 337 174 40 81 -46 0 10 -8 -162 138 117 265 157 -109 -42 -55 -62 179 41 34 -75 302 -92 216 44
8107 44 108 89 71 -152 -103 -34 -14 168 -11 133 55 3 132 -97 -39 -102 -78 80 -76 150 68 -131 -30 20 -31
8132 -31 -64 11 208 271 237 59 126 -129 164 -130 60 96 26 66 16 -28 58 99 200 71 -98 -80 46 166 -31
8157 -31 7 -112 -172 -140 -249 67 -78 -13 -70 -113 -63 71 111 -38 78 87 -173 412 -115 2 -31 55 112 -59 -30
8182 -30 -172 52 -95 39 115 48 -14 -171 -21
8191b1
##END NTUPLES=NMR FID
##END=
