##TITLE=1H ikalashn
DE-77_org Ph_T
21.11.2024
##JCAMPDX= 6.0         $$ Bruker NMR JCAMP-DX V2.0
##DATA TYPE= NMR FID
##DATA CLASS= NTUPLES
##ORIGIN= UXNMR, Bruker Analytische Messtechnik GmbH
##OWNER= root
$$ TOPSPIN		Version 1.3
$$ 2024-11-21 14:01:38.953 +0400  Irina@DPX200
$$ Compression mode = diff/dup
##.OBSERVE FREQUENCY= 200.131300845
##.OBSERVE NUCLEUS= ^1H
##.DELAY= (6, 6)
##.ACQUISITION MODE= SIMULTANEOUS
##.ACQUISITION SCHEME= undefined
##.AVERAGES= 64
##.DIGITISER RES= 18
##SPECTROMETER/DATA SYSTEM= spect
##.PULSE SEQUENCE= zg
##.SOLVENT NAME= CDCl3
##.SHIFT REFERENCE= INTERNAL, CDCl3, 1, 17.49637
##AUDIT TRAIL= $$ (NUMBER, WHEN, WHO, WHERE, WHAT)
$$ ##TITLE= Audit trail, TOPSPIN		Version 1.3
$$ ##JCAMPDX= 5.01
$$ ##ORIGIN= Bruker BioSpin GmbH
$$ ##OWNER= Irina
$$ $$ F:/spectra/data/iren/nmr/1H/4/audita.txt
$$ ##AUDIT TRAIL=  $$ (NUMBER, WHEN, WHO, WHERE, VERSION, WHAT)
(   1,<2024-11-21 14:01:26.812 +0400>,<Irina>,<DPX200>,<TOPSPIN 1.3>,
      <created by zg
	started at 2024-11-21 13:57:13.765 +0400,
	POWCHK disabled, PULCHK disabled
       configuration hash MD5:
       BE 6D 3F 07 2A EA 11 49 91 17 2B D3 AF B3 58 0D
       data hash MD5: 16K
       02 E9 97 7C D4 9A 87 BA D1 50 3E DE F8 1E 73 9B>)
$$ ##END=
$$ 
$$ $$ hash MD5
$$ $$ 11 6B D1 EE 78 73 A0 2F B8 D3 70 36 B6 BE 39 E6
##$RELAX= 
##$RELAX= 
##$RELAX= 
##$RELAX= 
##$RELAX= 
##$RELAX= 
##$RELAX= 
##$RELAX= 
##$RELAX= 
$$ Bruker specific parameters
$$ --------------------------
##$DU= <F:/spectra>
##$EXPNO= 4
##$NAME= <1H>
##$PROCNO= 1
##$TYPE= <nmr>
##$USER= <iren>
##$AMP= (0..31)
100 100 100 100 100 100 100 100 100 100 100 100 100 100 100 100 100 100 
100 100 100 100 100 100 100 100 100 100 100 100 100 100 
##$ANAVPT= -1
##$AQSEQ= 0
##$AQ_mod= 1
##$AUNM= <au_zg>
##$AUTOPOS= <>
##$BF1= 200.13
##$BF2= 200.13
##$BF3= 200.13
##$BF4= 200.13
##$BF5= 200.13
##$BF6= 200.13
##$BF7= 200.13
##$BF8= 200.13
##$BYTORDA= 1
##$CFDGTYP= 0
##$CFRGTYP= 5
##$CHEMSTR= <none>
##$CNST= (0..63)
1 1 145 1 1 1 1 1 1 1 1 1 1 1 1 1 1 1 1 1 1 1 1 1 1 1 1 1 1 1 1 1 1 1 
1 1 1 1 1 1 1 1 1 1 1 1 1 1 1 1 1 1 1 1 1 1 1 1 1 1 1 1 1 1 
##$CPDPRG= <>
##$CPDPRG1= <>
##$CPDPRG2= <>
##$CPDPRG3= <>
##$CPDPRG4= <mlev>
##$CPDPRG5= <mlev>
##$CPDPRG6= <mlev>
##$CPDPRG7= <mlev>
##$CPDPRG8= <mlev>
##$CPDPRGB= <>
##$CPDPRGT= <>
##$D= (0..63)
0 2 0 0 0 0 0 0 0 0.06 0 0.03 0 0 0 0 0.0002 0 0 0 0 0 0 0 0 0 0 0 0 0 
0 0 0 0 0 0 0 0 0 0 0 0 0 0 0 0 0 0 0 0 0 0 0 0 0 0 0 0 0 0 0 0 0 0 
##$DATE= 1732183285
##$DBL= (0..7)
120 120 120 120 120 120 120 120 
##$DBP= (0..7)
150 150 150 150 150 150 150 150 
##$DBP07= 0
##$DBPNAM0= <>
##$DBPNAM1= <>
##$DBPNAM2= <>
##$DBPNAM3= <>
##$DBPNAM4= <>
##$DBPNAM5= <>
##$DBPNAM6= <>
##$DBPNAM7= <>
##$DBPOAL= (0..7)
0.5 0.5 0.5 0.5 0.5 0.5 0.5 0.5 
##$DBPOFFS= (0..7)
0 0 0 0 0 0 0 0 
##$DE= 6
##$DECBNUC= <off>
##$DECIM= 32
##$DECNUC= <off>
##$DECSTAT= 4
##$DIGMOD= 1
##$DIGTYP= 9
##$DL= (0..7)
0 120 120 120 120 120 120 120 
##$DP= (0..7)
150 150 150 150 150 150 150 150 
##$DP07= 0
$$ [...]
##$SW= 21.9926040160658
##$SWIBOX= (0..15)
0 0 2 0 0 0 0 0 0 0 0 0 0 0 0 0 
##$SW_h= 4401.40845070422
##$TD= 16384
##$TD0= 1
##$TE= 300
##$TE2= 300
##$TE3= 300
##$TEG= 300
##$TL= (0..7)
0 120 120 120 120 120 120 120 
##$TP= (0..7)
150 150 150 150 150 150 150 150 
##$TP07= 0
##$TPNAME0= <>
##$TPNAME1= <>
##$TPNAME2= <>
##$TPNAME3= <>
##$TPNAME4= <>
##$TPNAME5= <>
##$TPNAME6= <>
##$TPNAME7= <>
##$TPOAL= (0..7)
0.5 0.5 0.5 0.5 0.5 0.5 0.5 0.5 
##$TPOFFS= (0..7)
0 0 0 0 0 0 0 0 
##$TUNHIN= 0
##$TUNHOUT= 0
##$TUNXOUT= 0
##$USERA1= <user>
##$USERA2= <user>
##$USERA3= <user>
##$USERA4= <user>
##$USERA5= <user>
##$V9= 5
##$VALIST= <valist>
##$VCLIST= <CCCCCCCCCCCCCCC>
##$VD= 0
##$VDLIST= <DDDDDDDDDDDDDDD>
##$VPLIST= <PPPPPPPPPPPPPPP>
##$VTLIST= <TTTTTTTTTTTTTTT>
##$WBST= 1024
##$WBSW= 25
##$XGAIN= (0..3)
0 0 0 0 
##$XL= 0
##$YL= 0
##$YMAX_a= 1373889
##$YMIN_a= -1449629
##$ZGOPTNS= <>
##$ZL1= 120
##$ZL2= 120
##$ZL3= 120
##$ZL4= 120
##$ABSF1= 10
##$ABSF2= 0
##$ABSG= 5
##$ABSL= 3
##$ALPHA= 0
##$AQORDER= 0
##$ASSFAC= 0
##$ASSFACI= 0
##$ASSFACX= 0
##$ASSWID= 0
##$AUNMP= <proc_1d>
##$AXLEFT= 0
##$AXRIGHT= 0
##$AXTYPE= 0
##$AXUNIT= <>
##$AZFE= 0.1
##$AZFW= 0.1
##$BCFW= 1
##$BC_mod= 2
##$BYTORDP= 1
##$COROFFS= 0
##$CY= 7568.61572265625
##$DATMOD= 1
##$DC= 2
##$DFILT= <>
##$DTYPP= 0
##$F1P= 17.9538593292236
##$F2P= -4.03888763876832
##$FCOR= 0.5
##$FTSIZE= 32768
##$FT_mod= 4
##$GAMMA= 1
##$GB= 1
##$INTBC= 1
##$INTSCL= 1
##$ISEN= 128
##$LB= 0.02
##$LEV0= 0
##$LPBIN= 0
##$MAXI= 945.577
##$MC2= 0
##$MEAN= 0
##$ME_mod= 0
##$MI= -402.1523
##$NCOEF= 0
##$NC_proc= 0
##$NLEV= 6
##$NOISF1= 8.587773
##$NOISF2= 6.764455
##$NSP= 1
##$NTH_PI= 0
##$NZP= 0
##$OFFSET= 17.49637
##$PC= 1
##$PHC0= 323.0213
##$PHC1= 4.6935
##$PH_mod= 0
##$PKNL= yes
##$PPARMOD= 0
##$PPDIAG= 0
##$PPIPTYP= 0
##$PPMPNUM= 100
##$PPRESOL= 1
##$PSCAL= 0
##$PSIGN= 0
##$REVERSE= no
##$SF= 200.13
##$SI= 32768
##$SIGF1= 18.5376
##$SIGF2= -6.396296
##$SINO= 400
##$SIOLD= 32768
##$SREGLST= <1H.CDCl3>
##$SSB= 3
##$STSI= 0
##$STSR= 0
##$SW_p= 4401.40845070422
##$SYMM= 0
##$S_DEV= 0
##$TDeff= 0
##$TDoff= 0
##$TI= <>
##$TILT= no
##$TM1= 0
##$TM2= 0
##$TOPLEV= 0
##$USERP1= <user>
##$USERP2= <user>
##$USERP3= <user>
##$USERP4= <user>
##$USERP5= <user>
##$WDW= 1
##$XDIM= 8192
##$YMAX_p= 0
##$YMIN_p= 0
$$ End of Bruker specific parameters
$$ ---------------------------------
##NTUPLES= NMR FID
##VAR_NAME=  TIME,          FID/REAL,        FID/IMAG
##SYMBOL=    X,             R,               I
##VAR_TYPE=  INDEPENDENT,   DEPENDENT,       DEPENDENT
##VAR_FORM=  AFFN,          ASDF,            ASDF
##VAR_DIM=   8192,          8192,            8192
##UNITS=     SECONDS,       ARBITRARY UNITS, ARBITRARY UNITS
##FACTOR=    0.0002272,     1,               1
##FIRST=     0,             0,               0
##LAST=      1.8609952,     284,             32
##MIN=       0,             -1449629,        -1449629
##MAX=       1.8609952,     1373889,         1373889
$$ Real data points
##PAGE= N=1
##DATA TABLE= (X++(R..R)), XYDATA
$$ [...]
2004B84n59L56m1K75m03m57M10M62p56k91N99M11K74q78P1N29J8n88j5Q74j91
$$ 284 -275 81 40 315 -88 -545 -135 327 -429 -720 -121 290 564 -314 -243 286 304 -284 -299 575 384
2025C84l21q3K83K10m70m43M53N11m47n07K21R25n81l65j34O71p8o05J69L70J75
$$ 384 63 -20 263 473 3 -440 13 524 77 -430 -209 716 135 -230 -364 307 229 -376 -207 163 338
2046C38k31m20N36k05M38r43P51L87j45r29K79O66r7j005j1N52P61j027r0L97
$$ 338 107 -313 223 18 456 -487 264 651 506 -423 -144 522 425 -580 -591 -39 722 -305 -395 2
2066BK94j21l12q1O93j63n56J59N82j44n76k98N15L77l60m79O06K22n29j44K82
$$ 2 296 175 -137 -218 475 312 -244 -85 497 353 -223 -521 -6 371 11 -468 138 360 -169 -313 -31
2087c1J32n77q2N38L76n00n11O06M26o1q21O2Q08k56j45k38N01J37l83j99q9Q62
$$ -31 101 -476 -558 -20 356 -144 -655 -49 377 316 -505 -443 365 109 -36 -274 227 364 -19 -218 -307 555
2109E55l42n33K14M16Rn33m78J109J77r67M3R9L63J5o09K28P12l28p59O47M48
$$ 555 213 -320 -106 310 319 -214 -692 417 594 -373 -330 -231 132 147 -462 -234 478 150 -609 38 486
2130D86k80m73L95L60p7n73l76P73p9m62n8J86K21k80m17J86P80m24j16J10N98
$$ 486 206 -267 128 488 411 -162 -538 235 156 -306 -364 -178 43 -237 -654 -468 312 -112 -228 -118 480
2151D80l06p30M34M46J78l38m15L37M77l72o14M94J80k40k16J05L96J2q65K91
$$ 480 174 -556 -122 324 502 164 -251 86 563 191 -423 71 251 11 -205 -100 296 308 -557 -266
2171b66M45J31q81L36O5O96o80l6J60J57k77l92N58J88j98j96RN19k97k17r4O58
$$ -266 179 310 -571 -235 -170 526 -154 -190 -30 127 -150 -542 16 204 6 -190 -181 338 41 -176 -270 388
2193C88j50n92j40M50K83m94o9K94%K53n01j61P05l60J63j76K77O5j31l61P14
$$ 388 238 -354 -494 -44 239 -255 -324 -30 -30 223 -278 -439 266 -94 69 -107 170 235 104 -257 457
2214D57j42l52k02K00M11n89j33M17L26r6n60K28K47l76j45K32K48J74o56Q5L72
$$ 457 315 -37 -239 -39 372 -217 -350 67 393 297 -263 -35 212 -164 -309 -77 171 345 -311 -226 146
2235A46j62j40J19J90L06k51k50J02K66p0m19j21N40q7l13p9M2M42m69p3L48K8
$$ 146 -16 -156 -37 153 459 208 -42 60 326 256 -163 -284 256 169 -144 -223 -181 261 -208 -281 67 95
2257I5n13N24j78N95l34n31M1O64j83l15L8L21L28l84l15L30l65K31o62O08J13
$$ 95 -418 106 -72 523 189 -342 -301 363 180 -135 -97 224 552 168 -147 183 -182 49 -613 -5 108
2278A08J12k50k42K76j7J04o43N97r4K81k55J37R3j90l77K36N41j25m43k68M16
$$ 108 220 -30 -272 4 -13 91 -552 45 -49 232 -23 114 207 17 -360 -124 417 292 -151 -419 -3
2299cN2l63J82o9N87k80j84K14m6k47j04M35K74l99n46N48Q2Q5m71K95K61n95
$$ -3 49 -314 -132 -201 386 106 -78 136 90 -157 -261 174 448 49 -497 51 133 218 -253 42 303 -292
2321b92J09MM86n6j52m63M47K61n23L89j49j53k2k64L33j5P9j51r7L11l9l55J00
$$ -292 -183 -179 307 251 99 -364 83 344 -179 210 61 -92 -114 -378 -45 -60 19 -132 -229 82 43 -312 -212
2344b12L44l82N8P1Q8N89l89l45j22M01J43p28K96K90n48P3K14J37O5k78pL40
$$ -212 132 -250 -192 -121 -33 556 167 -178 -300 101 244 -484 -188 102 -446 -373 -159 -22 43 -235 -242 98
2366I8N2k78R6k63K11J17k17J58L52R6l70J26L35l38l02K9M89j03n61J64L21l53
$$ 98 150 -128 -32 -295 -84 33 -184 -26 326 422 52 178 513 175 -127 -98 391 288 -273 -109 212 -141
2388a41J62k43K43j15k33Q4J44M7j62L1j47O86n33Rj13L46J45l36K59l87L58n10
$$ -141 21 -222 21 -94 -327 -243 -99 -52 -214 -183 -330 356 -177 -168 -281 65 210 -126 133 -254 104 -406
2410d06M83j62k89L07j57O1K00J36j5n04K08J66o38K28K42K10k27P6o1jq6j3L82
$$ -406 77 -85 -374 -67 -224 -163 37 173 158 -346 -138 28 -610 -382 -140 70 -157 -81 -142 -143 -229 -242 140
2433A40L96l17k10K54j40Q9l81L11j4k42j11L5K09j29j29J42R3O5j99p7L79J35
$$ 140 536 219 9 263 123 212 -169 142 128 -114 -225 -190 19 -110 -239 -97 -4 61 -138 -215 164 299
2455B99o3l14R1J97j49j34j6K41J21l6M1j66L20j97k22k22M33N2l30R5j73M79
$$ 299 236 -78 13 210 61 -73 -89 152 273 237 278 112 432 235 13 -209 224 276 -54 41 -132 347
2477C47o12J95L60j9l50m00O13l43K53k31L54m3l43J75p9J15Q0j42l7L32J5l99
$$ 347 -265 -70 290 271 -79 -479 134 -209 44 -187 167 124 -219 -44 -123 -8 72 -70 -107 225 240 -159
2499a59j66N18J90k9n28j70M11j3j46L51m72J93J22j42J67J35k76Q0K46k98M5
$$ -159 -325 193 383 354 -174 -344 67 54 -92 259 -213 -20 102 -40 127 262 -14 66 312 14 59
2520E9j06M1j1j05K09n71O82n9l44oL25j55j70M08mk48l9K04p3M11m52j6J14l56
$$ 59 -47 -6 -17 -122 87 -484 198 139 -205 -211 114 -41 -211 197 193 -55 -94 110 37 448 -4 -20 94 -262
2544b62J80l2R4K03l19R7R0j05J44o2K96k39j37L3M73r03N01R5J7k46K80n69J59
$$ -262 -82 -114 -20 183 -136 -39 51 -54 90 28 324 85 -52 -19 454 -449 52 147 164 -82 198 -371 -212
2567b12M2O51l32j12P4K3k42J37j80j79Q16n00L69m78p1J52j89L13j19M31m62
$$ -212 -170 481 149 37 111 134 -108 29 -151 -330 486 -14 355 -123 -194 -42 -231 82 -37 394 -68
2588f8K5K40K30m15j55K46m4Q0pJ9p5Q5o15L99K85k65o3k80N23J1j25j46l45M77
$$ -68 -43 197 427 12 -143 103 59 139 132 151 76 161 -454 -55 230 -35 -98 -378 145 156 31 -115 -460 17
2612A7j29K47K34k04j62P7q8R4j36L61n9P8k03l62K45j75L66k72O2J48M19m67
$$ 17 -112 135 369 165 3 80 -8 86 -50 311 252 330 127 -235 10 -165 201 -71 -9 139 558 91
2634I1Q1p3j0j7N1n31L90k83L34k99J3N77m35n0K50j9m3N5j68J15j8K47n66N74
$$ 91 172 99 89 72 123 -408 -18 -301 33 -266 -253 324 -111 -161 89 70 27 82 -86 29 11 258 -308 266
2658B66p6k56q1J96q6K06l38j92K74j05L39k77K28J34n96R09j84l37K75R6l08
$$ 266 190 -66 -147 49 -37 169 -169 -361 -87 -192 147 -130 98 232 -364 545 361 24 299 395 87
2679H7l6R5k44m9K39P9m37M97j53J45j05m73L87L17m78Q2K75p77K95M0J26J44
$$ 87 51 146 -98 -147 92 171 -266 231 78 223 118 -355 32 349 -129 -47 228 -549 -254 -214 -88 56
2701E6Jj3k63N40k88N1k58N04l46j95K5M71q9l81k9L07p4m55L59L03P9k2j88k92
$$ 56 57 44 -219 321 33 84 -174 330 -16 -211 -186 285 196 -185 -214 93 19 -436 -77 226 305 283 95 -197
2725a97L58k45k15L52L35k23N0j37L05l69k62N33j19k10k71o7M15j76J99k43L20
$$ -197 161 -84 -299 53 388 165 215 78 383 14 -248 285 166 -44 -315 -382 33 -143 56 -187 133
2746A33l64k2L35l23L56q0l74M74k71K87k1l03R9J83n16L46M55l25k33%K62k74
$$ 133 -231 -253 82 -241 115 35 -339 135 -136 151 130 -173 -74 109 -407 -61 394 69 -164 -164 98 -176
2768a76K75k4J25L5k77K99k79J66k61L00k99R2j51L76k88K43r6K21k63K55l67
$$ -176 99 75 200 235 -42 257 -22 144 -117 183 -116 -24 -175 201 -87 156 60 281 18 273 -94
2789i4J49p7J13n6jj14r5J34k39K68o2K33L77p29J12p1K91j99l45O44k00l98L60
$$ -94 55 -22 91 35 34 -80 -175 -41 -280 -12 -74 159 536 -193 -81 -152 139 -60 -405 239 39 -359 1
2812AL04pl39O9j06r4L21o5O9J78l68J5q7K78q1m00L19K64j37o7K10J16m19l4
$$ 1 305 298 -41 28 -78 -172 149 84 153 331 -37 -22 -109 169 88 -312 7 271 134 67 277 393 -26 -60
2836f0L46l35K0J14L82l80r2Q5k88K43mj4J38J30q2j22R5l29L39k41J56k8j42
$$ -60 286 -49 -29 85 467 87 -5 80 -208 35 31 17 155 285 203 81 176 -153 186 -55 101 73 -69
2859f9OJ51K02p33L75L59k95n4J8p3K62j74k24L33k58K36m1PK03k42j15k2K61
$$ -69 -63 88 290 -443 -68 291 -4 -58 -40 -113 149 -25 -249 84 -174 62 21 28 231 -11 -126 -148 113
2882A13Qr3j01P8j54k58K02K03j13J04kJ69N8j97l7J51L07l64L8l57O48n46r0
$$ 113 121 28 -73 5 -149 -407 -205 -2 -115 -11 -13 156 214 17 -20 131 438 74 112 -245 403 -143 -233
2905b33P1K61M27l11k82J02lk36L27k35j81M45j83j2K73K33m54L90n90K05J04
$$ -233 -162 99 526 215 -67 35 32 -204 123 -112 -293 152 -31 -43 230 463 9 399 -191 14 118
2926A18l44M41k22K0N3m8J3l4N4r4K79k8j39j62J12k25O6K77m56M29M50k82l16
$$ 118 -226 215 -7 13 66 18 31 -3 51 -43 236 208 69 -93 19 -206 -140 137 -319 110 560 278 -38
2949c8M37n82K76j00k95J70K6J82P4K7J12k75J23j11m82L13O7J72J69l37K61j22
$$ -38 399 -183 93 -7 -302 -132 -106 76 150 177 289 14 137 26 -456 -143 -76 96 265 -72 189 67
2971F7l73l3L39J8j60N70l93P3k65L13J52m21J68k38L19r0j47J21m29L64K14m73
$$ 67 -306 -339 0 18 -142 428 35 108 -157 156 308 -113 55 -183 136 46 -101 20 -409 -45 169 -304
2993c04L63j32N0L72n06j01J35O47l82k65K56n44O21l34K72J21m19J37O6K3J17
$$ -304 59 -73 -23 349 -157 -258 -123 524 142 -123 133 -411 210 -124 148 269 -150 -13 53 76 193
3014A93j16J51J39o07J38M4r8QJ69Po4j55N6K45l48j47L83P5l12L36lk79J59j7
$$ 193 77 228 367 -240 -102 -58 -156 -148 21 28 -36 -191 -135 110 -238 -385 -2 73 -239 97 94 -185 -26 -43
3038d3L81m89R0J57k41K28r6j24o1K39l40M63l48M16l10J94j0k23L17k30O6Q8
$$ -43 338 -151 -61 96 -145 83 -13 -137 -198 41 -299 164 -184 232 -78 116 106 -117 200 -30 36 124
3060A24J21m42j42N86j94m37K02L00l6n14K10J25O8j11L5r1O6M78k58J20l3l48
$$ 124 245 -197 -339 247 53 -384 -182 118 82 -432 -222 -97 -29 -140 -105 -196 -130 348 90 210 177 -171
3082a71R4N0k76K13N9k66L93K7k09J31L03j15m36J42L57J05n44J81Q7l70K37j67
$$ -171 -77 -27 -303 -90 -31 -297 96 123 -86 45 348 233 -203 -61 296 401 -143 38 125 -245 -8 -175
3104a75L6P8K57k83K23j84J35n2K36j5k95k75N68j00n0l50M9K89l31K48JQ2Q6
$$ -175 -139 -61 196 -87 136 -48 87 35 271 256 -39 -314 254 154 104 -246 -197 92 -239 9 10 92 178
3127A78j36K8J15J30j90l37J66K85m08K25mj74J9J36r5j84M64K03n05K49k78K45
$$ 178 42 70 185 315 125 -212 -46 239 -169 56 52 -122 -103 33 -62 -246 218 421 -84 165 -113 132
3149A32k35k13K60r2J59o0k05O34o97J4J00L07r9k2m2n4K82j49J12n1R9k05m3
$$ 132 -103 -316 -56 -148 11 -49 -254 380 -317 -303 -203 104 5 -17 -59 -113 169 20 132 81 180 -25 -68
3172f8J00Kn5L09j91m2k36K34j56K20j3j61k9R2p0O9J4q5J65m3j69L55O1m31J56
$$ -68 32 34 -21 288 97 55 -181 53 -103 117 104 -57 -86 6 -64 5 19 -66 99 56 -113 242 303 -128 28
3197B8n1L35k53k05K52n9J06j31j51R9M8j07oJ50k81O40n90N7J46K6j60K58l34
$$ 28 -23 312 59 -146 106 47 153 22 -129 -30 18 -89 -95 55 -226 414 -176 -119 27 53 -107 151 -183
3220a83PK68j92K08k11qK45j37P4k31J81J92o84J37K85j32K55j66K66k03M8m5
$$ -183 -176 92 -100 108 -103 -111 134 -3 71 -160 21 213 -471 -334 -49 -181 74 -92 174 -29 19 -26
3242b6J8r5K92k14m1R3L7pm58Q38l79J61j19J41k01N8j2k58M02j75o1N1J48l2
$$ -26 -8 -103 189 -25 -66 27 64 57 -401 437 58 219 100 241 40 98 86 -172 230 55 -6 45 193 161
3266A61L9j91j41lL10l64K21l56L36J73j50j71O66k80j00j00O0l69L39k59P3K38
$$ 161 200 9 -132 -135 175 -189 32 -324 12 185 35 -136 530 250 150 50 110 -259 80 -179 -106 132
3288A32m2K5k91%M3o6J24J57j18j80K73N4r2K41K7q7k65j48K59n6k52J41k06M51
$$ 132 90 115 -176 -176 -133 -199 -75 82 -36 -216 57 111 19 260 287 200 -65 -213 46 -10 -262 -121 -327 124
3312A24o0Q7l14M8o3M62m21j31L27p3K0M8O4Q3l71K99l01M37k40j71j1O1K18R9
$$ 124 64 151 -163 -115 -178 284 -137 -268 59 -14 6 54 118 201 -170 129 -172 265 25 -146 -157 -96 122 221
3336B21n98M42N1k54n7P8J84j9K84n76K10L2N5k10L08j14K25j99N9j15O3l18N10
$$ 221 -377 65 116 -138 -195 -117 67 48 332 -244 -34 -2 53 -157 151 37 262 63 122 7 70 -248 262
3359B62j28N5j86q4L81k23j98L30m29k01N46L4l00M53j69N0q4m56j15O29j34j91
$$ 262 134 189 3 -81 300 77 -121 209 -220 -421 125 159 -141 312 143 193 109 -347 -462 167 33 -158
3381a58J31k21R9M90n77L24J93j16l87oK67L7k11K03J48J61l79k42K44K71l26
$$ -158 -27 -248 -149 341 -236 88 281 165 -222 -228 39 76 -135 68 216 377 -2 -244 0 271 -55
3402e5K4N74n08O3J69l46L8o6K55m5j34n6J32P3j92n0K06n9J07K44o75L71P9j07
$$ -55 -31 543 35 98 267 -79 -41 -107 148 103 -31 -87 45 118 -74 -124 82 23 130 374 -301 70 149 42
3426D2k02K40k77M55m71M5Q2j39L67k0l71J78K17k72j38L87r3M7k98L32K38n59
$$ 42 -160 80 -197 258 -213 -168 -86 -225 142 122 -249 -71 146 -126 -264 123 30 77 -221 111 349 -210
3448b10O8q1J06J4K07k58O1j6k5L14m07K27k68m3J09J8J92m0r8J9L5K31l43j38
$$ -210 -142 -223 -117 -103 104 -154 -93 -109 -134 180 -227 0 -268 -311 -202 -184 8 -32 -130 -111 -76 155 -188 -326
3472c26J30J85p3o5K35M4j89k69K04J78k80N29k29k72K51J08l44pN92k21j22k46
$$ -326 -196 -11 -84 -149 86 130 -59 -328 -124 54 -226 303 74 -198 53 161 -183 -190 402 181 59 -187
3494a87M66l05m0J51o0p5O8Jj57q4n9L29J75k18K12L5m76L68n92J76j54K81n9
$$ -187 279 -26 -66 85 25 -50 18 19 -138 -222 -281 48 223 5 217 252 -224 144 -448 -272 -426 -145 -204
3517b04L61j38L30l24l3%j78L25j35M46l89O7R8K08k64J24k43l80M21O5J30l69
$$ -204 157 19 349 25 -8 -8 -186 139 4 450 61 128 226 434 170 294 51 -329 92 157 287 -82
3539h2K84j18L2K33l49k90N65J10om61Q0l46L42O4P1k48K58J90l83K13k60n0K25
$$ -82 202 84 116 349 0 -290 275 385 379 -82 -2 -348 -6 58 129 -119 139 329 -54 159 -101 -151 74
3562G4j74L56J55l34m4K62M5J44m72K17k12J0L5j27J33k19L50j24j35J82j4N2
$$ 74 -100 256 411 77 33 295 340 484 12 229 17 27 62 -65 68 -151 199 75 -60 122 108 160
3584A60m8j33J31m87P08l02L16m85k87R05o84m9r9J79L59j95K22m74M74n2P6k63
$$ 160 112 -21 110 -377 331 29 345 -140 -427 478 -206 -255 -354 -175 184 -11 211 -263 211 159 235 -28
3606b8L25l87j41r5M22k79M17l60L33j71J9j81K54l01K11J7k91L89n86N49n9J
$$ -28 297 -90 -231 -326 96 -183 234 -126 207 36 55 -126 128 -173 38 55 -236 153 -433 116 57 58
3628E8M21m94j68K01J80J36p58O98k00j36L90j78K07m43K15j24l14L36j00l3O4
$$ 58 479 -15 -183 18 198 334 -424 274 74 -62 328 150 357 -86 129 5 -309 27 -73 -106 -42
3649d2j28o3N60l89K61m40N0J55K16J60k69k15K57j16m9p1L47l88K90K25J3m16
$$ -42 -170 -233 327 -62 199 -241 -191 -36 180 340 71 -144 113 -3 -52 -123 224 -164 126 351 364 -52
3671e2n5K09l23K05J09J46l03n2KK13j77J30l09L91J12j01n14K44Q5j33J08J64
$$ -52 -107 102 -221 -16 93 239 -64 -116 -114 99 -78 52 -257 134 246 145 -369 -125 -40 -173 -65 99
3693I9m32K93O4J72l50k97P44l36M5J11r5K35k45j76J83j26J4J60l9j06M57o03
$$ 99 -333 -40 24 196 -154 -451 293 -43 2 113 18 253 8 -168 15 -111 -97 63 24 -82 375 -228
3715b28J0K48J97MJ0O7j87j20l6k0m6J42j22O2j48J52J33j85j09R0J55J57m45
$$ -228 -218 30 227 231 241 308 121 1 -35 -55 -101 41 -81 -19 -167 -15 118 -67 -176 -86 69 226 -219
3738b19J89QJ03j59K23o0Q0j95L51n01j7j0J20M21J26n24k13L79j40l95L54J08
$$ -219 -30 -22 81 -78 145 85 165 -30 321 -180 -197 -207 -87 334 460 -64 -277 102 -38 -433 -79 29
3760B9j51K52%j84N24m85j50L04j90r5K41k21J78l80M92R5o4k53q4j32M81j11
$$ 29 -122 130 130 -54 470 -15 -165 139 -51 -146 95 -126 52 -328 164 259 195 -58 -142 -274 207 96
3782I6l46P5J21K55n93K38j39L34k16JK98r9j03J54l20L67p0k6k24J32M33n28
$$ 96 -250 -175 -54 201 -392 -154 -293 41 -175 -174 124 25 -78 76 -244 123 53 27 -197 -65 368 -160
3804a60J70J8J7p4J65j3n1j93m9L74j31k98L02k84L63m50M54j48J57l11k3n4L49
$$ -160 10 28 45 -29 136 123 72 -121 -170 204 73 -225 77 -207 156 -294 160 12 169 -142 -165 -219 130
3827A30j73j17J88L1K28l05j79L92J87l45K9m83J225p41r8R2R6j75l6r2J05j57
$$ 130 -43 -160 28 59 287 -18 -197 195 382 37 66 -417 808 67 -31 61 157 -18 -54 -146 -41 -198
3849a98N5J50j22Mn8r8K43J37j24R4K29l28P8r2M01l87J0R3l50L84k75N19n31
$$ -198 -143 7 -115 -111 -169 -267 -24 113 -11 83 312 -16 62 -30 371 -16 -6 87 -263 121 -154 365 -166
3872a66o9M68k55J01n03J72R8j03N12r1j01J66jk65J35j13Q6j15K6Ll1J70l56
$$ -166 -235 233 -22 79 -424 -252 -154 -257 255 164 63 229 228 -37 98 -15 71 -44 -18 -15 -46 124 -232
3895b32K53J11k89J4k69L38p6j68K09L18m22L33n29K7M13%M14k86q8l16J63N5
$$ -232 21 132 -157 -143 -412 -74 -150 -318 -109 209 -213 120 -409 -382 31 31 445 159 71 -245 -82 -27
3917b7J65k13J66K77l99K43j20k98j4J96m74K33N9J81l60K78J48K05l33R1o1o6
$$ -27 138 -75 91 368 -31 212 92 -206 -220 -24 -498 -265 -206 -25 -385 -107 41 246 -87 4 -57 -123
3939a23o3M06j02j30K2j00L42j38l20L30J67m58r6K59O51q88K49j89j6J05N72
$$ -123 -186 220 118 -12 10 -90 252 114 -206 124 291 -167 -263 -4 647 -241 8 -181 -197 -92 480
3960D80q19M33K4j17K55j32j02j25k07J91j50L32n14L85L68l55L4L1L28l01N0
$$ 480 -339 94 118 1 256 124 22 -103 -310 -119 -269 63 -451 -66 302 -53 -19 12 340 39 89
3981H9M1r1J17R8k30l05J62O0J10k88j07K73j30J75J28j37j98N83Pn6m07P4M1
$$ 89 130 39 156 254 24 -281 -119 -59 51 -237 -344 -71 -201 -26 102 -35 -233 350 357 301 -106 -32 9
4004IJ86j27j74K18j98pj41J8M63k65j65K11n0O4j54K96l59L11J11k16K88j79
$$ 9 195 68 -106 112 -86 -93 -234 -216 247 -18 -183 28 -22 42 -112 184 -175 136 247 31 319 140
4026A40l52J35o4J5J79K8k07J3K04J80p0l14J4Pj96N0J66k8J44JK06m87R7L2J9
$$ 140 -212 -77 -141 -126 53 81 -126 -113 91 271 201 -113 -99 -92 -288 -238 -72 -100 44 45 251 -236 -139 -107 -88
4051h8l11J60l4R2J60J61o1j9K10k4m05J61K06k06k52j20K86m0P6J47L3j65P2
$$ -88 -399 -239 -273 -181 -21 140 79 60 270 246 -159 2 208 2 -250 -370 -84 -124 -48 99 132 -33 39
4074C9K13o5m23N38j93j12j9r1J47J23J34j07o4k39J71M9j31J54j39L2m21N19
$$ 39 252 187 -236 302 109 -3 -22 -113 34 157 291 184 120 -119 52 101 -30 124 -15 17 -404 115
4096A15k37J0m4j27O13k66k44O2M31l76l7J86q4k81K80k4r5j40J87q0K65P1k13
$$ 115 -122 -112 -156 -283 330 64 -180 -118 313 -63 -100 86 2 -279 1 -23 -118 -258 -71 -151 114 185 -28
4119b8k9l3K89l05K60j66M5L18j93k5j82K82n4j00n64N75J55J0o4n26N77j96J46
$$ -28 -57 -90 199 -106 154 -12 33 351 158 133 -49 233 179 79 -485 90 245 255 191 -335 242 46 192
4142A92l09K60o1q1m7j53o0L20J19k50J84m13M02j13N96o66Q6P7k88K10r1P3l6
$$ 192 -117 143 82 1 -46 -199 -259 61 180 -70 114 -299 103 -10 586 -80 6 83 -205 5 -86 -13 -49
4165d9K36o2J11k46n7q3J08K3J5l6R1l7P5j59j11p7n2L35j81L2P8l9Lk85O67j25
$$ -49 187 125 236 -10 -67 -150 -42 -19 -4 -40 51 14 89 -70 -181 -258 -310 25 -156 -124 -46 -85 -82 -367 300 175
4191A75k51J30R4k61q7L3j00L13k31k7N1R4j13j2J81L3q7J16j45m3K5J37q9J8
$$ 175 -76 54 148 -113 -200 -167 -267 46 -185 -212 -161 -67 -180 -192 -11 22 -65 51 -94 -137 -112 25 -64 -46
4215d6J55n6k46J39J36R1K55m51J83r8m25L60P7j43j03j6O5KJ65j00j99L41l1
$$ -46 109 53 -193 -54 82 173 428 -23 160 62 -363 -3 74 -69 -172 -188 -123 -121 44 -56 -255 86 55
4238E5j25K28M9k51NM89l79M7o92Q44l43Lr1r7J92l5K10k14j4K49q5m99O28m28
$$ 55 -70 158 207 -44 -39 450 71 118 -574 270 -73 -70 -161 -258 -66 -101 109 -105 -119 130 45 -454 174 -254
4262b54O4N2j72N54m19L44k18L01k61q6K09M8K8j41P4j3m89N42j67J13n8k23Q8
$$ -254 -190 -138 -310 244 -175 169 -49 252 -9 -95 114 162 190 49 123 110 -379 163 -4 109 51 -172 -84
4285h4j05K5j33L21j43nJ2P4n7N19m13J33J61m02J51K80o8p5j96K23p5k61L79
$$ -84 -189 -164 -297 24 -119 -124 -112 -38 -95 424 11 144 305 -97 54 334 266 191 -5 218 143 -118 261
4308B61k67j56K01k86K48K02m81L31M9j12k50M25K64o31N19l61K14k09m9J94J71
$$ 261 -6 -162 39 -247 1 203 -278 53 102 -10 -260 165 429 -202 317 -44 170 -39 -88 106 277
4329B77m68J82jk39L03j99P0q6L22m97J83K57K65m60p0J57K89k65K88l08K70k11
$$ 277 -191 -9 -10 -249 54 -145 -75 -161 161 -336 -153 104 369 -91 -161 -4 285 20 308 0 270 59
4351E9L7K28j81k30j21N6N13m93k53L46R1j70K81n9Kj32k50Q5K71N01o68j02M4
$$ 59 96 324 143 -87 -208 -152 361 -132 -385 -39 52 -118 163 104 106 -26 -276 -191 80 581 -87 -189 -145
4374a45K47l86J02K44J86K40o30M21m79J00K41j34J97k52J5L4l75M09j10L1k20
$$ -145 102 -284 -182 62 248 488 -142 279 -200 -100 141 7 204 -48 -33 1 -374 35 -75 -44 -264
4395b64M46k93j30N06j76k06L44j48j29K17l08K03J45m55J95m5k47M61j22J79
$$ -264 182 -111 -241 265 89 -117 227 79 -50 167 -141 62 207 -248 -53 -98 -345 116 -6 173
4415A73n15J41K85j40K73k57R3%k46Q5J53o1L60l86J41J1O5l59K00L19k52k78
$$ 173 -342 -201 84 -56 217 -40 53 53 -193 -108 45 -16 344 -42 99 110 175 -184 16 335 83 -195
4437a95O8K95j66j06L8J58j27J64O0j47m5j57r0J99N7J49j77q2K19Q4l86Q9n4
$$ -195 -127 168 2 -104 -66 92 -35 129 189 42 -3 -160 -250 -51 6 155 -22 -104 115 199 -187 -98 -152
4460a52M7J58J06J21k84k4K1k39L78L0K37l75K67l65N8j16J29n14O69j21kl70
$$ -152 -105 53 159 280 -4 -28 -7 -246 132 162 399 24 291 -74 -16 -132 -3 -517 152 31 29 -341
4482c41l6J82L88L5o2k68j87L46o5K43l61K49j13j65K18J84k69M42l78N6j76r1
$$ -341 -377 -195 193 228 166 -102 -289 57 -8 235 -126 123 10 -155 63 247 -22 420 42 98 -78 -169
4504a69R7J36l20J01K41l52L51M4R6k37p2j19n9L25R5L7j25Q0k39O5j11N5l5J50
$$ -169 -72 64 -256 -155 86 -266 85 129 225 -12 -84 -203 -262 63 158 195 70 150 -89 -24 -135 -80 -115 35
4528C5J52l69L83k46M49k55k1j8l1l87M24Q3j71J68m31n3M73l41m1L41O2J00l00
$$ 35 187 -182 201 -45 404 149 128 110 79 -308 116 199 28 196 -235 -288 185 -156 -197 144 206 306 6
4551FK70l64R1r9L10l32J01j8K09j0j22j37k23L51K99k72j03q2K9K2M5l76N28
$$ 6 276 -88 3 -96 214 -118 -17 -35 174 164 42 -95 -318 33 332 60 -43 -125 -96 -74 -29 -405 123
4574A23j38j13k4N8N6j05K44N1l8k63j8N30m42K45r0k16M43l98J14l6q5N28m55
$$ 123 -15 -128 -152 -94 -38 -143 101 152 114 -149 -167 363 -79 166 76 -140 303 -95 19 -17 -102 426 -29
4597b9q1K13j81J25j49lj0J68l29L01K33k42j31j99K66j02m6K2M24j81m21L38
$$ -29 -110 103 -78 47 -102 -105 -115 53 -276 25 258 16 -115 -314 -48 -150 -196 -174 250 69 -352 -14
4619a4oL42J67p16L61p5K87n95m9M90m66J89LK19J93m11K31Rm12L76J0j18j21
$$ -14 -20 322 489 -227 134 59 346 -249 -298 192 -274 -85 -82 137 330 -81 150 159 -253 123 133 15 -106
4642a06nJ71k41q3L63j79K0J02j43K52l31M35n57N25m24M57k01j32k22M51j87
$$ -106 -111 60 -181 -264 99 -80 -60 42 -101 151 -180 255 -302 223 -201 256 55 -77 -299 152 -35
4663c5J26m49M39n2O7Nl34K27J24r8Lj78J98n88L59r0M34o03M37n9j5L41j06j61
$$ -35 91 -358 81 29 96 101 -233 -6 118 20 23 -155 43 -545 -186 -276 158 -445 -8 -67 -82 259 153 -8
4687hQ7j93k89M22j6M1J80j38j90j89K62L9k6N98l73l55J81m0o3J22J56l48n1
$$ -8 79 -114 -403 19 3 44 224 86 -104 -293 -31 8 -18 580 207 -148 33 -7 -70 52 208 -140 -191
4710a91L41r4k09K56J35j58m8J05j58J91j30l26L78k57J65j18pm2L48j77J70k32
$$ -191 150 56 -153 103 238 80 32 137 -21 170 40 -286 92 -165 0 -118 -125 -167 181 4 174 -58
4732e8m34M42J80j98R5K77j64j75m6J7N9K56m41P6K14j59j2K80Ml15K98l47K27
$$ -58 -492 -50 130 -68 27 304 140 -35 -81 -64 -5 251 -190 -114 100 -59 -71 209 213 -102 196 -151 76
4755G6l58M75l07M9L26K9k04Q2k38m9M56m21%J41J6j53K83m53J45K78j03L0m59
$$ 76 -282 193 -114 -65 261 290 86 168 -70 -119 337 -84 -84 57 73 -80 203 -250 -105 173 70 100 -359
4778c59N43j46J09k87K11K9r8K69o49O41l25L82l99Q4j13Om4J38K12j23n01J12
$$ -359 184 38 147 -140 71 100 2 271 -378 263 -62 320 -79 5 -108 -102 -146 -8 204 81 -420 -308
4800c08N13m6j42PK16k87j76M16l01j76L01r7L32j1j22k10J41jK25n92M83k57
$$ -308 205 159 17 24 240 -47 -223 193 -108 -284 17 -80 252 241 119 -91 50 49 274 -318 165 -92
4822i2p8J89J93k83L9j56J17M52p11O11o27P6J72M9K39k87K8l7k55k8L31q6J48
$$ -92 -170 19 212 -71 -32 -188 -71 381 -330 281 -346 -270 -98 -49 190 -97 -69 -106 -361 -389 -58 -144 4
4845DJ40n46L87K87j58k72K98O7k21k12N5p9J67k17J62M44l69R6J22n4kj2j33
$$ 4 144 -402 -15 272 114 -158 140 207 -14 -226 -171 -250 -83 -300 -138 306 -63 33 155 101 99 87 -46
4868d6J42k22n4K13p5j74J43j15N13m09j41M74r0nMJ08k65j61K78l27J37J09k91
$$ -46 96 -126 -180 33 -42 -216 -73 -188 325 -84 -225 249 159 154 158 266 1 -160 118 -209 -72 37 -254
4891b54K47o2jK63l50k38N34j90l2L30m21RK30r0M8k32L10k21O9j84J09k1J21
$$ -254 -7 -69 -70 193 -157 -395 139 -51 -83 247 -174 -165 65 -25 23 -209 101 -120 -51 -235 -126 -147 -26
4914b6L3j02J77J05m50K35J51k14L7j07L36j63j39K77j75K53n20L15K58l94j40
$$ -26 7 -95 82 187 -263 -28 123 -91 -54 -161 175 12 -127 150 -25 228 -292 23 281 -113 -253
4935b53L70Q5k74j04p3n9M15O5k33k12L82j32j24M60k62K54l29L09k42j17j68
$$ -253 117 202 -72 -176 -249 -308 107 172 -61 -273 109 -23 -147 313 51 305 -24 285 43 -74 -242
4956b42K38j84L31m1k41N45r5J37n04p5K11K29k61j84J17q6J67k56K61Jk85R3
$$ -242 -4 -188 143 102 -139 406 311 448 -56 -131 80 309 48 -136 -19 -105 62 -194 67 68 -217 -124
4978a24k32j0l48M97j5L0N95n86j58K02j06L54q6N23l63l52n2J83Q2l40O66l04
$$ -124 -356 -366 -714 -217 -232 -202 393 -193 -351 -149 -255 99 13 536 173 -179 -231 -48 34 -306 360 56
5000E6j64k52k01N16m7J93m2l08M73l79L13n58J96L92k48L4Rj36l3K4K36K37p44
$$ 56 -108 -360 -561 -45 -92 101 59 -249 224 -155 158 -400 -204 188 -60 -26 -17 -153 -186 -162 74 311 -433
5023d33O15L36m53l82K83l65M56k63L46j33J61l02J17m2K56j68k21N08m12j70
$$ -433 182 518 65 -317 -34 -399 57 -206 140 7 168 -134 -17 -59 197 29 -192 316 -96 -266
5043b66N63k15k87J36o3K18L78o68J64j55L33r7j05L07l01j54k31N36J95k2l35
$$ -266 297 82 -205 -69 -132 86 464 -204 -40 -195 138 41 -64 243 -58 -212 -443 93 288 266 -69
5064f9M00m08R4j97M71k98J31j80j92J25M2M1L83m62L72k97k2j67j4N01m99L47
$$ -69 331 -77 17 -180 291 -7 124 -56 -248 -123 -81 -40 343 -119 253 -44 -66 -233 -247 254 -245 102
5086A02j98M41n39L61o39M0N49j41L6J22J41j94k41Q1J01J85n11m1J39L68o5l
$$ 102 -96 345 -194 167 -472 -432 117 -24 12 134 275 81 -160 -79 22 207 -304 -345 -206 162 97 94
5108I4nJ50j1o2Q8j55o8l91M95n39Q06o48M77k31L85m73K64l68L30J12k26J16
$$ 94 89 239 228 166 254 99 31 -360 135 -404 402 -246 231 0 385 -88 176 -192 138 250 24 140
5130A40l04L23m01L82l24L4j04L28k5j60K07k44J16J10j63m5J42J10j48L51o02
$$ 140 -164 159 -242 140 -184 -150 -254 74 49 -111 96 -148 -32 78 -85 -130 12 122 -26 325 -277
5151b77L01j80K73k25l4L27l65J37K38l82Q3L61k24L71o03j67K52J71j29k91L63
$$ -277 24 -156 117 -108 -142 185 -180 -43 195 -187 -104 257 33 404 -199 -366 -114 57 -72 -363 0
5172@N4J1p4n2L6J27j15p4K18l75M13o11L34K01l00N68o97M18j08q6k9p2q0%K08
$$ 0 54 65 -9 -61 -25 102 -13 -87 131 -244 169 -442 -108 93 -207 361 -336 82 -26 -112 -141 -213 -293 -293 -85
5197h5L8j76K34k60L97N1p4l6j73L04m23k8L37%j72q8K45L37l13j71K42j51j87
$$ -85 -47 -223 11 -249 148 199 125 89 -84 220 -203 -231 106 106 -66 -154 91 428 115 -56 186 35 -152
5220a52R7NJ3J03j40o3K22r1k89K34L6K74j45j45j04K34p7k94K59J67l07K89k15
$$ -152 -55 -50 -37 66 -74 -137 85 -6 -295 -61 -25 249 104 -41 -145 89 12 -282 -23 144 -163 126 -89
5243h9j03J30K39J18k19k48J23J0j25O08N4l68k67L13l98L07l23K75l19N79n28
$$ -89 -192 -62 177 295 76 -172 -49 -39 -164 444 498 130 -137 176 -222 85 -238 37 -282 297 -231
5264b31K13P36o78K6J36j35j41L02j6m30K94L44k09k99J52P1m85K59R5Q1k53R0
$$ -231 -18 718 40 66 202 67 -74 228 212 -218 76 420 211 -88 64 135 -350 -91 4 85 -168 -78
5286g8P4J71Mj38J51l90Q2j63J04K4j23N31j49k80J15j14K47J31k85N5l85L16
$$ -78 -4 167 171 33 184 -206 -124 -287 -183 -159 -282 249 100 -180 -65 -179 68 199 -86 -31 -416 -100
5308a00J41J43m85K46k93L62K11n04O69J86p88J12k2K57J65l16J69j12l10K98
$$ -100 41 184 -301 -55 -348 14 225 -279 390 576 -212 -100 -122 135 300 -16 153 41 -269 29
5328B9J3M3P1j94K42j9l1o27L42J7N0l08N92m4J80j09l8n6l02K08N0M9J19j78
$$ 29 42 85 156 -38 204 185 154 -473 -131 -114 -64 -372 220 176 356 247 209 153 -149 59 109 158 277 99
5352I9j95K2j44N43p2o04J27L04K7k28k15M65J4k87o4M92J30l42m55Q54m92K37
$$ 99 -96 -74 -218 325 253 -351 -224 80 107 -121 -336 129 143 -144 -208 284 414 72 -383 471 -21 216
5374B16j55N07k75r2o06M22J59q3J01N4k87l6r6M94j72k25J53J92K28p75R6L85
$$ 216 61 568 293 201 -405 17 176 93 194 248 -39 -75 -171 323 151 -74 79 271 499 -276 -180 205
5396B05k16n3J77l13K17P2j12j64K67j91L05j73K91m45L24Mk44K42l71J69k91
$$ 205 -11 -64 113 -200 17 89 -23 -187 80 -111 194 21 312 -133 191 195 -49 193 -178 -9 -300
5417c00K58k23l6L33m2j30L43r6j48j59L15M81l72k77P5l45K98J35j8k18j75M16
$$ -300 -42 -265 -301 32 -10 -140 203 107 -41 -200 115 596 224 -53 22 -323 -25 110 92 -126 -301 115
5439A15j13n1J75j39k82K87J42l00L27o7K5j75j35K76j44QJ96l75J11j46M15k16
$$ 115 2 -49 126 -13 -295 -8 134 -166 161 94 119 -56 -191 85 -59 -51 145 -230 -119 -265 150 -66
5461f6kL50l42L53j58J92m65J56j40L9K82k75j58L33j70J2r3O33q27M28N4O2m97
$$ -66 -68 282 -60 293 135 327 -138 18 -122 -83 199 -76 -234 99 -71 -59 -152 481 -346 82 136 198 -299
5484b99K47J37J40J29l71J32j52N2j18J71O1k97M25R0j84m10L59m10J99J82J95
$$ -299 -52 85 225 354 -17 115 -37 15 -103 68 129 -168 257 347 163 -247 112 -298 -99 83 278
5505B78j60k57K43k58J53p3k70K10k35M46k07J96j63J24l48K65R1K01J5j32n0
$$ 278 118 -139 104 -154 -1 -74 -344 -134 -369 77 -130 66 -97 27 -321 -56 35 236 251 119 69
5526F9m14N20m36J89pPL35p7l34N15k48N3j45Rl55J51K19j44J83k5j28jkj32L
$$ 69 -345 175 -261 -72 -79 -72 263 186 -148 367 119 172 27 36 -319 -168 51 -93 90 65 -63 -64 -66 -198 -195
5551a95K41J46l55n7Q3K82o7k32L06j54l75K55M09k70k41J33L11l02L41Q6j34
$$ -195 46 192 -163 -220 -137 145 78 -154 152 -2 -377 -122 287 17 -224 -91 220 -82 259 345 211
5572B11j20J12n5P9O6k47P5k04p1m7J60M75j01k13K19m2l09R8J81k06M9l69J92
$$ 211 91 203 148 227 293 46 121 -83 -154 -201 -41 434 333 120 339 297 -12 86 267 61 110 -259 -67
5595f7J94o12L79L84k68j62o4M4k2Q9m0J85M8m32J4K18M54k66K67o63N8M69n22
$$ -67 127 -485 -106 278 10 -152 -216 -172 -194 -105 -145 40 88 -344 -330 -112 342 76 343 -320 -262 207 -315
5618c15K61J57m45L53K66m2l38J08j6l7K90L5j93j20J58k02L9K9Q3j57M2J17j09
$$ -315 -54 103 -342 11 277 235 -103 5 -11 -48 242 277 84 -36 122 -80 -41 -12 71 -86 -44 73 -36
5641c6l21J59%p9q6M84m95M40r9K14l32K46J13j56J18q3j5q5j53l09N49j59J66
$$ -36 -357 -198 -198 -277 -363 121 -374 66 -33 181 -151 95 208 52 170 87 72 -13 -166 -475 74 -85 81
5664H1j22r2m8K48n5j72J52P2N0p4k20K62J47k38R3r3J14o8O7J36n36J19J14J59
$$ 81 -41 -133 -181 67 12 -160 -8 64 114 40 -180 82 229 -9 84 -9 105 37 104 240 -296 -177 -63 96
5688I6r6J20k23k17K57j0R2K15l80K37L4j43N3m92L26L87k80P2k6j99k1K08L58
$$ 96 0 120 -103 -320 -63 -73 19 234 -146 91 125 -18 35 -457 -131 256 -24 48 22 -177 -198 10 368
5711C68l57ML9l6k36PP7j02R3J30m52M64J35k20K21j77P96o85O6k35p7K68l8K18
$$ 368 11 15 54 18 -218 -211 -134 -236 -143 -13 -465 -1 134 -86 135 -42 754 69 135 -100 -177 91 53 271
5735B71j39J13m70J12o4Q5J92k83J64j63L95l07J97j5j52j46M7k21O46l8k63J5
$$ 271 132 245 -225 -113 -177 -92 100 -183 -19 -182 213 -94 103 88 -64 -210 -163 -384 262 224 -39 -24
5757b4K12N8l21J63k69K6L28k39l87J91L17k08p9K76k3L0K7k95L31K50m19j87
$$ -24 188 246 -75 88 -181 -155 173 -66 -453 -262 55 -153 -232 44 21 51 78 -217 114 364 -55 -242
5779b42R1K5M3j40L10J3J6j75j48J23L42m34J62K78ol14j9L29l28J09j75q1M42
$$ -242 -151 -126 -83 -223 87 100 116 -59 -207 -84 258 -176 -14 264 258 -56 -75 254 -74 35 -140 -221 221
5802B21l67m4p6O63j78k1l23N39n19J73N2j57r4J36j91M73m55P5j18J1J83R4Q1
$$ 221 -146 -190 -266 397 219 198 -125 414 -105 68 120 -37 -131 5 -186 287 -168 -93 -211 -200 -17 77 158
5825A58l69J10O0R8P9O3k42L3K13k28o7Q4k59J96l24K93K08J26l06M20n04k5L58
$$ 158 -211 -101 -41 57 136 199 -43 -10 203 -25 -92 -8 -267 -71 -395 -102 106 232 -74 346 -158 -183 175
5848A75k14J7L36m83L76m45M30km43Q0J64k84L09k26K07j77K78L10l71j14j89
$$ 175 -39 -22 314 -169 207 -238 192 190 -253 -173 -9 -293 16 -210 -3 -180 98 408 37 -77 -266
5869b66K60j12J33q5j21K84j40l17K62J06r7L4L21p66N80J96k99q5K3O5r3O3K34
$$ -266 -6 -118 15 -70 -191 93 -47 -364 -102 4 -93 -59 262 -504 76 272 -27 -112 -89 -24 -117 -54 180
5892A80j47j87Q1N1k1R8j24L71l68n6M62k36K3l00J22J24k41J44j55Q4j91j77
$$ 180 33 -154 -73 -22 -43 55 -69 302 -66 -122 340 104 127 -173 -51 73 -168 -24 -179 -95 -286 -463
5914d63K41K05l6l22J56L05K21j74j42l70N36n41P51m09K32k18l5L76k03J10p0
$$ -463 -222 -17 -53 -375 -219 86 307 133 -9 -379 157 -384 367 -42 190 -28 -63 313 110 220 150
5935A50o0j21n3J78pj13j14J8K7j79K95k98L59q6Q8l07K63j44j32N0K49k23K27
$$ 150 90 -31 -84 94 87 -26 -140 -122 -95 -274 21 -277 82 -4 84 -223 40 -104 -236 -186 63 -160 67
5958F7P5l96L68o3J20j06m37K84l84P36k08j14j27K0P3j1O3j18R6N9J65k43j16
$$ 67 142 -254 114 51 171 65 -372 -88 -472 264 56 -58 -185 -165 -92 -103 -40 -158 -62 -3 162 -81 -197
5981a97P7K27j69K32l53j02L35j96n2j8J14o0J39k58M23j77p9J46k98L83k57K37
$$ -197 -120 107 -62 170 -183 -285 50 -146 -198 -216 -102 -162 -23 -281 142 -35 -114 32 -266 117 -140 97
6003I7l00N69l41r1J6l71R17l22k06K02m79N53j24j37J82l55M57m60k56K88m1
$$ 97 -203 366 25 -66 -50 -421 496 174 -32 170 -309 244 120 -17 165 -190 267 -193 -449 -161 -202
6024b02j84O17k92j05M00m54J6L47J03j77K21l92J83q6o8L21N9J5J15o91L62k26
$$ -202 -386 231 -61 -166 234 -220 -204 143 246 69 290 -102 81 -5 -73 248 307 322 437 -254 108 -118
6046a18L85m76L47l17J58K84l92K41k50J9j1J1J15l8J16J81n08L90j56K48k64
$$ -118 267 -209 138 -179 -21 263 -129 112 -138 -119 -130 -119 -4 -42 74 255 -253 137 -19 229 -35
6067c5K70Q2n20N0J63P5j13lo6K51m30J89j41K91L2l39K68K31k47k16M00q9n9
$$ -35 235 317 -203 -153 10 85 -28 -31 -97 154 -276 -87 -228 63 95 -244 24 255 8 -208 192 103 44
6090D4jj2j42Q0j22K25n2j58j8Q7L28j49j30J73l48L81j36r7J04m61L58m55M90
$$ 44 43 31 -111 -31 -153 72 20 -138 -156 -69 259 110 -20 153 -195 186 50 -47 57 -404 -46 -501 -11
6113a1j17m40M29r3K36j3J08p3L5k08K21k15J33k62M86o1k90P4q2L0k2k25K1K54
$$ -11 -128 -568 -139 -232 4 -9 99 26 61 -147 74 -141 -8 -270 216 155 -135 -61 -143 -113 -135 -360 -339 -85
6137h5K00j76K43l17j03O18m38K3j10L40k02j38J91m6j13L66j80J12n11L24K71
$$ -85 115 -61 182 -135 -238 380 -58 -35 -145 195 -7 -145 46 0 -113 253 73 185 -326 -2 269
6158B69n25K82l3j85M3J33N1J33k44j96L42j34k9M03n97k30J85M97o9k81L31j82
$$ 269 -256 26 -7 -192 -149 -16 35 168 -76 -272 70 -64 -93 310 -287 -517 -332 165 96 -185 146 -36
6180c6N4o6j10L56k89J26r7K0R4p1j95M8J36j06L24k97o6K3L4m0J38N2M69k43
$$ -36 18 -48 -158 198 -91 35 -62 -42 52 -19 -214 -166 -30 -136 188 -109 -175 -152 -118 -158 -20 32 501 258
6204B58L4l8k82j44j28K42k20N11k04l42N03j32l1j17J06j52J06j36j27N07k81
$$ 258 292 254 -28 -172 -300 -58 -278 233 29 -313 190 58 27 -90 16 -136 -30 -166 -293 214 -67
6225f7k8J73l97K60j17L93j07j59k08K10M32k39k49J18l55M64Rm5j98k36J70O2
$$ -67 -95 78 -319 -59 -176 217 110 -49 -257 -47 385 146 -103 15 -340 124 133 88 -110 -346 -176 -114
6247a14K85l47L14k52l98M86L05j9n26J23M0M22k63J03Q0k87K68j33p4O6k66J29
$$ -114 171 -176 138 -114 -512 -26 279 260 -266 -143 -103 319 56 159 239 -48 220 87 13 79 -187 -58
6269e8o8J28J93j5n67M35Ln0Q8Q7l99L41k53J27J4l43J41K24M56m67J6M92l85
$$ -58 -126 2 195 180 -387 48 51 1 89 176 -223 118 -135 -8 6 -337 -196 28 484 17 33 525 140
6292A40op4j21O2j18k30M30l41l1N4N04k3j63nk70O8K82k24n3K23K5n6m18L72
$$ 140 134 60 -61 1 -117 -347 83 -258 -289 -235 269 246 83 78 -192 -124 158 -66 -119 104 129 73 -345 27
6316B7j1O0j57P0j46o3K94L3m9k1P3k83O8j18L57l30O5M7L78l04Q1p5k53J42J19
$$ 27 16 76 -81 -11 -157 -220 74 107 58 37 110 -173 -105 -223 134 -196 -131 -84 294 -10 71 -4 -257 -115 4
6341DL8J85m57N6J57J15q0j44j24P25m82j83K8K31l50J06P63p63J29K61o13L69
$$ 4 42 227 -230 -174 -17 98 18 -126 -250 475 -7 -190 -162 69 -281 -175 588 -175 -46 215 -398 -29
6363b9Q5Q0M1j13J87l22J18J95j88j51q6J19Q1l89M31N9K2l38J67J75l47M33J38
$$ -29 56 136 177 64 251 -71 47 242 54 -97 -183 -64 17 -372 59 118 140 -198 -31 144 -203 230 368
6386C68o39MQ0L92k92OQ3m72L11K86m90L82L4j66L45o2L4l72K85p3M3j51L74n26
$$ 368 -271 -267 -187 205 -87 -81 2 -470 -159 127 -363 19 53 -113 232 170 204 -168 117 44 87 -64 310 -216
6410b16J38l9j63K45p1K20n1q8k51K0L13j79%q7K89j75r9P3Q3L39j97n9K9j61
$$ -216 -78 -117 -280 -35 -106 114 63 -25 -276 -256 57 -122 -122 -209 80 -95 -194 -121 -38 301 104 45 74 -87
6434h7j59O4MM39k26m54L21j14K16j62p5L15J29O1l06L27o8j97K55l65m3K16l29
$$ -87 -246 -182 -178 261 35 -419 -98 -212 4 -158 -233 82 211 272 -34 293 225 28 283 -82 -125 91 -238
6457b38K4J75j01K61k65O2P6J65j99j80N89n45J11K09R5o51M02J61j45J91mj89
$$ -238 -214 -39 -140 121 -144 -82 -6 159 -40 -220 369 -176 -65 144 239 -412 -10 151 6 197 193 4
6479Dj21K74k16j84J25r5K8K73l43L24M03n00J59k57K54o8k62M54j20k53L16k92
$$ 4 -117 157 -59 -243 -118 -213 -185 88 -255 69 472 -28 131 -126 128 60 -202 252 132 -121 195 -97
6501i7l4K16L4n1K81K9m96j29J85K98P9l6l46L03m37L13J90k78P3p1l46L99J65
$$ -97 -131 85 119 68 349 378 -118 -247 -62 236 315 279 -67 236 -201 112 302 24 97 26 -320 79 244
6524B44m75N8M70j60J34m91J32k83M42l11l5K79l55J59j47j06O45k33K18J3k38
$$ 244 -231 -173 297 137 271 -220 -88 -371 71 -240 -275 4 -351 -192 -339 -445 200 -33 185 198 -40
6545d0k74JM5l8m7M48k73K13J9k1K7n4k1J97l09L64j19J41p62L58N38j56k27r1
$$ -40 -314 -313 -268 -306 -353 95 -178 35 54 33 60 6 -15 182 -127 237 118 259 -503 -145 393 237 10 -81
6569h1q6N9j51J67j76P5R7J9l14K65J47J82l37K75p2q7Qq8n6K72j76J1M8K09J36
$$ -81 -167 -108 -259 -92 -268 -193 -96 -77 -391 -126 21 203 -134 141 69 -18 -10 -98 -154 118 -58 -47 1 210 346
6594C46l83J81l28nj24K35k43J9N53J79k84l03M04m45K01o3J87K51k77N8j10j98
$$ 346 -37 144 -184 -189 -313 -78 -321 -302 251 430 146 -157 247 -198 3 -60 127 378 101 159 49 -149
6616a49L68n81J12Q6K33k6j51J58m86P3L32K2J05j81k2J78l12r%K68j53j0o6J63
$$ -149 219 -362 -250 -164 69 43 -108 50 -436 -363 -31 -9 96 -85 -107 71 -241 -250 -250 18 -135 -145 -211 -48
6640d8k98J83L09r3O1R5l20l99j1N41j03j84K57Nk27K69j22P0L56l29m2k21K40
$$ -48 -346 -163 146 53 114 209 -111 -510 -521 20 -83 -267 -10 -5 -232 37 -85 -15 341 12 -30 -251 -11
6663a1n5j05K89J84m79K19K2K12j26m17J33K42k5j09m62M59K76k37j71L31q7K2
$$ -11 -66 -171 118 302 -177 42 64 276 150 -267 -134 108 83 -26 -488 -29 247 10 -161 170 83 105
6685A05m21J1K42o0L64J77q6j86K9o0K64o74K9K14j57L21k78L15K28k86m70J60
$$ 105 -316 -305 -63 -123 241 418 332 146 175 115 379 -295 -266 -52 -209 112 -166 149 377 91 -379 -219
6707b19K97J65j46K3k82m8p0nM32m98K3L83l28L26k0m1J97j12l92M7j70L24M01
$$ -219 78 243 97 120 -162 -210 -280 -285 147 -351 -328 55 -273 53 33 -8 189 77 -315 -268 -438 -114 287
6730B87m21J39j63N4q7J30O33k93j80j22k4M1j39L73l59L03l58M1J23r7R0j3j73
$$ 287 -134 5 -158 -104 -191 -61 572 279 99 -23 -47 -6 -145 228 -131 172 -186 -145 -22 -119 -29 -42 -215
6753b15N09m94K43j48L77n03L33M37m84N77q92R5K44k12K19j79K82j10j42J98
$$ -215 294 -200 43 -105 272 -231 102 539 55 632 -260 -165 79 -133 86 -93 189 79 -63 135
6773A35L9k51N15l28J0j26j45J43l01K92k69N47o72N48M7n9j67K28k11m7M6p8
$$ 135 174 -77 438 110 120 -6 -151 -8 -309 -17 -286 261 -411 137 184 125 -42 186 -25 -72 -26 -104
6795a04Q8j20N66o88K48p8R0j71J93M7k15o0J76K43n12K73J22j95k7O40m59j54
$$ -104 -16 -136 430 -258 -10 -88 2 -169 24 71 -144 -204 -28 215 -297 -24 98 -97 -124 516 57 -97
6817i7k0L4m4J61j26K18L6o3J30kk66q7M0J8Q1j71qO6Q4p7K55R1k95R1Jn4K30
$$ -97 -117 -83 -127 34 -92 126 162 99 229 227 -39 -126 -86 -68 13 -158 -166 -100 -16 -93 162 253 -42 49 50 -4 226
6844B26m51J10n4Q7J76k26J77j96NQK44j32j80N18m50jJ88l42M20K92o44l4M85
$$ 226 -225 -115 -169 -82 94 -132 45 -151 -146 -138 106 -26 -206 312 -138 -139 49 -293 127 419 -225 -259 226
6867B26m8J72m36L88j32k21K06k23j58O39l48j23OJ62J81k57O6J73j27k57L99
$$ 226 178 350 -86 302 170 -51 155 -68 -226 413 65 -58 -52 110 291 34 100 273 146 -111 288
6888B88j87kk34M99n08L06J85l18j63L75j26q8j38n9P05n98J40K97m22J53k37
$$ 288 101 99 -135 364 -144 162 347 29 -134 241 115 27 -111 -170 535 -63 77 374 -48 105 -132
6909a32j50K04J12n3K94k09l89M58Q9j33o1r3M2L23k29K8k6j15MJ98l49J75j38
$$ -132 -282 -78 34 -19 275 66 -323 135 224 91 30 -63 -21 302 73 101 75 -40 -36 162 -187 -12 -150
6932a50p6K63nl4k64M49j37J66k87k11J65n05N57j15L52r2k60J82l73Q27l05l41
$$ -150 -226 37 32 -2 -266 183 46 212 -75 -286 -121 -626 -69 -184 168 76 -184 -2 -375 452 147 -194
6954a94Q2R6k9j13J38R8j44j9k64L41k55L10j48M44j02n55J94k0O35k55j46K91
$$ -194 -112 -16 -45 -158 -20 78 -66 -85 -349 -8 -263 47 -101 343 241 -314 -120 -140 495 240 94 385
6976C85l58j55K37o6O4L76n23j32L31j72j31O1J41k71o5M51j27J22m3k12j10O33
$$ 385 27 -128 109 43 107 483 -40 -172 159 -13 -144 -83 58 -213 -278 173 46 168 125 -87 -197 436
6998D36l34J86j27l29o2J85n7J11q3J95M5l24K29j87q8J72M5l84N02o05Q37l60
$$ 436 102 288 161 -168 -230 -45 -102 9 -74 121 166 -158 71 -116 -204 -32 13 -371 131 -474 363 3
7020Cn2K01O3Pn1k05nM7J4K52j70j05o3o6J49m65N08j35K28k46J36n4K28j30l0
$$ 3 -49 152 215 222 171 -34 -39 8 22 274 104 -1 -64 -130 19 -446 62 -73 155 -91 45 -9 219 89 59
7045E9l37J27M4K33j34L31k92j63J98k47J1r7Q4N4J46n1K9q0Q5L6M66m23q5r7
$$ 59 -278 -151 -107 126 -8 323 31 -132 66 -181 -170 -267 -183 -129 17 -34 -5 -85 0 36 502 79 -6 -103
7069a03j36K94j6R7j22k34R3j75O87q08M57k32R1J74P4k1k47L88l71J84P7j94
$$ -103 -239 55 39 136 14 -220 -127 -302 385 -423 34 -198 -107 67 141 120 -127 261 -110 74 151 -43
7091d3J70K8j11K24l99Q8J68K1l09L45l46J50j44J55k13R5M89m20j05L76j79K73
$$ -43 127 155 44 268 -131 -43 125 146 -163 182 -164 -14 -158 -3 -216 -121 368 -52 -157 219 40 313
7113C13m81o9L47Q0m78o1K43K36p9r4P8m70L50L65m08P8J69p1M22o39J6J19p2
$$ 313 -168 -237 110 190 -288 -349 -106 130 51 -43 35 -435 -85 280 -128 -50 119 48 470 -169 -153 -34 -106
7136a06J79J04k3R8l53L2j70L01m9L03k08k75R9J13R3k26Q1Q8l30J63Q5m75Q09
$$ -106 73 177 154 252 -101 -69 -239 62 13 316 108 -167 -68 45 138 -88 -7 81 -249 -86 -1 -476 333
7159C33m51j78L08j89J29q3j75k1K25J93J64k36J14J34l67J52l8M07m15k93p0
$$ 333 -118 -296 12 -177 -48 -131 -306 -327 -102 91 255 19 133 267 -100 52 14 421 6 -287 -357
7180c57P53n3J51l92l82L77K2m4QK14K05n11j11L06j8j8j72K62m85j60M58l18
$$ -357 396 343 494 102 -280 97 119 75 83 297 502 -9 -120 186 168 150 -22 240 -245 -405 53 -265
7202b65K59KJ71k63J41j15QQJ66j22p9J49L8l27m1L14q0n4M04j76m28L13K87J28
$$ -265 -6 -4 167 -96 45 -70 -62 -54 112 -10 -89 60 98 -229 -270 44 -36 -90 314 138 -290 23 310 438
7226D38m89k5J31l08K9K78l29J48J61L53m68K10q6P2j2k44J17Q4N6l0l2q9K3l02
$$ 438 -51 -76 55 -253 -224 54 -275 -127 34 387 -81 129 43 115 103 -141 -24 60 116 86 54 -35 -12 -314
7250c14M56j0K30o27M83N5n89J71L71m61K00j80L04j56k4n6K63l11L12l97K23
$$ -314 142 132 362 -265 218 273 -316 -145 226 -235 -35 -215 89 -67 -91 -147 116 -195 117 -280 -57
7271e7J56K4j02L7J71k16j83o5K37R8k52M76k99j50O9K19l83k7r1M10k24R5L23
$$ -57 99 123 21 58 229 13 -170 -235 2 100 -152 324 25 -125 -56 163 -220 -247 -338 72 -152 -57 266
7294B66k68K07k94p2J1L39m89J99P8J9K8J65P4l00R7J27l13o8K64n05J11P74o23
$$ 266 -2 205 -89 -161 -150 189 -300 -101 -23 -4 24 189 263 -37 60 187 -126 -194 70 -435 -324 450 -173
7317a73j55P2N82n64j12R5K35R3l37O4J93J59m2Nl10M17J8j29k12M6L69m28L71
$$ -173 -328 -256 326 -238 -350 -255 -20 73 -264 -200 -7 152 110 115 -195 222 240 111 -101 -55 314 -114 257
7340B57k08m52N06J38q3J00K0q8n05L47K93n74K50m37P97m50N45l52J08l39L1
$$ 257 49 -403 103 241 158 258 278 190 -315 32 325 -249 1 -436 361 -89 456 104 212 -127 -96
7361i6j51K15K59l44J43j14L38p08M69o6r9K71M3o66J12O06j88K58j52K28p52
$$ -96 -247 -32 227 -117 26 -88 250 -458 11 -55 -154 117 160 -506 -394 212 24 282 130 358 -394
7382c94M2L22J29J21n2kJ8l28O28l34l47K80r6Q0j06K22l09M40l64K28k23j00
$$ -394 -352 -30 99 220 168 166 184 -144 484 150 -197 83 -13 67 -39 183 -126 314 -50 178 -45 -145
7404a45l46L07Q2K27l15K0o2L27j44L31j43j42k83K20M16l24L6k0o2j2j84J57
$$ -145 -491 -184 -102 125 -190 -170 -232 95 -49 282 139 -3 -286 -66 350 26 62 42 -20 -32 -216 -59
7426e9J26q6J9j08L50l81J73m2J98m27J79K37p2N0j01m4J55k50%K6K0m0K56R3
$$ -59 67 -19 0 -108 242 -139 34 -8 190 -237 -58 179 107 157 56 12 167 -83 -83 -57 -37 -77 179 272
7450B72l06l33N44l75M01J4k76J75l1J94o33N08q4l52J62N5n21O22J07l28K61
$$ 272 -34 -367 177 -198 203 217 -59 116 85 279 -354 154 70 -282 -120 -65 -586 36 143 -185 76
7471G6j1qj8R7l58K98K8k94J35K8K4j57M8O8l15Q0L45j01Q7l10P6J05P6K80j31
$$ 76 65 57 39 136 -222 76 104 -190 -55 -27 -3 -160 -112 -44 -359 -279 66 -35 52 -258 -182 -77 -1 279 148
7496A48J20l61J38L20j18j61l39j7j03M75J82K02k70l70J93K42n83K80j66K72
$$ 148 268 -93 45 365 247 86 -253 -270 -373 102 284 486 216 -154 39 281 -302 -22 -188 84
7516H4n21M43K29k46mk09O50q89L33K47o40M85K0K12n2K4j8mp1j49r6J12k29N40
$$ 84 -437 6 235 -11 -15 -224 426 -463 -130 117 -523 -38 -18 194 142 166 148 144 73 -76 -172 -60 -289 251
7540B51m90o1K9K98O5j38k11K79j09O29l17p6j84P8o0m54N05j5lJ14p5l7P7q9
$$ 251 -239 -300 -271 27 92 -46 -257 22 -87 542 225 149 -35 43 -17 -471 34 19 16 130 55 18 95 6
7564Fj90J54L42m20j64N29n68J60K04m09N48k3l19k08J24L17j71m0J36Q9J21r1
$$ 6 -184 -30 312 -108 -272 257 -311 -151 53 -356 192 169 -150 -358 -234 83 -88 -128 8 97 218 127
7586A27oo1nk8k81N31m73NK76m38P24l64j21M37n08L66k26n1K15j04L25o02L97
$$ 127 121 60 55 27 -254 277 -196 -191 85 -353 371 7 -114 323 -185 181 -45 -96 119 15 340 -262 135
7609A35q9p9l37L62j55M23j63l1K00m84J67o7N20j46j75k14K69j05L9j76m9j25
$$ 135 46 -33 -370 -8 -163 260 97 66 266 -218 -51 -118 402 256 81 -133 136 31 70 -106 -155 -280
7631b80M25j9J11m93O3J44j50N8L49l17K69j70K02j27k83L87l39N51l16J72n01
$$ -280 145 126 237 -256 -193 -49 -199 -141 208 -109 160 -10 192 65 -218 169 -170 381 65 237 -264
7652b64N17l84M8J07j29L67k23j3j2j60q3J5K41j78J09K13m63N14j84J8q4q1J81
$$ -264 253 -131 -83 24 -105 262 39 26 14 -146 -229 -214 27 -151 -42 171 -292 222 38 56 -28 -109 72
7675G2j51qR0J14k01j29K21R7J7r0J26k36%L42k47j15k3L44O5j23o6l44R9j6M22
$$ 72 -79 -87 3 117 -84 -213 8 105 122 32 158 -78 -78 264 17 -98 -121 223 288 165 99 -245 -146 -162 260
7700B60j8q8R1m52J58j04J73q2l55N24j17jQ2J10j86K95j02k01M49o00Q0K14K78
$$ 260 242 154 245 -207 -49 -153 20 -62 -417 107 -10 -11 71 181 -5 290 188 -13 436 -164 -84 130 408
7723D08k22q3q1j1l82K89k27L64K10l36rj67K90k01Q2J11r0k5j6R3op9K48J64
$$ 408 186 103 22 11 -371 -82 -309 55 265 -71 -80 -247 43 -158 -76 35 -55 -80 -96 -3 -9 -88 160 324
7747C24n3K29p08NJ99K01l40N4K62J4l45J56J04K43o03K45J29l73O37o75K23M42
$$ 324 271 500 -208 -203 -4 197 -143 -89 173 187 -158 -2 102 345 -258 -13 116 -257 380 -295 -72 370
7769C70q20L54J32j44K27j8k62j99N20q5k1L89m51p8L46m90M12j73K02M9m90N7
$$ 370 -450 -96 36 -108 119 101 -161 -360 160 75 54 443 -8 -86 260 -230 182 9 211 260 -230 -173
7791a73J20M31n59K44j81j67nM70j95q3L6K14r6k00K57k75P4K29Ok39o6J6j24
$$ -173 -53 378 -181 63 -118 -285 -290 180 -15 -98 -62 152 56 -144 113 -162 -88 141 147 -92 -158 -142 -266
7814b66J84k82M88k21J45j33J00J85l93K4J56J15J25j19j88O8o7k21M3L34j57
$$ -266 -82 -364 124 -97 48 -85 15 200 -193 -169 -13 102 227 108 -80 -12 -79 -300 -257 77 -80
7835h0J84k7l06L94l93n1L40m7L11k5k82J50j25P8k70J10L33k09o4j1J98l50J72
$$ -80 104 77 -229 165 -228 -279 61 14 325 300 18 168 43 121 -149 -39 294 85 21 10 208 -142 30
7858C0K11n5J30m89K39Q5K39K2m60J18m7L03m40O9r1K57J4l61K20j30J91j63L66
$$ 30 241 186 316 -173 66 151 390 412 -48 70 23 326 -114 -45 -136 121 135 -226 -6 -136 55 -108 258
7881B58m80M28k66j51K65K17j24r4J30m27K19p4J25M3K79l99j94L77n84N41M1
$$ 258 -222 206 -60 -211 54 271 147 53 183 -244 -25 -99 26 69 348 -51 -245 132 -452 89 130
7902A30l92m9R4N6K84l42J29K4N04l70n0M2j05J3J22l76K21K20l96N9K71O6n48
$$ 130 -262 -311 -217 -161 123 -219 -90 -66 438 68 18 60 -45 -32 90 -286 -65 155 -241 -182 89 155 -393
7925c93L25m0l86N0M87j23J67k53K31J5k36J93j44R0J41j32j62L18k04K03j75
$$ -393 -68 -108 -494 -444 43 -80 87 -166 65 80 -156 37 -107 -17 124 -8 -170 148 -56 147 -28
7946b8j08J53K04k83J04j36J8j7Q6K25k54k39J67K49l55N10k94K03l49K62k30
$$ -28 -136 17 221 -62 42 -94 -76 -93 -7 218 -36 -275 -108 141 -214 296 2 205 -144 118 -112
7967a12L83j36k80M57k73O6R5pk39K45k69J38J92k74k4J9J20j13M3R1j46j34K51
$$ -112 271 135 -145 312 39 105 200 193 -46 199 -70 68 260 -14 -38 -19 101 -12 31 122 -24 -158 93
7990I3k27K62m33J35M34m59J31J85n8j08j03L67P2l49L58k30j23L19j81J01k84
$$ 93 -134 128 -305 -170 264 -195 -64 121 63 -45 -148 219 291 -58 300 70 -53 266 85 186 -98
8011i8L82O8l25o9N2K30j43n3J91k83j59J93j26L5K15n8J18k56N1k10K98j74K18
$$ -98 284 352 27 -42 10 240 97 44 235 -48 -207 -14 -140 -105 110 52 170 -86 -35 -245 53 -121 97
8034I7k0J1n41M25K42k93K24j20M02m49L8j74j70M8L71l4L44m33m15M30Nl03J09
$$ 97 77 88 -453 -28 214 -79 145 25 427 -22 16 -158 -328 -280 91 57 401 -32 -447 -17 -12 -315 -206
8057b06M59m24N26o21N45j61Ok36K0j26K42l22M09J78l34K54j89K75k88l93m5
$$ -206 253 -171 355 -266 279 118 124 -112 -92 -218 24 -298 111 289 -45 209 20 295 7 -386 -431
8078d31M59J56k0k13L3J16j2m7R9j98m3l87L76k6K75q0p0k17K2M42l55j40K44
$$ -431 28 184 164 -49 -16 100 88 41 140 -58 -101 -488 -112 -138 137 57 -13 -230 -208 234 -121 -261 -17
8101a7J23P9J22k74j6J82j7k15j19Q8k03K27j10or0K30j44q2O42l49l85M65j07
$$ -17 106 185 307 33 17 199 182 -33 -152 -64 -267 -40 -150 -156 -246 -16 -160 -242 400 51 -334 131 24
8124B4k9Jq4O3q3L08O7nl50K47j68m1O4J47O4n12K18p2k68N36j48L25l60l75J40
$$ 24 -5 -4 -88 -25 -108 200 267 262 -88 159 -9 -50 14 161 225 -287 -69 -141 -409 127 -21 304 -56 -431 -291
8149b91K14j26K04j33M40k97J27n7k46M92P7l03K4k52j38L29N3J7j48J76j87k73
$$ -291 -77 -203 1 -132 308 11 138 81 -165 327 404 101 125 -127 -265 64 117 134 -14 162 -25 -298
8171b98N99k64K1l32J05M40l09r6p9J15L33k41o9l06M92k25P1K97k29K59
$$ -298 301 37 58 -274 -169 271 -38 -134 -213 -98 235 -6 -75 -381 111 -114 -43 254 25 284
8191B84
$$ Imaginary data points
##PAGE= N=2
##DATA TABLE= (X++(I..I)), XYDATA
0@%%%%%%%%%%%%%o4J28j28J28j28J29j93K56k95L59l84M48n76O54p18Q32r61J125
$$ 0 0 0 0 0 0 0 0 0 0 0 0 0 0 -64 64 -64 64 -64 65 -128 128 -167 192 -192 256 -320 334 -384 448 -513 612
31F12j316J474j666J915k161K421k689L002l359L737m147M600n102N644o236O879
$$ 612 -704 770 -896 1019 -1142 1279 -1410 1592 -1767 1970 -2177 2423 -2679 2965 -3271 3608
47C608p590Q361r202J0144j1178J2315j3589J5017j6620J8441k0535K2969k5828
$$ 3608 -3982 4379 -4823 5321 -5857 6458 -7131 7886 -8734 9707 -10828 12141 -13687
60a3687K9253l3448L8716m5567N4872o8325Q9561j28189K20401q20519p35105
$$ -13687 15566 -17882 20834 -24733 30139 -38186 51375 -76814 143587 -676932 -1412037
71a412037K134283O51643j601246j222272J239080J294311n08154j030122L09906
$$ -1412037 722246 1373889 -227357 -1449629 -210549 1083762 575608 -454514 -144608
80a44608N32926m98735o11028O72878R06329l49622j060800r4059P78446L42518
$$ -144608 388318 -110417 -721445 -48567 857762 508140 -552660 -646719 131727 474245
90D74245m58246l07830K18680J87789k03530r7452L17525K81753k92540n14606
$$ 474245 15999 -291831 -73151 114638 -88892 -186344 131181 412934 120394 -394212
100c94212l204N20162K59131l25614l03104K12882K59678j97450k45689K47301
$$ -394212 -397416 122746 381877 56263 -246841 -33959 225719 28269 -217420 29881
110B9881K92558l11424m60308K39753N97011m2923n63588q1101M55555P1201m44611
$$ 29881 322439 11015 -449293 -209540 387471 344548 -219040 -300141 155414 226615 -217996
121b17996p3309M77140J43095m65335k12789M27347K82942l48224l12173K56103
$$ -217996 -291305 185835 328930 -136405 -349194 78153 361095 12871 -299302 -43199
131d3199K84996k10275k54861K12522K85777j78128l32740P6643L09360P4k61487
$$ -43199 241797 31522 -223339 -10817 274960 96832 -235908 -159265 150095 150169 -111318
142a11318m6239K15618Q1255j64302r1947J31461J02013j16788j39997P4039J65524
$$ -111318 -157557 58061 139316 -24986 -116933 14528 116541 -247 -140244 -66205 99319
153I9319j3594j53799j4551J56957M5767j63932q9303J55140J24290j41153j56662
$$ 99319 85725 -68074 -82625 74332 120099 -43833 -133136 22004 146294 5141 -151521
164a51521J22678J85508r8351k08400O5889K17266l9035k22798J5115K28378J7565
$$ -151521 -28843 156665 58314 -150086 -84197 133069 94034 -128764 -113649 114729 132294
175A32294k22952m9009K01175N8604j90833o4421J95898R1734j84599j17055J64727
$$ 132294 -90658 -139667 61508 120112 -70721 -135142 60756 152490 -32109 -149164 15563
186A5563J39788j36151j54188R9468J53816o8286j45231M7017J37387l0780j39014
$$ 15563 155351 19200 -134988 -35520 118296 50010 -95221 -48204 89183 58403 -80611
197h0611L350J29387K1035j13038m0157R7261N3824q1742o6051P0059Q1363n5140
$$ -80611 -77261 52126 73161 -39877 -80034 17227 71051 -10691 -76742 -6683 74680 19540
209A9540r8408L5595J16117j803j15326k7201J08150M7148r9735o4760R0576P8568
$$ 19540 -78868 -43273 72844 71041 -44285 -71486 36664 83812 -15923 -80683 9893 88461
221H8461q3623r2138P3220J05216o2957j18570M4486J23242l2572j30949J6274
$$ 88461 4838 -87300 -14080 91136 28179 -90391 -45905 77337 44765 -86184 -69910
232f9910J36477L672j35137k1912J35333M7248j20294o1782J05173P3587r0468
$$ -69910 66567 70239 -64898 -86810 48523 95771 -24523 -86305 18868 92455 1987
243A987q0519P5098Q5936o1712r1972M5151R3484l1761r7501J2500R5142K797
$$ 1987 -78532 -3434 82502 20790 -71182 -26031 67453 35692 -61809 -49309 45833 48630
255D8630r3186k0561Q7627L9866p7050n4612O4697O7734m5807p3934L1592P9114
$$ 48630 -44556 -65117 22510 62376 -14674 -69286 -4589 63145 17338 -56596 -25004 54110
267E4110j5366q0259L106Q1303R668q1670k2900P8874L4787p8080m9355P2106
$$ 54110 38744 -41515 -38409 42894 52562 -29108 -52008 26866 61653 -16427 -65782 6324
279F324O1597o5835p6811N3182Q6447l7743r2786K1208R3135n081q8225l782Q6268
$$ 6324 67921 2086 -74725 -21543 64904 27161 -65625 -44417 48718 43637 -44588 -48370 37898
292C7898J5512q0954k3790Q0352L4709p5154m8118O6005N7341n6046o6935M2291
$$ 37898 53410 -27544 -51334 29018 63727 -11427 -59545 6460 63801 7755 -59180 -16889
304a6889P1744k9588p6447J4388P6007p89p3903j3537O8917K4946o1690l2715
$$ -16889 54855 25267 -51180 -36792 39215 38426 -35477 -49014 19903 44849 -16841 -49556
316d9556N6291M2842m9221m9056M2167N7630l2304o3600K1667O8675q823p1361
$$ -49556 6735 49577 356 -48700 -6533 51097 18793 -44807 -23140 45535 36712 -34649
328c4649k935P0027J4440o8649k7777O1752L6892n5338m6677M6052N1652l7474
$$ -34649 -37584 32443 46883 -21766 -49543 12209 49101 -6237 -52914 -6862 44790 7316
340G316n5524K9869N9884k0482o2460J3287O6155l32o6353j0023O3988K2702n9882
$$ 7316 -48208 -18339 41545 21063 -41397 -28110 38045 37713 -28640 -38663 25325 48027 -11855
353a1855l2784N1993M0486m4483m7822L4723N1431k5856n4796J5883N5473p642
$$ -11855 -44639 7354 47840 3357 -44465 -9742 41689 15833 -38963 -23080 32393 24751
365B4751n7253j194N6458J0206n5045j9212N3549K9948m7359l7356M1748M4847
$$ 24751 -32502 -33696 22762 32968 -22077 -41289 12260 42208 -5151 -42507 -759 44088
377D4088l2897m9550K4955N2958j4996n5165O392N5067J455n4814j1257N0500
$$ 44088 11191 -38359 -13404 39554 24558 -30607 -24215 30852 32307 -22507 -33764 16736
389A6736J7471m9048k6074M4419L2206l9627l7579L3476M5447k5242m7938J6679
$$ 16736 34207 -14841 -40915 3504 35710 -3917 -41496 -8020 37427 12185 -35753 -19074
401a9074N1946o797n1180k281N0227J1330m6816j8674M2825K4350l8818l0245
$$ -19074 32872 26075 -25105 -27386 22841 34171 -12645 -31319 11506 35856 -2962 -33207
413c3207L2562L4986k8479m0568K1520M3792j5045m7560O146M8725K991m8110
$$ -33207 -645 34341 5862 -34706 -13186 30606 15561 -31999 -25853 22872 25863 -22247
425b2247j0678M5874J9472m1071k4108L7413L0442l1086l4076K6252L8372k0941
$$ -22247 -32925 12949 32421 -8650 -32758 4655 35097 4011 -30065 -3813 34559 13618
437A3618m1209J3909M2466q035m5101n05M3373P225m3589j4252L9114K2100l4912
$$ 13618 -27591 -13682 28784 20749 -24352 -24857 18516 25741 -17848 -32100 7014 29114 -5798
450e798k7260L0364L2255k3318l4435J7401L7326j0559l8395M852L9189J314l8269
$$ -5798 -33058 -2694 29561 6243 -28192 -10791 26535 15976 -22419 -17567 21622 22936 -15333
463a5333p183L7687J3041l5897j9823L2188K4820k8899l0936K2215L3747j5816
$$ -15333 -22516 15171 28212 -7685 -27508 4680 29500 601 -30335 -8120 25627 9811
475I811l7308J0156L8030m132l6875j524L6802P742l5358j1915L4339J8348l0893
$$ 9811 -27497 -17341 20689 16557 -20318 -21842 14960 22702 -12656 -24571 9768 28116 -2777
488b777k2150K7711K6484k3409l1273J7973L3069j2116l6303N529L5180O21l5419
$$ -2777 -24927 2784 29268 5859 -25414 -7441 25628 13512 -22791 -17262 17918 18539 -16880
501a6880o179L2803J1216l0028j5719K7875J9559k4366k2987K1181K7353j6007
$$ -16880 -23059 9744 20960 -9068 -24787 3088 22647 -1719 -24706 -3525 23828 7821
513G821k9991J1813L2543m663l3168j631L3089P168l1623j3330K8293J7002k5904
$$ 7821 -22170 -10357 22186 17523 -15645 -17276 15813 22981 -8642 -21972 6321 23323 -2581
526b581k1184K1817K3343j9330k6995J5388K9644j0479l1427O122L3533j81l2333
$$ -2581 -23765 -1948 21395 2065 -24930 -9542 20102 9623 -21804 -15682 17851 17670 -14663
539a4663n273L2063J0830k9565j4778K7674J8917k3799k2764J9388K5043j6423
$$ -14663 -19936 12127 22957 -6608 -21386 6288 25205 1406 -21358 -1970 23073 6650
551F650k8185J1529K8489o362k8846J086K9078K015k9106p316K7798J2380k4978
$$ 6650 -21535 -10006 18483 12121 -16725 -15639 13439 15454 -13652 -20968 6830 19210 -5768
564e768j6816K3169K1419j7538k4632J3592K6465q132k6950M144K7519J33k7145
$$ -5768 -22584 585 22004 4466 -20166 -6574 19891 11759 -15191 -11047 16472 16605 -10540
577a0540n014K6032P956k6573j3836K4587J8067k1533k2134J7217K5326j3017
$$ -10540 -15554 10478 18434 -8139 -21975 2612 20679 -854 -22988 -5771 19555 6538
589F538k6687P671K8332l151k7104l64K8542N381k7781r216K6114J3232k4298
$$ 6538 -20149 -12478 15854 12703 -14401 -14765 13777 19158 -8623 -17839 8275 21507 -2791
602b791j7128K1342K0657j7840k3712J3565K4096j0331k6644N617K6909p64k6998
$$ -2791 -19919 1423 22080 4240 -19472 -5907 18189 7858 -18786 -13169 13740 12976 -14022
615a4022l264K5950Q166k4223j1919K1878J5050j7310j6516J5317J9316j1793
$$ -14022 -17286 8664 16830 -7393 -19312 2566 17616 306 -16210 -893 18423 6630
627F630k1134Q199K2493n078k4006p6K4066M469k2956r990K0444J2531j8109j5807
$$ 6630 -14504 -6305 16188 11110 -12896 -12972 11094 15563 -7393 -17383 3061 15592 -2517 -18324
641a8324J4709J8720j1719j9774R716K1441n436k3167K452K4617J789k3663o039
$$ -18324 -3615 15105 3386 -16388 -6672 14769 9333 -13834 -11382 13235 15024 -8639 -14678
654a4678K3278R896k1161j4032J9015J5870j6753j8713J3556K0572j1255k2396
$$ -14678 8600 18496 -2665 -16697 2318 18188 1435 -17278 -3722 16850 5595 -16801
666a6801P105K2946m246k3192M99K3118L412k1498n844K0682R031j8930j0873
$$ -16801 -9696 13250 9004 -14188 -13689 9429 12841 -8657 -14501 6181 15212 -3718 -14591
679a4591J6515J4858j3936j5971J0345J7882p604j9296L136J8439k07j8043k508
$$ -14591 1924 16782 2846 -13125 -2780 15102 7498 -11798 -8662 9777 9570 -8473 -10981
692a0981J6517N228j5415r030J4053J1140j2547j3272J0749J6365p192j7532L896
$$ -10981 5536 10764 -4651 -13681 372 11512 -1035 -14307 -3558 12807 5615 -11917 -8021
705h021J8724J74j9409k827J9491O748j8504r000J7103J0977j6861j3869J4269
$$ -8021 10703 10877 -8532 -11359 8132 14880 -3624 -12624 4479 15456 -1405 -15274 -1005
718a005J5746j2745j7188R504J9063p798k0025M292K0398j215k0147p75K0074
$$ -1005 14741 1996 -15192 -5688 13375 5577 -14448 -10156 10242 9027 -11120 -11895 8179
731H179M972j8396o774J6345R270j4323j0972J2240J2983j0206j3349O983J3826
$$ 8179 13151 -5245 -12019 4326 13596 -727 -11699 541 13524 3318 -10031 -3048 10778
744A0778n182j5056N36J4941K134j4841m644J3311Q150j1692j0341R287J2368
$$ 10778 5596 -9460 -8924 6017 8151 -6690 -11334 1977 10127 -1565 -11906 -2619 9749
757I749o892j3186N660J5248k159j6006O0J6111L305j7282n598J6468Q174j5816
$$ 9749 2857 -10329 -4669 10579 8420 -7586 -7526 8585 11890 -5392 -10990 5478 13652 -2164
771b164j0516J3788J2476j3961j4491J1010J5551q780j6511O329J8181l541j7916
$$ -2164 -12680 1108 13584 -377 -14868 -3858 11693 2913 -13598 -7269 10912 7371 -10545
784a0545J725J6792J408j6139k392J5695M970j4154o809J2249Q768j1288j0415
$$ -10545 -8820 7972 9380 -6759 -9151 6544 11514 -2640 -9449 2800 11568 280 -10135
797a0135Q014J1607n941j1280K234J1396L7j2150k078J0708M472r908o477R761
$$ -10135 -2121 9486 3545 -7735 -5501 5895 5932 -6218 -8296 2412 6884 -3024 -9501 260
811B60Q968q282j0155O151J2004k928j3605J815J4244J302j4862l328J4174M605
$$ 260 9228 946 -9209 -3058 8946 6018 -7587 -5772 8472 9774 -5088 -8416 5758 10363
825A0363j4048p327J3130Q778j2321j0921J0752J2181r515j3398P997J3942n549
$$ 10363 -3685 -11012 2118 10896 -1425 -12346 -1594 10587 1072 -12326 -4329 9613 4064
838D064j3661L486J4924j388j4292j39J3750K282j2777l951J1884N573j0335o834
$$ 4064 -9597 -6111 8813 7425 -6867 -7006 6744 9026 -3751 -7702 4182 9755 -580 -7414
852g414P679P726o208r288M368R138k834r392r3J0048J771r703l655Q932O591
$$ -7414 265 7991 1783 -7505 -3137 6001 3167 -6225 -6318 3730 5501 -4202 -7857 1075 7666
867G666p691p573O195R150m319r950K898J1697j635j1711m37J1550K157j2462
$$ 7666 -25 -7598 -1403 7747 3428 -6522 -3624 8073 6438 -5273 -5710 5840 7997 -4465
881d465m139J1782N668j1896p449J0607Q550q932j0017Q009J0784o326j1206N172
$$ -4465 -8604 3178 8846 -3050 -10499 108 8658 -274 -10291 -2282 8502 2176 -9030 -3858
895c858J1727k804j2043J947J2146m0j1299j651J0309L521r575n186Q391N748
$$ -3858 7869 5065 -6978 -5031 7115 7075 -4224 -5875 4434 7955 -1620 -6806 1585 7333
909G333o996p348N099P994m054q552J714Q604q9q292j395Q033L635p250m875P327
$$ 7333 337 -7011 -1912 6082 2028 -6524 -4810 3794 3705 -4587 -5982 2051 5686 -1564 -6439 888
925H88O070n743p002M616Q757l649r408J841R814p41j0257j659J0302K808j0077
$$ 888 6958 1215 -5787 -1171 7586 3937 -5471 -3630 6184 5443 -4814 -6473 3829 6637 -3440
940c440m444R301N886q857o716Q037P205o525q255N426R583l869r706K708R930
$$ -3440 -7884 1417 7303 -1554 -8270 -233 6972 447 -7808 -2382 7201 3332 -6374 -3666 6264
955F264o25r655n55R604J477q673l237P512M181p096n362N613N963m518o984L107
$$ 6264 5639 -4016 -4571 5033 6510 -2163 -5400 2112 6293 -803 -6165 -552 5411 893 -6091 -2984
971b984P204j923p315N06P476J825p877k397P418M199n952n546N586O592m881
$$ -2984 4220 2297 -5018 -4512 2964 4789 -3088 -5485 1933 6132 180 -5366 220 6812 1931
986A931p139L420P794k154q950J072Q117M15q544k083Q352K968p982m498P703
$$ 1931 -5208 -1788 6006 3852 -5098 -4026 4091 4506 -4038 -6121 2231 5199 -2783 -7281 422
1001D22N472o802o007O153P113m216p820L325Q175j475q164L83P772J095p679
$$ 422 5894 -908 -6915 -762 6351 2135 -5685 -2360 5815 4340 -3824 -3441 4331 5426 -2253
1016b253k405O969L059o949m001N951M432n193n898M205O794l227o830J542P558
$$ -2253 -4658 2311 5370 -1579 -5580 371 4803 -390 -6288 -2083 4711 1484 -5346 -3804 3754
1031C754j51o981r19O737K695o256k976N493M429m994n569M648O091l591p230
$$ 3754 3603 -3378 -4297 2440 5135 -1121 -4097 1396 5825 831 -4738 -90 6001 2410 -4820
1046d820K084P110j262o899q38O973J653p082k614O663L602o170l957N357N160
$$ -4820 -2736 4374 3112 -3787 -4625 2348 4001 -3081 -5695 968 4570 -1600 -5557 -200 4960
1061D960m113n521L559O359k516o442J784O702o53o768r84O317K240o989k888
$$ 4960 847 -4674 -1115 5244 2728 -3714 -1930 4772 4119 -2649 -3633 2684 4924 -2065 -4953
1076d953N991L334n020m886M041N545l314n658K779N689j228o286J033O202Q03
$$ -4953 1038 4372 -648 -5534 -1493 4052 738 -4920 -2141 3548 2320 -3966 -2933 3269 4072
1091D072o389j070N660K837n292l796M314M397l355n496K683N549k435n449O63
$$ 4072 -2317 -3387 2273 5110 -182 -3978 336 4733 1378 -4118 -1435 4114 1679 -3770 -3107
1106c107N959m88n616n86N341K224n881k686N450M411m851m844M092N455l086
$$ -3107 2852 2364 -3252 -3838 1503 3727 -2154 -4840 610 5021 170 -4674 -582 4873 1787
1121A787n031J881O050j505o147n8O487N84o370j785N269K486n426l042M576L878
$$ 1787 -3244 -1363 4687 3182 -2965 -3023 3464 4048 -2322 -4107 1162 3648 -1778 -4820 -244 3634
1137C634l687m720L271N300k517n272K359N278n35n761l44N747J262n472j524
$$ 3634 -53 -4773 -1502 3798 1281 -3991 -1632 3646 3111 -2650 -2994 2753 4015 -1457 -2981
1152b981M224K974m151l690L397L815l057m265J935M470j096n147K87N113R85
$$ -2981 1243 4217 66 -3624 -227 3588 531 -3734 -1799 2671 1575 -3572 -3285 1828 2813
1167B813n144j358M813K597m298k743L586M463l571m144K341N054k024n360O02
$$ 2813 -2331 -3689 1124 3721 -577 -3320 266 4729 1158 -2986 -645 4409 2385 -2975 -2373
1182b373N978p33n206j055N032J520n186j904M780K681m480l236L666M247l155
$$ -2373 3605 2872 -2334 -3389 1643 3163 -2023 -3927 853 3534 -946 -4182 -516 3731 576
1197E76m826K574M638p82m505N68M859L03m629j190M639J094l995k398L840K771
$$ 576 -4250 -1676 2962 2180 -2325 -1757 3102 3405 -1224 -2414 2225 3319 -676 -3074 766 3537
1213C537l550l350J725L764j562l920J161M347l95l695q18L882J642l818j862
$$ 3537 -13 -3363 -1638 2126 564 -3356 -2195 2152 1757 -1938 -2756 1126 2768 -1050 -2912
1228b912M121K333k928l218K936L279j941m625J654M389r32m769j14M496N68m388
$$ -2912 1209 3542 614 -2604 332 3611 1670 -2955 -1301 3088 2156 -2613 -2727 1769 2337 -2051
1244b051j763M639J682m084j966L317L553l542l343L041L991k156m155J686M392
$$ -2051 -3814 825 2507 -1577 -3543 -226 3327 -215 -3558 -517 3474 1318 -2837 -1151 3241
1259C241p96m450M34L900L55l857j150L441J512k860k841K840K694k391k886J354
$$ 3241 2445 -2005 -1571 2329 2684 -1173 -2323 1118 2630 -230 -3071 -231 2463 72 -2814 -1460
1275a460L255q17l268Q12L369N50l328j700L704J768k935k345K664L115k420l275
$$ -1460 1795 978 -2290 -1478 1891 2441 -887 -2587 1117 2885 -50 -2395 269 3384 964 -2311
1291b311J714L543j735m033P98M245m16m084n69L852J184l747j818L673K414l161
$$ -2311 -597 2946 1211 -2822 -2024 2221 1805 -2279 -2848 1004 2188 -1559 -3377 296 2710 -451
1307d51k594K880L155k390l215K262L379j234l789R95L302j9l662l99L359O83
$$ -451 -3045 -165 2990 600 -2615 -353 3026 1792 -1997 -1002 2300 2281 -1381 -1780 1579 2262
1323B262l725j172L011J776k536k209J941K331r50k842P16K783J82k675o20L059
$$ 2262 -1463 -2635 376 2152 -384 -2593 -652 1679 729 -2113 -1397 1386 1568 -1107 -1727 1332
1339A332J154l013j414K765J716k116k965K075L251j867k934N53L488j017l516
$$ 1332 2486 -527 -1941 824 2540 424 -2541 -466 2785 918 -2016 -1463 2025 1008 -2508
1354b508J87L453K20l207q28L488J412l104j819K808K547k285k665K670L016k738
$$ -2508 -2321 1132 1352 -1855 -2683 805 2217 -887 -2706 102 2649 364 -2301 369 3385 647
1370F47k446J051K857p41k680m11L663m18k876p31K616Q46k446j389K327J779
$$ 647 -1799 -748 2109 1368 -1312 -1723 1940 1522 -1354 -2085 531 1377 -1069 -2458 -131 1648
1386A648j610j702R53K096m23k126L17K853o8k335p65K485Q09k055j854J962J926
$$ 1648 38 -1664 -711 1385 962 -1164 -847 2006 1938 -397 -1162 1323 2132 77 -1777 185 2111
1403B111j893j988R71K806j478k502L37K674K2l183k4L221O01l176p43K922J701
$$ 2111 218 -1770 -799 2007 529 -1973 -1636 1038 1060 -2123 -2147 1074 1675 -1501 -2244 678 2379
1420B379k628j649K184K337k311k007J793K406j174k940N62K737n95k462j49J831
$$ 2379 -249 -1898 286 2623 312 -1695 98 2504 1330 -1610 -1048 1689 1094 -1368 -1517 314
1436C14J220k474j123J817J297j183j633J251K251j058j993Q34K222k04k457j2
$$ 314 1534 -940 -2063 -246 1051 -132 -1765 -514 1737 679 -1314 -480 1742 1538 -919 -931
1452i31K040N12j932j101K045J172j822j901J795J628j460j855P41K378n03k614
$$ -931 1109 1621 -311 -1412 633 1805 -17 -1918 -123 1505 45 -1810 -1069 1309 806 -1808
1468a808K60K677Q2k522m75K842R99k612j250K463J926k460j798J987J792j366
$$ -1808 -1548 1129 1211 -1311 -1786 1056 2055 -557 -1807 656 2582 122 -1676 311 2103 737
1484G37k257J163K306j221k543J51K638J98k466m35J827P52j403j119J828J341
$$ 737 -1520 -357 1949 728 -1815 -1664 974 1172 -1294 -1729 98 850 -553 -1672 156 1497
1500A497j097j758J094J887n65k031L47K066J11k145m83K065M21j866j286J937
$$ 1497 400 -1358 -264 1623 1058 -973 -626 1440 1551 -594 -1077 988 1409 -457 -1743 194
1516A94J131j418j496N58J986o40j738K63J848N56k507K75J785N96j820o86K087
$$ 194 1325 -93 -1589 -1031 955 315 -1423 -1160 688 1244 -1263 -988 797 1393 -427 -1113 974
1533I74P99j638j073J163J455j069k045P88K224j301j725L91K000k31j865m33
$$ 974 1773 135 -938 225 1680 611 -1434 -646 1578 277 -1448 -1057 943 712 -1153 -1586
1549a586K032M58j667r34J566J165j202j194J456J330r62j334J57K250k24j683
$$ -1586 446 904 -763 -1697 -131 1034 -168 -1362 94 1424 462 -872 -715 1535 1311 -372
1565c72p29J975N29j911q07J577P70j224j398J289J285p88j726O88K025l06k331
$$ -372 -1101 874 1403 -508 -1315 262 1032 -192 -1590 -301 984 196 -1530 -842 1183 877 -1454
1582a454N77J776L51j628m50J838L37j398j240J783R22j148j351J142J189o28
$$ -1454 -877 899 1250 -378 -828 1010 1347 -51 -1291 492 1414 266 -1085 57 1246 618
1598F18j890K96J817j12j941R2J474N30j965l50K036P28j677o44J173J397j034
$$ 618 -1272 -976 841 729 -1212 -1120 354 884 -1081 -1431 605 1333 -344 -988 185 1582 548
1615E48j729J207J084k64j503K34J606k05j673R5J299J86j599o31J093J000r15
$$ 548 -1181 26 1110 846 -657 -423 1183 978 -695 -600 699 885 -714 -1345 -252 748 -167
1632a67j377J025J113k16j171L62J422Q4j720l7J811n3j425m79J633K90j428j064
$$ -167 -1544 -519 594 378 -793 -431 991 1075 -645 -682 1129 1076 -349 -828 805 1095 -333 -1397
1650a397J212J538j259j374Q51J307m79j888N01J377L81j577n33K046L90j449
$$ -1397 -185 1353 94 -1280 -429 878 399 -1489 -988 389 770 -807 -1340 706 1096 -353
1666c53q91J526R05o99q63O66Q64n24j453N43J283Q7j667l15J239M56p80j201
$$ -353 -1244 282 1187 488 -375 291 1155 631 -822 -279 1004 1091 -576 -891 348 804 24 -1177
1684a177J189N05r09q50R12J171q42p49M93Q50P3j444N6J489K09j424j60J084
$$ -1177 12 517 -392 -1242 -330 841 -1 -750 -257 593 666 -778 -722 767 976 -448 -608 476
1702D76M46r35q75P80J246j704q87J459N75n20j107L3J236K04j767K74J456N16
$$ 476 922 -13 -888 -108 1138 -566 -1453 6 581 61 -1046 -1013 223 427 -1340 -1066 390 906
1720I06j454j59J361O6p38p36Q77J161r23r61O19R16q22p47j66J489l10q32n57
$$ 906 -548 -707 654 720 -18 -754 123 1284 361 -600 19 935 113 -634 -800 689 379 -453 -1010
1739a010J151L88j286k16R49R65r47q37M12J097l33r12J54J247mj167k67J226
$$ -1010 141 529 -757 -973 -24 941 -6 -843 -431 666 333 -579 -425 822 818 -349 -616 610
1757F10K65j129n53J148L83q80j172J351P15o89j446Q23J293p82o97J53J153J0
$$ 610 875 -254 -807 341 724 -156 -1328 23 738 49 -1397 -574 719 -63 -760 -607 546 556
1775E56j121K33Q26K22p06m07Q84N04m61j098J035N40o49j097O85J033r31j058
$$ 556 -565 -332 494 716 10 -397 487 991 530 -568 467 1007 358 -739 -54 979 48 -1010
1793a010J75J229k33q92q5P71M08p30m97N39Q89m24r52P81O75l66o03%J093o7
$$ -1010 -835 394 161 -731 -816 -45 363 -367 -864 -325 564 140 -812 -31 644 278 -325 -325 768 701
1813G01r98l74J254K25j006l68Q50M93p27q79M01R35j73q50J6J327j95j265K50
$$ 701 -297 -671 583 808 -198 -566 284 777 50 -829 -428 507 334 -516 -500 827 632 -633 -383
1832c83J002L47r70j03R51j3o69m83Q52J14j06q81m55J430n73p28K97R85n38p65
$$ -383 619 966 -4 -107 844 831 162 -321 531 645 539 -342 -797 633 60 -668 -371 614 76 -689
1852f89L29Q96J52j061k25R06O10r88n16N84O56k90r59O51O18j46j186L82N26
$$ -689 -360 536 688 -373 -598 308 918 -70 -586 -2 654 364 -595 56 674 528 -658 -276 250
1871B50N7p27l80J146k3j92p79M30O18p85n49P93R02l62p47L49N73L4q62K55M35
$$ 250 307 -420 -800 346 323 131 -648 -218 400 -385 -934 -141 761 399 -348 1 574 608 -254 1 436
1892D36J51m63l87J98P72m31p55o4J322p13p83L74R02k27q40r0P90J25j246N38
$$ 436 587 124 -263 -65 707 276 -479 -543 779 66 -717 -343 559 332 -508 -598 192 317 -929 -391
1912c91L35O65q78j65K11O98m50m42P26M38m85o39L6J182k58r12o3O45L6m91n22
$$ -391 -56 609 -269 -434 -223 475 25 -417 309 747 262 -377 -341 841 583 -329 -392 253 289 -202 -724
1933g24P01M48l55n95M46O57P3r62L90O00k31n07n27J213k3p86j24N03J95n01
$$ -724 -23 425 70 -525 -79 578 651 -311 79 679 448 -59 -586 627 604 -182 -306 197 392 -109
1953a09l61O10P03j090n44L85Q49r26k89M58O16n4p81P7J067k91l87k83P00K58
$$ -109 -470 140 843 -247 -791 -406 443 -483 -772 -314 302 248 -533 -456 611 320 -67 -350 350 608
1973F08n94n54N46P22m41r67L72R31l21l95j53L88o3k29l33Q67L21q53l46N58
$$ 608 14 -540 6 728 287 -680 -308 623 302 -93 -246 142 79 -150 -483 384 705 -148 -494 64
1993F4K91k47m41N32O45n39o29K85N64J94n54k73P35Q0j068k76Q92J64m79n30
$$ 64 355 108 -333 199 844 305 -324 -39 525 719 165 -108 627 707 -361 -637 255 419 -60 -590
2013e90L67N29k06p05K40P10j87q92K64J016j90l39k63M01M50n78n50P70M28k21
$$ -590 -223 306 100 -605 -365 345 158 -734 -470 546 356 17 -246 155 605 27 -523 247 675 454
2033D54q18L69L83m76p2k0P80p49j79n8K09N66o51j67M75M66l50o98M28P81k48
$$ 454 -364 5 388 -88 -160 -180 600 -149 -328 -386 -177 389 -262 -429 46 512 162 -536 -108 673 425
2054D25q08L19M02L98q61j04M49J92o13l89N40L50o09k22N24J9l69j51J01P19
$$ 425 -383 -64 338 736 -125 -229 220 412 -201 -590 -50 300 -309 -531 -7 12 -357 -508 -407 312
2074C12j8r33O48J69J9l29j85M00N99q99j55O57K78l09n92J50N77N0q80K03M94
$$ 312 294 -639 9 178 197 -132 -317 83 682 -217 -372 285 563 254 -338 -188 389 439 -441 -238 256
2095B56j76m14J53K65J92n24m79J044N0k70n23K27M14J53m27M7K36J8l44l01O29
$$ 256 80 -334 -181 84 276 -248 -727 317 367 97 -426 -199 215 368 -59 -12 224 242 -102 -403 226
2116B26j89j90l16N67P3m26J24q1M48n27J20M23m5L88o24j0J27K30n50K99K47
$$ 226 37 -153 -469 98 171 -255 -131 -212 236 -291 -171 252 207 595 -29 -39 88 318 -232 67 314
2137C14j65k83j57M95K96l21k90J0K39K8o26L03K14J10m24O4K45J91k39o62P45
$$ 314 149 -134 -291 204 500 179 -111 -101 138 166 -460 -157 57 167 -257 -193 52 243 4 -658 87
2158H7L22o12j45L31M58j15n68K28K17R8r13K72Q25l09j87j47J74L33n28j44M23
$$ 87 409 -203 -348 -17 441 326 -242 -14 203 301 -612 -340 485 176 -11 -158 16 349 -179 -323 100
2179A00M86q18J4L31K43n41k03L84K20q6l07P2P51l04o71j62P31L2l16rK41J91
$$ 100 586 -232 -218 113 356 -185 -388 -4 216 130 -177 -105 646 342 -329 -491 240 272 -44 -53 188 379
2201C79m63L5L69k39J1n04qQ77l29l46O4K69J77m48j25L46N1K9k89Q3N38n36K17
$$ 379 -84 -49 320 81 92 -412 -420 457 128 -218 -154 115 292 -156 -281 65 116 145 -144 -61 477 -59 158
2224A58J1J09k39l71L67M2R7k90m89R88j87n01m54O05L15j94l31J74O34j24m58
$$ 158 169 278 39 -332 35 77 174 -116 -605 383 196 -305 -759 -154 161 -33 -364 -190 444 320 -138
2245a38Q1L10M87p26m2K12L14m99l51O65j43j34j15K01K43j81l74K59j1J75o40
$$ -138 -57 253 740 14 -28 184 498 -1 -352 313 170 36 -79 122 365 184 -190 69 58 233 -407
2266d07R2L94L59p22J68K47L96o17k44M46mJ32m48M83K1j93m30M64q9J72l07j61
$$ -407 -315 79 438 -284 -116 131 527 -90 -334 112 108 240 -208 275 296 103 -327 137 48 220 -87 -248
2288b48K36K84l55j94O9L13L4l90j4M44j52j34J72J84j75l1JO07m71j13n14K61
$$ -248 -12 272 -83 -277 -208 105 139 -251 -265 179 27 -107 65 249 74 43 44 651 180 67 -447 -186
2310a86N44q13R1K24L1k00J43J8L67j22j99R3j8J13k09J05q2M82r6m76M91q0n8
$$ -186 358 -455 -364 -140 -109 -309 -166 -148 219 97 -102 -9 -27 86 -123 -18 -100 382 286 -190 301 221 163
2333A63o02K80J88k40j99J48N55j38l34J54K62k72j41j22O53j59r3k66j0M14o0
$$ 163 -439 -159 29 -211 -410 -262 293 155 -179 -25 237 -35 -176 -298 355 196 103 -163 -173 241 181
2354A81Q7j61M44k25n47N08L8L27q24L07m18N50l99m8N0J17Lj6J5m0r8J3K34j33
$$ 181 268 107 551 326 -221 287 325 652 -172 135 -283 267 -132 -180 -130 -13 -10 -26 -11 -51 -149 -136 98 -35
2378c5J25J75l45j24N42j16l28k4K90j58O2n2q9K43l45J19J66M6n56K86m5M77
$$ -35 90 265 -80 -204 338 222 -106 -130 160 2 64 12 -77 166 -179 -60 106 152 -404 -118 -163 314
2400C14n78K38N00k24k63j17J56k11L33p6K38l3l12j60L21M57l75l02m31O63k54
$$ 314 -264 -26 474 250 -13 -130 26 -185 148 72 310 277 -35 -195 126 583 208 -94 -525 138 -116
2421a16K4j77N00j40m18j19N95L89k96l36K83l55K83J6O9j4l24M08q9q6m2O6k04
$$ -116 -92 -269 231 91 -327 -446 149 538 242 -94 189 -166 117 133 202 188 -136 272 183 97 55 121 -83
2444h3L5N74p39K2K58pj46J42k14J34j59l8M45J38j09n0l19k37O57l32q9J40M51
$$ -83 -48 526 -213 -191 67 60 -86 56 -158 -24 -183 -221 224 362 253 203 -116 -353 304 -28 -117 23 474
2467D74m88j94K34N41o90M46o14L81J41m7k39M41m62j82L29K61j65k99r8L08r0
$$ 474 -14 -208 26 567 -123 323 -291 90 231 184 -55 386 -76 -258 71 332 167 -132 -230 78 -12
2488a2K14J7m19K76n5j39K84l12K80K05l26J79J73l20J18j66k67Q04p60p0M97
$$ -12 202 219 -200 76 21 -118 166 -146 134 339 13 192 365 45 163 -3 -270 534 -226 -296 201
2509B01j27k46K4O44m97o0J69l09M62l97K66k12j75K61j86j10M24j24J8l6K51
$$ 201 74 -172 -148 496 -1 -61 108 -201 261 -136 130 -82 -257 4 -182 -292 132 8 26 -10 241
2530B41n47L90p2P9k46M7j66P7J36J12l27J14k9N26p93M85p1K3K7j68K68k9n0
$$ 241 -306 84 12 91 -155 -108 -274 -197 -61 51 -276 -162 -191 335 -458 27 -44 -21 6 -162 106 77 27
2553B7m03O94j12l45K50O1Q6n8m17J25K43pn5J8m33O26p7j37R4m01K38r8K33K31
$$ 27 -376 318 206 -139 111 172 258 200 -217 -92 151 144 89 107 -326 300 223 86 180 -221 17 -81 152 383
2577C83k20l21j8N52L6n75L00n7p0k18K87l17O80o43J13L83k81M16n51M52k7k08
$$ 383 163 -158 -176 376 412 -163 137 80 10 -208 79 -238 442 -201 -88 295 14 430 -121 331 304 96
2599I6n4K88o09K39j78N15O5k37o73M8K12M96j93O0l4K00p2j29J24k45K10j27
$$ 96 42 330 -279 -40 -218 297 362 125 -548 -500 -288 208 15 75 41 241 169 40 164 -81 129 2
2621Bo4K72o84Q01n58M15L2l91J64J32k87J63PJ1mj87L61k15K23j6n34L59M38
$$ 2 -62 210 -474 327 -231 184 216 -175 -11 121 -166 -3 4 15 11 -176 185 -30 193 177 -357 2 440
2644D40o54K66K84n46N93l00m14N48j41k3j46K47Mj29K16j49O0l4l62L14K29m56
$$ 440 -214 52 336 -210 383 83 -331 217 76 53 -93 154 158 29 245 96 156 122 -240 74 303 -153
2666a53J81n2KQ8k88%o1L63m9j20J01L3j92K44O2Qk10k31L83M5k95j56K32r9K96
$$ -153 28 -24 -22 66 -222 -222 -283 80 31 -89 12 45 -147 97 159 167 -43 -274 109 154 -141 -297 -65 -164 132
2691A32j11J04J69m16K52J17l07J88j87k60L39KK71n08K76J51l59K02J06j7L5
$$ 132 21 125 294 -122 130 247 -60 128 -59 -319 20 22 293 -215 61 212 -147 55 161 144 179
2712A79J7l40J54J10k39J12o9M47m54m97Q25k8Q2o47L33k19M07j1k22L24l27K33
$$ 179 196 -144 10 120 -119 -7 -76 371 -83 -580 245 217 299 -348 -15 -234 173 162 -60 264 -63 170
2734A70k86Q7j12K86o8m78P11n72M6K32m2J17m15L09j0k06K82l07L1L21k95L02
$$ 170 -116 -29 -141 145 77 -401 310 -262 -216 16 -26 91 -324 -15 -25 -231 51 -256 -225 96 -199 103
2756A03m9k50K50J14j65j10O42p03M29l48K42p8J68l16J76k32K54j52k7J99j08
$$ 103 54 -196 54 168 3 -107 535 -168 261 -87 155 77 245 -71 105 -127 127 -25 -52 147 39
2777C9M09m07l2k32P5J65K88j89K6j82MN22l28k77J57K86k51l97L85m2L6j40j83
$$ 39 448 41 9 -223 -148 17 305 116 142 -40 -36 486 158 -119 38 324 73 -324 61 19 55 -85 -268
2800b68L76R5j14r8j99K77l89N44l65J86k4l54N17k45J31k15J86k87L40m21L93
$$ -268 108 203 89 -9 -208 69 -320 224 -141 45 21 -333 184 -61 70 -145 41 -246 94 -327 66
2821F6J15j24j26k94J40L07j69J04j48k5J49q2J25q7p5r1jL48k49k8J45m6K82
$$ 66 181 57 -69 -363 -223 84 -85 19 -129 -154 -5 -87 38 -49 -124 -215 -216 132 -117 -145 0 -46 236
2844B36o08J81R9O1j71J77J18O7k30m3K56l05K97l65K65N21p03L6j57K83j45J83
$$ 236 -372 -191 -92 -31 -202 -25 93 160 -70 -113 143 -162 135 -230 35 556 -147 -111 -268 15 -130 53
2866E3K78j91J96n20L22K3J7k26J45k93O35j95n37M55p0l43O7J58j36O0J22j77
$$ 53 331 140 336 -184 138 161 178 -48 97 -196 439 244 -293 162 92 -251 -184 -26 -162 -102 20 -157
2888a57L01j97L52m69Qj45K20J96Mk0j93kJ10M7m9QP7k89K41J56m3k36L04r1k62
$$ -157 144 -53 299 -170 -162 -307 -87 109 113 93 -100 -102 8 55 6 14 91 -198 43 199 156 -80 224 133 -129
2913a29J26k00J30n7j0N16j23l96K58OQ2j16q0K93k69M43n84K38n4j83P9n6K78
$$ -129 -3 -203 -73 -130 -140 376 253 -143 115 121 203 87 7 300 31 474 -110 128 74 -109 -30 -86 192
2936A92m77L8J97L01m31K33l34P8J89k72J10K9M25l1k32p3K4L50m64M10k40j30
$$ 192 -285 -247 -50 251 -180 53 -281 -203 -14 -286 -176 -147 278 247 15 -58 -34 316 -148 262 22 -108
2958a08j09N9J05j39L55k77K71j11j79K08m7jl8kk55J02K65j63j85K36L58K21
$$ -108 -217 -158 -53 -192 163 -114 157 46 -133 75 28 27 -11 -13 -268 -166 99 -64 -249 -13 345 566
2980E66r40P35l80J25k59l61N57n6O0L27m67l2J54J01j47j12K52l39P11j54n85
$$ 566 -374 361 -19 106 -153 -514 43 -13 47 374 -93 -125 29 130 -17 -129 123 -216 495 341 -244
3001b44M11m13K95k20L81K3n45N4j14N54j00J59j35k76J67Q4r3K79l13L42l03
$$ -244 167 -246 49 -171 210 233 -312 -258 -372 182 82 241 106 -170 -3 81 -12 267 -46 296 -7
3022gm9OM5J58O9R8l32K00j09r1k23K52j26L46p5j55k80J82j15L63m51N92m84
$$ -7 -56 -50 -5 153 222 320 -12 188 79 -12 -235 17 -109 237 162 7 -273 -91 -206 157 -294 298 -186
3045a86Q6k48j28N35J64k46J35j19L58l60l17N09k15K67m93P9L67j89J30K62l62
$$ -186 -100 -348 -476 59 223 -23 112 -7 351 -9 -326 183 -32 235 -258 -179 188 -1 129 391 29
3066B9L1K8n50L33L47m26M11Q1j98LJ94k82r9J89M2k95O56n48n65P66m33N10j80
$$ 29 60 88 -462 -129 218 -208 203 284 86 89 283 1 -98 91 133 -162 494 -54 -619 147 -286 224 44
3089D4k41K6M31n48N09l65K96m18o3M36L8o27O03j87L6j70K17j1k69L76l33L99
$$ 44 -197 -171 260 -288 221 -144 152 -266 -329 107 145 -482 121 -66 -30 -200 17 6 -263 113 -220 179
3111A79l39j66N44k37k3Q6j50J82o0K1j04J46l3J87k47o8n7K21k36r3L18q1j69
$$ 179 -160 -326 218 -19 -42 44 -106 76 16 37 -67 79 46 233 -14 -82 -139 82 -154 -247 71 -10 -179
3134a79L66k10j61L84K3P1n88Q06m37J58J03m83N01k62o6l81O40N4m18j65L48
$$ -179 187 -23 -184 200 223 294 -294 512 75 233 336 -147 354 92 26 -355 285 339 -79 -244 104
3155A04J68k14k25K78j37n9K29j99j49j9K18J15k00r2k22N78j29j21J23L08r7
$$ 104 272 58 -167 111 -26 -85 144 -55 -204 -223 -5 110 -90 -182 -404 174 45 -76 47 355 258
3176B58N1p8o07O50j36n39M01k67J48J60Mk57N09j72K61k45qJ25o4k56M5K9p7
$$ 258 309 231 -376 274 138 -401 0 -267 -119 41 45 -212 297 125 386 141 133 258 194 -62 -17 12 -65
3199f5R2K20m79J77k3K8Q4K90o73K44J70R6l23K30O8m0l07O3J56k05J7N2J33m
$$ -65 27 247 -232 -55 -78 -50 34 324 -349 -105 65 161 -162 68 136 96 -211 -148 8 -197 -180 -128 5 1
3223Ak1k48J75L73l31K71k07j86M05N3m12n3K97k33L54l60K84k36k2M44k61K43
$$ 1 -20 -268 -93 280 -51 220 13 -173 232 285 -127 -180 117 -116 238 -122 162 -74 -96 348 87 330
3245C30j77p0J01m15L86k37K79p1m67M31l15J06L03k28M73o74J91J27K77m01j17
$$ 330 153 83 184 -231 155 -82 197 126 -341 90 -225 -119 184 -44 429 -245 -54 73 350 -51 -168
3266a68k47M23k56J8M7Jl5M48j30j36M55o44N58j53K10n59l8K66k02j58J86K09
$$ -168 -415 8 -248 -230 -183 -182 -217 231 101 -35 420 -224 334 181 391 -168 -206 60 -142 -300 -114 95
3288I5O5J2k51K22K62j78j45k52J19j11K08Q6k81j15Q8L39k98M25l20m06O25m05
$$ 95 160 172 -79 143 405 227 82 -170 -51 -162 46 132 -149 -264 -176 163 -135 290 -30 -436 189 -216
3310b16L22n6J18m1m38O93n27L05k99L82j58k83O5J99j43j13O1k1o6m0L81k99
$$ -216 106 50 168 127 -311 382 -145 160 -139 243 85 -198 -133 66 -77 -190 -129 -150 -216 -256 125 -174
3332a74K28o2k05L67j42J95k05j54J02K75l10J0M02r4j66l85L93j78K86j31K47
$$ -174 54 -8 -213 154 12 207 2 -152 -50 225 -85 -75 327 233 67 -318 75 -103 183 52 299
3353B99n68J22PJ03j39J8K64J26k74O1O3L8j32N5O0o3J91m4q0r1l37K88j87L38
$$ 299 -269 -147 -140 -37 -176 -158 106 232 -42 19 82 120 -12 43 103 40 231 187 107 16 -321 -33 -220 118
3377A18K2n6o3J15j72p2J43p00Q22J48j06j16J37j88m4L40p30J46M63k63j84N05
$$ 118 140 84 21 136 -36 -108 35 -665 157 305 199 83 220 32 -12 328 -402 -256 207 -56 -240 265
3399B65j66j13n6L39j00p1k61j53K89J08j85J7l07L33l3J84J74m41L45l78j27
$$ 265 99 -14 -70 269 169 98 -163 -316 -27 81 -104 -87 -394 -61 -94 90 264 -177 168 -210 -337
3420c37N96l18l37N6L16P2j22k74K85l2J18J9l48L85k24L12N6N5k9jl87J84r9
$$ -337 259 -59 -396 -340 -24 48 -74 -348 -63 -95 23 42 -306 79 -145 167 223 278 249 248 -139 45 -54
3443e4J50j04J20J85r9J21j00j04j7J14n70M81J80l34j9n7q4j19J09K30k64K53
$$ -54 96 -8 112 297 198 319 219 115 98 212 -358 123 303 -31 -50 -107 -191 -310 -201 29 -235 18
3465A8J45l05P1k1r5L58Q4m20J00p3J16L48m24K64m5k24K76l73K38J74m49Q8J45
$$ 18 163 -142 -71 -92 -187 171 255 -165 -65 -138 -22 326 -98 166 121 -103 173 -200 38 212 -237 -149 -4
3488dL45k72J7K9K12l32K29k65j60p2J46J79P6L6l86K86l1k1j29k5lM38j41m2
$$ -4 341 69 86 115 327 -5 224 -41 -201 -273 -127 52 128 164 -222 64 33 12 -117 -142 -145 293 152 110
3512A10J06j96j73L92m95L56j48Q7j16L84m26p3K90k75L73j45k91O21n41n5M82
$$ 110 216 20 -153 239 -256 100 -48 39 -77 307 -119 -192 98 -177 196 51 -240 381 -160 -215 267
3533B67k60j52N13o2n31N20j22l1r1k86R2l8K15M21l19m73M22L02m06p2n3K03
$$ 267 7 -145 368 306 -225 295 173 142 51 -235 -143 -181 34 455 136 -337 85 387 -19 -91 -144 59
3555E9J17k16j84M4J09O2K84j26q2K23n44M74l50J74j11k38K42j3N91m22k53J66
$$ 59 176 -40 -224 -180 -71 -9 275 149 67 290 -254 220 -130 44 -67 -305 -63 -76 515 93 -160 6
3577FM35m61J3j91j0L11P2k97L0J26J11j05Q5j86K15q0R1k33J33J34m14Q5Q6R1
$$ 6 441 -20 -7 -198 -208 103 175 -122 -92 34 145 40 125 -61 154 74 165 -68 65 199 -215 -130 -44 47
3601D7j8J21k07Q0l13J62M67q36L23N43k71pJ24j63l76J93J31K46p1no3k94J48
$$ 47 29 150 -57 23 -290 -128 339 -497 -174 369 98 91 215 52 -324 -131 0 246 175 170 107 -187 -39
3624c9Q3J25J2k65j18R1Q8m8j06j46J63r1L11K61m89J35J43PPM3J12n53K72j3
$$ -39 44 169 181 -84 -202 -111 -23 -71 -177 -323 -160 -251 60 321 -168 -33 110 117 124 167 279 -274 -2 -15
3648a5K85l11J92m2J70k86M31m34Lj46L9K64Kj73L5j27j88k50Q48k03K73l82M47
$$ -15 270 -41 151 109 279 -7 424 -10 -7 -153 -114 150 152 -21 14 -113 -301 -551 297 94 367 -15 432
3671D32l54j96L12k35j44r1N7M21l16K28k89j32K67K05m77M34k28Kj13M44k87
$$ 432 78 -118 194 -41 -185 -276 -219 202 -114 114 -175 -307 -40 165 -312 122 -106 -104 -217 227 -60
3692f0j99l2R5J78k75L39j95N4J11J22j03J23j04q6K13L2K4p36J85M71j39j01
$$ -60 -259 -291 -196 -18 -293 46 -149 -95 16 138 35 158 54 -32 181 213 237 -499 -314 157 18 -83
3714h3K26N3l10L26j19n4J7Q6K2j39J65m09M30k86j38L95l70L96N9n61J73L77
$$ -83 143 196 -114 212 93 39 56 142 164 25 190 -219 211 -75 -213 182 -188 208 267 -294 -121 256
3736B56m01J45p9K84j32j89N34q38J81L40k33K1M98o15M90m97K19J50k47K95k97
$$ 256 -145 0 -79 205 73 -116 418 -420 -239 101 -132 -111 387 -228 262 -235 -16 134 -113 182 -115
3757a15J22J58o3Pk17L95K6o38K95k6L03m08N4l08J7O13j06L12l78j25j10K56
$$ -115 7 165 102 109 -108 287 313 -325 -30 -56 247 -161 -107 -415 -398 215 109 421 43 -82 -192 64
3779F4J67l36J51k21K13j55k03M2M7J26k71L75q7J64k12J05K10l7o6k2R1J02j17
$$ 64 231 -105 46 -175 38 -117 -320 -278 -231 -105 -376 -1 -88 76 -136 -31 179 142 76 54 145 247 130
3802A30k81N6K28k12J17j86J0M21j6k52R5N7J3Pq1j36K12J08m14L64l60j16K73
$$ 130 -151 -95 133 -79 38 -148 -138 283 267 15 110 167 180 187 106 -30 182 290 -124 240 -120 -236 37
3825C7m8J04q9j91J55j77j64K68j19L48N6K8n22N17j75j92o0O67m91j29J81j49
$$ 37 -11 93 4 -187 -32 -209 -373 -105 -224 124 180 208 -314 203 28 -164 -224 443 -48 -177 4 -145
3847a45J43J22l40N54k39j74K5K8q8K60m83L34L03j12k02J12j19k88M49K13m91
$$ -145 -2 120 -220 334 95 -79 -54 -26 -114 146 -337 -3 300 188 -14 98 -21 -309 140 353 -138
3868a38K33k19K45k3J25r5R2M8m45L00j15l96N07m19J88K60o01N20N3l55J52J97
$$ -138 95 -124 121 98 223 128 220 268 -177 123 8 -388 119 -300 -112 148 -453 67 120 -235 -83 114
3890A14l41L95m80K61o1L99k75%k05j33K27l2L64j48j28J44l14L70j2k02J38j52
$$ 114 -227 168 -312 -51 -112 287 12 12 -193 -326 -99 -131 233 85 -43 101 -213 157 145 -57 81 -71
3912g1k13l0J95J16J78N1J94k80q5k58O3M38j39j46r9j60Q8L0l7N83l99j53K0
$$ -71 -284 -314 -119 -3 175 226 420 140 55 -203 -140 298 159 13 -86 -246 -158 -128 -165 418 19 -134 -114
3935a14K30k92L24o06L47R9l40K71K98l51O0j08K59o8j50K11j2j25l31K52J35
$$ -114 116 -176 148 -458 -111 -12 -352 -81 217 -134 -74 -182 77 9 -141 70 58 -67 -398 -146 -11
3956a1J87n05L64o3k4K98k71K1k6K06j53m8Ql22k5J91M64j53L53n34p6K90l78
$$ -11 176 -329 35 -28 -52 246 -25 -4 -30 176 23 -25 -17 -339 -364 -173 291 138 491 -43 -119 171 -207
3979b07L14o5k35J24j25M7L84n64K11j43J58j76M59Jl52L34j89l38J90Q2K94n4
$$ -207 107 42 -193 -69 -194 -147 237 -327 -116 -259 -101 -277 182 183 -169 165 -24 -362 -172 -90 204 150
4001A50K6l20J05q1l06M84k76L57j24j61L46j75j82K5J64n4K3m9K53r5m48M22
$$ 150 176 -144 -39 -120 -426 58 -218 139 15 -146 200 25 -157 -132 32 -22 1 -48 205 110 -338 84
4023H4J31L20m03L02m59K39J57k20j51N84m76o3l49P80r62R48m00k68q8P67k15
$$ 84 215 535 132 434 -25 214 371 151 0 584 108 45 -304 476 -486 462 62 -206 -294 473 258
4044B58n79K46N4j05K8L3J14l20j7K92m37O33k11k7j04J37n35M76QL2K08J95j72
$$ 258 -321 -75 -21 -126 -98 -65 49 -271 -288 4 -433 200 -11 -38 -142 -5 -540 -64 -56 -24 184 379 207
4067B07k21J20k59J11L38k70M0k69J0L24K24m56J03o4j3J13r6K97l29OL65k53
$$ 207 -14 106 -153 -42 296 26 66 -203 -193 131 355 -101 2 -62 -75 38 -58 239 -90 -84 281 28
4089B8j54O5k28O95n83j33L75J36k55J47J59k19r4J07n82O58k20K18J8k55mn7
$$ 28 -126 -61 -289 406 -177 -310 65 201 -54 93 252 33 -61 46 -536 122 -98 120 138 -117 -121 -178
4111a78J62J75k6j32J11Jj26L9N0l62Q6L33j65k9m6N3rJ08k36K15K53m18LK50
$$ -178 -16 159 133 1 112 113 -13 26 76 -286 -200 133 -32 -61 -107 -54 -63 45 -191 24 277 -141 -138 112
4135A12j98r8r7N78p45P21l26L67n92M28o6k56J89k85L18R8j11j24K58k24m5j82
$$ 112 -86 -184 -281 297 -448 273 -53 314 -278 150 84 -172 17 -268 50 148 37 -87 171 -53 -98 -280
4157b80L65j15L87l32j82L87J15k54j48o7N10j21j68L8K69l76PK56k47R5j34m01
$$ -280 85 -30 357 25 -157 230 345 91 -57 -124 386 265 97 135 404 28 35 291 44 139 5 -396
4179c96O63k83k6K70k72L37m4j21m2j52J4J73j92J35j06l4J63k53K82L48q40O67
$$ -396 267 -16 -42 228 -44 293 249 128 86 -66 -52 121 -71 64 -42 -76 87 -166 116 464 -376 291
4201B91n12J06L15m60L15k03O1L59j99l88N39l34J14K06k79J42k48L24LJ23P1
$$ 291 -221 -115 200 -260 55 -148 -87 272 73 -315 224 -110 4 210 -69 73 -175 149 152 275 346
4222C46j68k38K10K59o23J75j2m92N83l54L63K20q17O78K82l88K40o9k33l6j14
$$ 346 178 -60 150 409 -214 -39 -51 -543 40 -314 49 269 -548 130 412 24 264 195 -38 -74 -188
4243a88K49n08M40k98M63k5q0Kj49K77m66K71j58K92J53k36J07j8j58j33K58k76
$$ -188 61 -447 -7 -305 158 133 53 55 -94 183 -283 -12 -170 122 275 39 146 128 -30 -163 95 -181
4265a81L4J65n2r1K6q8rL86l8l97j8M21j05j72oJ70J89j14k99j82N02m51J55M24
$$ -181 -147 18 -34 -125 -99 -187 -196 190 152 -245 -263 158 53 -119 -125 45 234 120 -179 -361 141 -310 -155 269
4289B69L1l75L06j45Q5J18j01j40J06k00j12j33K67k59M60m02M52J57l24j48J02
$$ 269 300 -75 231 86 171 289 188 48 154 -46 -158 -291 -24 -283 177 -225 227 384 60 -88 14
4310A4J18Q6p11J73K92J20j0l90N93j83m6K43l51k43L97m8K50o9j05l16K12N5
$$ 14 132 218 -493 -320 -28 92 82 -308 285 102 56 299 -52 -295 102 54 304 235 130 -186 26 81
4332H1J14k39l2N3K57n20K69j00L75q1J62j93l33L79k21k75L93n5j03m6l3K63
$$ 81 195 -44 -76 -23 234 -286 -17 -117 258 177 339 146 -187 192 -29 -304 89 34 -69 -115 -148 115
4354A15O9l53J15J7J48l21K7Q1L32k16K6l24K21J15k38N26n51L31l21M24K8j91
$$ 115 184 -169 -54 -37 111 -210 -183 -102 230 14 40 -284 -63 52 -186 340 -211 120 -201 223 251 60
4376F0K1k11K66m78K39NN74k87k18j05j11J51j8J91j41l28J82J32L38k57k33L03
$$ 60 81 -130 136 -342 -103 -98 476 189 -29 -134 -245 -94 -112 79 -62 -390 -208 -76 262 5 -228 75
4398G5j74J15j73J39k58K6K78o2j40J08j67J55l0rK17k98M04K6k34L09j65j69
$$ 75 -99 16 -157 -18 -276 -250 28 -34 -174 -66 -233 -78 -108 -117 100 -198 206 232 -2 307 142 -27
4420b7O4J92m16K11j38L72l10K72j45K89n98M82m55m3K98k09p4N97l90l93O08
$$ -27 37 229 -187 24 -114 258 -52 220 75 364 -234 248 -207 -250 48 -161 -235 362 -28 -421 187
4441A87k17K31l07j66J48R3j68M76m99N29o26K09J31J26l33L18J1m10P16o13L19
$$ 187 -30 201 -106 -272 -124 -31 -199 277 -222 307 -319 -110 21 147 -186 132 143 -267 449 -164 155
4462A55k2j00j19k09O65m81k2K05o5K33N8n05L01K5j67J56k0m45J05O76k53m47
$$ 155 133 33 -86 -295 370 -111 -133 72 7 240 298 -207 94 119 -48 108 88 -357 -252 424 171 -276
4484b76N15k06m37N39K29j66n4k02J71j01j35K7M02k41l2j82K4O2K16Rl19K85
$$ -276 239 33 -404 135 364 198 144 -58 113 12 -123 -96 306 65 33 -149 -125 -63 153 162 -157 128
4506A28j66n15J53M35P2l94M63l5k25j55r6RK02M0J21k18K28J78j48K22m39l7
$$ 128 -38 -553 -400 35 107 -287 176 141 -84 -239 -335 -326 -124 -84 37 -181 47 225 77 299 -140 -177
4528a77K43J69J76k04m65L64n6o6j9k6O3k75Q8K51k33O65o60K30K00k91L7M3l13
$$ -177 66 235 411 207 -258 106 50 -16 -35 -61 2 -273 -185 66 -167 498 -162 68 268 -23 14 57 -256
4551b56L54J05Q2m39N06m19L55j35k58N11n12k07K01j12L45k29K70j93r0j3mK95
$$ -256 98 203 285 -154 352 -67 288 153 -105 406 -106 -313 -112 -224 121 -108 162 -31 -121 -134 -138 157
4573A57J70n10M48k77m28O73j56j1L5k90K15K1o7mm60N95m1K58m02J10m3J72n7
$$ 157 327 -183 265 -12 -440 233 77 66 101 -189 26 47 -20 -24 -484 111 70 328 -74 36 -7 165 108
4596A08m3l7k98J04k88J21J31K07J69j90K80j45j99L99l20M3m02K34l6mj40N00
$$ 108 65 28 -270 -166 -454 -333 -202 5 174 -16 264 119 -80 319 -1 42 -360 -126 -162 -166 -306 194
4618A94J08K90m80j06K31l33M50o00N46j61L0L6j45k8L07k76l6J1K5K75j28k76
$$ 194 302 592 112 6 237 -96 354 -246 300 139 169 205 60 32 339 63 27 38 63 338 210 -66
4640f6J43j04K49o2j48L47l77J24k12r0J73K43j81M6l01k28J032r69J79Q7j82
$$ -66 77 -27 222 160 12 359 -18 106 -106 -196 -23 220 39 85 -216 -444 588 -381 -202 -115 -297
4661b97J46pj1L02j59J10k16k94J35N72k24k83M81k89J86M1q1l89J62j26j01M55
$$ -297 -151 -158 -169 133 -26 84 -132 -426 -291 281 57 -226 255 -34 152 193 112 -277 -115 -241 -342 113
4683A13j29j05J28J80N1l42K09k58L51j63q0Q1J11L6j82j1K8P6k18j85K17l3L18
$$ 113 -16 -121 7 187 238 -104 105 -153 198 35 -45 36 147 183 1 -10 18 94 -124 -309 -92 -125 193
4706A93j68j1Q4m74M67ql60J40R3m83O80j55J2N4j11N4M9N8n6k66P8r8rJ85J99
$$ 193 25 14 98 -376 91 83 -277 -137 -44 -527 153 -2 10 64 -47 7 56 114 58 -208 -130 -228 -237 -52 147
4731A47p0J34k44j89o6K81M00o54M69n7l53K54j24o3j05L23j00K54k01K17l1k5
$$ 147 77 211 -33 -222 -288 -7 393 -261 208 151 -202 52 -72 -135 -240 83 -17 237 36 253 222 197
4753A97l34L52k82K9n5K52j39J91K40l24j2J47j96J22l19mJ66R4l95K81J78J57
$$ 197 -137 215 -67 -38 -93 159 20 211 451 127 115 262 66 188 -131 -135 31 125 -270 11 189 346
4775C46k01j55L1m36J52O0L00l2J86l24K63l00Q1N03l33q2J23n3m20J43K60J95
$$ 346 145 -10 21 -415 -263 -203 97 65 251 -73 190 -110 -29 474 141 59 182 129 -291 -148 112 307
4797C07l85M44n27L66Nl5n0k09L65n60J67M23k55k12M47m55l4L01r9l84L60j98
$$ 307 -78 366 -161 205 210 175 125 -84 281 -279 -112 311 56 -156 291 -164 -198 103 4 -380 -20 -218
4819b18J15K0J40j64L9j17K90K2l2m99K26L79Oj28Q7l29r4L13n8K18n39M35rJ49
$$ -218 -103 -83 57 -107 -68 -185 105 127 95 -404 -178 201 207 79 166 -163 -257 56 -2 216 -323 112 103 252
4843B52q8K19n78K15K14j60j25J47l98L98k12K12K26j68L3K08m92P3J70n8n7L
$$ 252 164 383 -195 20 234 74 -51 96 -302 96 -116 96 322 154 187 395 -97 -24 146 88 31 34
4865C4j0n0o0k16J36J82J80o42L64J7ok15K82k87M85j98P9j06K21P5l81M00n1
$$ 34 24 -26 -86 -302 -166 16 196 -446 -82 -65 -71 -286 -4 -291 194 -4 75 -31 190 265 -116 284 233
4888B33J83n32J44o7m0Q4k43j65K58J59J40k10j17K08J41n80L66J24j56R8J23
$$ 233 416 -116 28 -39 -79 5 -238 -403 -145 14 154 -56 -173 35 176 -404 -38 86 -70 28 151
4909A51Q2l01K87k23J24m78M53k86j51J22N33n70J86K39k64J37Q5k57J02m9j80
$$ 151 233 -68 219 -4 120 -358 95 -191 -342 -220 313 -257 -71 168 -96 41 126 -131 -29 -78 -258
4930b58N60m0jl35J61k23K98n35O38q4j99n8M36m34M9o6K6J32l29L40r3j3J74
$$ -258 302 262 261 -74 87 -136 162 -373 265 181 -18 -76 360 -74 -25 -91 -65 67 -262 78 -15 -28 146
4953A46K73q66N38J50m00J92k53K26j73J37j72r6M47l82k4M06J02m10J05Q8q2
$$ 146 419 -447 91 241 -159 33 -220 6 -167 -30 -202 -298 149 -233 -257 149 251 -159 -54 34 -48
4974d8oj29N28j26o03N89K9l19q2K25l00J65K6J50k40j51L54R3l3r7J02J46l05
$$ -48 -54 -183 345 219 -384 205 234 -85 -167 58 -242 -77 -51 99 -141 -292 62 155 122 25 127 273 -32
4997c2l11M24j59J04K2k2J94m45K02n2L01K78o77J98l00J74j37K19J24j48m2M7
$$ -32 -343 81 -78 26 48 26 220 -225 -23 -75 226 504 -173 25 -275 -101 -238 -19 105 -43 -85 -38
5019c8n1J80k00j8M97m13j55K90K4J38r4k29J4l4J50J38j32M1j82R6K86m36k04
$$ -38 -89 91 -109 -127 370 -43 -198 92 116 254 160 -69 -55 -89 61 199 67 108 -74 22 308 -128 -332
5042c32K81l7j09N49k48j30k07J53j15L30l49K88K59k68m66J59L36q9R5l4l96
$$ -332 -51 -88 -197 352 104 -26 -233 -80 -195 135 -214 74 333 65 -401 -242 94 5 100 66 -330
5063c30M38j1k63J20K18k84J37j99K03l12L05j82L36k62r9o3j46P83n40J16k3
$$ -330 108 97 -166 -46 172 -112 25 -174 29 -283 22 -160 176 -86 -185 -248 -394 389 -151 -35 -58
5084e8k31M29J29kl86j17K78j85O8K5j2J88o0q5qO8j25K44j77p0M01m21N7P5l73
$$ -58 -289 140 269 267 -119 -236 42 -143 -75 -50 -62 126 66 -19 -27 41 -84 160 -17 -87 314 -107 -50 25 -348
5109c48J73L38j96Q3m4l12M9J16K02q2J43k0l41K66m32M73J14o5L14k35k54k80
$$ -348 -175 163 -33 50 6 -306 -257 -141 61 -21 122 102 -239 27 -405 68 182 117 431 196 -58 -338
5131c38L48q8j8P0L4p3o7K5J45M2J05l0k60J34m6j44J81J90k09M3r7o3K91k37
$$ -338 10 -78 -96 -26 8 -65 -132 -107 38 80 185 155 -105 29 -17 -161 20 210 1 44 -53 -116 175 -62
5155f2q4K35Q3k1j17j60MJ88l53L57k49M17J90n13KJ66o9r5J63k58R5J33j1rj68
$$ -62 -146 89 172 151 34 -126 -122 66 -287 70 -179 238 428 -85 -83 83 14 -81 82 -176 -81 52 41 32 -136
5180a36M30m07J87m1J26P4l62Q5K25l65L04k05kJ45o1k7L1J80k62k09J67L32j2
$$ -136 294 -113 74 33 159 233 -129 -44 181 -184 120 -85 -87 58 -3 -30 1 181 -81 -290 -123 209 197
5203A97j76k21K32k60L59QK30m60n7J9K68K86m92j00M61k09o6p8j60M55k16k69
$$ 197 21 -200 32 -228 131 139 369 -91 -148 -129 139 425 -67 -167 294 85 19 -59 -219 236 20 -249
5225b49N15l35J80P0k59j94K84o9J12k44J63K9J43o2q7pK23m10M4O8J30k17P30
$$ -249 266 -69 111 181 -78 -272 12 -57 55 -189 -26 3 146 84 -3 -10 213 -197 -153 -85 45 -172 558
5248E58l36J8J52o92N12n1k08lq0K24k03J60Q8k49K80jP8n0n9j40L15j30l15O7
$$ 558 222 240 392 -300 212 161 -47 -50 -130 94 -109 51 139 -110 170 169 247 197 138 -2 313 183 -132 -65
5272f5j28J40N7k3k31J09L36k4m64N11j31J42l80L42m72J70L8J70R2l52J51K06
$$ -65 -193 -53 4 -19 -250 -141 195 171 -293 218 87 229 -151 191 -281 -111 -73 97 189 -163 -12 194
5294A94q5j88k1N4J51J99l89P1K04m08O15m37p0o5j15N21j48J38l85J47j78K89
$$ 194 109 -79 -100 -46 105 304 -85 -14 190 -218 397 -40 -110 -175 -290 231 83 221 -164 -17 -195 94
5316I4rJ00k67P20p45J59Q6p6J24m7r9K64m23P8k69K50J72J40k66k41N55l59J44
$$ 94 85 185 -82 638 -107 52 138 62 186 139 40 304 -119 -41 -310 -60 112 252 -14 -255 300 -59 85
5339H5o3lp5N87o23J90q5j02j29J17K85l68M16m66N64j75n0k7K2J19k66K78P7
$$ 85 22 19 -56 531 -92 98 13 -89 -218 -101 184 -184 232 -234 330 155 105 78 100 219 -47 231 308
5362C08k03l39O37j88m36J37J50L9o7K51j93j77M28n34j0J43K88l52K22j5J30
$$ 308 105 -234 403 215 -221 -84 66 105 38 289 96 -81 347 -187 -197 -54 234 -118 104 89 219
$$ [...]
8191C2
##END NTUPLES=NMR FID
##END=
