##TITLE=1H ikalashn
DE-77_oil
15.11.2024
##JCAMPDX= 6.0         $$ Bruker NMR JCAMP-DX V2.0
##DATA TYPE= NMR FID
##DATA CLASS= NTUPLES
##ORIGIN= UXNMR, Bruker Analytische Messtechnik GmbH
##OWNER= root
$$ TOPSPIN		Version 1.3
$$ 2024-11-15 14:16:44.609 +0400  Irina@DPX200
$$ Compression mode = diff/dup
##.OBSERVE FREQUENCY= 200.131300845
##.OBSERVE NUCLEUS= ^1H
##.DELAY= (6, 6)
##.ACQUISITION MODE= SIMULTANEOUS
##.ACQUISITION SCHEME= undefined
##.AVERAGES= 64
##.DIGITISER RES= 18
##SPECTROMETER/DATA SYSTEM= spect
##.PULSE SEQUENCE= zg
##.SOLVENT NAME= CDCl3
##.SHIFT REFERENCE= INTERNAL, CDCl3, 1, 17.49637
##AUDIT TRAIL= $$ (NUMBER, WHEN, WHO, WHERE, WHAT)
$$ ##TITLE= Audit trail, TOPSPIN		Version 1.3
$$ ##JCAMPDX= 5.01
$$ ##ORIGIN= Bruker BioSpin GmbH
$$ ##OWNER= Irina
$$ $$ F:/spectra/data/iren/nmr/1H/4/audita.txt
$$ ##AUDIT TRAIL=  $$ (NUMBER, WHEN, WHO, WHERE, VERSION, WHAT)
(   1,<2024-11-15 14:15:58.984 +0400>,<Irina>,<DPX200>,<TOPSPIN 1.3>,
      <created by zg
	started at 2024-11-15 14:11:46.093 +0400,
	POWCHK disabled, PULCHK disabled
       configuration hash MD5:
       BE 6D 3F 07 2A EA 11 49 91 17 2B D3 AF B3 58 0D
       data hash MD5: 16K
       B4 EF 61 43 36 D6 7B 8E 21 F8 4C 41 FE FE F7 B8>)
$$ ##END=
$$ 
$$ $$ hash MD5
$$ $$ C7 60 DB 72 7C D8 E4 26 F2 D9 12 D1 90 85 48 7F
##$RELAX= 
##$RELAX= 
##$RELAX= 
##$RELAX= 
##$RELAX= 
##$RELAX= 
##$RELAX= 
##$RELAX= 
##$RELAX= 
$$ Bruker specific parameters
$$ --------------------------
##$DU= <F:/spectra>
##$EXPNO= 4
##$NAME= <1H>
##$PROCNO= 1
##$TYPE= <nmr>
##$USER= <iren>
##$AMP= (0..31)
100 100 100 100 100 100 100 100 100 100 100 100 100 100 100 100 100 100 
100 100 100 100 100 100 100 100 100 100 100 100 100 100 
##$ANAVPT= -1
##$AQSEQ= 0
##$AQ_mod= 1
##$AUNM= <au_zg>
##$AUTOPOS= <>
##$BF1= 200.13
##$BF2= 200.13
##$BF3= 200.13
##$BF4= 200.13
##$BF5= 200.13
##$BF6= 200.13
##$BF7= 200.13
##$BF8= 200.13
##$BYTORDA= 1
##$CFDGTYP= 0
##$CFRGTYP= 5
##$CHEMSTR= <none>
##$CNST= (0..63)
1 1 145 1 1 1 1 1 1 1 1 1 1 1 1 1 1 1 1 1 1 1 1 1 1 1 1 1 1 1 1 1 1 1 
1 1 1 1 1 1 1 1 1 1 1 1 1 1 1 1 1 1 1 1 1 1 1 1 1 1 1 1 1 1 
##$CPDPRG= <>
##$CPDPRG1= <>
##$CPDPRG2= <>
##$CPDPRG3= <>
##$CPDPRG4= <mlev>
##$CPDPRG5= <mlev>
##$CPDPRG6= <mlev>
##$CPDPRG7= <mlev>
##$CPDPRG8= <mlev>
##$CPDPRGB= <>
##$CPDPRGT= <>
##$D= (0..63)
0 2 0 0 0 0 0 0 0 0.06 0 0.03 0 0 0 0 0.0002 0 0 0 0 0 0 0 0 0 0 0 0 0 
0 0 0 0 0 0 0 0 0 0 0 0 0 0 0 0 0 0 0 0 0 0 0 0 0 0 0 0 0 0 0 0 0 0 
##$DATE= 1731665757
##$DBL= (0..7)
120 120 120 120 120 120 120 120 
##$DBP= (0..7)
150 150 150 150 150 150 150 150 
##$DBP07= 0
##$DBPNAM0= <>
##$DBPNAM1= <>
##$DBPNAM2= <>
##$DBPNAM3= <>
##$DBPNAM4= <>
##$DBPNAM5= <>
##$DBPNAM6= <>
##$DBPNAM7= <>
##$DBPOAL= (0..7)
0.5 0.5 0.5 0.5 0.5 0.5 0.5 0.5 
##$DBPOFFS= (0..7)
0 0 0 0 0 0 0 0 
##$DE= 6
##$DECBNUC= <off>
##$DECIM= 32
##$DECNUC= <off>
##$DECSTAT= 4
##$DIGMOD= 1
##$DIGTYP= 9
##$DL= (0..7)
0 120 120 120 120 120 120 120 
##$DP= (0..7)
150 150 150 150 150 150 150 150 
##$DP07= 0
##$DPNAME0= <>
$$ [...]
##$SW= 21.9926040160658
##$SWIBOX= (0..15)
0 0 2 0 0 0 0 0 0 0 0 0 0 0 0 0 
##$SW_h= 4401.40845070422
##$TD= 16384
##$TD0= 1
##$TE= 300
##$TE2= 300
##$TE3= 300
##$TEG= 300
##$TL= (0..7)
0 120 120 120 120 120 120 120 
##$TP= (0..7)
150 150 150 150 150 150 150 150 
##$TP07= 0
##$TPNAME0= <>
##$TPNAME1= <>
##$TPNAME2= <>
##$TPNAME3= <>
##$TPNAME4= <>
##$TPNAME5= <>
##$TPNAME6= <>
##$TPNAME7= <>
##$TPOAL= (0..7)
0.5 0.5 0.5 0.5 0.5 0.5 0.5 0.5 
##$TPOFFS= (0..7)
0 0 0 0 0 0 0 0 
##$TUNHIN= 0
##$TUNHOUT= 0
##$TUNXOUT= 0
##$USERA1= <user>
##$USERA2= <user>
##$USERA3= <user>
##$USERA4= <user>
##$USERA5= <user>
##$V9= 5
##$VALIST= <valist>
##$VCLIST= <CCCCCCCCCCCCCCC>
##$VD= 0
##$VDLIST= <DDDDDDDDDDDDDDD>
##$VPLIST= <PPPPPPPPPPPPPPP>
##$VTLIST= <TTTTTTTTTTTTTTT>
##$WBST= 1024
##$WBSW= 25
##$XGAIN= (0..3)
0 0 0 0 
##$XL= 0
##$YL= 0
##$YMAX_a= 3038600
##$YMIN_a= -1868867
##$ZGOPTNS= <>
##$ZL1= 120
##$ZL2= 120
##$ZL3= 120
##$ZL4= 120
##$ABSF1= 10
##$ABSF2= 0
##$ABSG= 5
##$ABSL= 3
##$ALPHA= 0
##$AQORDER= 0
##$ASSFAC= 0
##$ASSFACI= 0
##$ASSFACX= 0
##$ASSWID= 0
##$AUNMP= <proc_1d>
##$AXLEFT= 0
##$AXRIGHT= 0
##$AXTYPE= 0
##$AXUNIT= <>
##$AZFE= 0.1
##$AZFW= 0.1
##$BCFW= 1
##$BC_mod= 2
##$BYTORDP= 1
##$COROFFS= 0
##$CY= 7568.61572265625
##$DATMOD= 1
##$DC= 2
##$DFILT= <>
##$DTYPP= 0
##$F1P= 17.9538593292236
##$F2P= -4.03888763876832
##$FCOR= 0.5
##$FTSIZE= 32768
##$FT_mod= 4
##$GAMMA= 1
##$GB= 1
##$INTBC= 1
##$INTSCL= 1
##$ISEN= 128
##$LB= 0.02
##$LEV0= 0
##$LPBIN= 0
##$MAXI= 945.577
##$MC2= 0
##$MEAN= 0
##$ME_mod= 0
##$MI= -402.1523
##$NCOEF= 0
##$NC_proc= 0
##$NLEV= 6
##$NOISF1= 8.587773
##$NOISF2= 6.764455
##$NSP= 1
##$NTH_PI= 0
##$NZP= 0
##$OFFSET= 17.49637
##$PC= 1
##$PHC0= 129.0637
##$PHC1= -15.43751
##$PH_mod= 0
##$PKNL= yes
##$PPARMOD= 0
##$PPDIAG= 0
##$PPIPTYP= 0
##$PPMPNUM= 100
##$PPRESOL= 1
##$PSCAL= 0
##$PSIGN= 0
##$REVERSE= no
##$SF= 200.13
##$SI= 32768
##$SIGF1= 18.5376
##$SIGF2= -6.396296
##$SINO= 400
##$SIOLD= 32768
##$SREGLST= <1H.CDCl3>
##$SSB= 3
##$STSI= 0
##$STSR= 0
##$SW_p= 4401.40845070422
##$SYMM= 0
##$S_DEV= 0
##$TDeff= 0
##$TDoff= 0
##$TI= <>
##$TILT= no
##$TM1= 0
##$TM2= 0
##$TOPLEV= 0
##$USERP1= <user>
##$USERP2= <user>
##$USERP3= <user>
##$USERP4= <user>
##$USERP5= <user>
##$WDW= 1
##$XDIM= 8192
##$YMAX_p= 0
##$YMIN_p= 0
$$ End of Bruker specific parameters
$$ ---------------------------------
##NTUPLES= NMR FID
##VAR_NAME=  TIME,          FID/REAL,        FID/IMAG
##SYMBOL=    X,             R,               I
##VAR_TYPE=  INDEPENDENT,   DEPENDENT,       DEPENDENT
##VAR_FORM=  AFFN,          ASDF,            ASDF
##VAR_DIM=   8192,          8192,            8192
##UNITS=     SECONDS,       ARBITRARY UNITS, ARBITRARY UNITS
##FACTOR=    0.0002272,     1,               1
##FIRST=     0,             0,               0
##LAST=      1.8609952,     -544,            307
##MIN=       0,             -1868867,        -1868867
##MAX=       1.8609952,     3038600,         3038600
$$ Real data points
##PAGE= N=1
##DATA TABLE= (X++(R..R)), XYDATA
$$ [...]
2614f476L203K283K508K503K578N44l088l050k649j652j638j602J150K826L433
2629H73L335L78J379o97j866k524l778l340r3J580J426K405K821K879K249j038
2645E989k720l218j737j745k777l96J943L687L337J839J496M05j076k885l016
2660h74k810k312j91J437K049K536L119K840J96r13k315k393k960l034j102R61
2676e766K906K471K475K096J989j48k219k793k662k474j228k28P32K329L267M081
2692D828J008J36j821k114k358k597l339o23K230K192K958K046K569Q06m14k118
2708C389l252k945k082j073R41J806J696L201L100J088o14j837k321k656k491
2723d050j399q9J694J574L259K553J990j67j003j953k897l036k227m95J620K137
$$ y = [-6476, -3273, -990, 1518, 4021, 6599, 7143, 4055, 1005, -1644, -3296, -4934, -6536, -5386, -2560, 873, 4208, 4586, 5965, 5268, 3402, 878, -2900, -6240, -6333, -4753, -3327, -922, 1899, 4778, 7027, 5989, 3269, 51, -1686, -3431, -6208, -6604, -4661, -974, 2363, 4202, 5698, 6103, 5027, 2142, -874, -3684, -5996, -6187, -4750, -2701, -165, 2954, 5794, 5990, 5077, 2762, 369, -2591, -5625, -6727, -5766, -2860, -389, 2086, 4182, 6171, 6023, 3804, 1011, -1651, -4125, -5353, -5581, -4849, -2520, 747, 4828, 5836, 5972, 4151, 2037, -321, -2918, -6257, -6880, -4650, -2458, 500, 2546, 5115, 5921, 5507, 3389, 137, -2808, -4890, -5963, -5022, -3216, -1520, 1681, 4781, 5869, 5255, 3418, 1097, -1559, -4050, -5449, -5538, -3844, -2270, 989, 3542, 5532, 5365, 4362, 2409, -488, -3524, -5751, -6246, -4626, -2489]
2739b489K642K558J807J509n31k822k480l099k367j70O31J193K516L170K357R66
2755E391o52o73l422k134k748j312J88J148K436K307K894K117o7j570j741k343
2771a81l093k084m83Q30K550K780K517J297J195k1j760l286l291j795k74L7R53
2788d109K202L605L053J428j110j553j612k485l201k117p5J579K798K258K570
2803C231J392R91l66k773l409k331j557n20N67J517K681L480K552M37j387j099
2819C406k388k943j782k371J118K109K271J884K644J622m0j496k738k731j206
2834b641j751j247P34K973L057K311Q65L13k66j435k959l080k285M27J230J036
2850b718K116K715K897J099j250k481j876j735k267j227k62O76L288L274J161
$$ y = [-2489, 153, 2711, 4518, 6027, 5496, 2674, 194, -2905, -5272, -5442, -4811, -3618, -1102, 2068, 4425, 5391, 4739, 4066, 644, -1490, -4238, -5550, -5362, -4214, -1778, 529, 3423, 5540, 5473, 3903, 2162, -181, -3274, -5358, -5841, -5011, -2461, 319, 2836, 4133, 5328, 5307, 3547, 261, -3030, -4825, -5099, -5062, -4109, -1907, 1698, 4751, 6179, 5069, 3516, 1904, -581, -3782, -5899, -5974, -4395, -1597, 661, 3231, 4623, 5614, 5248, 2475, -934, -3265, -4822, -5342, -4775, -3258, -577, 2903, 5455, 5892, 4505, 3406, 1018, -1925, -3707, -6078, -4960, -2851, -580, 1304, 3948, 5570, 5530, 4034, 1296, -1435, -2641, -4392, -5639, -4905, -1932, 1125, 3436, 4301, 4614, 4348, 2913, -46, -3126, -5411, -4984, -3754, -2718, -602, 2113, 5010, 6109, 4859, 2378, 502, -1233, -3500, -4727, -4989, -4313, -1025, 2249, 3410]
2865C410Q86K42k00k377l353k620j174P50P96J684K208L039J931Oj089j761k146
2882B32k520k226j242Q14K273K222K062K276J394k12j529k997k630j772j735K57
2898e333J836K574L103K157P92k07r31k338k588k618j571j97J197K678J912K158
2914B624J618J197q98k819k040k278j235j173L71J677L097J862J884P64j80j791
2930B680k100k314j286j873j11J389K608L076J297R65M30p32k594j977k408k203
2946e153J28J270K004K085J949J968J576j709k583k046j549j397j721N98J780
2961b800K659K452J105M81Q76j717j893k851j929r27L6J454J793J940K674J558
2977D911p6j232k453j552k178k116o59J236K500K620J450J291J606n75k838k275
$$ y = [3410, 4296, 4538, 4338, 1961, -1392, -4012, -5186, -4436, -3640, -1956, 252, 3291, 5222, 5228, 4139, 2378, 232, -2288, -4514, -5756, -4942, -2669, -447, 1615, 3891, 5285, 5073, 3544, 547, -2083, -3855, -5590, -5333, -3497, -923, 2180, 4337, 5129, 4922, 3991, 1653, -935, -3553, -5124, -5321, -4124, -1446, 466, 2624, 4242, 5439, 4541, 1722, -318, -2596, -3831, -5004, -4633, -2956, 141, 2003, 3887, 4651, 4471, 2680, 580, -1734, -3020, -4893, -5004, -3615, -1007, 2069, 3366, 4331, 4761, 4029, 1435, -542, -2950, -5153, -5025, -3755, -1751, 334, 2283, 4251, 5827, 4118, 1535, -511, -2060, -3457, -5178, -4580, -2800, -141, 2311, 3416, 3897, 4773, 3056, 1163, -1688, -3617, -4544, -4508, -3054, -1261, 679, 3353, 4911, 4835, 3603, 1150, -402, -2580, -4696, -5355, -4119, -1619, 1001, 2451, 3742, 5348, 4773, 1935, -340]
2993c40k129r70q49L46J188J711K560K888O95o64j851j243k368k409j545L77J902
3010b701K497J256J112K430K42j201k244k531j794o17n14J41K111K399K144R50
3026C680N81o35j314j529k396k663q22R39J698J943J717J757K033l51j717k590
3042C31j481j858j322j48R22K946J650K349L73J99n48j755k295j999j658K80J134
3059b880R61J720K344K076N99j581j539j561j628j886j255N88J628K547J793J618
3075C544K58J1j84k763k976j485k51L47P47J221K213K570N63L30j450j471j787
3092e63j771j761l68J424O32K765J951J924K5l53j323k066k783j314p53L11J608
3109b415J982K786J691N8j162j1j988k157j777j265L16J046J841J665J827J549
$$ y = [-340, -2469, -3439, -4288, -3942, -2754, -1043, 1517, 4405, 5100, 4436, 2585, 1342, -1026, -3435, -4980, -4603, -2701, -204, 1052, 2164, 4594, 4836, 3635, 1391, -1140, -2934, -3551, -4065, -3924, -1813, 586, 2730, 3680, 4261, 3626, 2312, 783, -1613, -4276, -5098, -4159, -2461, -518, 1199, 2956, 4989, 4638, 2921, 331, -1150, -3008, -4330, -4478, -3556, -610, 1040, 3389, 3762, 3961, 3413, 1658, -637, -2636, -4294, -4014, -2880, -1919, -199, 2145, 4221, 4820, 3239, 1700, 139, -1489, -3375, -4630, -4042, -2414, 133, 1926, 3544, 3802, 3813, 3629, 866, -2110, -3595, -3846, -3499, -2752, -1531, 682, 3252, 3815, 4145, 2695, 1224, -563, -2334, -4095, -4463, -3039, -2407, 358, 2309, 4233, 4258, 3905, 2582, 516, -2267, -3581, -4334, -4023, -2415, -433, 2353, 4044, 4102, 2940, 2929, 941, -1216, -2993, -4258, -3942, -2896, -1055, 610, 2437, 3986]
3125C986j22r41j043k529j460j195n56L21J389J863K480J618J49r9j756j723k669
3142b287j062j26m09J391K367J581J789K20r5o41j855k105j588n44K1R64J195
3159a184J837J741J257r3m21j907j726j606j739K42k84J199L294K167M69r0K94
3176C450j079k099k827k83n37N32O17J615K198J471N89m31j65k343j536k016p79
3193c623K2N56J869K170J446L68R77r22j082k674k052k55oP8J028K237J984J178
3211C299k64k88q09p65k593j800k1k61J546J507J845Q29R93R67j594k360j745
3228a514q54o24q18P74J573K487J169P58M9k35n75k596j796j144N02l24J651R69
3246e48K651R53N28n24j007k398r01q52j821L46J123K337J615Q33O75n9l43k154
$$ y = [3986, 3864, 2923, 1880, -649, -2109, -3304, -3860, -3539, -2150, -287, 2193, 3811, 3960, 3861, 2105, 382, -2287, -3349, -3475, -3884, -2493, -126, 1455, 3244, 3464, 3369, 2728, 873, -1232, -2820, -3364, -3343, -2379, -1184, 653, 2394, 3651, 3558, 3137, 1230, -496, -2102, -3841, -3599, -3883, -2684, 610, 2777, 3246, 3156, 3450, 2371, 272, -2555, -2838, -3375, -2843, -2226, -611, 1587, 3058, 3647, 3216, 3051, 708, -828, -2844, -3623, -3601, -3045, -1176, 994, 2440, 2808, 3785, 2863, 1781, -893, -2945, -3200, -3206, -3128, -2100, 137, 2121, 3299, 3035, 2747, 1938, 1173, -1420, -3220, -3241, -3502, -1956, -449, 1396, 2225, 3218, 4185, 2591, 231, -1514, -2368, -2992, -3810, -3036, -1463, 1024, 2193, 2951, 3000, 2765, 2190, -406, -2202, -3346, -2844, -3168, -1517, -548, 2103, 3056, 3584, 3060, 2053, -345, -1246, -2098, -3919, -3573, -2450, -113, 1502, 2335, 3010, 2951, 2608, 454]
3264D54j763r35j154M08M80J045K300J214J231n10k82j043k029j035q71p17m3
3281c250J737J621J333L91J657o06j014j371k346n61p11J50R92J463J638J508
3297B631L70K25j383j298j714j247l13k45L23J543J848R87J145P01j122r04j821
3314b74j490j209l06O85Q64J781J348J375K79K18j521j458j282j558k75n45J436
3331a932J222J190J953P26m01q57q48r47k301r45j07Q91J493J648J428O38K76
3348C127k86j530j743q31r82n29j41Q72K262J228J171L5L4r53j260j640j128j15
3366b409o23J613O80J778J319N86j17j090n66k140k19j475p99J333J535J443M95
3383A344Q72P79m65q12j914j515n51l91N52M07J508J642J376k68o87j97j060j464
$$ y = [454, -1309, -2244, -3398, -2990, -2510, -1465, 835, 2049, 3280, 2770, 2488, 1445, -584, -1619, -2490, -3207, -3250, -1513, 108, 1441, 1832, 3489, 2883, 1869, 498, -1848, -2409, -3120, -2970, -1978, -515, 1123, 2631, 3001, 3226, 1843, 545, -1169, -2416, -2729, -2974, -2651, -1108, 740, 1727, 2872, 3573, 2451, 1547, -274, -1764, -2973, -3279, -2594, -1730, 51, 1399, 2774, 3053, 3271, 1750, 292, -990, -2548, -2823, -3368, -1932, -710, 480, 2433, 3159, 2758, 1901, 1053, 106, -2195, -3140, -3247, -2356, -863, 785, 2213, 2851, 3127, 2841, 1311, -432, -1263, -2245, -2774, -2915, -2043, 219, 1447, 2618, 2653, 2687, 1734, 474, -1166, -2294, -2409, -3032, -1419, -739, 1039, 2358, 2944, 2827, 1737, 1171, -969, -1188, -2663, -3462, -2129, -594, 849, 1344, 2216, 2995, 2530, 1718, -196, -1711, -2262, -2653, -2101, -1694, -186, 1456, 2832, 2564, 1877, 1680, 620, -844]
3401h44j383j149L72J116J803P29J462Q46oj404p23j660q59o97l35M93J127J704
3419E92J093J369n55l4n81j619j244j663l01J474K45Q59R20J527P56j20j164j669
3437a15q19p52m94j046P57J962J496J403L66n35j25j273j256j491j196O88J65
3454b265J777J042R90J428j85p00j195j173j096j202P4j81K028L57J654N58M70
3471B381k53p26j476j592o46p6M9P58P43J117J315J001k00p86p66j549j222o56
3489b584n4M02R47J307J327Q33p7J10j389j208j011j215L79L74L59J271J483O10
3507A864M88m24r67q62j522o25p62N04P00O22J617J353J40J47r17l43j461q88
3525a336r24n48R03Q84J456O24J213L26m86j432q33j144q32J56l03J161J137R40
$$ y = [-844, -2227, -3376, -3004, -1888, -85, 644, 2106, 2952, 2946, 1542, 819, -841, -1700, -2397, -2732, -2239, -1112, 592, 1685, 3054, 2499, 2465, 1884, 265, -979, -2642, -2943, -1469, -1224, -365, 555, 2082, 2838, 2718, 1554, -115, -934, -1686, -2180, -3226, -2469, -507, 989, 2392, 2758, 2223, 2098, 825, -431, -1922, -3118, -2430, -2265, -488, 554, 1544, 2972, 2787, 2087, 892, -281, -1377, -2579, -2505, -2686, -658, -301, 1353, 1911, 2381, 2128, 1402, -74, -1666, -2312, -2388, -2339, -1581, -838, 279, 1594, 2595, 2395, 1609, 843, -706, -1928, -2584, -2638, -2236, -1289, 18, 1345, 2178, 2101, 2211, 822, -386, -1397, -2612, -2233, -1859, -1500, -229, 1254, 1864, 2352, 1928, 961, 99, -1423, -2048, -2810, -2306, -1606, -984, 633, 1986, 2126, 2273, 1356, 1013, -448, -1336, -2260, -2808, -1905, -1021, 435, 1059, 2272, 2598, 2112, 680, -153, -1297, -2129, -1973, -2276, -1115, 22, 962]
3543I62R35M60p51n16r36j517o55n31M87P19J003P66J473L28k11j86j329r96q73
3562a368n15n56N65J180J179P62R52k4J5j252o70k223K79m45K52M24J410Q03J063
3581A831O51o98p65j122m42j029n66P0R01J027Q92O23L41M21l14j348j585q81
3599a993o98Q02L8P98J422J489J35k12k83j080l00j306o04m20L28R42R71Q68P20
3618A617K44K93p79j234q76r64k28J85P6Q72J510J010M41k65m5j421j36j716j065
3637b481j66Q57J105N85J150O59L68M1j263j381l35n66m70n11R35J522Q89M45
3655A383K46j08l21r55j089o68n13K61Q10O10L65J654O47l91l72j139m40q19j097
3674a936j30N60J036O20O11O08L25k39l44j320p61r43l99J88P26O31J354J007
$$ y = [962, 1897, 2357, 1606, 1090, 154, -1363, -2018, -2549, -2062, -1343, -340, 426, 1899, 2227, 2016, 1830, 501, -495, -1368, -1883, -2439, -1874, -694, 485, 1247, 2199, 2175, 2190, 938, 268, -1955, -1676, -2121, -1869, -1445, -35, 768, 1831, 2482, 1784, 1019, -103, -545, -1574, -2140, -2070, -1169, -142, 750, 1373, 1714, 2135, 1821, 473, -1112, -1993, -2691, -1889, -1851, -1053, 369, 1858, 1993, 1781, 1498, 418, 118, -1188, -1792, -2212, -1884, -942, 29, 897, 1617, 1861, 2154, 1375, 141, -735, -1699, -1927, -1742, -1666, -794, 716, 1726, 2167, 1902, 1857, 436, 300, -1416, -2481, -2647, -1790, -685, -100, 1050, 1709, 2077, 2118, 855, -526, -861, -1427, -1897, -2408, -1473, 49, 938, 1383, 1629, 1521, 1200, 245, -844, -1512, -2025, -1764, -954, -344, 21, 1675, 2322, 1931, 1559, 420, -20, -839, -1936, -2066, -1506, -470, 150, 761, 1369, 1694, 1455, 1111, -209, -970, -1913, -2312, -2124, -1398, -767, 587, 1594]
3692A594L12k34k99r44r24j333l42J07N46J236J22J070J424p27k23r31q36p42
3710a124o09j00M84O96P80J248O5J16k0o05r38q67o2j034O6P23J292P09J446r0
3730B176k79n18j043j273m47p86J75R19R43O73Q18N62l01n29l84j061r74j53m48
3749a930L54Q79J080Q78J34m9j8n67j048m38j043Q3j83J044R15N59Q08K69K95
3768B022j034j295j71m20o88qJ072J25Q56J220j10K72o05O6j503p56o99K82N11
3787h63m34Q79J151R33M55n19q26j179o59n27k37M32P80P48L44R51N33k19n43
3806A200r92j027p89k16P33K31O22K49P97J027n81l06j18j115q79l31q1L77P07
3825d92O76M45O88K41o83k14q26o44m57p7o2M04R38O75Q13L58m39m35n20j053
$$ y = [1594, 1906, 1672, 1373, 429, -495, -1828, -2170, -2063, -1517, -281, -159, 911, 2335, 1608, 1385, 454, -382, -1124, -1733, -1833, -1349, -653, 127, 1375, 1440, 1556, 1536, 931, -7, -874, -936, -1970, -1904, -1181, 111, 820, 2266, 2176, 1897, 1379, 336, -937, -1384, -2170, -1995, -1076, -133, 540, 1358, 1920, 1619, 1090, 706, -355, -1329, -1482, -1930, -1576, -697, 383, 1261, 1395, 1346, 1328, 761, -287, -725, -1768, -1685, -1868, -824, 91, 650, 1458, 1727, 2022, 988, -307, -478, -898, -1586, -1594, -522, -397, 459, 1679, 1569, 1841, 1236, 1302, -201, -957, -1656, -1374, -863, -1297, -418, 733, 1666, 2121, 1602, 776, -403, -1062, -1589, -1826, -1394, -614, 134, 478, 1429, 1962, 1743, 1200, 208, -819, -1608, -1824, -1091, -860, -238, 11, 808, 1835, 1254, 948, 830, -285, -1164, -1495, -1576, -1199, -492, 184, 629, 1317, 1558, 875, 661, -165, -809, -1266, -1343, -1405, -1001, -63, 612, 1425, 1783, 1344, 909, 389, -664]
3845f64q49m44N59N45M87R05N40K23j5k88n42l29j245q38K84M34P22Q86L73M97
3865A241l5K25o13q85l42j107L58j61K46L69J384N83J66K86r00n22q84n67k52
3884a410R1K78J023L70R73K73n2k90j047p22k78q03K07K54O95N78K27R43J76k90
3904A196j022m37m41k78l2K29l98J223N39P45j81j0j2l24j443m43j34q00J013
3923a010Q03R45L73PK45o26l42o53j088M39k80o1M67P61Q71N88L85p73p97j71
3943H3o31m68l71M85j38P34O51Q22O62l27q26k57j175l75p1l35N37M41R62L84
3963G87j68K42M99m53j485p17K84k28m07J029Q80O83M45k10l90m94l67q40p6m31
3983a417P6O90N04N57J079N8j07p65k64p94q14O3LL67L28N96Q41J99k21qj1p57
$$ y = [-664, -1513, -1957, -1398, -853, -366, 539, 1079, 1302, 1287, 999, 457, 128, -1117, -1955, -1671, -1237, -515, 371, 744, 1241, 1206, 1431, 818, -67, -409, -1516, -1158, -1319, -1073, -704, 680, 1263, 1429, 1715, 815, 293, -591, -1158, -1410, -1319, -1041, -18, 352, 1325, 1598, 1546, 1256, 209, -513, -791, -1594, -1387, -1133, -438, 140, 367, 1310, 1486, 1196, 174, -263, -704, -982, -1014, -785, -1183, 40, 579, 1324, 1143, 1133, 1121, 797, -646, -1089, -1223, -2023, -1010, -207, 738, 1111, 1118, 1363, 737, 395, -258, -1346, -907, -1187, -1248, -781, -20, 851, 1439, 1824, 1051, 254, 83, -548, -1016, -1387, -902, -1040, -306, 345, 1167, 1829, 1502, 676, 419, -756, -1131, -1202, -1537, -1000, -559, 403, 787, 619, 861, 1360, 907, -578, -1295, -1011, -1239, -1646, -617, 263, 946, 1391, 1181, 791, 297, -70, -910, -986, -1417, -1341, -651, -147, 410, 1489, 1547, 1440, 675, 411, -383, -1197, -1134, -1131, -764, -436, 160, 1001, 1200, 979, 971, 960, 203]
4005B03q91n29k58O01P69L86K95L35J76k62j04j094m48k53j68m6J39J225P74Q1
4025I31M73j49l88r14j44p62j87l28R0J785l26O34R59k34m94J06j213m82j0k68
4045i21PN74N74L87R10p97K87l55m71r21j35j51j7M05L47N65P79j76k9j69o52
4066D1j251J47LoP11J02O03M63J99j38l66N6o65m40q11J3M30j28J407M67O43P9
4088A559r12l52p0q91l30j40L15Q39K48j11Q55M06n74J52r78k79m80p6m6N69N6
4109b40K55L17J037k3n24l50m20n76k79m29M96N09l18J420j90N85q53L4m67p63
4129g79m28J3L13K89J121k04M06JM2q5j092l27j38k07K54%O94K62R11K34k38k04
4151H38p92l47n44k51LQ78m7J20O01L06L27o02J48r64Q7o15L28n67L95M83Q72
$$ y = [203, -688, -1217, -1475, -874, -105, 281, 576, 911, 1087, 825, 721, -373, -821, -1074, -1242, -1288, -1149, 76, 850, 931, 1404, 1255, 867, -47, -191, -953, -1140, -1468, -1378, 407, 81, 715, 1674, 1440, 946, 1052, -161, -643, -653, -921, -914, -340, 234, 621, 1531, 734, 1021, 666, 195, -726, -861, -1012, -1029, -624, -277, 288, 1067, 891, 862, 693, 41, -1210, -1063, -1060, -1066, -355, -253, 350, 813, 1012, 874, 508, 564, -101, -541, -1352, -1339, -909, -1037, 370, 837, 1480, 1559, 647, 295, 225, -666, -996, -1136, -821, 18, 266, 155, 1010, 1416, 842, 994, 16, -263, -743, -819, -865, -296, -240, 15, 332, 1369, 1346, 822, 472, 52, -524, -803, -1232, -736, -227, -545, 875, 685, 1270, 417, 451, -16, -779, -1207, -1194, -881, -592, 529, 325, 731, 732, 774, 689, -403, -730, -868, -1075, -821, -821, -127, 135, 1046, 1280, 1042, 838, 46, -301, -845, -1096, -1093, -215, -262, -142, 459, 765, 1092, 490, 638, -326, -239, -854, -526, -1093, -698, -215, 657]
4172F57J5J57k02l96n8j151J73n5r3J7O02O83N50L78l19l47j90p97L92j227J17
4193a094K83J056m85P85J32r9N64o73l05r43m2J94M6q4O01N74L03L02n73k08j69
4214A65o24n83k50K94j42R47O04l3N07k72j53o34q5n0p38N91k15K64N7O19J011
4235A280l50k74m04m65l2k21q04O29N94O34p79J262l43K60r75J00n68l25L19q07
4255a269Q19J65M46N20J94m6m20n11J32l85o65o0M72L85q5M37P36Q1o1m53o78
4276b46L3o63p78R75O59N13kM80l58K37m86r69j91k84j48P93l01O67O37k17P64
4297A115j62l50q49j2l46M36q22P06K50J09N99J21n78J30J23j100M17l27j53R2
4317f01N72j33N14J70JM39p99k48m59m89J44K8L20J60Q96J21J61l7N5m61j188
$$ y = [657, 672, 829, 627, 231, 173, -978, -805, -860, -953, -936, -334, 349, 899, 1277, 958, 611, 421, -376, 16, -1211, -1094, -811, 245, -240, 545, 677, 578, 1142, 469, 164, -779, -821, -627, -581, -665, -64, 510, 813, 1115, 542, 334, 165, -459, -1042, -1292, -998, -1140, -193, 411, 378, 885, 613, 460, -174, -259, -309, -1047, -456, -671, -407, -350, 269, 1280, 930, 656, 252, -213, -245, -466, -1270, -641, -47, 587, -192, 1070, 727, 987, 12, 112, -456, -781, -462, -1269, -450, -285, 161, 681, 875, 829, 409, -102, 30, -355, -1020, -1080, -608, -223, -308, 129, 865, 946, 885, 432, -246, -213, -876, -1654, -679, -20, 493, 491, 971, 613, 850, 364, -605, -796, -1080, -1228, -435, -736, -69, 568, 351, 1115, 953, 603, -246, -258, -604, -168, -990, -284, -34, 75, 674, 795, 217, 347, 470, -630, -213, -540, -693, -601, -29, -162, 352, 522, 523, 962, 163, -85, -544, -1033, -889, -861, -541, -381, 515, 636, 797, 760, 815, 354, -834]
4338h34J39l0N60n72Q06P4N82K46k22J1m73n60j60j61l00M92M64oO87j78L5l1
4360E69k72k84n89K7o3M1jO35K99K68J7m9k16p85j60k1N88j135J19R72P36l32
4382C64L94k52J39p17k3k38m42L2J68K18O41L29k47J021q36q43m6J38p49J04k15
4403a060L43R35K41K17k02j84j47k64j42m92k04L38J04r4R35R1K27j87O54j386
4423b77k50n3L16r4K99N2L02j64L69L22m01j65m04J78m80m22J44Q87O6M66p07
4444a6N29k90N00l24n18j26m79j19J185j62L4Q9O60n95j68j61J50m34l91Q4m7
4465e99N71K56L39m2K36q34L0k70j23l28j67L42Q31m85L85L20J26p52j49K62r4
4486a45j73J3k74L18M33J22K25p5P2m55J96l44J82k21j53K0K57K60K09o9L60o81
$$ y = [-834, -695, -725, -165, -737, 69, 143, 725, 971, 749, 760, 287, -273, -433, -594, -894, -402, 62, 56, 743, 565, 600, 569, 297, 13, -576, -549, -612, -571, -572, 63, 362, 630, 647, 598, 382, -403, -563, -584, 4, -1131, -1012, -40, 696, 364, 758, 506, 645, -72, -95, -333, -775, -743, -575, -357, 284, 613, 366, 1387, 551, -292, -338, -200, -949, -845, -1060, -717, 218, 459, 676, 474, 290, 143, -121, -263, -755, -959, -621, -517, -611, 324, 415, 642, 455, 1109, -277, -527, -580, -264, -358, -59, -7, 295, 131, 500, 822, 421, 256, -148, 30, -450, -872, -728, 159, 225, 691, -16, 513, 223, 723, 399, -119, -245, -724, -843, 342, 180, 214, 303, 963, 368, 200, 39, 189, -245, -636, -552, -599, -28, 228, 567, 525, 761, -73, -43, -313, -436, -764, -931, -589, 242, -243, 142, 462, 588, -164, -313, -51, -145, -318, -305, -579, -261, 172, 294, 519, 444, 516, 61, 257, -87, 95, -126, -279, -259, -2, 258, 467, 398, 758, 77]
4508G7n8p0k53j58J55l43N32K2J58P58m33J89l46J02l64j21o05L7O05K0J72N17
4530E93rk04N4l89l32j2m46N81q3M59k88J67J88j2K01o07m54j11p6J17M66N4O36
4553D93P3n26P17p25Q2O3o20K43o79N52O0M5N11K7K73N0o62p2N5m61k50J46L56
4576b49k30N85l38O95K6r2o04K02n39l57M08J70M33K36m58N40K81k73o10L52j93
4597a5j07r4j91M73L6l15Q78J22j08m83j04k42m71N0L41O12k62J80l35M32m13
4618a6K39k83k19K97o60K60L07J07q4N90q4K4J68j094P51n06l7n51O53j32K54
4639a6N36Mj11j38l11m01K09k30P6P0k72L72M49J93n5L35p72J87r8j07p01N46
4661b35J64J90K17K94n74O13o76k0nm85K68o4j92M09K91k08Q39l97pl97J01k6
$$ y = [77, 19, -51, -304, -462, -307, -650, -118, -96, 62, 820, 387, 576, 230, 332, -32, -153, -758, -721, -116, -96, 76, 593, 584, 380, 434, 45, -287, -299, -745, -164, -247, 212, -76, 91, 279, 267, 468, -139, -593, -704, -780, -663, -197, -143, 493, 566, 40, 757, 32, 114, 177, -443, -200, -879, -327, -267, -222, 289, 316, 589, 639, -23, -95, -40, -501, -751, -605, -249, -479, 106, -232, 463, 489, 397, -207, -5, -544, -901, -493, -323, 110, 346, -112, 428, 709, 436, -174, 178, -15, -122, -216, -407, 66, 102, -213, 665, 787, 679, 196, 92, -150, -621, -571, -230, 382, 120, 300, -35, 397, -16, 223, -60, -279, 18, -642, -382, -75, 32, -52, 538, 454, 478, 646, -448, 303, -203, -240, -791, -138, -270, -16, 520, 524, 413, 275, -36, -437, -228, -458, -382, -312, -584, -212, 237, 430, 375, 710, -62, 125, 27, -80, -781, -235, -71, 119, 336, 630, 56, 669, -7, -27, -32, -517, -249, -313, -505, -96, 195, -13, 826, 429, 422, 25, 126, 100]
4683A00m83KN18o07P52J0k7K82j66m95J2L9o27L15K35j93L72L44O1O5k47p5K63
4706D50m61p67N90L0K82J29K62j20K11j30n3J92p73o29M58j18L62J40L53P2m79
4727AN64q23M13l48n81J042n52K8l45N73M12j18n5Q9l55K62m42P9k88M4J13N9
4749b28L16O95l25l19M65j013M99o51L42K91l3K13n8N6L61l64K84Jp50j05K46
4770g7j80J38k45J17J51L69P5L56k01q00L87o45N86n72K96R9M59n59L98j28O5
4791H9L11J14j254PP09p26Q76k78N64r4K66m79L61q71P75m34k29l93P43k5L28
4812C60k52K19L97q70J42l64K24j51K27l3M6Q1M60j25K96n02j15l13k86J03m41
4833h97P66K75J53j16k4m42O24o2n68k0R6l71M42j15N38J4L52m46J03K89p86q8
$$ y = [100, -383, -381, 137, -470, 282, 292, 265, 547, 381, -114, -102, -63, -690, -375, -140, -333, 39, 383, 444, 509, 262, 187, 450, -11, -778, -188, -158, 124, 253, 515, 395, 606, 476, 423, 615, -158, -787, -329, -447, -85, 55, 408, 480, 1, 565, -258, 155, -193, -774, 268, -284, -256, -601, -28, 384, 266, 211, 300, -55, 207, -235, -156, -444, -400, -287, -228, 88, 783, 458, 139, 604, -409, 90, -561, -219, 72, 39, 252, 194, 250, 611, 247, 531, 532, -218, -323, -77, -257, -119, -364, -247, -96, 273, 348, 704, 503, -297, 90, -555, 31, -541, -245, -146, 313, -246, 152, 24, 89, 400, 514, -740, -733, -24, -750, 126, -152, 412, 318, 584, 105, 466, -405, 370, -64, -293, -686, 57, 32, 360, 108, 327, 724, -146, -4, -368, -144, -295, -68, -101, -55, 26, 486, 361, 657, 155, 40, -273, -559, -456, -897, -131, 144, 297, 181, 157, -285, 339, 277, -291, -311, -215, -586, -144, -259, 279, 293, 645, 199, 302, 591, -195, -283]
4855b83p28R08K9J49p6M09j41L29p63M66J88r81M81o15J64K48M28n6M72k81m14
4876f7K12n0k36M11n43J7n02R32o1M84k44j09N6r13L61Jj27k73K53k21M04K65
4898E0K67J63j74k14N0p58k13M85M93l37J83M80j40N9l12m91O10n58N1k21m8J83
4920c92N61L92j56J88j44o0j9m87j47l46L42j06nM50K20r7N9j07L22m18j22l24
4942c96J62K08l1m10L91J49K31p7j4k4n11K99l49k19J50O20O4J11J36J23l75N3
4964B91j82k57n84K61J16N47Q4J01k38k82L49J6p3l80j63j93N29j62L65L70l23
4985A92N22m53q5J03n03L52m66K09J45j43P35l73K68K90n33j97k96l98NO65n35
5006d96K98L98o43L73P87p38O8l6k13k69RN1J52J71M33J37K18m34l9m07j61k2
$$ y = [-283, -1011, -103, -74, 75, -1, 408, 267, 596, -167, 299, 487, -494, -13, -628, -464, -216, 212, 156, 628, 347, -67, 145, 95, -141, 270, -273, -256, -758, 174, 113, 597, 353, 244, 300, -613, -252, -251, -378, -651, -398, -619, -215, 50, 317, 480, 306, 92, 142, -616, -829, -344, 149, -188, -5, 475, 335, 394, 82, -409, 201, -357, -306, -527, -575, -392, 169, 561, 405, 593, 449, 389, 370, -117, -264, -610, -268, -374, -379, 71, 291, 194, 253, 146, 468, 50, -72, -396, -234, -26, -57, -467, -76, 73, 304, 227, 213, 189, -322, -23, -372, -591, -441, 179, 243, 354, 490, 613, 238, 291, 109, -148, -732, -471, -355, 192, 276, 377, 139, -143, 206, 222, 149, -231, -394, -587, -58, -220, 145, 515, 192, 714, 261, 176, 279, -224, 128, -338, -129, 16, -127, 608, 235, 503, 793, 260, 63, -233, -631, -626, 39, -496, -198, 200, -443, -70, 717, -21, 47, 11, -202, -471, -462, -411, -259, -88, 345, 482, 700, 266, 227, -180, -341, -363]
5028c63l2M49l33L24L45l45O07m10j22J77l91K22p57O39l62P08r3q3J96J01j87
5049B90K24k04k57j06k86J28K56k61L16k25N44p19K81L41l91m08L44l87P17p5
5069A22o3M80k09n98K82j54o00M48k1O0P8m9K04O21n07P80n15k73l81k9ok02K05
5092c27M60J00K03k96M59k81o54M44q12N22o91P73O66n81M2L55m97O30J33q39
5112a91J55J32r04N13K24o2O36r9K08k44l04j57K0J74o94K85J86J21K18M8L4k70
5134B9J56K45j059J66Q3K68m48N74o38O72nJ76Q1m1J5m96k2M9P2l1k0N86k70j96
5158e4N76m32J01n4l78n63K16j73M56M18j53L85j29L2m0l12M5k4o13M9N05M31
5180B89m15P61k66j19m64m5N7l3L1j3k00M94J07O23q39M2p7J08j3m37M03o41N42
$$ y = [-363, -395, 54, -279, 45, 390, 45, 652, 242, 120, 297, -94, 128, -629, 10, -352, 356, 263, 180, 376, 477, 290, 514, 310, 53, -53, -339, -211, 45, -216, 100, -125, 419, -300, -19, 322, -69, -477, -133, -520, 197, 122, 59, 539, 330, -268, 14, -140, -740, -292, -313, -253, -175, -224, -20, 601, 94, 874, 359, 86, -295, -324, -330, -532, -327, 133, 233, 436, 140, 599, 318, -336, 108, -704, -182, -873, -100, 566, -15, 27, 382, -115, 515, 648, -191, -36, 96, -808, -295, -71, -133, 503, 404, 612, 368, 64, -93, -73, 101, -593, -308, -122, -1, 217, 265, 299, 29, 185, 430, -629, -463, -380, -112, -560, 14, -624, 48, 43, 219, 300, 259, 274, -222, -244, -195, -123, -154, -174, 412, 142, -54, 522, 90, 191, 137, -241, -804, -588, -761, -305, 113, -40, 345, 216, 248, 208, -104, -59, -83, -696, -647, -142, 289, -126, 635, 369, 250, -214, -259, -202, -235, -204, -217, -417, 77, 184, 807, -32, 10, -67, 41, 28, -409, -6, -647, -105]
5203a05o4N39J48n97O02k31M3j71n35k12L87Q8j8L92j7k71J20k7P8k77j03k08
5225d39M92n81O54l3j86O77o45q1J93n81M73j47n19K04L66k18L48M03j43R6K8
5246C61m18O6m92j02l05P12K99m59R34l10L83J94p92m04N86p62L5L2L07Q4j54
5267b05N71j44r8j87j63Kl9K94J21k91J22L20j59L69J45m72L79q38N1j6k74M45
5289f7K5L41j35P4q3L91l91L50q82L29n72J77J46M15m06L65q7J038p54m49k43
5310d18m5PL43l23L36K10L6K8K73j32M9j84r04J55J94J17l68L88M61p9M04k14
5332C34o41P90o01l02L89P8r2J41j99N0N50l09M1m6n06K03k03L37R8k27k6K64
5354A23N86o04M28o40K36k30Oj70k80L95N96k73r4j27L42m34m8J53l63mN68m96
$$ y = [-105, -169, 370, 518, -79, 523, 292, 335, 164, -371, -583, -196, -108, -126, 266, 249, -22, 98, 71, 149, -128, -231, -439, 53, -528, 126, 93, -93, 584, -61, -142, 51, -530, -57, -204, -723, -519, -153, -371, -23, 380, 237, 333, 361, -57, 9, -483, -585, -890, -178, 121, -338, 596, 286, 669, 863, 71, -333, 253, -509, -474, -442, -135, -51, -205, 366, 222, 124, -63, -226, -224, -263, 31, 152, -139, -17, 303, 144, 513, 658, 186, 565, -273, -222, -238, -512, -67, -42, 299, 164, 238, 155, 546, 155, 505, -377, -48, -620, -443, -297, 118, -288, 77, -10, 1028, 274, -175, -418, -463, -456, -113, -436, -100, 110, 146, 174, 447, 315, 364, 180, -724, -569, -375, -258, -626, -238, 223, 144, 548, 334, -307, 483, -118, -420, -31, 47, -45, 96, -103, -53, 497, 188, 229, 183, -323, -120, -323, 14, 112, -115, -141, 123, 709, 105, 533, -107, 129, -101, -95, -265, -545, -150, 446, 173, 79, -48, 294, -140, -188, -35, -398, -402, 166, -330]
5376c30J77K44M22J61p57L78l15N4l81K28k56l65J053m64J88K90j42j39k51L15
5396A10m37K08Mn61Q62j64L43l81K14O57j42r05K1j24l15L16J85j78N50M47n64
5417A46K72m78k36L44k67n46L99L01N4L00m30N68M3L21o94L7m31j47l70N84N02
5438B72l61M64j87m06N06l30n92L34l48N86n03L64oM00J0n9J27R8k21k23n1l23
5460d49N4rL73J55j36K65J32k49l13K63m58n4n8K46K44M39k38J23LJ39q7j02q62
5483e79K22N86o10N18k19N2M25qK95r69j91K83j81l00p8P09l81P55j84R8l03K56
5505A96K9j74n95n8P92p58L85k71O21p5M03o86L26m02J61q0J24J02k7k59L27L81
5527D62m17O97o20O3l79j05O32m89jL83j96K38N32l68j21k3l52j34n86L64J72
$$ y = [-330, -153, 91, 513, 674, -83, 295, -20, 34, -347, -119, -375, -740, 313, -151, 37, 327, 185, 46, -205, 110, -327, -119, -115, -676, 186, 22, 365, -16, 198, 855, 713, -192, -171, -295, -610, -294, -109, -287, 263, 710, 146, 418, -60, -296, 48, -219, -765, -366, -65, -11, 289, -141, 427, 470, 791, 97, 134, -297, -444, -814, -230, 272, -89, 375, 188, -218, 288, -42, -634, -300, -648, -62, -565, -201, -207, 193, 203, 144, 271, 369, 148, -75, -126, -449, -395, -404, -31, 124, -12, 253, 385, 136, -177, 86, -372, -426, -484, -238, 6, 445, 207, 330, 333, 472, 385, 283, -579, -357, 229, -381, 137, -82, -30, 395, 387, 682, -287, -478, -195, -376, -676, -754, -45, -426, 329, 145, 243, -60, 196, 225, 51, -544, -602, 190, -568, -183, -454, 167, 92, 495, -191, 135, -267, -106, -186, -62, 40, 13, -246, 81, 462, 45, 742, 122, 185, -194, -299, 333, -156, -157, 226, 30, 268, 800, 432, 311, 288, -64, -198, -784, -420, -248]
5548b48N00m65J052k06J7m15n2j99j60j27K53J04m58M53l32O33j22j39q2L35p66
5569d24l38P83p6j29J73j6m3K72P8K84k21p45R7Q8m21K42o5N14L70o60L70J27
5591B60n9j95n38j93N44k90P63n25J94M83K65q34J32M01n96M8J00m41L73j0M0
5612g8N14k52J75m6m84m2P0m5p60M21M77m24Q06n3J27K96n91j53K5l50j09M64
5634a2j93K09j62J4M05K63p09O88m56j91K97k82J2P4N51k49K7m55P52q50K28j21
5656a60J56n14L33k19l8M51L21k1K4n12J53j31K42l51K36o4m7P9N22K32m22p26
5678d56K69n24N77j60K56k72N44K04j57L17j16n22p5n96P40l01k55M1J25K03N30
5699C72k18L54p6j11J25p22M96j69k91l62P59P1J82n05J49j44L15q01O48m89m96
$$ y = [-248, 252, -213, 839, 633, 650, 235, 183, -16, -176, -303, -50, 54, -404, 49, -283, 350, 228, 89, 7, 342, -424, -762, 21, -55, -184, -11, -27, -70, 202, 280, 564, 343, -402, -305, -217, -638, -396, -461, 53, 423, -237, 133, 260, 201, 6, -532, -725, -181, -471, 292, -233, -39, 444, 709, -125, 7, 408, -188, -140, -40, -481, -108, -118, -78, 436, 184, 359, 313, -171, -213, -143, -188, -948, -527, -50, -474, 332, 279, 406, 702, 111, -42, -17, -367, -476, -12, -205, 4, -158, -144, 261, 524, -185, 503, 47, -144, 153, -129, -117, -43, 508, 259, 286, -169, 583, -267, -39, -160, -4, -518, -185, -404, -442, 9, 330, 309, 333, -179, -26, -157, 85, -266, -30, -94, -141, -62, 460, 692, 270, -456, -187, -711, -134, -294, -38, -310, 234, 438, 281, 598, 482, -40, -115, -711, 29, -272, -527, -486, -361, -158, 372, 154, 508, 432, 321, 446, -276, 220, 51, -240, -602, 157, 228, 410, -95, 54, -90, 225, -576, 72, -417, -913]
5720i13R54m9o9K68Rj62j59l0L88n82K08k76j13L34O95o5j46P9l08L92n22J09
5742D2q02K32M78n4j92M39J57P7j37o64N08J55Rq77M63j98L94j44R8Q0K6K66l06
5765E0k67J74n51N9r4Q38l20K47L9j16J53R7j10p05R3L86r09M63K91M55Q2K58
5787F13l21k5k56M44o30L0n1L49M28n41L90m01P22k65l34j1k02j07J7R1N42m42
5809D0j75R47l23l32k18J29r2l80k08N38k58L76n09P14j03l40L57q12O47K40l89
5830a51o81O74L73N3k96j47L73L55k28j78k40l24L2j21N75J05J89K01l83m12L48
5851A17m97L79k45K52l01L94K27k6k80N98m51j97r0N92q92J46M51k23j70l15M18
5872a13L40k41K64k4k37m66N42k32l80M20k53O38m03L82M37o64K35m51M47q18
$$ y = [-913, 41, -8, -77, 191, 200, 38, -121, -151, 237, -345, -137, -413, -526, -192, 503, 438, 292, 371, 63, 455, -67, 42, -760, -528, -50, -104, -296, 143, 300, 377, 240, -424, 84, 239, 248, -629, -166, -364, 30, -114, -16, 64, 90, 356, 50, -217, -43, -594, -535, -629, 209, -111, 136, 175, 59, 212, 309, 199, -506, -413, -27, -936, -473, -182, 273, 355, 613, 292, 267, 11, 455, -175, -145, -196, 153, 581, 40, 430, 29, 751, 486, 152, 141, -61, -168, -151, -60, 482, 40, -135, 812, 489, 157, -61, 68, -24, -404, -612, -74, -332, 44, -465, 249, 146, -194, 163, -649, -2, 238, -151, -832, -158, 215, 268, -28, -175, 198, 553, 325, 147, -93, -417, -385, -506, 69, 174, 363, 564, 181, -231, 117, -380, -1, -246, 6, -295, 99, 326, 300, 20, 618, 167, -30, -120, 472, -420, -274, 177, -46, -216, -531, -113, 227, -14, 250, 226, -11, -477, 65, -167, -547, -127, -380, 258, -145, 237, 674, 10, 245, -206, 241, -577]
5892e77N76j22Q2J79M36k4m91P0J37k07o34J49n9L81L22k05Q2L27K24r10j93K40
5914b17lk6L29l95J51J18L41m8m44N00j07j28n03m6P3M21j93K9L02j9J06J35n54
5937a78K92m15J57k65K22ql12M68L91j90k06K69j48j0m13K9J14l2l82J048j2m2
5959C77l28O34r56j21J07k1Q9k46N25K20K20k90K05l07P8n00L22l82K26l71N44
5980B5L17O6n54P11J34q41M86Qm87L65m43N73l55O3J31K07j67K43p49J12j86L40
6002am44j49R98l10K05P5j40N2j07n43J94J8k13P3K60k05O61m02K17m37L25m0
6024H7j17M03p18j44K71L27j32K84k70L54m23K19k91J83l6l00R8L45r2l93J019
6045F74o12J18K81l08p6m23J86L50j89l67M72n3k0J63K80l34l25j98L36k10j69
$$ y = [-577, -1, -123, -41, 138, 574, 550, 59, 129, 266, 59, -575, -426, -485, -104, 218, 13, 95, 422, 646, -264, -457, -217, -220, -246, 83, -312, -161, -43, 298, 250, -194, 306, 199, 71, -432, -478, -405, 16, -177, -148, 154, 135, 241, 376, -178, 114, -301, -144, -409, -187, -195, -507, -39, 352, 162, -44, 225, 77, 67, -346, -317, -203, -235, -617, 431, 419, 377, 49, 683, -273, -394, -287, -308, -219, -465, 60, 280, 500, 210, 415, 108, 186, -314, 8, -374, -148, -519, 25, 342, 408, -146, 565, 699, -142, 344, 352, -135, 230, -213, 360, 5, 68, 199, 406, 239, 482, -267, -155, -341, -1, -445, -594, 404, 94, 299, 374, 234, 286, 179, -364, -170, -152, -365, -292, -32, -237, 424, 22, 239, -198, 127, 87, -30, 373, -345, -489, -218, 109, -23, 261, -9, 345, -78, 141, -150, 33, -3, -303, -205, 140, 48, -345, 674, 62, 180, 461, 153, 77, -346, -160, 190, 1, -366, 106, 53, 33, 196, 476, 142, -183, -381, -45, -255, -424]
6066d24j14O00n59M25O70o06n8l25J31L07J41m60m45J392q94J71M20n39J55o6
6086g8J94l84Q1L82l63K45K5K6J6J83K56q58J13J74l94K8M03j02o85R79K25j54
6108C12j18j1l8k20n47N98q1k30o5K94M74m53p0p0J29M22l57k41R9K13l84K94
6130e0k44O4O29o51K73r3j06m4j87l4K23L85l04M88L76m53K62j60n11k4k11R3
6152b79L30j55j34L43J18j73M37m55o5m45L68m72L61J28K61l18m4M30q1M33o27
6173c9j22k87j3J09J37M80m53P87l88L47l32j13o02M25K90r97N55R2J12M70r1
6194C67J83m71J46J70j169L25k15M92l9M42J62j23q9L2j00j86L74m69j69P32l67
6215B8l34O50p09J040j82k12k39k59n4J18k92o4L13k3N72L9l55j51O0P7l9K2k97
$$ y = [-424, -538, 62, -497, -72, 598, -8, -66, -391, -260, 47, 188, -272, -717, 675, -219, -48, 372, -167, -12, -78, 116, -268, -187, 195, -168, 77, 102, 128, 144, 327, 583, -275, -162, 12, -382, -354, 49, -53, -738, 241, 466, 312, 194, 183, 145, -75, -622, -24, -105, -335, -400, -106, 368, -85, -155, -225, -96, 326, -31, -272, -173, 40, -344, -50, -294, -230, 399, -252, 21, -72, -178, -222, -409, -443, -220, 165, -139, 349, 725, 272, 534, 374, -137, -161, -372, -279, 51, -104, -238, 105, 223, 50, 487, 32, -33, -478, -110, -582, -221, -93, 168, -150, -194, 236, 155, 588, -39, -161, -448, -461, -352, -215, 265, -188, 599, 211, 558, 226, 113, -489, -64, 226, -771, -216, -124, -12, 458, 367, 550, 79, 225, 395, -774, -449, -664, -172, -211, 231, 393, 270, 181, 213, 113, -73, 301, -168, -337, 395, 28, -306, 344, -365, 675, 493, 281, 42, -217, -271, -153, -445, -509, -196, -219, 353, 392, 37, -114, -54, 23, -16, 6, -291]
6238b91l61O27l5N28J70K38m28k39j84K17k75L8p2r6K62j56K49J06p2N80r66K43
6260H3k40k56J62L16N2k40j57K84R2J21m15J43k17l77N6M79J06L45k14K09l89
6281e7M61p00j68q7J76O65p63J86J94m15R57qj42J82o91r5L24J19l46K78m63R72
6303E79l13Q1l49L41n10k78O76k72l61J40M04n77L10O98l69n2k11j11n24Q64l38
6324a72L56k15l01M64j65k00M15j87N3j53l0k49n82Q22j54O2K28l03R9P57n25
6345B0l55N26k09l53N81m63L49K15j60j83O79o98N21l37n87j44P79m72n6Q52l78
6366A27L99q94J66r4Q92q01Rm6J52L20n37L1L95j20M33k06l49J3n5o01P86k14
6388a94M19j29r8j18O2J4M9L20l19n0k02L17N3j07M12L5k01j17l16K77J09l51
$$ y = [-291, -652, -25, -60, 468, 638, 876, 448, 209, 25, 242, -33, 5, -67, -163, 99, -57, 192, 298, 226, 806, -160, 83, -157, -413, -251, 65, 117, -123, -280, 4, 96, 217, -198, -55, -272, -649, -593, -114, -8, 337, 123, 332, -57, 404, -296, -464, -551, -375, 290, -473, -287, -93, -508, 449, 441, 299, 481, -210, -305, 19, 138, -208, 70, -393, 579, 266, 347, -2, 339, -171, -449, 227, -45, -406, -266, 138, -439, -129, 569, 200, 148, -63, -174, -698, 166, -172, 184, -31, -332, 132, -33, -233, 182, -5, 48, -105, -135, -384, -966, -144, -298, -236, -8, -311, -212, 545, 20, -335, 191, -18, -371, 210, -253, 96, 311, 151, -32, 647, -51, 470, 133, -454, -598, 181, -291, -347, 505, 127, 526, -368, -202, -296, 596, -205, -196, -242, -90, 230, -307, -276, 119, -1, 432, 226, -123, -110, -165, -766, 20, -194, 225, 96, -2, -120, -58, -44, 5, 325, 6, -44, -246, 71, 124, 17, 429, 464, 263, 146, -170, 107, 216, -135]
6410a35Q0K00J45l04J05j66J60J70n52K30R0j92R0k61J22K74j49N52j69J13P3
6431D76n45J50k87m00L26M45r9l14K03L4P98j005M29l87J19j53JK9R7M4L22N6
6453C39K9k50j36J23j0O6m44J35O0j66L88J04P8k87J8n4J34J1m43J47m66R68J24
6476D68n42n4K88n4r4r4l83L33R4k84M45m87K52P02l37L12o25J56J27j87k05K28
6498E9k25L47N8k83O6J12q8L94r49J64M44j80k54P3q2K38J22L27m27J89m93j08
6520d96o7K97k00M95j78N4N53m75K10m58N19o49M26L0k33R6R0m30J61l8r7M89
6542I9k47L24k16l45L74k32N41n50M45m20K81n24L29J24l6j9L05l56p47R84k55
6563a41O55P4l36k69Q8m9J29k74J70k17K63j83q4N07k85j45k18N15P7m7n49j62
$$ y = [-135, -55, 145, 290, -14, 91, -75, 85, 255, -297, -67, 23, -169, -79, -340, -218, 56, -93, 459, 290, 403, 476, -69, 81, -206, -606, -280, 165, 66, -248, -45, -11, 787, -218, 211, -176, -57, -210, -209, -180, -83, -39, 283, 339, 368, 118, -18, 105, 95, 161, -283, -148, -88, -254, 134, 238, 316, 29, 47, -7, 127, 138, -305, -158, -624, 344, 468, -74, -128, 160, 106, 12, -82, -465, -132, -38, -322, 123, -364, -112, 590, 253, 565, -60, 96, 223, 36, -169, 59, -166, 181, 239, -44, 22, 134, 46, 440, -509, -345, 99, -81, -335, -262, -344, -106, 16, 343, -84, 105, -388, -496, -563, -266, -466, 29, -149, -95, 458, -17, 193, -265, 254, -395, 31, 61, -172, -76, 14, -416, -255, -293, -390, 99, -148, 176, -40, -385, -11, -243, 298, -252, 193, -227, 54, -470, -141, -17, -53, -72, 233, -123, -870, 114, -141, 514, 588, 252, -17, 71, 22, 151, -123, 47, -170, 93, -90, -174, 333, 48, -97, -315, 200, 277, 230, -319, -481]
6585d81M99J88o66J16L23L33j86j42k98Q50m31Q8k43K69r9m60P13n31J04o7j04
6606b25K61l65N38k05j14J86m2O8j40m5m34M75j27N1M98r0o11O43m00K67m87N84
6628B86l16l80O01l55J88J71l8n19Q16o88M13j01N43p02L01r8k42J10j18J70J38
6649A80J4j41J50k25L41r83Q09l63K22m8L22o1n8nr9l83J07l25L53K3O84o35O9
6672e2K12k71L11K00m1n35k03L25J30k81o3J59n10O27K60n55l3N23L20l05n17
6693b99r5M41J3j12N37p13O07k98J86k37k17J80o16L88j14L73l90K78K0j92N89
6714C29j6l61J53K54q8l44K11k10n06J264o98K39l16j95J73L36l57J98j95l86
6734e15P50m14J7N11k70M7j63k16Qj07J96l16L11J7J70l42K32mL63k47l05J82
$$ y = [-481, 18, 206, -460, -344, -21, 312, 126, -16, -314, 536, 105, 193, -50, 219, 120, -340, 373, -158, -54, -121, -225, 36, -329, 209, 4, -110, 76, 34, 102, -38, -83, -517, -42, -169, -118, 380, 290, -321, 322, -78, 189, -298, 286, -30, -410, 191, -164, 24, 195, 157, -362, 454, -234, 179, 78, 621, -81, 220, 122, -120, -10, -128, 42, 180, 194, 53, 203, -22, 319, -664, 145, -218, 4, -44, 278, 217, 159, 154, 55, -328, -221, -546, -193, -170, 514, -121, -52, 160, -111, 200, 400, 359, -176, -379, -54, 76, -205, -268, -109, -619, 8, 268, -287, -320, 203, 523, 218, -299, -394, 47, 60, -52, 485, -228, 379, 81, 267, 30, -187, -7, -623, -235, -349, 24, -366, -88, -68, -260, 329, 313, -48, 105, 359, 271, -73, 138, -72, -578, 686, -12, 227, -89, -284, -111, 225, -132, 66, -129, -515, 235, -179, -162, 349, 79, 126, -37, -253, -245, -352, -156, -472, -161, -144, 26, -316, -84, -88, 275, 28, -277, -95]
6756i5K45m84J65j22K61K14k3K89n84J59j15L3l58P42l07j15J37M03K62o79K37
6777B65k3P0n35O22o42K1K88k64j24L80K3Q2o39J70O75p82q5O59j46P1m46o6N90
6800A64k65L64k77n0K65n3m74N01P8L33j77k49j04n69P90j78l27J89j1J80%j19
6822A1j89k07M31M65n16j0m5k44P5O8J12n4L97N9j07L7K46l8o97K34n8l24j7K63
6846a08K67J34l73J29L4j98J00M13o12L07k65r2L28L73l01j7l09L3J32k65K73
6867a7J0j75k3K10p3K84j26l60M32k13k08l1O2L52k67J45O7l95K55K43P3n54M93
6890A84m94M21p4n2r6O01p35K77K2k37J53j86j77j94O21k41k52L51K38j75K42
6911A97L4n46p7L42M05Q8n77N80o08M06n25R1N05q68L64K80m5l07n1Q43l94Q2
$$ y = [-95, 150, -334, -169, -291, -30, 184, 161, 450, -134, 25, -90, -57, -415, 327, 20, -95, 42, 445, 707, 28, 265, 242, 312, -223, 399, -243, -222, 66, -198, -322, 58, 81, 163, -476, -306, 369, -413, -498, 161, 15, 86, -360, -426, 164, -101, 263, -14, -64, 201, 148, -326, 175, 253, 586, 409, 160, 56, -513, 277, 99, -228, -39, -50, 130, 130, 11, -178, -385, 46, 511, -5, -15, -60, -304, -229, -161, -49, -103, 294, 353, 246, 283, 529, 491, -206, 28, -30, -354, -371, -108, 159, 293, -80, 49, 83, -115, -15, 398, -214, 93, -172, -264, 64, 437, 136, 119, -190, -157, -25, -290, -17, -7, -182, -205, 5, -68, 216, 90, -270, 162, -51, -259, -290, -228, 124, -143, 2, 69, -326, -71, 172, 245, -309, 184, -310, 111, 37, -15, -111, 490, -245, 32, 54, -183, -30, -216, -393, -587, 34, -207, -459, -108, 130, -45, 197, 231, -315, -392, -50, 355, 443, -134, 446, -162, 244, -281, -190, 315, -553, -189, 91, 46, -261, -312, 531, 137, 219]
6933B19o65R91m70J07o84O93n8j45j33J38L99o09M19k28K47j27m17K83k68j40
6953d48M34K49j65j70O4k51P20m70L71j75j95K33k62J5j99M74L9K24l89r4J68
6974A73k6O4o59O39j86m54L05n3M60m49k4M53k63k28J56L94m08j03m9n0O1J51
6996i6L30M2o94P44l83L07j23l94L66k21p7J66j60J54L13p8o2l89L44j5k48l42
7018e16O47j47O07o48M63m04K19k31m46P36m24L08o37J10N78J76j75m70P53k42
7038B57k68j75L65m81m4Q48o36Q0O1K0k4m54J25P3K57k67O05j53R4q5k27L4R9
7061A04k91l21J79K70k77q8N65m25J76K31J60k59R4K03J36m13l23J4K26pm5P1
7083b0R2L35k39j58l04K90j90j19k4J01J00K28j80P3J7Q7p9l09K5M29k62K8K14
$$ y = [219, -446, 545, 75, 182, -502, 191, 133, -12, -145, -7, 392, -217, 202, -26, 221, 94, -323, -40, -308, -448, -14, 235, 70, -100, -36, -287, 433, -37, 334, 159, -36, 197, -65, -50, -249, 225, 264, 488, 99, 5, 173, 147, 211, -448, 191, 5, -449, -144, -197, 263, -186, -210, 243, -20, -248, -92, 302, -106, -209, -258, -308, -247, -96, 234, 276, -418, 326, -57, 250, 127, -267, 99, -122, -199, -33, -193, -39, 274, 196, 134, -255, 89, 74, -174, -516, 131, -16, 591, -57, 406, 2, 221, -10, -456, 280, -144, 164, -473, -363, 215, 391, 216, -254, 499, 257, -11, -186, 179, -302, -346, 502, -134, -54, 7, 27, 3, -451, -326, -253, 4, -263, 342, 189, 283, 198, -29, 5, 104, -187, -508, -329, -59, -336, -424, 141, -284, -108, 123, 283, 24, 118, 321, 457, 44, -279, -265, -39, -46, -91, -20, 72, 407, 168, 10, -294, -4, -194, -313, -337, -236, -136, 92, -88, -15, 2, 89, 10, -299, -274, 155, -107, -79, 135]
7106A35o6j9N06n07j06J37k52M85j07k29k09N46k98K31N2p72N54J47l60J49Rj91
7128a65J15L77K43k34k80O4J14L9q76P91K2n87L06j64K49k87N93o55O93J55m60
7149E3l10L02J98m86O65q08P25j01l82M08l97L38k02Q5k89j62Q07n28M40p89P97
7170C64k22O2k55J92Q2o3r5M6J33m98M99j36j61L88j52m73L34k77Jq1j30M57n55
7193e40N34j12J89Q5J56m50j15L86j37J20J05m60k59J18Q94m52O05p51n2M4n4
7214a46n9K11J81K49l63l0o7k39O04k17k84P65m52k10O0J89k31N46K3n71K63k
7236B20k71L29k78n2J0k01M35J21m24o3l8M13j19J14j44k27J22m13O39J73j04
7257B42k29J14r8K56m51j26N22k76l96O26n95J074o68qJ88k07L74o46L2P07n06
$$ y = [135, 69, 50, 556, 49, -57, 80, -172, 313, 206, -23, -232, 314, 16, 247, 299, -473, 81, 228, -132, 17, 26, -165, -50, 327, 570, 336, 56, 120, 234, 273, -603, 188, 210, -377, -71, -235, 14, -273, 320, -335, 358, 513, 53, -257, 45, 243, -243, 422, -386, 339, 238, -144, 264, -133, 205, 3, 88, -201, -363, 444, -84, 356, -433, 364, 142, 204, -51, 141, 223, 160, 65, 111, 244, -254, 245, 109, -52, 336, 184, -289, 45, -232, -231, -312, -442, 15, -540, -6, -118, 71, 156, 312, -138, -253, 133, -4, 116, 221, -239, -498, -380, 514, 62, 667, -84, -136, -92, -146, -205, 6, 187, 436, 73, 43, -24, -263, 341, 124, -160, 605, 153, -57, 3, 192, -39, 507, 530, -41, 222, 220, -51, 278, 0, -52, -42, -243, 192, 313, -111, -174, -212, 201, 82, 196, 52, -175, -53, -466, 173, 346, 242, 13, 127, 29, 285, -166, -292, 230, -46, -442, 184, -411, 663, -5, -13, 175, -32, 342, -304, -272, 435, -71]
7278g1N4N14n69M19m37J68Q3l10P0l34L35Q1m33M15j87M8j70RR5n0K26j18j5l77
7302e54N19k58J91k61N44L5o17k2J64K8K66j67K5j50K79P3O9m04N5M59k73k22
7324b21L07J4J37m89R1J69k7m24N51K61k69l8J80Q4m62o2k25m2J89K67j22J75
7346D4k23K38n24N80j26p4L1j40K09K50j7M97n10j60M9N8m76M71J25r7r1n00N88
7369B02m41J3O17m64j39m6K93m97J92l7M24j83M36k65l45L15k12J70kj33J55j50
7391i7L20k22J6J83K62k19m67Q1k95M64Om53M24K75j21l06L09L1r0nK22l04O3
7414G7J46n05J74J8M57n65k87O14K47o09PM6L54l17L61m28M55p4K36p03j3L95
7436H6K7l63N56p67M91o2k88N67n89O96n86L73j04Q4j61k01L09j36j95L39l98
$$ y = [-71, -17, 497, -72, 347, -90, 78, 161, -149, -79, -413, -78, 3, -430, -15, -202, -154, -324, -315, -220, -270, -44, -162, -177, -554, -35, -293, -102, -363, 181, 216, -401, -423, -259, -231, 35, -132, -107, -257, 22, 95, 164, -240, -185, 274, 1, -221, 86, 100, 237, -252, -161, 8, -19, -443, 108, 369, 100, 62, 242, 326, -136, -198, -423, -465, -276, -9, -131, 44, -179, 59, -465, 115, -11, -85, -54, -194, 15, 265, 248, 745, 235, 75, 124, 182, -294, 177, 302, 205, 114, -386, 202, -239, -226, 391, -73, -212, -258, 35, -462, -270, -307, 117, -66, 370, 105, -240, 75, -137, 33, 31, -102, 53, -97, 223, 1, 17, 200, 462, 243, -224, -143, -438, 26, 32, -421, 3, 278, 157, -149, 160, 191, 101, 96, 318, 14, 77, 223, -282, -108, -90, 367, -198, -485, 129, 376, -233, -226, -180, 174, -143, 218, -210, 245, 171, 407, -296, -309, 86, 113, -250, 306, -461, 30, -32, -320, 247, -342, 354, -232, 141, 37, 121, -40, -241, 68, -68, -263, 76, -322]
7457c22O07k47l7K07q8k37n8R7K03M8l86J08M62j16o52L4L03m2n13K75N71L21
7479E38m87j0j85K90M3k67K57l96p7M07n97Q68k77l80J40J15O79o08j12L61n6
7500B46k79M55j91j17K9m82K85m3J34r8j46K14J97m45M53o63K14L36j64L49m63
7521a79K14l13O44n41P3K01l55K16q2j13Q2J01k20L87j99K19j51L2R0n19M00O84
7543F71q89K53j01l70q8O51J56p78P58n11m0O31l76m11L78l51N3l31N96K01j01
7564AK49n7R0k60j3Qm4K11n52N87K13n48P1p3N62o14L96l09j52L05m74K62l77
7587e18O97k56M16k65j31K09L76q60p5L57j82j57Q52o91j91K95j86L53j11N12
7607D44n20l79M04O4L0j37J53K36k72K75j9l46l69L24l49P03k41K16j73k43J58
$$ y = [-322, 285, 38, 1, 208, 120, -117, -175, -78, 125, 173, -213, -105, 357, 241, -411, -377, -74, -116, -629, -354, 217, 538, 51, 41, -144, 146, 189, -78, 179, -217, -294, 113, -484, 384, 107, -273, -133, -18, 661, 53, -59, 302, 246, -33, 422, 231, 114, 143, -339, -54, -97, 37, -61, -207, 7, 204, -241, 212, -451, -237, 99, -65, 284, -179, 35, -278, 366, -175, -102, 99, -256, -40, -122, -235, -153, -52, -272, 115, -84, 135, -16, 16, 106, -413, -13, 671, -218, 35, -66, -436, -524, 127, 283, -495, 263, -248, -288, 343, -33, -444, -66, -417, -364, -695, -99, 102, 1, 250, 193, 283, 23, 10, 18, -26, 185, -367, 220, 433, -115, -44, -117, 445, -169, 227, -82, -234, 71, -403, -141, -518, 179, -77, 339, 74, -57, 152, 528, -332, -407, -50, -232, -389, 463, -228, -419, -124, -310, 43, -68, 444, -76, -455, -51, 13, 43, -94, 59, 295, 23, 298, 279, -67, -436, -112, -461, 242, 1, 217, 44, -199, -41]
7628d1J26K98l51J34J08j5m16j8N60m68L2N9J35j50j29r2J95L3p3K40k48n0K50
7651A19j42M12n8J11m23J44p05N75j12l21O17L41n82j09M73k16Lk64m5J01J50
7672F9k26j35k25M13j87K77k86K57l26N11k79O3j01M95m14j13L33m24Q4O42k78
7693A50m9k3j24l6j61J54J40j04K42m18K69n12L64p4J40O1p5P5K03j06j25M46
7715D37L30k74q02N00p6j54q3j29M54m39l6K72J64m72M40J02m60K82n55k11N87
7736a23L22m11K58o3N39m20K91l11l25J40N44k32p6r7j85K97J7L51l89p3R5k67
7758a18r3k82M61j81M6N1N51o27R4K1K81o6m38q8M53L1p9J94k73O49q83M18k53
7781a31Q04q32j1N6k90M56k38q3J017l18r17M04jJ09k59P8l21J39RN19r5R5q5
$$ y = [-41, 85, 383, 32, 166, 274, 259, -157, -175, 385, -83, -51, 8, 143, -7, -136, -228, -33, 0, -73, 167, -81, -131, 119, -23, 389, 331, 442, 19, 163, -542, 33, -79, -400, 217, 558, -24, -133, 340, 124, 127, -137, -182, -81, 69, -157, -292, -517, -104, -291, -14, -300, -43, -369, 142, -137, -74, -175, 320, -94, -207, 126, -298, -214, 428, 150, 101, 78, -46, -82, -243, -89, 51, -53, 189, -229, 40, -472, -108, -182, -42, 19, -56, 19, 222, 116, -9, 437, 767, 493, -309, 191, 115, -39, -122, -251, 203, -236, -272, 0, 164, -308, 132, 234, -226, 56, -499, -710, -123, 199, -212, 46, -17, 522, 102, 393, 82, -243, -103, 441, 209, 133, 36, -149, 148, 165, 516, 127, 54, 149, -118, -211, -493, -32, -213, -167, -116, 435, -192, -98, -77, 204, 138, -300, -388, 65, 96, 17, 211, -62, 587, -296, 122, -131, 673, -159, -170, -114, -404, 52, -186, -269, 748, 430, -487, -83, -84, 25, -234, -156, -477, -338, -329, 190, 95, 190, 105]
7804A05K35o36j41L92m33Q10n96K69j81q1M67n21l33P81j67r9m3J85K5Q9K16l5
7826C08k16j12l03N41l81K8k75L82j02j46L85J5J25j44N81p31K75o77M77K63R2
7847C85Op15M11j46M5n3J94m8J51j27j22o50P58M23J49m07n48O72j38m60P01l88
7869I3k29K15J43k20l58O90j31j6P4k92L26m39j17L0p5M57m2J36J60n14K0k03
7891b92N42l57j75k25R45k12J34o58N62K3m54L92j23J38m84K74m34N37m22j3J75
7912a27J26J45n5K63r9j76m95L81r7n08O53k55N19l60L23J1m25O05j085P50l75
7933b81L6L55j12K55n79J76l4J82O09m50jl28K30m60L61J08j7N2L57m98L65O5
7955C91l01m5M9n18M93j04J4J81o24O40m63N11j61M00o05j05m20K31L15Q3K60
$$ y = [105, 340, -296, -437, -45, -478, 332, -264, 5, -176, -257, 210, -311, -644, 137, -30, -129, -172, 13, 38, 127, 343, 308, 92, -20, -323, 218, -163, -135, -410, -28, -130, -276, 109, 124, 249, 105, 686, -45, 230, -447, 30, 293, 385, 391, -324, 87, -59, -14, -67, 127, 79, 230, 103, -19, -669, 89, 512, 661, 254, -294, 378, 240, -220, 481, 93, -136, 79, 222, 2, -356, 334, 203, 187, 261, -31, 295, -144, -261, -231, -306, 151, 109, 245, 405, -109, -89, -292, 250, -107, -282, -507, 438, 226, 360, -298, 264, 287, -167, 225, 102, 240, -244, 30, -404, 133, -289, -302, -127, -1, 144, 89, 352, 253, 77, -418, -37, -134, -642, 11, -244, 275, -85, 238, 249, -176, 429, -656, 94, -281, -245, 110, -2, 253, -326, -150, -184, -2, 607, 157, 156, -172, 58, -402, -41, 67, 50, 102, 459, -39, 326, 391, 90, 45, 94, -424, 69, -35, -21, 160, -464, 176, -287, 224, 63, 463, -142, -247, -667, -436, -121, -38, 222]
7976B22M6l48k11K47l58N42k22r3J90o3n7M34j0n10L72l30K07j25p4l16M48L89
7998C80m03L9K79p12K85L8l6m95K73L94k01k66M49L51N3l47k01K49M3k27N2j53
8020a56J83k47P9L98j82n0j68l8J9K84J2o25M13m18M34K15m32K18j33L67K7l38
8042a38M49n63K57J6N23p73K87r5j84j81Q77m82K10L01o56O54r57L36Q26l96q6
8063B25k69j1Q8N4k70J181q56j68M82m33J65k14J97m63O45o26m2J28K95M1J04
8084B53k71M12k71J27o30L47J14n97J22P44m69O2K21J38k83N92p96J2N0J37O1
8105G5j54L37l98k82J95M03n0O46n76n17M41q3P0m77N56q2l17L81o41K64K36k02
8127a75j29O19q95M92k26L37K25K2k42K34m14J14o4j4m75J59N66j43L28l97O16
$$ y = [222, 268, -80, -291, -44, -402, 140, -82, -175, 15, -48, -105, 329, 319, -191, 181, -149, 58, -67, -141, -457, -9, 380, -23, 16, 295, -417, -132, -94, -130, -625, -352, 42, -159, -425, 24, 375, 428, 81, -120, 129, 172, -55, -3, -156, 27, -220, -141, 257, 75, 25, -143, -181, -162, 122, 134, -491, -78, -496, -62, 153, -279, -61, -194, 173, 200, -138, 311, -252, 5, 21, 544, -229, 58, -37, -221, -402, 475, -7, 203, 504, -152, 502, -455, -119, 707, 311, 225, -44, -55, 33, 87, -183, 998, 142, -26, 456, 23, 188, -26, 171, -292, 353, -273, -315, -187, 108, 149, 253, -18, 394, 123, 250, -380, -33, 81, -516, -394, 350, -119, -57, 164, 302, 19, 611, -185, -173, -123, 14, 75, -79, 258, -140, -422, -227, 176, 126, 772, 196, -321, 120, 37, 107, -370, 186, 104, -213, 168, -473, -209, 27, -175, -304, 315, -580, -88, -314, 23, 248, 270, 28, 262, -152, -38, -102, -116, -591, -432, 134, -9, 319, -78, 538]
8148E38l28l75P85o54K20j54J29k45L03K79k61J4j62K48j05Pk65R9j23l10K5J56
8170a79j37L78p4L0J17k59j56J50l06M7j56K78L6L91L1j46J60J00p51o1l7
$$ y = [538, 210, -165, 620, -34, 186, 32, 161, -84, 219, 498, 237, 251, 89, 337, 232, 239, -26, 73, -50, -360, -335, -179, -316, 62, -12, 18, 135, -124, -280, -130, -436, -389, -545, -267, -231, 160, 191, 45, 205, 305, -446, -507, -544]
8191e44
$$ Imaginary data points
##PAGE= N=2
##DATA TABLE= (X++(I..I)), XYDATA
0@%%%%%%%%%%%O4j28J28j28J92k56K56l20M48n12N76p04Q32r61J153j350J543
28H33j794K060k380K735l115L518l970M482n029N644o308P029p838Q719r679J0719
44E626j1852J3105j4469J5956j7579J9370k1340K3508k5915K8592l1587L4952
56A8367l8767M3143m8221N4180o1292O9987q0870R4952j14009J41373j84258K61615
68A56200m44887J664764J662523k492304q58387K87031j17708j470553k55546
77a868867J169025J035158j65878J05597N26893J5161o51122J05774N05826m93791
87B83776j308523j20342R53533J18106r50790J39050J577954Q92670p44590n69132
97B71712M75800k4803j399884j023907N78525R14418j7938M930R03246O92860
$$ y = [0, 0, 0, 0, 0, 0, 0, 0, 0, 0, 0, 0, 64, -64, 64, -64, 128, -128, 128, -192, 256, -256, 320, -384, 448, -513, 640, -710, 833, -961, 1099, -1281, 1454, -1661, 1857, -2113, 2369, -2660, 2984, -3324, 3705, -4133, 4586, -5093, 5626, -6226, 6879, -7590, 8366, -9213, 10157, -11183, 12325, -13590, 15002, -16585, 18367, -20400, 22743, -25478, 28702, -32590, 37397, -43473, 51479, -62530, 78843, -105415, 156200, -288687, 1376077, 3038600, 546296, -312091, -25060, -142768, -1613321, -1868867, -699842, 335316, 169438, 275035, 801928, 817089, 165967, 271741, 777567, 283776, -1024747, -1145089, -191556, -73450, -1024240, -885190, 692764, 1585434, 840844, 271712, 747512, 722709, -677175, -1701082, -1122557, -208139, -226077, -221147, 682099, 1374959]
107A374959n78955q33831K1475J67243n42404m49449M17174M19707l54761k01749
117e60591P38543O49695l95080m55406N17197M85698p82681j138746P764O45072
127b88535p4425l97336N58203J120603K45771o22312l23480P6285l54370o44961
137g04557l1635M67396Q0643k26433K58384N83420P1136l01279J42268L75766
147G15109l19124q25513k51899L59949K585l98975J85541Q68022M72622k93513
157E14804k00745K73291j5220o92876o28013J7870K36717L7318J54853M81543
167A79542L62259l0822o2862P2031j87280n12582k80748J34542Q478l08009o100
178f31551N93200N48366q230j42137J75187J02136m39328o07142j77566J24855
$$ y = [1374959, 796004, -37827, -16352, 150891, -391513, -840962, -423788, -4081, -358842, -560591, 177952, 827647, 432567, -22839, 494358, 980056, 197375, -941371, -933607, -288535, -362960, -760296, -202093, 918510, 1164281, 541969, 218489, 294774, -59596, -704557, -736192, -268796, -188153, -414586, -156202, 427218, 498354, 197075, 339343, 715109, 395985, -429528, -681427, -321478, -318893, -717868, -532327, 335695, 808317, 514804, 314059, 587350, 572130, -120746, -748759, -730889, -494172, -456854, -302001, 179542, 541801, 510979, 448117, 520148, 332868, -179714, -460462, -325920, -317442, -625451, -631551, -38351, 510015, 501785, 359648, 534835, 636971, 197643, -409499, -587065, -462210]
188d62210p854l3214K93785M72515K48874J8509K35q9547l13912l39629j41797
199c54245p4842j40743K9343L67051L81195P9627M93K12234J57028k96759n28274
210a67892k37034O1505l2736j45547J02597M07045L51905R5974m634P239q1065
221C57357k25461k74433k47450j78325Q534K44733K93914J52438J11856K18528
231D61691J42411k04362m07106k20283Q137o2816j95801j5828L13409L70934J48950
242C39336q590J9655K5274j11675k54905k66645j58088l552J13424J29117R3641
253h3008J46245K61616K10528o3759k75295k16045q2355j29925k27445r1572K10478
264c40537L39052K03849O7217Q2715R5387n2369k47416k95656j86375m7937K3047
$$ y = [-462210, -470064, -503278, -209493, 263022, 511896, 530405, 530640, 441093, 127181, -212448, -354245, -429087, -569830, -540487, -173436, 207759, 287386, 287879, 500113, 657141, 360382, -167892, -404926, -343421, -376157, -521704, -419107, -12062, 339843, 435817, 431183, 438422, 357357, 131896, -142537, -389987, -568312, -559778, -315045, -21131, 131307, 243163, 461691, 604102, 399740, -7366, -227649, -219512, -282328, -478129, -493957, -180548, 190386, 339336, 330746, 350401, 375675, 264000, 9095, -257550, -415638, -419190, -305766, -176649, -83008, 63237, 324853, 535381, 471622, 196327, -19718, -102073, -231998, -459443, -551015, -340537, -1485, 202364, 269581, 352296, 447683, 395314, 147898, -147758, -334133, -382070, -359023]
275c59023N1415J02093K01076K66179J83797j7283j51273j28489q6724j68523
285a06755k59456j51436J07624K49908J77969Q4418J25424J77162O1934j62569
295C04223k77128k07733q6839m1166m2088K0167J61539K64408K20872P0099n1202
306C35152p8941q9539j57382k26629j78172j4295J25268J51704J34582J55149
316A56897J68947Q3688p1146j78275j82777j42458j22354q6793J7197J53656K13571
327A0153J68665R1134M7193J2303p5513j86012k23011j41670j9875M3660N4812
338b18161R6673J74982K00546J10394l5604j23775j26036j10780j32562j42012
348c06335o1906P7986J73272J68814J16519Q5113O0293p503j14489j84457j69860
$$ y = [-359023, -307608, -205515, -4439, 261740, 445537, 428254, 276981, 148492, 61768, -106755, -366211, -517647, -410023, -160115, 17854, 102272, 227696, 404858, 466792, 304223, 27095, -180638, -267477, -308643, -350731, -330564, -169025, 95383, 316255, 386354, 335152, 256211, 166672, 9290, -217339, -395511, -409806, -284538, -132834, 1748, 156897, 325844, 409532, 338386, 160111, -22666, -165124, -287478, -374271, -357074, -203418, 10153, 178818, 269952, 317145, 329448, 253935, 67923, -155088, -296758, -316633, -272973, -218161, -121488, 53494, 254040, 364434, 328830, 205055, 79019, -31761, -164323, -306335, -368241, -290255, -116983, 51831, 168350, 253463, 313756, 306253, 191764, 7307, -162553]
359a62553j03724m0683J5798R1280J60474J72614J19586M5878j0596o7926j37267
370H2881j83692j53239n4472L7204P3171R0992J33622J71225J25998k992j20633
381B00065j40494r6463q3404j10568q9838L0778J62406J89184J11047L7753K9622
392B40088K4686n5850j70483k01074j10090N810N1636M8668Q0851J49723J69556
403B33521Q5682m1745j11193j10824j06693j29477j14623j9362R8399J49253J26718
414E9656J00274R3884N5419m8854j50501j64899j09264o3021m5524K462J02064
425a68304J84944J70216P3816j3939l9315m6713r7590j67915j61591m6385Q4654
436b28122J19561P5931O9818J26962J33891J1277j40726j68231q9493m2669p1300
$$ y = [-162553, -266277, -306960, -291162, -199882, -39408, 133206, 252792, 298670, 288074, 220148, 82881, -100811, -254050, -308522, -271318, -198147, -107155, 26467, 197692, 323690, 320698, 200065, 59571, -36892, -120296, -230864, -320702, -289924, -127518, 61666, 172713, 210466, 240088, 264774, 208924, 38441, -162633, -272723, -266913, -215277, -166609, -85758, 63965, 233521, 319203, 277458, 166265, 55441, -51252, -180729, -295352, -314714, -216315, -67062, 59656, 159930, 253814, 309233, 260379, 109878, -55021, -164285, -227306, -272830, -270368, -168304, 16640, 186856, 260672, 246733, 207418, 160705, 63115, -104800, -266391, -312776, -228122, -108561, -32630, 37188, 164150, 298041, 309318, 168592, 361, -89132, -131801, -203101]
447b03101o9803L0508J50980J74597J06134L3187M453j7180p4863j44945j63317
458a73350r7110J2150P9755P8229P7976J25183J44856N1459q5631j30422q2745
469C50o9255j18223j07539K2412J50617J48097P0831M8800P4028M3278o4358j51980
481D7058j51084q8069k0127J3627K4609N9304J32204J70230R1450n2347j09564
492A17291n5039l1031j10467j58788n3361J03385J34127O2714M6520J01747R7625
503B54723j0360j13406j27901r4656o8362m3606o409M1833R5410J38481J23457
514A89204L9524l8246m6867m7564j08800j58761q7592M8834R4947N0804N1406
525a3111J18976J20864R587r0012q8744o0022p7793r4853m5021L5975Q5770R8734
$$ y = [-203101, -272904, -242396, -91416, 83181, 189315, 222502, 226955, 209775, 134912, -10033, -173350, -270460, -258310, -178555, -100326, -22350, 102833, 247689, 299148, 213517, 83095, 350, -68905, -187128, -294667, -272255, -121638, 26459, 97290, 146090, 220118, 263396, 199038, 47058, -104026, -192095, -212222, -198595, -173986, -114682, 17522, 187752, 279202, 226855, 117291, 62252, 31221, -79246, -238034, -291395, -188010, -53883, 8831, 55351, 157098, 254723, 244363, 130957, 3056, -91600, -159962, -203568, -209977, -168144, -72734, 65747, 189204, 228728, 190482, 143615, 96051, -12749, -171510, -259102, -210268, -115321, -64517, -13111, 105865, 226729, 236316, 146304, 57560, -2462, -80255, -175108, -220129, -184154, -98384, 350]
537C50R8003O7678J6547j4871l2660q2249j32816j02372j0105L7081K2185M8368
549h4861J26869J39858M0034n2978n2354l6992q9818j36293p9744K3768O7126
560a35385O1619Q0811J07255Q4613J9509l9665q6730j17400j01939m2956n565
571a75833j047M2161J24212J42055N2888k7143j4295r58p5855j51579j04666N485
583a84575M3311K1034M5587J09345J12253M3992j6224m0606o8591r3664q5307
594a13445n5581k8062K1453J01190J30944O8684P977K5327L1556o5262j61696
605c6915j13782N782K7785l0094k281J13251J52915O3070k4014k6942k1414o1650
617D5711r5615q3168m8334n780O2715J09588P8006K6639M5015O9178j7281j44219
$$ y = [350, 98353, 166031, 182578, 167707, 135047, 52798, -80018, -182390, -192495, -155414, -133229, -84861, 42008, 181866, 221900, 168922, 116568, 79576, -10242, -146535, -226279, -202511, -135385, -73766, 7045, 114300, 198913, 218422, 178757, 92027, -25373, -127312, -170268, -175833, -176880, -134719, -10507, 131548, 184436, 157293, 142998, 142040, 66185, -85394, -190060, -184575, -141264, -120230, -74643, 34702, 146955, 190947, 174723, 134117, 65526, -28138, -113445, -169026, -197088, -175635, -74445, 56499, 125183, 133160, 158487, 190043, 124781, -36915, -150697, -144915, -117130, -147224, -149505, -36254, 116661, 179731, 155717, 128775, 107361, 45711, -49904, -133072, -181406, -187186, -124471, -14883, 63123, 89762, 134777, 203955, 186674, 42455]
629D2455j39076k3261J8508m5193l8961Q8082J57914P7225j7264N95K9621l5523
641A15122j17454j03076l7364o876Q896N1783P8801O2589N4861O3603J2837q8969
653I4753j14780l6479j202o8739q3516M7951J63628J02524j6395l860O9237K4417
665A77539j06044j37258n5482k707j2549J025N8825Q6364P2438O2785L7639l9920
677A42655j01181p2188k1198m7364q2077p22J19332J13212J6800J274O9725M9357
689A87625p7219j33678n6314L931l0598n1408K4170J00436Q7173L9525L0640K0657
701A44940k6763o2546o1557o7275q1120l1898O5037R4843M1018K1812P7707Q2099
713A96297l1049j22738q5334j2469k5613o5899j8753P9104R9253N3368L0963L4562
$$ y = [42455, -96621, -119882, -101374, -146567, -185528, -97446, 60468, 137693, 120429, 121024, 150645, 115122, -2332, -105408, -142772, -149648, -140752, -88969, -10168, 52421, 107282, 170885, 183722, 94753, -20027, -56506, -57708, -126447, -209963, -162012, 1616, 104140, 87745, 83885, 153122, 177539, 71495, -65763, -121245, -123952, -136501, -135476, -76651, 9713, 82151, 144936, 182575, 142655, 41474, -30714, -51912, -99276, -181353, -182075, -62743, 50469, 67269, 68543, 138268, 187625, 110406, -23272, -79586, -75655, -106253, -157661, -133491, -33055, 54118, 93643, 124283, 144940, 118177, 55631, -5926, -73201, -154321, -186219, -121182, -26339, 14679, 36491, 114198, 196297, 165248, 42510, -42824, -55293, -80906, -146805, -165558, -86454, 12799, 66167, 97130, 131692]
725A31692M123m9227o5825n4460n6471n0264N92N4898N8982M1842N5368O4548
737A35798J0589n8120o2262l2363m5475p2708l0051N3644P6149L4532K4816O0515
749I5064N6317j7506p6289o8674m1148l9230l4337j067M0170O4228P3854O5396
761A16778K1298k7364m2322l5672n5022q1423n0139K5786O4921M4971L4067N6531
773G2410N8604M308n1851n5504l9643m4465n2059k2741K5863N3908N5225N0284
785E4339M1695K3196k111l3873o8118q0067m7693j220J6024J3680L7306Q3698
797C6856Q5223J8836m2761m3887k1106l9247p1578n5933L924N3863N8105M2186
809B4481L3049L4100K7274n982n4627q0360n8254j5326R06n649J5904O9898R0165
$$ y = [131692, 135815, 86588, 20763, -33697, -90168, -140432, -139840, -84942, -25960, 15882, 71250, 135798, 146387, 88267, 26005, -6358, -51833, -124541, -154592, -100948, -24799, 9733, 34549, 95064, 151381, 133875, 57586, -11088, -52236, -91466, -125803, -126870, -86700, -22472, 51382, 116778, 138076, 110712, 68390, 32718, -22304, -103727, -153866, -128080, -63159, -18188, 15879, 72410, 131014, 135322, 83471, 27967, -11676, -56141, -108200, -130941, -105078, -51170, 4055, 54339, 96034, 119230, 117119, 83246, 15128, -64939, -112632, -113852, -97828, -84148, -46842, 36856, 122079, 140915, 98154, 54267, 33161, -6086, -77664, -133597, -129673, -75810, -17705, 24481, 57530, 91630, 118904, 112922, 58295, -22065, -80319, -95645, -94739, -100388, -84484, -14586, 75579]
822G5579M3880j2555k3632j5389l9681p5934o5099j1857L2299L8578L6561M7046
834B9796N2671L3779l748m1624n7805m8106k8214k2219k1611N522N6963P9708
846C5112M4620K116J370J1879k0134p4340q1090l0059J4487K0087J6523L9156
858b0273O5793N8796J6226k5677m6465m5171l9025l6004l2625o878L8296O8136
870d871N3758J9761J1939J5505o948n5644p2657m1675l827K469K784K8033O1332
883I959O2048K6035o798k0328k8099l9496m9767m2929j6488K0585M4643M4839
895D204L4024L0817K8416L985l7359o1787m8194k2999j4992j0667J5670N3150
907b5732O2552L9784J2371j969j3948l4793n4985n2586k7537K265K3539L5042
$$ y = [75579, 119459, 106904, 83272, 67883, 28202, -47732, -112831, -124688, -92389, -53811, -17250, 29796, 82467, 116246, 112498, 70874, 13069, -35037, -63251, -85470, -107081, -101559, -44596, 35112, 79732, 81848, 83218, 95097, 74963, 623, -80467, -110526, -96039, -75952, -59429, -20273, 45520, 104316, 120542, 94865, 48400, 3229, -35796, -71800, -104425, -111303, -73007, -4871, 48887, 68648, 80587, 96092, 89144, 33500, -39157, -80832, -84659, -82190, -79406, -51373, 9959, 72007, 98042, 91244, 70916, 42817, 3321, -46446, -89375, -105863, -85278, -40635, 4204, 38228, 69045, 97461, 101446, 64087, 2300, -45894, -68893, -83885, -94552, -78882, -25732, 36820, 76604, 88975, 87006, 73058, 38265, -16720, -69306, -96843, -94578, -71039, -35997]
919c5997M2460M5576L7601J1877k1551m3171m2725l4958l0920k2402M447L7779
931e1984N1397M1396K4651J5853L446k1042m5850n1577l4745j3230K222J6957
943f2506L2949M5998M2891K5470Q56k0570l3689m0518m1695k9907o213J8175L3600
956c5159L9576L9441L3068J3099j5166l6849m1399l4960k9969j9974M498L3526
968e0268N0634M2955K2388R550j67j5231m0159n3313l9651r207J2465K0373K4622
981b5009L7218M5378L0908m044l0844l5060l0387k9182k9915j6750J5222L9957
993c2508M3972L2169K0360J3689j991k8000m7516m3781k3849o190M340J6791L6630
1006a5884M8987L6257R650j1673j8991k4988l8763m3995k6670Q771L2004L1112
$$ y = [-35997, 6463, 52039, 89640, 101517, 79966, 36795, -5930, -40888, -71808, -94210, -89763, -51984, -587, 40809, 65460, 81313, 84759, 63717, 17867, -33710, -68455, -81685, -79463, -62506, -29557, 16441, 59332, 84802, 85658, 65088, 31399, -9119, -50814, -80721, -86934, -68759, -35159, 4417, 43858, 76926, 90025, 74859, 38010, -3389, -38349, -68318, -88292, -83794, -50268, 366, 43321, 65709, 75259, 75092, 59861, 19702, -33611, -73262, -82469, -70004, -49631, -25009, 12209, 57587, 88495, 84451, 53607, 18547, -11840, -41022, -70937, -87687, -72465, -32508, 11464, 43633, 63993, 77682, 75691, 47691, 175, -43606, -67455, -73645, -69305, -52514, -15884, 33103, 69360, 79010, 67337, 48346, 23358, -15405, -59400, -86070, -77299, -45295, -14183]
1018a4183K4554K7534L1857J5461j9536m5040m1579k1841j1978j2819l268K5045
1030d5793N0755M5249J7042n918r108q529k5698m4999m0056j0822J7717K5568
1042c4592K2941K6113L3629K7249m86k7320l6998k9863k2232k0464j2293J2987
1054f1329L7134M1968K8208J3968P937l689k6507m6426m0664j7298L943R005J4479
1067c9271L0452M5099L3557N278k0792k5122k1703k6078l2448k4965M241L3189
1079c8563L8973K5474J2997J5106J3133q884l7612m6070k6625m782K227M531J8122
1092c1973L7638M0607K1610l611j8030k1484k6083l0541k6577j0363J2193K7792
1104b8822L1557K7377K1874J2855n592k3384l3917k9038k0251j3616r66J7494
$$ y = [-14183, 10371, 37905, 69762, 85223, 65687, 20647, -20932, -42773, -54751, -67570, -70838, -45793, 4962, 50211, 67253, 61335, 52227, 43698, 18000, -26999, -67055, -77877, -60160, -34592, -11651, 14462, 48091, 75340, 74854, 47534, 10536, -19327, -41559, -62023, -74316, -61329, -24195, 17773, 45981, 59949, 67886, 64197, 37690, -8736, -49400, -66698, -62755, -53750, -39271, -8819, 36280, 69837, 75115, 54323, 29201, 7498, -18580, -51028, -75993, -71752, -38563, 410, 25884, 38881, 53987, 67120, 58236, 20624, -25446, -52071, -56853, -54626, -50095, -31973, 5665, 46272, 67882, 64271, 46241, 24757, -1326, -31867, -58444, -68807, -56614, -28822, 2735, 30112, 51986, 64841, 59249, 35865, 1948, -27090, -47341, -60957, -61923, -44429]
1116d4429L4173L4577K2044J0569K005r148k7280l9020l1956j2761L795J3339
1128d4092K0433K7660L2129K3482N109j5976k6063k7002k3397k0777j2544N290
1140e5748K3127L1532K6600J8275J0965K04j5180k7273k9995k4428j4881j884
1152e8686J4537K7360L2548K5331J3729J623j0235k1406l4632l1849j6280L434
1164e4526J3802J8180K3602K9670K5617N403j7522k6256k3085j8311j8118j4120
1176e5664J868K2575L2287K6921J3561M831K416p717k5804l7326k6371m578Q113
1189d4888R073J4505K9161L4364J7362o732j7981j7144k1226k7840k2859n368
1201e9573J6002K5342K4719K1422J6431R484k392k0692l3203k8422j2881k504
$$ y = [-44429, -10256, 24321, 46365, 56934, 58939, 49791, 22511, -16509, -48465, -61226, -57431, -44092, -23659, 4001, 36130, 59612, 64721, 48745, 22682, -4320, -27717, -48494, -61038, -55748, -32621, -1089, 25511, 43786, 54751, 54955, 39775, 12502, -17493, -41921, -56802, -58686, -44149, -16789, 15759, 41090, 54819, 56442, 46207, 24801, -9831, -41680, -57960, -54526, -40724, -22544, 1058, 30728, 56345, 61748, 44226, 17970, -5115, -23426, -41544, -55664, -53796, -31221, 1066, 27987, 41548, 46379, 48795, 41078, 15274, -22052, -48423, -53001, -44888, -35815, -21310, 7851, 42215, 59577, 52845, 34864, 17720, -3506, -31346, -54205, -59573, -43571, -18229, 6490, 27912, 44343, 53827, 51435, 30743, -2460, -30882, -43763, -46267]
1213d6267n70P299K6812M0169K4057r80j1065n977j2893l1588l4420j2462J1609
1226d6276J7231J4965J8366K5417K0614M667j4382k5801k6097j6508r502q030
1238d5336l569J8248L5791K9597O411l820L018j754k6216l9762k4083L909J1379
1251c6187O586J4125K8247K9124J2219o991j7406k1683k1791j7230j3021o680
1263e0688Q835K8200L1305J6653K689M054J965j6186l4905k7438n997K862M42
1276c8209Q175K6531L1170J5919m89n869r671j9612k6229k0155q379M235J4729
1289b7854K1648K0964J4769J1238O840j0498k8009k7227j1289m000p059j692K0894
1302b1275L3324K2054M124q96j746j0801k4915k5960j5258l264P080J6283K1391
$$ y = [-46267, -46837, -39538, -12726, 27443, 51500, 50520, 39455, 33478, 20585, -11003, -45423, -57885, -46276, -29045, -14080, 4286, 29703, 50317, 54984, 40602, 14801, -11296, -27804, -37306, -45336, -48905, -30657, 5134, 34731, 41142, 37322, 40340, 38586, 12370, -27392, -51475, -47566, -36187, -29601, -15476, 12771, 41895, 54114, 47123, 29717, 8034, -13757, -30987, -44008, -50688, -41853, -13653, 17652, 34305, 36994, 41048, 43013, 26827, -8078, -35516, -41513, -38651, -38209, -30034, -3503, 27667, 43586, 43097, 37228, 27557, 7945, -18284, -38439, -46818, -42583, -27854, -6206, 14758, 29527, 40765, 47605, 37107, 9098, -18129, -29418, -33418, -40477, -42169, -21275, 12049, 34103, 38227, 37331, 35585, 24784, -131, -26091, -41349, -44613, -37533, -21250, 141]
1315A41J9140J5236R632o62j6723k5819k1210j2034p756k286J2020K3485K2577
1328A5741J4452Q837L808j0121k3066k2776j3683p897n576L503J8328K5566J9753
1341B6869R228J811m611j1944j7862k1564j9461p123P414J7440J7558J4425J6275
1354B8455J4975R92j8156k4126j7692j1555j0724l641J0759K1823K2222J5218
1366B8550Q233R34q159j6932k0326j7188j0676n78O814J3180J6388K0443J5602
1379C6285L216j1304j3526j2515j3517j9285j2497O559J9987J8564J0399J0682
1391B3048J2286M854j2005k3765k1631j1769k838O31L605J2323K1859K3574J0181
1404D0353n718j2852j0150j0435k0077j9440m037J3515J8627J3882J1645J4260
$$ y = [141, 19281, 34517, 44149, 43487, 26764, 945, -20265, -32299, -40055, -42341, -30321, -6836, 15741, 30193, 39030, 42838, 32717, 9651, -13125, -26808, -34705, -40281, -36778, -18450, 7116, 26869, 36097, 37908, 33297, 21353, 3491, -18073, -37534, -44657, -37243, -19803, -2245, 12180, 28455, 43430, 44422, 26266, 2140, -15552, -27107, -37831, -41472, -30713, -8890, 13332, 28550, 36783, 37717, 29558, 12626, -7700, -24888, -35564, -36142, -29328, -16148, 240, 20683, 36285, 39501, 28197, 14671, 2156, -11361, -30646, -43143, -36584, -16597, 1967, 12366, 23048, 35334, 40188, 28183, 4418, -17213, -28982, -31820, -31189, -27584, -15261, 6598, 30172, 40353, 34635, 21783, 11633, 1198, -18879, -38319, -42356, -28841, -10214, 3668, 15313, 29573]
1416B9573R694m741j6786j9746j5217j0859n661N61R854J8035J9865J4517L938
1429C3027l465n437j1770j9858k0049r341O562R805Q136J1395K0434J7069J419
1442C7927j3811j4986j1578j1662j3539r139M172J5595K0557J4380Q141L018J27
1455B9202o289j6893k1972j5078j948P183P251Q786J7287J9130R997n662j2466
1468A8528j1466j2467j4839j1696j080R093J5055J5076J2425R142L406m561j3241
1481A3375j5825j5396q715j877K273Q047J4724J9053J2453K031n051o859j0720
1494G513j6736j6919o960M853J0308J1013J3050J3849J0567J284r287j4646j5346
1507g457j2339p202j865M022J1925J6899J5871P854j08l831r271j3680j6729j0744
$$ y = [29573, 39267, 34526, 17740, -2006, -17223, -28082, -33743, -33182, -23328, -5293, 14572, 29089, 33027, 29562, 24125, 12355, -7503, -27552, -36893, -30331, -20526, -12390, -995, 19439, 36508, 37927, 24116, 9130, -2448, -14110, -27649, -36788, -32616, -17021, 3536, 17916, 26057, 29075, 29202, 22913, 6020, -15952, -31030, -32978, -25795, -18544, -9758, 7529, 26659, 36656, 30994, 18528, 7062, -5405, -20244, -31940, -33020, -23927, -8872, 6204, 18629, 27771, 31177, 26616, 13375, -2450, -17846, -26561, -28438, -26165, -18118, -3394, 15659, 28112, 30143, 25092, 18233, 7513, -9223, -26142, -33102, -28249, -17941, -6928, 6122, 19971, 30538, 31822, 22535, 7889, -7457, -19796, -26998, -28863, -24841, -12916, 3983, 19854, 27708, 27600, 23769, 14498, 818, -15911, -26655]
1521b6655k805N126R321J3085J3374J2881M531k874q359j2688j4910j2152n876
1534b8001J251P342J1312J4994J2618P880N80o439j1142j4491j2938q536k313
1547b7883L667J1140J5483J3871Q633K388l054q325j4292j5768j0757k682M600
1560b2979O818J1146J3948J3452O287k765q966j2160j1882j0647p842j838O982
1573b0446J3236J4329J0210N542J852k754j0128j4865j2880p255o53K841P765
1586a3206J2007J3768R822K266l722p226j0336j1987j1963o097K545Q918J2065
1599c146J0309J0180P199K196p811j4440j3198q227m244k312K175J1180J6177
1612F038J3304M641j691m772n662j1611j3883j2050j045P963R764Q978P936J0880
$$ y = [-26655, -29460, -24334, -15013, -1928, 11446, 24327, 28858, 25984, 17625, 4937, -9973, -22125, -28001, -26750, -19408, -8096, 6898, 19516, 27396, 27976, 21537, 10395, -4096, -17034, -25570, -27883, -24216, -13076, 2407, 16278, 24911, 27299, 24245, 15920, 1628, -14140, -24897, -27579, -22979, -16161, -5015, 8933, 22385, 28672, 25907, 16941, 4781, -7101, -17748, -25590, -27428, -20446, -7210, 7119, 17329, 22871, 24723, 21969, 11841, -3024, -15904, -23159, -23812, -20971, -13206, -1199, 12569, 22391, 24657, 20935, 13709, 3373, -8614, -20577, -26674, -24129, -15211, -3146, 7163, 17343, 24542, 26738, 18927, 4487, -8711, -16938, -21182, -23494, -21319, -10139, 6038, 19342, 23983, 22292, 17520, 11858, 247, -13636, -25686, -26731, -18768, -9004, -26, 7910, 18790]
1626A8790P458o62j1396j4406j0417o291l700l033M391J3064J5079J0384K508
1639B1769q76l717p388j3208j2822p681R59N581P676J0638J1020R779K662n021
1653A9371r202j0551r846q570n776K294J0034J2801R446O872M415J197n761j3158
1667C566j3940q105j465Q82L801P129J2319J2686O080k306p011p342p129r489
1681a0324j0224l536N124J1728J0358O974N852M566N78p864j2639j1872o788k356
1695b0423J039N579R400J2321R036N555k362o771r308r429r557n553k85N838Q704
1710f216R840R491O967J221n360q895r226q007p643l630L253R104J0138R481N942
1725A6460L312j664o199r576j0592q515l464K732O667P315P635J0152O156q58
$$ y = [18790, 26248, 25586, 14190, -216, -10633, -16924, -20624, -23657, -19266, -6202, 8877, 19261, 21769, 20893, 17176, 9788, -3420, -16242, -23923, -22964, -17383, -9707, 931, 11951, 21730, 24392, 19371, 10169, -382, -10228, -18798, -24574, -22280, -12246, 555, 10001, 16873, 21288, 22485, 16724, 3566, -10374, -18479, -19944, -19062, -15261, -8132, 4187, 16873, 22953, 20647, 13636, 6294, -835, -10324, -20548, -24084, -18960, -7232, 3126, 10100, 15952, 20518, 21096, 13232, 593, -11279, -18067, -20423, -19384, -13805, -4405, 7916, 16952, 22507, 20145, 13374, 4066, -5363, -14920, -20473, -20758, -14920, -6216, 3624, 13115, 20082, 21303, 15943, 7048, -2178, -10185, -17828, -21458, -18205, -9101, 1037, 10518, 16460, 19772, 18108, 11909, 2333, -8259, -16774, -20238, -17506, -10839, -3524, 4111, 14263, 20419, 19561]
1739A9561o654q426q295q401o252j192L970Q429R119R630P021J089m260p014q336
1754a1r127q666l601L385Q925R262Q432O959L618k017n874q219j0621q270k541
1769a8366K617M620N531Q906J0095O111j885o058o026n893r247p705k080M553
1783a4827P615Q730P809O186K459j944o840q487j0092o029j405J862M342P357
1797c264J0383Q867J249l037m308m893q308j0080n100K457O018N658N543R027
1811A0212O684J259l928q304r241p285m205j812Q11O547J0509J0298M948j105
1825A5388l189k171p190j1368q016p18M685N204M253P200Q352N115j564o170o995
1840B816n914o616m721k317K309P760R230Q208L794R68j457m375j0865j0591n428
$$ y = [19561, 12907, 4481, -3814, -12215, -18467, -19659, -15689, -7260, 1859, 11489, 18510, 19599, 15339, 8325, -11, -9138, -17804, -21405, -18020, -9095, 167, 8599, 15558, 19176, 17159, 11285, 3066, -7555, -15825, -18366, -15749, -11129, -5598, 3308, 13403, 19514, 17629, 11571, 5545, -348, -9595, -17300, -19380, -14827, -7212, 1518, 9327, 15513, 17972, 16028, 9188, 701, -9391, -15420, -16825, -14963, -10621, -3264, 7119, 15986, 17235, 14198, 9890, 4997, -3311, -13391, -18491, -16034, -10016, -4358, 1185, 10212, 16896, 18155, 14227, 5923, -3318, -10603, -14808, -16620, -15809, -9262, 1247, 11545, 16493, 15388, 12199, 10028, 2838, -8530, -16546, -17264, -12579, -7375, -3122, 4078, 12430, 17545, 15981, 9811, 2816, -3098, -9714, -14435, -16752, -14443, -6683, 2547, 10755, 14549, 15517, 14060, 9685, -1180, -11771, -17199]
1855a7199J869L022L890P216R652P107K029m439o223n891o380o506l934J150N253
1870i384P666O456M975L074J631j818o628r753o223l778L73R95L803R589Q999
1885I977N494l56l681l810o934q045p220j621M053N274O621O353N700L096j257
1900A3644n249o472p765m470k622l46K198N988Q701P247L540n39k934n299p653
1915b031q821l489l39K909N990Q012O567N064l17k538m514o595p458m912q68J941
1931a1399L954N505O554N591L162l02l410n918p319n849l265m74J394O043Q914
1946C181P487K880o4k661n433p290p992l736j00L099N068O213O846M344N72j597
1962A0817l929n778o434m929k577M11M263N674O656N222K856R04j633p761q150
$$ y = [-17199, -15330, -12308, -8418, -1202, 8450, 15557, 17586, 13147, 6924, 1033, -5347, -11853, -15787, -14637, -9384, -1718, 4738, 9713, 12787, 14418, 12600, 5972, -3781, -10004, -13782, -13409, -12414, -8611, 978, 9977, 15471, 15115, 11434, 7624, 690, -7355, -14575, -16196, -12143, -6869, -248, 6105, 11805, 14901, 13644, 8395, 1923, -5842, -10312, -12934, -13280, -11082, -5094, 3607, 10854, 14394, 13855, 10921, 5622, -2031, -10852, -14341, -14680, -11771, -5781, 2231, 8798, 13862, 13545, 11007, 6493, -102, -7560, -12472, -13340, -11399, -7445, -1940, 4614, 10205, 13367, 13065, 9655, 3737, -3582, -9431, -12696, -13170, -11776, -5733, 3181, 10668, 13548, 13484, 10823, 5390, -1900, -9892, -13628, -13728, -10629, -5561, 652, 7498, 11842, 12414, 10817, 6888, 1110, -5324, -10253, -12830, -12419, -8156, -2482, 4174, 9396, 12252, 13156, 11523, 3762, -4388]
1977d388n536k148J43J126M629Q018Q559K886j198k600l690n997o390n070j340
1992a2996K022N702N261M304L801L922R25m142p640o818l840j049j207J407O640
2007c708Q372N341J843k63k507m773p212n935l605Q9L624M926M770N750M554J597
2023A2863l030n701n704m145k855l014K8M557P589M937K535J856J315j601o484
2038C146p488n568j736J457K414L146N646P105M943K53n431n296m782l471m596
2053a0258l131K063P070P092L674K422J365N10m134o745o322l529q51J369K438
2068f967M615N199O392K931r24l680m648m728n393m047o36M226M693M649M456
2083F138M028J913k260n864n702m111l304j531O26M091N781O195L152J420j161
$$ y = [-4388, -9924, -12072, -11929, -10803, -6174, 1844, 10403, 13289, 12091, 9491, 5801, -196, -6586, -11656, -12996, -10974, -5272, -11, 4293, 8094, 12016, 12941, 8799, 1159, -5659, -9499, -10548, -11755, -10348, -3708, 4664, 10005, 11848, 11585, 9078, 4305, -2907, -8842, -12447, -12358, -8734, -3808, 962, 6712, 11266, 12863, 9833, 4132, -1572, -5717, -8572, -11586, -11558, -7001, 588, 5525, 8060, 9916, 11231, 9630, 3146, -4342, -9910, -11646, -10189, -7775, -4629, 1017, 8122, 13065, 13318, 7887, 2591, -2191, -5662, -10258, -13389, -11326, -4256, 2836, 6510, 8932, 10297, 10807, 6673, -72, -6394, -9923, -10774, -9405, -6967, -2352, 2847, 9239, 12170, 11246, 7566, 2918, -1810, -7203, -11250, -11886, -7660, -2967, 1682, 6138, 10166, 12079, 9819, 3955, -1747, -5858, -9162, -10693, -10067, -5976, -195, 6000, 9152, 10572, 9411]
2098I411k666m325o223o039j757J541L883M308M036N606L771k88l507n426m962
2113b637m142l025r14K122M499N813M616L411O68k106m112m537m641l800k320
2128a1105J654M299L897N504M292J855m69l230m366n164n101k682O23K848M584
2143b561M371N068L277K27k662m375m432m619l526j455K162L762N964M206L420
2158H827J351j087l404m702n605l807j739J283L245L698N020M824K756j457l035
2173F168l851m077n466k272p26L001M243M800L866L214R56j473l940n902l631
2188e090l349p51M18L036N702N252L203P55n67k760l871m802n860j768J720L037
2204e695L950L734M362L224L39l071m881m623l121k404m99K44M662N443M424K545
$$ y = [9411, 6745, 2420, -3803, -9842, -11599, -10058, -6175, -1867, 2169, 7775, 11546, 11258, 7751, 2325, -2637, -6779, -9804, -10718, -8596, -4097, 1716, 6332, 9743, 10411, 8305, 4193, -344, -4985, -8785, -11105, -9451, -5152, -1255, 4249, 8541, 10396, 9927, 6697, 2331, -2833, -7934, -10616, -9993, -7145, -2561, 1810, 6878, 10155, 10382, 7720, 3345, -1087, -5706, -9232, -10687, -8525, -4763, 1201, 5407, 8827, 10178, 9091, 5687, 985, -4620, -8427, -10166, -8883, -5638, -1940, 3080, 7904, 10660, 9203, 6168, 2317, -1760, -7226, -9498, -10224, -7223, -2980, 1820, 5686, 8900, 9856, 8383, 4443, -1459, -5090, -8439, -9190, -8772, -5736, -34, 5218, 8421, 9176, 8609, 5849, 1978, -2824, -8684, -10452, -8732, -5695, -1745, 1989, 6351, 9575, 9914, 6843, 1962, -2661, -5782, -8186, -8685, -8441, -3779, 1664, 6088, 8633]
2220H633n71q84k286l763o405l376m03J976K343L566L915M471K356n50m520l788
2236G14k825l996k440r70K744M766N228L070J248J177j282l138o182m463k070
2251h419Q04J128K158L875N322L999N65k373l348l441l903l635k779J614L599
2266d834M597M018K576J853N15j909m864n765k847q22J35M70K971M765N607K191
2282H657p28j410k891l431m681l346j584J907M141L968K929L324J910k53l351
2297E161m909m302k820j208k66K391M528M755L545J330o88j430l503m286m769
2312f471j601K28K025K872L744L705L265J146k180m027l471l534j969k781O45
2327h404L418N606L866K021J188l24j253m464n043l583p83M86J561M152M113K938
$$ y = [8633, 8062, 7178, 4892, 1129, -5276, -8652, -9055, -7079, -4736, -1170, 2745, 7216, 9572, 9022, 4502, 714, -2111, -6107, -8547, -9517, -6773, -2007, 3221, 6291, 7539, 8716, 7434, 4296, -1886, -6349, -8419, -7615, -6487, -4329, -454, 4868, 8867, 9432, 7059, 3711, 270, -3633, -7268, -10047, -8433, -4834, -237, 3781, 6357, 8210, 8725, 6816, 1952, -3813, -6660, -7482, -7347, -6877, -3906, 859, 6466, 8657, 7929, 6519, 3628, 197, -4484, -7830, -9414, -7507, -3366, 602, 3531, 6855, 8765, 8512, 5161, 252, -4050, -6870, -8078, -8344, -5953, -1425, 3330, 6875, 8205, 7517, 6087, 2584, -1702, -6471, -8072, -7844, -5819, -2947, 797, 4502, 7767, 8913, 6733, 2706, -765, -4299, -6268, -9049, -8404, -4986, 620, 4486, 6507, 7695, 7371, 6118, 1654, -3389, -6972, -7755, -7269, -5708, -1556, 2557, 5495]
2343E495K581K14k322k816m947l672k061m39J437L152M318L750L369L46j489m079
2359B837l211l106l187j516J1M294L943L195K899J397J9j852m344m102l256j450
2375g429M28J494K775L981M027K701K70j966l810m050k644l243j079J576L922
2390c047L611L262K941J526p96l748m159l246k109j789M34K333L743M684K692
2405F332O79K62j811k782m192m867j714O02K864K609K535L090L658J745l197l716
2421B097l391k186k116k272O72L458M506L516K217k3k43j774l427l865l638j467
2437g936J597K397K031L072M272K633m59l085k823k937l431l047m16K795L552
2452a785L135L404J824J314j217l596m314l640j740o83J203K189L228M498L654
$$ y = [5495, 8076, 8290, 5968, 3152, -1795, -5467, -7528, -7967, -6530, -3378, 940, 4690, 8059, 8405, 6916, 2837, -374, -3480, -6667, -8183, -8172, -3878, 65, 3260, 6159, 7556, 7575, 5723, 1379, -2723, -5979, -7429, -7001, -5507, -2732, 1249, 5276, 7977, 8247, 6281, 2471, -1579, -4223, -7466, -8545, -6969, -3047, 564, 3826, 6767, 8293, 7497, 3749, -410, -3656, -5765, -7554, -7120, -4787, -1044, 3640, 6332, 7011, 7273, 5462, 2680, -1512, -6379, -8093, -7491, -4627, -2018, 517, 3607, 7265, 9010, 5813, 2097, -1294, -3480, -5596, -7868, -7196, -3738, 768, 4284, 6501, 6478, 6235, 4461, 1034, -2831, -6469, -7936, -6339, -3942, -1911, 1161, 5433, 8066, 7607, 4522, 1699, -1238, -4669, -7716, -8132, -5337, -1785, 1350, 4754, 6578, 7892, 6675, 3079, -1235, -4875, -6615, -7298, -6095, -3906, -678, 3820, 7474]
2467G474m11j739j850j715l656l921k747J111L492K798K791L152K728J64k201
2482E470l856l819k939j533L34M99J430M636M685J931l9j587j014l414l904l608
2498f728n65J162K326K403L626M160P79q65j609l737l156l269j456K02K139L079
2514a509L307K985K043m82j220k575l763l114k407L57J277J595L273L764K327
2529E858N43p99j636l529k930l411j262J030K050L249L574K991J825p82k008l014
2545A749m144k892j943J023J704K622L494L018K226n22j179k847l284l347j697
2560f019j52J493P31L538L869K778l41q22j508k363l646l086j566R37K106L022
2576a029L420K451K036l39j726l382l646l185l31k11Q84J878M785L755R81q07
$$ y = [7474, 7063, 5324, 3474, 1759, -1897, -5818, -8565, -7454, -3962, -1164, 1627, 4779, 7507, 7671, 5470, 1614, -2205, -5144, -6677, -6343, -5844, -4414, 222, 4907, 6838, 6799, 5212, 4198, 784, -3120, -6728, -7293, -6131, -3805, -1402, 2224, 6384, 7163, 6298, 4689, 952, -2204, -5473, -6929, -6727, -4588, -1509, 1798, 4783, 6826, 6344, 5124, 2549, -1214, -4328, -6735, -6378, -5101, -3506, -233, 3531, 5858, 6401, 5602, 3966, 437, -2493, -5904, -7166, -6136, -4086, -837, 2737, 5728, 7553, 6771, 4763, 1749, -2395, -5287, -7230, -6207, -4503, -1881, 1613, 4631, 6857, 6335, 5156, 2309, -975, -4322, -6019, -6171, -4678, -3947, -409, 3460, 6238, 5897, 5075, 3567, 1204, -2442, -5528, -7094, -6157, -4051, -1029, 2391, 4842, 6878, 6539, 4813, 1431, -2215, -5400, -5731, -5942, -5058, -3180, 1605, 5360, 6341, 5534]
2592E534r44j739k498l782k746j92J586J802K546K806L240Q78m9k382l337l463
2608b740k143j764N9J651L875M017K083N89J20p07k512m736l339q11J119P59J780
2625b700K489L692K538k6j232k386k234l288j565k298M77K743L937K920K091K20
2641E378Q31j222m191l847k714Q3L49J322J903L553L638J329r92j940j282l173
2657i75l162j543m64J000L032L283K170K055O77n08k665l343l175j469n32P5J745
2674c799L442L929J627K31o85q43k964k766k962j283P53J553K377K738K767J432
2690E547Q61j287l170l425j846j624j428O51K528M339K764J635J86q12j702l160
2706E7l547j776m11l7K306L253K638J849J800n37j717k503l413j895j431p8J080
$$ y = [5534, 4590, 2851, 353, -3429, -6175, -6367, -4781, -2979, -433, 2373, 5613, 6491, 6442, 4060, 723, -2740, -4883, -6647, -6588, -4937, -1062, 2955, 5038, 5627, 5747, 5040, 2528, -2208, -5547, -6358, -5239, -4480, -2700, -211, 3481, 6019, 5993, 4761, 2375, 141, -3147, -4712, -7010, -6533, -3790, 147, 3067, 5158, 5378, 6209, 4987, 796, -3051, -5765, -5682, -5333, -4011, -2108, 1445, 5083, 6412, 5420, 3480, 2198, -975, -4137, -5680, -6144, -5144, -2112, 1171, 3341, 5396, 6073, 5565, 2900, -443, -3618, -5087, -5619, -5544, -3799, -357, 3572, 5199, 5430, 4745, 3902, 938, -1828, -4790, -6073, -5320, -3767, -1390, 1348, 4115, 5547, 6408, 5121, 1951, -1474, -3320, -4944, -6372, -5721, -3193, 1146, 3910, 5545, 5731, 4919, 3217, 57, -3490, -5266, -5677, -5714, -3408, -155, 2483, 4332, 6132, 5595, 3878, 1375, -2038, -3933, -5364, -5442, -4362]
2723d362L605K106K749J159K46r21k408k814k560k022p27R31K177L622K650J827
2739E258J21n26k094k454l430k151m95Q40K045K604K321K116J662k45k195j938
2755A439l374j897j328n47J738L076K345K314J191P51j105k541l204k260j130
2770d532o79J68J927L373K990J662O33j028j932j949l325k234j449J309K346K530
2786a90K317J532K085K79k180l213k277k182p71o72P30J949M171L155P51k64j063
2803D157j783k645l079k568J80J335K595J708K687J984J259n22k789k160k570
2818b211j703j871L12J463L371K834K241O68K06j267j970l616k872p34J2J551
2834c586J189K862K952J854M12k330j583j859k639j918j450R70L125K513J893
$$ y = [-4362, -757, 1349, 4098, 5257, 5503, 4582, 2174, -640, -3200, -5222, -5949, -5018, -2841, 781, 3431, 5258, 5379, 4853, 2759, 305, -3125, -5276, -5771, -4931, -2886, -282, 2039, 4155, 5817, 5572, 3377, 1439, -1935, -3832, -5160, -5707, -3969, -893, 1452, 3766, 4957, 5708, 4603, 2062, -1142, -3402, -4532, -5211, -5043, -3116, 257, 3247, 4909, 5542, 4514, 2582, 633, -2692, -4926, -6375, -5066, -2720, -190, 2127, 3659, 5744, 6023, 3843, 630, -1647, -3829, -4600, -5272, -4542, -2593, 1578, 4733, 5484, 5220, 4157, 2374, -271, -3350, -5918, -5738, -4403, -1808, -100, 2587, 4571, 5830, 5308, 2519, 359, -2211, -3914, -5785, -5473, -4010, -639, 2195, 4436, 5104, 5310, 4043, 2073, -1543, -4415, -5149, -5137, -3586, -2397, 465, 3417, 5271, 5683, 3353, 1770, -89, -2728, -4646, -6096, -5126, -2001, 512, 2405]
2849B405J801Q63J78j588l224l208j625p3L6J433J624K794L032J294j249j347
2865C146k105j827k383k484K84J730K618J917J793K114R93j765k035k592k512
2880c108j355n77K78K088K489K929J848L63j79j631k194k915k986m05P67J371
2896c217K147K518L000J163j402m45k490k729j674j709n91J034K671K920J466
2911B662J849R8k95j738l095k421j548j87J081J252J465K835K042R81l42k080
2927B559j891k760k060q10M46R64K475K468K291J310j13j497j714k517k483j261
2943d593n94J568K021K514K361P44N80o33j739k489k989j602k05J340J149K080
2959d87K462K016P86k68k041j916k403j569q34k39J330K081K305K211J068K15
$$ y = [2405, 4206, 5069, 5247, 3659, 435, -2773, -4398, -4471, -4435, -3002, -1378, 1416, 4448, 5742, 4493, 3146, 1041, -786, -3169, -5653, -5369, -3639, -1021, 896, 2689, 4803, 5796, 4031, 1996, -596, -3108, -4463, -5040, -4762, -2674, -185, 2744, 4592, 4955, 4776, 3145, 951, -1964, -4950, -5355, -4588, -3217, -1070, 1448, 4448, 5611, 4209, 3764, 1274, -1455, -3129, -4838, -5429, -4395, -1724, 1196, 2662, 4511, 4609, 4314, 2576, -519, -2940, -4488, -4675, -3594, -2342, -877, 1958, 4000, 4981, 4639, 2559, 668, -2092, -4152, -4962, -4516, -3552, -1077, 1391, 3682, 4992, 4879, 3382, 1668, -849, -3332, -4593, -5187, -3619, -1598, 916, 3277, 4021, 4601, 3968, 2229, -260, -3249, -4851, -5056, -3716, -2567, -487, 1975, 3991, 4777, 4509, 2468, 552, -1851, -3420, -4254, -4493, -3163, -1082, 1223, 3434, 4502, 4717]
2975D717r48j936l419j738r73K09M27Q69L244K398J699k81q03j426k168k012k143
2992d284m51J008K002J538J400K475Q50J32j836k325k421j463m22o70R69K497
3008a001K677K672k65K10j190q87l024k771o59l7J546R75K202J528K367N5n90
3025C808k359k356j357j058j340J99J803K676K412N35J150p4n06k546k885k241
3041d139m6M92N15K282J992K798Q60n69j509j387j916j596k018l82J069K102K326
3058H74J038J489R24O6j940l027j827j247r7K79L97K562K772J560O94j089r00
3075B528k108j728j781j579N08J551K242J758J079J004K92p15j826j903j888j463
3091d029M03O31J343K380J785J245M44k78j893k103k062k292j65L66K071J797
$$ y = [4717, 3769, 1833, -1586, -3324, -4297, -4088, -3661, -2792, 452, 2850, 4549, 4268, 3465, 2039, -129, -2141, -4284, -4735, -3727, -1725, -187, 1213, 3688, 4538, 4670, 2834, 509, -1912, -3375, -3797, -4467, -3498, -1001, 1676, 4348, 4083, 4293, 3103, 2216, -808, -3579, -4238, -4275, -2729, -1754, 448, 1976, 4343, 4398, 3808, 1449, -907, -2264, -3322, -4662, -4463, -2660, 16, 2428, 2963, 4113, 4039, 3533, 987, -1898, -4139, -4185, -3693, -3178, -896, 1096, 3894, 4754, 4185, 2676, 1289, -627, -2223, -4241, -4623, -3554, -1452, 874, 1912, 3401, 4325, 4391, 2451, -576, -2403, -3650, -3747, -3468, -3071, -509, 2263, 3823, 4517, 3428, 2528, 420, -1308, -3089, -4668, -4160, -2609, -367, 1391, 2470, 3474, 3766, 3051, 1225, -678, -2566, -4029, -3626, -2995, -1652, 728, 2513, 3758, 4202, 3924, 2031, -72, -2134, -4426, -4591, -4225, -2154, -357]
3107c57K484J360P75l79k359j102j895j122j277k59J475K290J676J038R43P95
3123D086r78j937j570k277r08n39L94J696J683K376K330J78p03j859j774k396
3139b198j341p96N03J906K105J098J877R96o08j588j670j275j181j409l93J441
3155b533K096J085J593R96P14o97j923j919j697j500N01P53O91K276J438K118
3171C992L21j284j905j242j336j568j373R56J906J548J188J428J425l05j057j702
3187I92k108j289j357p6J603R69K374J403J353m43q36r98j882k051j842K80J209
3204b699J236J330K239J398L17p15k009j492k67j661j005l02J487K268J405J076
3220B606O23m91m38j272j976k244r56R96J229J005J214J742K069k01j756j190
$$ y = [-357, 2127, 3487, 4262, 3883, 1524, 422, -1473, -2595, -3872, -4131, -2656, -366, 1310, 2348, 3291, 4086, 3108, 1171, -399, -2676, -3584, -4123, -3729, -2033, -350, 2026, 4356, 4534, 3831, 1972, 198, -2198, -3539, -4335, -3832, -1926, 179, 1277, 3154, 4150, 3542, 1954, 284, -991, -2172, -3581, -3974, -2533, -437, 648, 2241, 3237, 3951, 3254, 1331, -588, -2285, -3785, -3284, -2531, -1840, 436, 1874, 3992, 4313, 3029, 1124, -118, -1454, -3022, -4395, -3439, -1533, 15, 1203, 2631, 4056, 3751, 2694, 992, -1116, -2405, -3762, -3838, -2235, -1266, 1108, 2511, 3864, 3421, 2585, 1587, -295, -2346, -4188, -3908, -2699, -1463, -133, 2106, 3504, 3821, 3106, 1097, -395, -662, -2323, -3328, -3630, -2143, 125, 1530, 2606, 3229, 2738, 2300, 1028, -948, -3192, -4148, -3152, -1923, -918, 296, 2038, 4107, 3906, 2150, 960]
3236I60j146j609j130m01J38J721J749J489J451N08m28j615r96k160k331J18J415
3253b267K95J810J191J583J354j227j005j311r02k009j036L70J243J371Q85K127
3269B472Q23M8m45k231j543q72j208m27O82J128J615J116K046K39p81p23j577
3286C62j461k151l50Q16Q60J476J285J648J443j090o99j696j470j473n08l0J374
3303a664O48J303J977O65r2l80j128j963j701k5l05N9J495J185J782J253m0q12
3321B257m11j088j974j748j78O80K6J754J931Q94R42J68j539l81k114j254p82
3338b817m35P18J450J934J271L09JM3j792j037k030p77N5N82J221J231J897Q57
3356B681K56l91j132j069j851q23n35j79J579J146J656M22Q50K15k41j916j469
$$ y = [960, -186, -1795, -2925, -3326, -3188, -1467, 282, 1771, 3222, 3730, 3302, 1687, 691, -1469, -3800, -3682, -2267, -1972, -162, 1029, 2612, 3966, 2739, 1734, 423, -479, -2488, -3524, -3154, -1911, -540, 345, 2472, 3295, 3343, 2898, 667, -876, -1748, -2956, -3383, -2701, -1573, 42, 1158, 3204, 3443, 2662, 1939, 362, -1099, -3250, -3600, -2784, -1924, -448, 837, 2485, 3928, 2838, 2139, 443, -1027, -2500, -3008, -3038, -1664, -1016, 287, 2264, 2929, 2837, 2457, 1329, -634, -2335, -2360, -2665, -2606, -1111, 74, 1856, 3109, 3069, 2257, 1846, 758, -1216, -2964, -3142, -2462, -2436, -682, 1249, 2143, 3085, 3253, 1714, 1333, -781, -2035, -2817, -3252, -2534, -1084, 850, 2121, 2430, 2431, 2474, 682, -355, -2385, -3162, -3107, -2525, -1304, -73, 1824, 2681, 2937, 2546, 1414, 345, -1506, -2329, -2864, -3043, -1464, -318, 1338, 1760, 2610, 2825, 2584, 668, -801]
3373h01j271k34l8O63J026J576J245K31L62j105p97k72k485p24n20O15J114K101
3391F86J017P60J032p75q47k217j210o40k08j80N32J547J347J645M05k06p75j105
3409H08j636r74p00L65K06J150J179J342Q41O86j335r60j048j623m96r53O64Q51
3427a633J443J891K93K48K0k76j922j105j575j4P67J56J140J036J428Q03n16j11
3445B073r88j782j375n23k60Q11J540J045J126M65J98j86o55j692j372o32R0P2
3463b045Q05J075J707R33K42l82j262j015j022j472pN24L51Q92J609J183P10m87
3481B339o48j235j237q48p16k82M48J531J503P98J096m84o87k10j447j559j139
3498b777N60J48P92J585P72R80O93l68j192j213j330o49j57o47J584R87J204J183
$$ y = [-801, -2072, -2306, -2344, -1681, -655, 921, 2166, 2397, 2759, 1654, 857, 585, -1900, -2624, -3144, -2529, -1415, 686, 1703, 2463, 3495, 2720, 1873, -344, -1554, -2194, -2402, -2582, -2050, -503, 844, 2489, 2894, 2688, 1913, 808, -828, -1802, -2502, -2137, -1931, -781, 398, 1740, 2581, 3267, 1932, 972, -76, -1699, -2195, -3148, -2484, -1633, -190, 1701, 1994, 2242, 2262, 1986, 64, -1041, -2616, -2630, -1863, -1707, -567, 469, 1897, 2700, 2184, 2073, 1085, -697, -2072, -2595, -2855, -2044, -504, 541, 1667, 2132, 2330, 2144, 1489, -203, -1575, -2207, -2117, -2045, -1240, -165, 1542, 2475, 2717, 2335, 1073, 58, -964, -2436, -2443, -1919, -1568, -676, 933, 2116, 2826, 2339, 1691, 456, -781, -1629, -2345, -2627, -2179, -648, 855, 1653, 2749, 2265, 1578, 1368, -79, -1638, -2777, -2217, -2069, -1277, 308, 1080, 2060, 2753, 2385, 1193, -20, -1350, -1999, -2156, -2803, -1219, -232, 972, 2155]
3516B155L48n27m75q85j429m34j288o9Q60J064J092J149N61L20j96j231j394j542
3534a921l73n98Q66J199J023Q23J274M80o92r07j285j177k50r81j7N89J321J417
3552G91R42L95J42r27p68j497r42n21K61P60O82Q12N27J605K75l07j380k30j238
3571f18j800p9M07J266J016L81Q40Q46l42n97j199j053q51l89P4P28J112R12J406
3590B060M76r70J31o90j384j323j206Q35J001O66P84R54M65O59n47j338j364m45
3608a236k54j018P33N87J074J457M91M23p55o49p56j002j217k67P81P06M61J135
3626F94J184M04k30m35j016q57j297o46m47P74J205R80J129K26K97k25j011q37
3644a08o49j296L34jO38Q43J397L47K03O5n58j020p35n83j053p0R57P64J120Q61
$$ y = [2155, 2503, 1976, 1501, 616, -813, -1247, -2535, -2604, -1744, -680, 412, 1561, 2122, 2442, 2246, 1015, -379, -1921, -2294, -2892, -2026, -827, 196, 1019, 2293, 2773, 2081, 1174, -111, -1288, -1538, -2519, -2536, -1947, -626, 791, 1733, 2128, 2270, 1343, 575, -922, -1864, -2385, -2124, -1364, -682, 130, 657, 2262, 2537, 2230, 850, 620, -618, -2418, -2497, -2090, -824, 192, 573, 1413, 2259, 1917, 1320, 121, -932, -1783, -2172, -2098, -1370, -258, 654, 2060, 2536, 1566, 1697, 1007, -377, -1700, -2906, -2071, -1070, -404, 380, 1334, 1799, 2458, 1911, 573, -791, -1236, -1490, -2508, -1775, -1188, -114, 1343, 1834, 2257, 1502, 853, 97, -905, -2122, -2389, -1608, -902, -441, 694, 1878, 2282, 2052, 1617, 601, -256, -1553, -2199, -2646, -1872, -667, 313, 1442, 1668, 1965, 1740, 729, -108, -757, -2053, -1719, -1720, -1082, -239, 1158, 1505, 1708, 1773, 1215, 195, -540, -1123, -2176, -2246, -1289, -525, 595, 1456]
3664A456N7N16p65n04j044j510j81j15R00K94J208J093Q99m30j98m48j206r18
3682h96j031K54M33K6Q16J699j5Q91o99j53o33j665o65k67q8J094M90J368K06
3701A165Q82l63n24j49k192k62m72J29J33R50Q05J214N06n38J91k04j490p52p16
3720a687K94n47R54J206Q25N61K77r7L36k076j080k67k40J22J96O44R93J006M49
3739A869n00j51n96j641k18m06k2K04Q48R29R09P36k26m37m24q74o54p64m48L72
3759a494N44J032J538k89L46j96j2j652q48k00m74K25Q1Q61J390Q94J39k11n10
3778A164p47n65j099l17j92J21J044J258L42r9K60J062j268j099o53m12l23m3
3796a566O37J403M93P3Q88o75k04j099j129k2o92N07M30P41P03O32M15N10q67
$$ y = [1456, 1513, 2029, 1264, 760, -284, -1794, -1975, -2090, -1190, -896, 312, 1405, 2304, 1874, 1676, 1228, 22, -896, -1927, -1673, -1240, -1214, -398, 1301, 1286, 2177, 1478, 1325, 692, -973, -1638, -1905, -1993, -899, -409, 959, 1165, 2047, 1684, 1160, 1011, -1181, -1443, -1915, -1786, -1653, -703, 102, 1316, 1822, 1284, 1475, 1271, -219, -971, -1687, -1393, -1940, -986, 220, 1045, 1606, 1883, 1786, 2122, 46, -1034, -1301, -1541, -1419, -1223, -579, 414, 1420, 1869, 1369, 1218, 622, -1019, -1237, -1643, -1665, -1461, -613, 316, 1225, 1961, 1735, 1298, 874, 0, -654, -1418, -1866, -1494, -950, 82, 1620, 1331, 1677, 1481, 1469, -183, -1031, -1231, -1705, -1480, -1399, -538, 852, 1746, 1885, 1674, 1164, 417, -148, -1247, -1564, -1756, -1635, -591, 667, 1009, 910, 1170, 2232, 964, -135, -788, -1200, -1523, -1566, -929, 474, 967, 1040, 1928, 1253, 1049, -50, -1179, -1201, -1893, -1386, -956, -215, 488, 1120, 1535, 2045, 1178]
3815A178p35p59r00J46n09K15R12Q11Q75K13O65m31q36r38j339L71m65L30L46
3834h50Q01R17K36K4L42n97j137O2j031k13k9J02J427R17L13k73P44p51o40q79
3854e15o43O3m26L16O42O98N96R31n5pq67p36q51l01n00P42M74Q40Q04l11N22
3875A416p35Q4l72j500K09n11J29M55L00Q31P06j45P27o45n40q53j83o82n01R66
3895h44L18Q96M33O45J68q10l79j078p3J29p80N65J10O13P11J54O17J38p29m36
3915C68j013n13J41j83q1J151N79O27M29l37j80k19r81j465K03j6K62Q02Q23M91
3935H88M44j17m1q72r0p46p14l57N70P15J96Q75L89L99J80q45n66j042k11k20
3955a165J27K8J031K99P74P91o30j11j298Jn42o67j44O14N01N25P79N00m59L23
$$ y = [1178, 443, -316, -1216, -1070, -1579, -1364, -452, 359, 1234, 1447, 2112, 1681, 845, -93, -1432, -1061, -1526, -1196, -850, -49, 868, 1104, 1128, 1470, 873, -264, -202, -1233, -1446, -1475, -1373, 54, 971, 1284, 1011, 1755, 1004, 364, -515, -1158, -1095, -1521, -1205, -563, 135, 731, 1662, 1607, 1600, 733, -3, -854, -1155, -1655, -913, -439, 401, 1205, 894, 1416, 681, 765, 393, -1107, -898, -1409, -1280, -825, -525, 306, 1012, 867, 1594, 949, 409, -444, -627, -1309, -1810, -844, -526, 370, 803, 1448, 1616, 806, 427, -651, -724, -595, -1375, -810, -700, -87, 624, 778, 1395, 1533, 804, 368, -645, -1158, -1017, -1200, -1281, -130, 449, 1076, 1505, 1168, 988, 769, -212, -1677, -1474, -1490, -1228, -426, 397, 888, 1332, 1215, 1174, 302, 212, -534, -1248, -1605, -1035, -320, -124, 751, 1140, 1539, 1719, 874, 308, -734, -945, -1165, -1038, -1010, 21, 320, 1094, 1885, 1255, 1144, -154, -153, -695, -1362, -1506, -892, -391, 134, 913, 1413, 954, 1277]
3975A277p81n17n38m97j37R9M84O56Q44j37O46o14o33l00m63m13l41L01L04O05
3995a55M55Q47J76j4k95o66m09n08l72L61k4M9N15Q07O83j44o36J6m20j254N1
4016i37n95J95J022O12L83l7Q64k69n73q13o16l97%l03O17R86L54O46J8k57k41
4037F59m12m8q53p16N73L57M20k10J462J2j07j36p94l04n51n02o6M46L61L48K06
4058A45J174m4k22m76j73j009m81k25M77m8N38Q72L64J53j82j36j97n48r49l70
4078a337J50J98O86N05R38j13J54l95k56o62k56o32p04O12P79o6R94P24n4k08
4098A057l00o48q74K9J22l68P16j40N69N92N52m44J35n35o94o21j58J03J022l32
4118b17K89P24K1N81l18m28q29n75m68L25k23Q50K48P12k71O39j1n90m79l61o83
$$ y = [1277, 496, -21, -559, -1056, -1193, -1094, -610, 46, 890, 753, 1399, 785, 152, -148, -611, -1024, -1365, -1064, -760, -155, 300, 1147, 1323, 1309, 1014, 348, -61, -569, -941, -580, -604, -555, -40, 767, 1450, 1306, 670, 686, 266, -988, -937, -1532, -1337, -315, 297, 680, 643, 1507, 1238, 665, -148, -764, -1161, -1161, -1464, -847, 139, 493, 1139, 1157, 900, 659, 247, 199, -654, -1370, -797, -440, -20, -230, 1232, 1244, 1137, 1001, 207, -97, -648, -1150, -1216, -770, -409, -61, 145, 1319, 1275, 1053, 577, 404, -605, -1086, -1311, -834, -882, -344, 528, 892, 1045, 863, 727, 530, -18, -967, -1337, -1187, -989, -303, 202, 1140, 1027, 1181, 786, 530, -132, -388, -1020, -1724, -1112, -333, -399, 595, 1319, 1265, 1057, 757, 109, -765, -736, -614, -982, -266, -406, 163, 755, 1307, 863, 998, 463, -231, -852, -1010, -907, 115, -217, 72, 796, 817, 1398, 1080, 652, -177, -752, -1220, -895, -1118, -268, -20, 692, 421, 1060, 1049, 459, -20, -381, -1064]
4139a064M5O41r10J557J43M0N45l29K46q91q4p82J75m10J90K66P35P57l8K82l9
4160A075q01j110M73n08k51J78L74O65M13L80K16k92j62m56k76q55k93J20P66
$$ y = [-1064, -1019, -378, -1288, 269, 412, 452, 997, 668, 914, 23, -61, -843, -668, -1078, -888, -622, 113, 870, 832, 1114, 1075, 274, -836, -363, -871, -1122, -944, -570, 95, 508, 888, 1104, 812, 650, 194, -82, -937, -1230, -1110, -344]
$$ [...]
8191C07
##END NTUPLES=NMR FID
##END=
