##TITLE=1H ikalashn
DE-77H
11.12.2024
##JCAMPDX= 6.0         $$ Bruker NMR JCAMP-DX V2.0
##DATA TYPE= NMR SPECTRUM
##DATA CLASS= NTUPLES
##ORIGIN= UXNMR, Bruker Analytische Messtechnik GmbH
##OWNER= root
$$ TOPSPIN		Version 1.3
$$ 2024-12-11 16:05:13.312 +0400  Irina@DPX200
$$ Compression mode = diff/dup
##.OBSERVE FREQUENCY= 200.131300845
##.OBSERVE NUCLEUS= ^1H
##.ACQUISITION MODE= SIMULTANEOUS
##.ACQUISITION SCHEME= undefined
##.AVERAGES= 64
##.DIGITISER RES= 18
##SPECTROMETER/DATA SYSTEM= spect
##.PULSE SEQUENCE= zg
##.SOLVENT NAME= D2O
##.SHIFT REFERENCE= INTERNAL, D2O, 1, 17.49637
##AUDIT TRAIL= $$ (NUMBER, WHEN, WHO, WHERE, WHAT)
$$ ##TITLE= Audit trail, TOPSPIN		Version 1.3
$$ ##JCAMPDX= 5.01
$$ ##ORIGIN= Bruker BioSpin GmbH
$$ ##OWNER= Irina
$$ $$ F:/spectra/data/iren/nmr/1H/4/pdata/1/auditp.txt
$$ ##AUDIT TRAIL=  $$ (NUMBER, WHEN, WHO, WHERE, VERSION, WHAT)
(   1,<2024-12-11 16:04:42.640 +0400>,<Irina>,<DPX200>,<TOPSPIN 1.3>,
      <created by zg
	started at 2024-12-11 16:00:29.781 +0400,
	POWCHK disabled, PULCHK disabled
       configuration hash MD5:
       BE 6D 3F 07 2A EA 11 49 91 17 2B D3 AF B3 58 0D
       data hash MD5: 16K
       23 44 CC 2C 29 2F F0 8E 7F 9D E2 CB 6D 9A 85 D1>)
(   2,<2024-12-11 16:04:44.250 +0400>,<Irina>,<DPX200>,<TOPSPIN 1.3>,
      <Start of raw data processing
       efp BC_mod = 2 LB = 0.02 FT_mod = 6 PKNL = 1 PHC0 = 341.3103 PHC1 = -13.36521 SI = 32K 
       data hash MD5: 32K
       BF BA 94 2E 0F 8F 53 DE E5 B1 97 18 00 BE C4 B3>)
(   3,<2024-12-11 16:04:46.875 +0400>,<Irina>,<DPX200>,<TOPSPIN 1.3>,
      <apk 
       data hash MD5: 32K
       28 1A 25 8A E0 86 EB FE 1E 36 60 20 F2 4F 11 4E>)
(   4,<2024-12-11 16:05:01.546 +0400>,<Irina>,<DPX200>,<TOPSPIN 1.3>,
      <pk fgphup PHC0 = -141.4227 PHC1 = 236.8 
       data hash MD5: 32K
       7C 87 DB 09 45 83 77 76 48 F6 D7 B7 36 7C 19 83>)
(   5,<2024-12-11 16:05:03.203 +0400>,<Irina>,<DPX200>,<TOPSPIN 1.3>,
      <abs n ABSG = 5 
       data hash MD5: 32K
       84 10 00 73 FB 27 B9 E5 6C 78 21 8E 19 32 1A 51>)
$$ ##END=
$$ 
$$ $$ hash MD5
$$ $$ 73 2E 62 55 9A C0 57 0B 9B C6 C4 69 3F B7 19 E8
##$RELAX= 
##$RELAX= 
##$RELAX= 
##$RELAX= 
##$RELAX= 
##$RELAX= 
##$RELAX= 
##$RELAX= 
##$RELAX= 
$$ Bruker specific parameters
$$ --------------------------
##$DU= <F:/spectra>
##$EXPNO= 4
##$NAME= <1H>
##$PROCNO= 1
##$TYPE= <nmr>
##$USER= <iren>
##$AMP= (0..31)
100 100 100 100 100 100 100 100 100 100 100 100 100 100 100 100 100 100 
100 100 100 100 100 100 100 100 100 100 100 100 100 100 
##$ANAVPT= -1
##$AQSEQ= 0
##$AQ_mod= 1
##$AUNM= <au_zg>
##$AUTOPOS= <>
##$BF1= 200.13
##$BF2= 200.13
##$BF3= 200.13
##$BF4= 200.13
##$BF5= 200.13
##$BF6= 200.13
##$BF7= 200.13
##$BF8= 200.13
##$BYTORDA= 1
##$CFDGTYP= 0
##$CFRGTYP= 5
##$CHEMSTR= <none>
##$CNST= (0..63)
1 1 145 1 1 1 1 1 1 1 1 1 1 1 1 1 1 1 1 1 1 1 1 1 1 1 1 1 1 1 1 1 1 1 
1 1 1 1 1 1 1 1 1 1 1 1 1 1 1 1 1 1 1 1 1 1 1 1 1 1 1 1 1 1 
##$CPDPRG= <>
##$CPDPRG1= <>
##$CPDPRG2= <>
##$CPDPRG3= <>
##$CPDPRG4= <mlev>
$$ [...]
##$SW_h= 4401.40845070422
##$TD= 16384
##$TD0= 1
##$TE= 300
##$TE2= 300
##$TE3= 300
##$TEG= 300
##$TL= (0..7)
0 120 120 120 120 120 120 120 
##$TP= (0..7)
150 150 150 150 150 150 150 150 
##$TP07= 0
##$TPNAME0= <>
##$TPNAME1= <>
##$TPNAME2= <>
##$TPNAME3= <>
##$TPNAME4= <>
##$TPNAME5= <>
##$TPNAME6= <>
##$TPNAME7= <>
##$TPOAL= (0..7)
0.5 0.5 0.5 0.5 0.5 0.5 0.5 0.5 
##$TPOFFS= (0..7)
0 0 0 0 0 0 0 0 
##$TUNHIN= 0
##$TUNHOUT= 0
##$TUNXOUT= 0
##$USERA1= <user>
##$USERA2= <user>
##$USERA3= <user>
##$USERA4= <user>
##$USERA5= <user>
##$V9= 5
##$VALIST= <valist>
##$VCLIST= <CCCCCCCCCCCCCCC>
##$VD= 0
##$VDLIST= <DDDDDDDDDDDDDDD>
##$VPLIST= <PPPPPPPPPPPPPPP>
##$VTLIST= <TTTTTTTTTTTTTTT>
##$WBST= 1024
##$WBSW= 25
##$XGAIN= (0..3)
0 0 0 0 
##$XL= 0
##$YL= 0
##$YMAX_a= 1328177
##$YMIN_a= -1450726
##$ZGOPTNS= <>
##$ZL1= 120
##$ZL2= 120
##$ZL3= 120
##$ZL4= 120
##$ABSF1= 17.49637
##$ABSF2= -4.496376
##$ABSG= 5
##$ABSL= 3
##$ALPHA= 0
##$AQORDER= 0
##$ASSFAC= 0
##$ASSFACI= 0
##$ASSFACX= 0
##$ASSWID= 0
##$AUNMP= <proc_1d>
##$AXLEFT= 0
##$AXRIGHT= 0
##$AXTYPE= 0
##$AXUNIT= <>
##$AZFE= 0.1
##$AZFW= 0.1
##$BCFW= 0
##$BC_mod= 2
##$BYTORDP= 0
##$COROFFS= 0
##$CY= 7568.61572265625
##$DATMOD= 1
##$DC= 0
##$DFILT= <>
##$DTYPP= 0
##$F1P= 17.9538593292236
##$F2P= -4.03888763876832
##$FCOR= 0.5
##$FTSIZE= 32768
##$FT_mod= 6
##$GAMMA= 0
##$GB= 0
##$INTBC= 0
##$INTSCL= 5.656564e-011
##$ISEN= 128
##$LB= 0.02
##$LEV0= 0
##$LPBIN= 0
##$MAXI= 945.577
##$MC2= 0
##$MEAN= 0
##$ME_mod= 0
##$MI= -402.1523
##$NCOEF= 0
##$NC_proc= -3
##$NLEV= 6
##$NOISF1= 8.587773
##$NOISF2= 6.764455
##$NSP= 0
##$NTH_PI= 0
##$NZP= 0
##$OFFSET= 17.49637
##$PC= 1
##$PHC0= -76.48312
##$PHC1= 72.1357
##$PH_mod= 1
##$PKNL= yes
##$PPARMOD= 0
##$PPDIAG= 0
##$PPIPTYP= 0
##$PPMPNUM= 100
##$PPRESOL= 1
##$PSCAL= 0
##$PSIGN= 0
##$REVERSE= no
##$SF= 200.13
##$SI= 32768
##$SIGF1= 16.12182
##$SIGF2= -4.496377
##$SINO= 3.521527
##$SIOLD= 32768
##$SREGLST= <1H.CDCl3>
##$SSB= 0
##$STSI= 32768
##$STSR= 0
##$SW_p= 4401.40845070422
##$SYMM= 0
##$S_DEV= 0
##$TDeff= 16384
##$TDoff= 0
##$TI= <>
##$TILT= no
##$TM1= 0
##$TM2= 0
##$TOPLEV= 0
##$USERP1= <user>
##$USERP2= <user>
##$USERP3= <user>
##$USERP4= <user>
##$USERP5= <user>
##$WDW= 1
##$XDIM= 32768
##$YMAX_p= 471213442
##$YMIN_p= -640981
$$ End of Bruker specific parameters
$$ ---------------------------------
##NTUPLES= NMR SPECTRUM
##VAR_NAME=  FREQUENCY,     SPECTRUM/REAL,   SPECTRUM/IMAG
##SYMBOL=    X,             R,               I
##VAR_TYPE=  INDEPENDENT,   DEPENDENT,       DEPENDENT
##VAR_FORM=  AFFN,          ASDF,            ASDF
##VAR_DIM=   32768,         32768,           32768
##UNITS=     HZ,            ARBITRARY UNITS, ARBITRARY UNITS
##FACTOR=    0.134324425510551, 1,           1
##FIRST=     4401.40845070422, -69351,       26066
##LAST=      0,             -38045,          -325395
##MIN=       0,             -640981,         0
##MAX=       4401.40845070422, 471213442,    0
$$ Real data points
##PAGE= N=1
##DATA TABLE= (X++(R..R)), XYDATA
$$ [...]
19582 40105 11348 -4461 -15694 -26307 -24256 -13570 -21757 -49415 -49982 2075 55980 46672 -11090
19569 -11090 -44677 -25738 5821 14627 9136 3120 -8537 -22506 -21204 -7762 -5318 -10835 5425
19556 5425 40511 47662 8174 -30758 -21660 16628 32833 15033 -7030 -11429 -2808 6551 8516
19543 8516 -773 -15751 -23932 -21267 -13224 -919 12707 7236 -30631 -67856 -55225 -3333 23540
19530 23540 4007 -9787 14312 28922 -12266 -72595 -91486 -77129 -71653 -65275 -25777 14796
19518 14796 -5602 -64294 -64488 23086 108708 104851 35954 -10446 4209 44340 57188 24451
19506 24451 -25989 -45204 -15467 23088 21594 -11274 -28657 -20035 -15466 -19421 -1878 35231
19494 35231 46180 17742 -2012 20010 51821 55618 44581 41739 31239 -4007 -36825 -34481
19482 -34481 -10208 5053 9925 13124 2626 -24572 -37970 -20935 -3921 -6667 6123 55511
19470 55511 83522 31237 -55829 -83414 -44476 -12698 -16178 -11379 17614 29478 12691 14625
19458 14625 54262 81907 60061 18269 -6012 -19274 -31949 -27931 -9168 -10812 -35343 -33205
19446 -33205 10081 32733 -5712 -48774 -28961 25172 40247 12243 -8268 -11965 -29891 -55785
19434 -55785 -49921 -15089 3919 -2628 568 23033 31127 10239 -13145 -21616 -25862 -24830 -590
19421 -590 35580 44884 23255 11772 29517 45060 31599 2595 -23776 -46854 -55275 -31393
19409 -31393 -1713 -19764 -71627 -69656 14343 81080 37100 -62179 -88904 -25467 24573 -3405
19397 -3405 -59059 -75014 -56713 -40703 -28885 -8665 6129 -2146 -20930 -31528 -41551 -60209
19385 -60209 -66306 -38873 -572 11420 6142 23962 62290 67804 20486 -22212 -2164 51911
19373 51911 63171 16828 -24275 -16311 11442 19946 21677 38036 43270 9310 -26632 -9807
19361 -9807 34136 28759 -25128 -37931 27875 90738 72195 12279 -2778 30499 52903 48045
19349 48045 43531 34418 -6119 -51165 -43216 4750 16844 -24308 -48478 -15123 24181 21591
19337 21591 12863 42591 73920 46022 -20312 -49925 -24327 3818 -942 -16930 -17822 -12159 -16889
19324 -16889 -29144 -37882 -38085 -26275 -3319 15673 14364 -1599 -12657 -13359 -12892 -12658 -5507 5611
19310 5611 10445 11577 20372 32319 26499 -6549 -50617 -79946 -80570 -57717 -29304 -8124 10769
19297 10769 33169 40043 7824 -40957 -48396 -2468 36682 24893 1980 21375 54448 35054
19285 35054 -27310 -59366 -40616 -25604 -42607 -51842 -27655 -6759 -19385 -38085 -35395 -32754
19273 -32754 -46899 -43665 1371 43738 30789 -14748 -30965 -8218 13523 16109 14145 10445
19261 10445 -4028 -15781 -4926 13050 8409 -10947 -16037 -12229 -25705 -45817 -38946 -14332
19249 -14332 -14684 -40004 -44021 -14803 5339 -3296 -4880 22601 45168 33827 13944 14722 17550
19236 17550 -1419 -19349 -6015 18968 18351 136 -1412 14032 22026 25224 42774 58221 34289
19223 34289 -19152 -45608 -22298 7204 304 -25006 -26042 -2238 7691 -15930 -47120 -48164
19211 -48164 -13215 29045 49533 46726 37342 26900 4743 -29120 -50709 -39065 -4608 23865
19199 23865 31219 21976 5559 -8272 -8408 6600 23396 31654 34761 31099 6911 -30384 -37801
19186 -37801 7362 56535 42751 -21984 -54196 -10869 55645 71955 28883 -30408 -66736 -60377
19174 -60377 -7901 58768 79345 33276 -19931 -12006 38489 52018 4477 -37873 -14328 48370
19162 48370 80962 64404 38182 32564 33915 19857 -3501 -13443 -1188 22852 42225 41622 14090
19149 14090 -22587 -27680 20147 83926 98339 46713 -15970 -30908 -3291 18329 9571 -11819
19137 -11819 -21783 -11539 18399 52245 53565 5675 -44355 -30210 35681 62840 8167 -52576
19125 -52576 -27105 58977 94495 34370 -46825 -61457 -13422 28498 23078 -9635 -27663 -12288
19113 -12288 21481 43802 39134 20281 10761 17236 28804 36797 38403 25234 -8727 -45406 -51476
19100 -51476 -17406 29067 55157 53253 34692 12499 -996 3492 20849 33471 30804 16744
19088 16744 -1515 -15036 -7058 27242 53952 29852 -29944 -54510 -11741 39507 30209 -20164
19076 -20164 -38124 -8048 13037 -8430 -33854 -19057 20666 41490 30804 5869 -18785 -32585
19064 -32585 -21244 11083 31053 18075 -619 10474 37320 37364 7331 -14786 -13317 -12682 -23773
19051 -23773 -21818 1839 12237 -12096 -33323 -8085 41833 61454 46190 38839 49990 40665
19039 40665 -4812 -43448 -36953 -7504 1913 -10333 -17420 -13991 -15175 -21250 -19697 -14141 -18504
19026 -18504 -26737 -18034 9327 34910 45179 43433 35773 30417 43065 75116 93813 66774 12372
19013 12372 -19574 -15698 -8307 -14983 -15016 1560 8304 -10347 -26854 -15454 5618 9733 8216
19000 8216 23142 39689 28505 -535 -8968 13724 40904 51235 48127 41224 37487 44368 54165
18987 54165 36238 -21848 -76328 -70954 -14442 28495 24905 7628 12345 25597 17500 -8353
18975 -8353 -24469 -17550 4203 26484 36615 29406 15085 8856 9724 5843 -1552 -2850 -5048 -21383
18961 -21383 -37696 -26618 2159 8975 -10246 -13806 14138 33646 17435 -2314 7344 23949
18949 23949 19104 18174 51011 79530 44910 -33088 -76112 -59945 -36769 -40547 -40433 -9552 20874
18936 20874 11331 -23365 -36750 -12073 24773 38170 14550 -24236 -35970 -5513 27410 16460
18924 16460 -22531 -31567 3079 34180 30028 13016 4498 -11824 -41078 -45466 -4223 38159
18912 38159 32072 -2508 -10496 16626 43627 53752 56330 48003 18311 -14310 -19789 -3931 4591
18899 4591 5214 16027 23237 -3544 -46586 -50493 -7190 27145 16649 -9159 -17908 -24651 -44550
18886 -44550 -48177 -11999 27517 24520 -1150 2541 30226 26089 -22102 -58058 -42049 -8680
18874 -8680 -9846 -37691 -43442 -14029 10517 -2519 -31984 -32270 6034 44762 47054 21013 4059
18861 4059 13557 30270 30694 17483 8479 8581 6544 -4793 -16766 -15257 689 12366 -918
18848 -918 -32221 -45308 -18670 18505 21900 -811 1912 41299 59818 17094 -38656 -34672 18647
18835 18647 43929 10883 -28042 -24018 3797 12726 -1198 -14807 -16115 -2166 31055 67574
18823 67574 68928 24694 -19862 -21271 522 -2306 -27901 -30235 6137 45349 56491 46021
18811 46021 26356 -4039 -34059 -35284 -8193 2452 -30774 -69405 -58647 -6172 29555 22080
18799 22080 5908 15726 34418 24599 -10501 -27895 -3919 32674 38147 9529 -16467 -16451 -7439
18786 -7439 -10625 -13417 4944 26106 11334 -31914 -45366 878 61417 74400 37460 -6294
18774 -6294 -31343 -39685 -27818 9702 50395 60868 43514 28361 21825 6784 -8561 4159
18762 4159 31457 21526 -26754 -40302 20788 87972 76283 10509 -13103 30559 70129 55914
18750 55914 27087 36057 67056 69904 35865 -80 -10352 4147 29380 48607 47024 24994
18738 24994 -679 -18301 -30628 -36113 -23603 577 5173 -24099 -55150 -48155 -9354 20660
18726 20660 22510 13669 12376 13264 3394 -17015 -36600 -44474 -36931 -19627 -2373 11917 26476
18713 26476 35859 26565 1454 -13505 -1836 19630 26104 17038 3692 -15188 -38130 -41079 -9309
18700 -9309 24662 17623 -16551 -22906 9519 30517 10314 -14200 -3541 20138 14508 -10837
18688 -10837 -13431 8814 14657 -11288 -31573 -10416 37265 68676 64442 40315 19425 8107
18676 8107 -3165 -22860 -43870 -46725 -20609 20096 45612 38959 12975 -2042 10060 31699
18664 31699 31192 7103 -886 37259 92571 107543 71257 27630 5517 -13594 -39936 -38436
18652 -38436 11324 58438 41953 -12950 -23626 29488 74643 53601 -2900 -30805 -16895 7546
18640 7546 22642 30416 29715 16840 2338 401 7799 12806 16111 24905 36284 44108 51711 60720
18626 60720 60085 45811 37756 52384 70145 58901 24263 5858 22094 47909 54959 48037 48823
18613 48823 63206 79314 84909 75179 54304 38233 43125 60613 58594 21977 -18369 -17318 28285
18600 28285 75798 90591 82244 77838 79638 70332 49956 40715 51896 64090 60409 53907 65710
18587 65710 90037 103271 98888 88860 75669 51184 23976 17570 34166 49226 52659 63435
18575 63435 85907 86048 42026 -8471 -10535 33582 71454 73638 60712 58514 64512 65403 56281
18562 56281 33660 -3534 -38483 -47296 -31656 -16147 -9740 1331 18667 24720 20248 30887
18550 30887 59481 70177 45281 22007 38414 71669 70237 28958 -8017 -9407 13475 33810
18538 33810 36392 22428 10814 24761 55300 57612 13413 -27807 -13140 30737 36505 4287
18526 4287 -938 36354 51181 10296 -21810 16211 77311 74676 16995 -6425 37605 84189
18514 84189 74623 32687 10130 11510 10843 4271 4989 9433 6908 8538 30561 56780 54119 26104
18500 26104 14910 38984 61483 43877 5779 -3021 22143 36062 19338 13175 50524 90456
18488 90456 70551 6142 -23224 10069 42322 20786 -14864 -2358 38952 41704 2928 -13977
18476 -13977 12322 27464 -4161 -40222 -31410 5605 30963 48857 78096 94066 63654 14742
18464 14742 4447 28026 26473 -13418 -34568 -1930 43623 53139 37277 29380 27979 20231 22973
18451 22973 49386 65877 38729 805 8809 46961 44137 -9773 -39234 981 54999 55222
18439 55222 24633 28783 65407 74106 39629 12440 21226 31677 14290 -3605 11297 38685
18427 38685 38670 16726 9699 23574 29879 18559 12020 21835 28556 17353 4913 14680 45797
18414 45797 80491 104531 107511 81002 33363 -6347 -15306 530 20995 35532 40109 26919
18402 26919 -2434 -24414 -16721 11257 30791 31242 24852 19730 12837 9140 21614 46610 62109
18389 62109 58141 48729 46438 46536 45369 50983 61490 55104 21030 -17190 -29664 -17255 -585
18376 -585 13584 30480 42113 32037 4402 -14289 -5196 25731 58296 71863 55285 20500
18364 20500 -464 9054 25940 20385 3136 9225 39969 57846 43048 18523 7793 2812
18352 2812 -8919 -16517 -6592 13465 33731 58371 82633 80105 40793 -1256 -9804 3630 5453
18339 5453 -1691 13678 54394 85025 81266 55475 29652 12460 6366 10213 11450 810 -5728
18326 -5728 12488 40300 40761 11635 -9520 -3760 5583 570 -1760 11185 19174 10514 15112 56791
18312 56791 101329 98081 55450 26617 28517 25076 -4964 -32120 -26532 -5530 -2662 -14409 -10040
18299 -10040 16420 35930 29567 18375 31947 60881 64433 27877 -11433 -12294 13713 22344 5795
18286 5795 4289 40594 80184 79728 47091 23904 28043 44151 56975 62210 53338 30086 15869
18273 15869 35217 72914 84419 52199 8050 -7089 12273 36344 32389 -2207 -31163 -15018
18261 -15018 34228 58130 32472 10415 45468 102772 106865 58450 29689 45282 50274 14987
18249 14987 -10546 13127 43954 32569 5427 9722 27602 18369 4729 34930 85396 87764
18237 87764 42534 19383 40841 51485 21627 -836 21546 47551 27661 -12101 -14250 19210
18225 19210 38278 26816 18393 35760 59486 62269 43836 24794 24665 48569 81947 99182
18213 99182 88169 63566 48005 46466 46614 37405 21037 12940 30140 67539 88715 62022 7486
18200 7486 -18463 8700 56356 85190 90576 79954 49231 8526 -5799 19281 43124 30389
18188 30389 10263 28657 67431 70908 38731 25802 48170 56000 18751 -21895 -14937 29500
18176 29500 65106 69241 48475 17266 69 22201 67541 78044 31047 -15668 265 54130
18164 54130 72163 41305 18609 35401 55813 43340 12569 -7468 -13595 -6620 25569 70824
18152 70824 80736 37388 -2537 20521 78982 95266 53723 14606 17927 36620 40056 43663
18140 43663 64083 75431 53262 25582 32502 60026 63220 40079 31643 52749 71197 61835
18128 61835 39475 27025 26231 31602 41301 43324 22886 -5170 -5387 22772 34788 6386 -27406
18115 -27406 -25478 603 13963 10162 11019 22702 36296 51696 66611 61963 34941 23390 52284
18102 52284 77936 42466 -28591 -48282 8962 70711 69330 23398 -9109 -8177 9897 30315
18090 30315 41952 32846 11785 5951 15721 7431 -25403 -36809 1425 46262 44331 9720 -9711
18077 -9711 -11624 -25389 -42188 -26142 12353 20888 -11630 -36065 -21206 3771 4880 -8023
18065 -8023 -14016 -19562 -33374 -37805 -18143 7096 17537 28760 63099 99755 93816 41761 -6660
18052 -6660 -9278 20276 36699 19923 -6496 -9720 12673 34899 39845 38117 42486 39602 9241
18039 9241 -34093 -45712 -4369 57567 87393 63674 10137 -28835 -23389 16198 45075 29312
18027 29312 -12640 -31098 -8172 23189 27446 7604 -12424 -20913 -17288 474 27904 49173
18015 49173 56680 60372 62859 44593 -4724 -55017 -61931 -19699 30384 42907 10459 -30952
18003 -30952 -33177 15147 66720 61792 2735 -43708 -31286 10058 25999 13257 7926 22033
17991 22033 34108 32060 26343 24316 23820 27606 35292 30736 9221 3559 42099 91774 93456 51823
17977 51823 33254 63729 87407 53633 -6090 -27034 964 37492 56258 60818 51912 24835
17965 24835 -1974 5929 53366 100555 104678 65679 25675 26724 66747 96324 69898 2942
17953 2942 -39370 -18886 31392 55970 47686 42724 58556 71344 57917 32130 25851 47577
17941 47577 73238 75502 55247 39640 47052 60912 51594 21722 7492 26983 51104 44744
17929 44744 16993 3371 10576 12044 -2680 -8510 12369 35885 28639 764 -3549 29722 58052
17916 58052 39317 -3314 -6191 46312 95798 89876 53291 44808 69292 80338 57893 28951
17904 28951 9908 -14625 -41703 -36129 6124 33631 16091 -2506 25882 70892 67661 15132
17892 15132 -27024 -22318 14330 57028 85589 75756 26863 -11595 5145 47830 56672 38757
17880 38757 49845 86723 84585 33892 9360 49146 89747 71437 33684 41240 76503 79948
17868 79948 53768 47131 65008 67047 44621 30897 38559 48149 56917 81228 107463 97659 54946
17855 54946 31128 51706 78948 71799 43676 33316 46994 59368 55488 45718 43889 48667 49090
17842 49090 41643 36587 42684 48820 35587 7885 -5735 3568 8294 -9908 -25134 -5083 39379
17829 39379 73186 83398 74626 44872 5957 -224 42737 78732 49019 -10464 -14188 40707
17817 40707 70642 39494 6919 18102 33586 13808 -5689 16166 45918 33402 138 556
17805 556 33235 58108 69306 83349 84370 52875 25449 49776 96089 92696 41653 15666
17793 15666 37690 51745 31153 26749 69530 105423 81927 35832 31025 56948 57223 26689
17781 26689 9559 17168 15530 -5906 -14105 7347 29188 28223 27562 57092 100112 109780 69332
17768 69332 14218 -4799 29656 87038 117368 98867 60647 51247 82257 114834 109737 77725
17756 77725 63061 82656 104656 94813 64021 51202 69664 93243 94580 75361 54068 44246
17744 44246 52952 80412 109101 112479 89267 70335 75798 87803 86510 85524 99296 102437 68434
17731 68434 30131 43185 94520 112328 77388 55760 91277 130764 106271 41213 11966 35455
17719 35455 61030 59921 58561 80963 112531 131863 134979 117277 71745 19028 2766 36429
17707 36429 83066 103963 101247 96464 93812 86303 78544 80688 91142 102025 112273 122751 128448
17694 128448 126142 120050 112639 102597 98151 114532 147214 166030 152008 125439 119597 138298
17682 138298 157920 162164 154779 143226 130262 122467 129820 150772 167719 164367 145957 138715 163556
17669 163556 205139 215885 168592 102372 89561 147843 212744 216877 171549 140744 153064 177716
17657 177716 181469 169321 161261 162044 168585 182824 202039 215050 220379 229846 243012 240605 220170
17644 220170 214952 250464 298645 308499 276725 253358 271666 304183 305146 274075 254222 277493
17632 277493 330832 375522 386208 370148 356452 366913 394768 416762 426370 439884 461622 465035
17620 465035 432881 400145 419007 482246 523350 506245 474166 482654 521195 542551 542610 557839
17608 557839 594320 616391 611290 611358 635608 659306 667032 688272 743143 793018 791574 755675 736201
17595 736201 741192 741758 738308 759799 800120 817193 804313 803443 831412 852636 851247 868627 925823
17582 925823 964047 924474 850087 837209 901763 962984 960004 920032 897462 902830 917009 930059
17570 930059 936044 923240 897067 884297 890454 883499 847267 818748 834857 868930 866164 826182
17558 826182 800125 809651 819240 797381 759167 730142 707741 683754 671758 681053 688009 667581
17546 667581 636541 629536 641786 633514 591911 552119 544918 552865 538013 495309 457680 454424
17534 454424 479234 498994 487727 452258 423863 420993 426602 414032 387822 376688 386360 386899
17522 386899 356757 313878 287266 280622 282903 291298 299188 285140 247112 227260 260075 308586
17510 308586 302943 241228 196429 210811 240843 235875 217257 231034 262076 256680 212553 185185
17498 185185 204298 235975 237443 206861 166993 137511 136065 169363 207043 201279 153026 122456
17486 122456 146831 184104 175401 133239 119199 150800 183834 186072 177232 182620 191099 183247 168908
17473 168908 167980 174831 170239 156184 152212 163110 173436 172677 166060 159235 149699 137170 127821 122657
17459 122657 113720 98671 89185 96440 114931 129261 132401 128572 122041 114677 114162 129871 153657
17446 153657 159112 135585 113307 130844 177721 197739 161658 108598 90253 97837 84142 46772
17434 46772 39076 88440 150810 172067 156431 140061 129546 111326 99322 119182 152385 151446
17422 151446 116627 103268 134835 160853 133941 85120 78278 119044 156730 159682 141709 122601
17410 122601 108976 112563 141364 167294 148531 96997 77745 117743 158481 136037 74507 51226
17398 51226 86033 118654 100533 61431 60773 102888 133632 113093 62884 32707 37721 48397
17386 48397 40115 29399 43957 72423 75033 44673 22732 39110 68201 70928 53527 47647
17374 47647 51327 36454 8276 5817 34429 48826 25948 8274 37701 83163 83303 40615
17362 40615 18862 49215 90025 92706 64614 42674 36677 30220 19982 21358 38321 53254
17350 53254 51730 41525 40567 54691 72503 78740 70819 62483 67916 81499 81632 60295 39323
17337 39323 45636 76173 101999 104997 94123 83613 73926 63839 64418 83307 104505 104389 86304
17324 86304 78940 95126 111082 99597 70679 60540 82886 108557 99911 55428 11102 -109
17312 -109 17538 32799 28565 23071 42109 77271 91283 70335 49338 65144 100066 103521 67596
17299 67596 43617 67797 103992 93828 44551 23469 63700 117765 125004 92361 74253 90017
17287 90017 103693 87824 66522 74250 101617 113679 104948 99494 102396 91773 65991 57555 79316
17274 79316 94224 72039 46041 68354 126801 157741 137298 106678 99470 97860 82163 73822
17262 73822 95077 125365 136761 140948 159334 173896 155210 120658 115850 148416 185640 208847
17250 208847 223952 226496 208054 193984 219402 265342 277246 253951 253365 292908 315046 284514
17238 284514 250011 260642 285058 276877 265372 303246 364074 378991 353455 356245 396869 407497
17226 407497 364165 338431 389533 474583 514808 499726 475555 468873 473438 489066 525271 574010
17214 574010 612235 628367 628165 624122 630540 652907 674058 673291 663759 677846 709871 719469 705224
17201 705224 716631 764248 784225 742129 706137 743239 799744 782200 718677 722796 807293 859357
17189 859357 823870 786711 820974 863856 832643 772782 780836 838214 841715 775083 731413 759424
17177 759424 796602 784767 755893 752854 744413 688158 623328 622036 674047 696365 654773 607617
17165 607617 612239 644367 643842 601850 559907 540418 523371 494159 474283 483287 496164 470906
17153 470906 411379 371222 387502 434568 457756 435048 388005 345928 321517 315410 321495 325208
17141 325208 312807 286044 257980 236676 224271 225803 241738 256087 252230 238434 235236 238956
17129 238956 226211 199129 192612 220227 243042 218941 162413 125664 131523 153066 154776 129841
17117 129841 98996 92299 127769 187187 217834 182956 110298 65759 76315 105238 110259 96747
17105 96747 94931 108448 114501 105876 103571 122459 145686 146912 127646 115423 123476 128039 99093
17092 99093 46285 13956 26464 58204 70160 58411 47626 51108 62584 78209 96886 101970
17080 101970 75956 38141 33557 70826 102060 84558 35817 3075 1572 12565 24465 40986
17068 40986 56313 56117 44105 40057 48961 55858 52972 47815 42165 29287 17462 27290 53147
17055 53147 56339 19115 -17673 -2666 51068 74931 34276 -22279 -24038 29592 69138 48342
17043 48342 5919 11686 70326 115972 103369 63471 46991 48445 27499 -13878 -27971 2203
17031 2203 31963 20651 -10214 -14063 12202 30722 19053 -8250 -28565 -33329 -21891 2026
17019 2026 23462 25215 9899 -692 6897 22142 26708 17018 5745 6023 16927 23176 11715
17006 11715 -9527 -16426 2722 31909 48396 49441 47178 46124 40008 24845 1835 -25840 -45844
16993 -45844 -37559 -185 29977 17460 -21263 -35463 -11067 10234 -5341 -34373 -33856 -2451
16981 -2451 25546 31098 23396 9807 -13985 -40687 -47129 -25236 2705 13708 14611 26654 48323
16968 48323 53335 27955 -6080 -17544 -6626 -3561 -24070 -43298 -28982 9236 26483 1353
16956 1353 -34651 -39910 -17327 -4155 -15578 -25567 -9297 18958 27094 10885 -3252 913 7402
16943 7402 -4033 -23885 -24510 -38 24560 27384 15523 8253 8973 8463 6479 12148 25325 33732
16929 33732 30242 20739 13850 14066 24443 42790 54833 46089 23451 10262 15874 24913 22361
16916 22361 13985 13328 21267 27583 23360 6568 -13337 -14048 19200 66247 85148 62518 30484
16903 30484 21494 29021 30268 23982 21200 19246 14935 26705 67857 107943 100870 52151 19839
16890 19839 38182 72367 66737 16954 -24042 -3639 74946 150266 159921 109488 71066 94325
16878 94325 139018 133302 83866 70188 122854 172612 154579 107602 113626 172461 204160 167819
16866 167819 113443 101506 123977 135743 128223 131798 159946 189083 196909 192182 193893 200775 201306
16853 201306 203570 229428 275983 307620 300627 276560 271369 286907 298559 299479 306159 325241 347917
16840 347917 375534 413546 438473 416448 367165 359490 416395 471628 461284 416969 415061 464594
16828 464594 508857 522149 535463 563330 573113 549206 531396 555484 597735 616083 614970 627939
16816 627939 656417 670354 664075 669899 707019 748939 760611 748131 747735 773495 802187 814031
16804 814031 821106 836450 838620 802762 755912 754438 800178 829434 807582 783216 807838 848041
16792 848041 836211 776506 732029 724325 718584 702910 704327 717289 695739 640432 617885 655246
16780 655246 687918 660829 615179 612135 628760 607157 563942 562313 596296 592505 527877 463909
16768 463909 448049 452870 440111 423318 429015 441834 430388 399177 377578 374859 375907 369223
16756 369223 354493 331333 301513 277470 271855 279911 282899 268730 243401 222929 217325 223338
16744 223338 232551 241468 245801 231993 194947 162663 172121 211187 221051 177760 132442 136542 165377
16731 165377 164022 136414 128110 142419 142465 126610 129242 145511 129587 79650 51531 67847 85446
16718 85446 78280 77284 93354 80112 24194 -3606 45773 109487 106990 67885 75489 124693 135306
16705 135306 85907 37379 29102 41587 62162 98795 121960 83868 12744 -2523 51010 80296
16693 80296 33306 -15443 11894 69381 66442 14667 867 45476 81590 67330 34768 17844
16681 17844 4710 -15571 -18368 11658 42351 35504 2277 -12304 12455 52165 69022 50137
16669 50137 16069 -2975 220 4675 -6425 -18652 -7369 21653 35821 21520 3750 10580
16657 10580 35374 48548 37581 20502 19767 32894 36013 16206 -7672 -6315 19984 37846
16645 37846 23216 -8211 -25137 -21596 -15908 -17506 -15918 -1940 17803 30414 29443 17669 5885
16632 5885 5250 11703 6302 -15960 -29629 -12162 16732 18836 -4193 -12886 4382 9186 -23419
16619 -23419 -58022 -50728 -18997 -13264 -34021 -31670 7516 31465 3544 -33871 -21066 25061
16607 25061 34999 -5801 -34353 -8021 31315 24727 -15382 -32602 -16380 -9545 -33356 -59026
16595 -59026 -61790 -55280 -54761 -48652 -31216 -26656 -49521 -71366 -62286 -41656 -47492 -71243 -67069
16582 -67069 -23067 16775 10217 -31217 -57533 -32230 32337 79922 59372 -15684 -70933 -56846
16570 -56846 -10567 -402 -29246 -41088 -13568 13539 9148 -6310 -9657 -16811 -45174 -73457
16558 -73457 -73698 -54829 -42092 -36088 -22061 -1086 14039 17417 5022 -27589 -63979 -69936 -40117
16545 -40117 -13540 -18697 -34897 -35714 -33759 -45362 -48808 -25715 -9337 -33631 -62817 -39404 15834
16532 15834 26257 -23687 -69242 -68122 -46401 -26880 9255 57962 64329 7746 -45201 -29563
16520 -29563 22170 31609 -12864 -54948 -59137 -42227 -27342 -19365 -24416 -49586 -79354 -85438 -63496
16507 -63496 -35806 -19389 -12538 -8110 -1859 5144 1 -29991 -67325 -73669 -46394 -29619 -42446
16494 -42446 -40704 6349 46049 13030 -61824 -88528 -49020 -12957 -23774 -46693 -42222 -19003
16482 -19003 6586 36733 54769 26468 -33435 -59481 -31934 -10684 -35404 -60006 -38073 -8670
16470 -8670 -29073 -73163 -73374 -29185 2412 1549 -3646 -5688 -23650 -45583 -35132 780 14426
16457 14426 -5081 -15557 5877 28743 22216 -5478 -34202 -55313 -58137 -35907 -12356 -17726
16445 -17726 -34362 -17576 24858 35489 2184 -18630 -465 2832 -49620 -106191 -98286 -47423
16433 -47423 -26534 -44487 -42935 440 33559 7035 -58384 -100736 -86118 -35492 2923 969
16421 969 -25055 -39999 -35940 -32576 -33257 -17403 11166 11564 -30762 -67534 -52774 -11771 -350
16408 -350 -19524 -18964 26170 84442 110219 85856 27561 -28209 -52576 -50642 -43958 -28486 10529
16395 10529 45525 35614 14851 57146 129460 108683 6334 14065 189755 260762 -30522
16384 -30522 -485644 -640981 -385360 -88768 -56168 -156209 -139007 -44498 -55967 -144040 -136573
16373 -136573 -37856 -8847 -74675 -99367 -44329 -22622 -72585 -88040 -23210 21942 -11838
16362 -11838 -40155 728 36965 -1704 -53033 -36965 6814 33 -40381 -48966 -24084 -4482
16350 -4482 7199 18701 4473 -38912 -54328 -13081 22008 -2555 -36516 -17803 11294 -18180
16338 -18180 -68546 -55766 -286 4224 -50047 -77254 -44100 -11787 -22960 -46067 -48141 -37663
16326 -37663 -21042 6911 21722 -6285 -44630 -34587 8207 16636 -7044 4958 53765 58482
16314 58482 -461 -36816 -1392 39426 24906 -4517 -2154 -6030 -50713 -78301 -36104 12607
16302 12607 -15734 -79487 -79241 -26919 -22129 -79763 -106826 -57243 4147 16730 4979 8247
16290 8247 11567 -9023 -33587 -33923 -18750 -10916 -14850 -28166 -50393 -64939 -49605 -16991 -5211
16277 -5211 -19165 -24454 -8420 1828 -5681 -8156 -658 -12339 -45805 -56954 -27346 -1522 -13299
16264 -13299 -28675 -9311 18058 12425 -5746 4752 24872 8577 -26254 -20664 18004 13537
16252 13537 -59846 -128629 -120638 -56716 -5279 8830 7736 5052 -7312 -29619 -47365 -51405
16240 -51405 -43434 -26398 -6115 4622 -430 -9655 -10181 -8828 -20254 -38994 -42301 -23849 -7699
16227 -7699 -17054 -38255 -34158 2909 30893 10388 -34320 -39858 6971 44568 23421 -21685
16215 -21685 -27480 1310 9966 -8282 -4700 28150 28717 -31781 -87643 -71459 -16501 -2603 -36631
16202 -36631 -58349 -44548 -31579 -37173 -33793 -12366 -4437 -16732 -6291 43439 76695 43501
16190 43501 -17497 -29159 15949 52274 36625 -2912 -17033 4018 30261 29828 233 -27500
16178 -27500 -21471 6134 6869 -33970 -64767 -38762 10742 16900 -17936 -30057 -2428 7260 -32748
16165 -32748 -68419 -43873 8675 20039 -9691 -19291 13171 39590 18584 -25626 -41111 -15027
16153 -15027 18607 23887 1314 -14877 6239 56890 97812 102670 81178 52964 22797 -1721
16141 -1721 3652 43572 74071 50940 -3798 -27626 -5209 17952 13689 9615 29512 45830
16129 45830 28203 1547 9700 42693 48412 10660 -28286 -29329 -4561 10870 7316 -182 -4523
16116 -4523 -13144 -24836 -22439 1549 25597 21250 -9604 -36547 -40679 -32675 -23544 -2632 34515
16103 34515 59077 43554 10820 8102 33751 33853 -17567 -76674 -89343 -57818 -22156 -4700
16091 -4700 -2637 -11685 -24818 -24196 -3992 13159 9133 1821 13202 25043 6000 -29206 -33019
16078 -33019 2539 29785 12078 -28802 -47538 -31298 -4565 4565 -9818 -28995 -28219 -6036
16066 -6036 10050 -399 -21232 -26674 -22031 -25798 -25254 6074 50918 58362 19476 -16091 -14572
16053 -14572 -302 -654 1583 25810 47656 40538 28947 49471 82194 74976 25145 -14266 -9356
16040 -9356 17621 30103 19125 -2016 -14486 -2580 27203 38897 9006 -31229 -32602 -570
16028 -570 14802 -747 -11522 -6324 -21167 -59568 -57290 20164 98514 84096 -43 -44846
16016 -44846 -8477 41959 47813 36554 52141 78184 79518 68510 73483 77345 47246 1724
16004 1724 -12358 3955 9968 2703 18509 52432 49313 -427 -27353 11970 60118 47791
15992 47791 4107 3029 38275 42042 12769 24759 96151 142068 100807 28254 9096 36012
15980 36012 45788 30191 32646 57949 63951 40248 24683 32011 29534 3173 -9196 19541 56151
15967 56151 56700 30342 14180 12363 5459 3547 37645 94491 108189 42572 -47429 -71221 -10910
15954 -10910 57720 59125 5559 -30593 -15127 11729 1339 -34958 -47994 -21952 9226 14385
15942 14385 4333 8122 30633 50122 49330 34280 22085 19402 18439 12150 5754 7611 14795 18855
15928 18855 21503 28066 28468 9829 -9540 7092 53595 71181 30875 -10032 18697 94830
15916 94830 130024 93153 44619 39177 55484 48091 19162 1851 6839 21357 37072 47710
15904 47710 39731 14393 286 15712 36470 30763 10404 13877 46706 71818 60727 28527
15892 28527 10878 21254 38372 32922 5797 -7001 20032 60124 65220 36103 22623 45114
15880 45114 61582 37827 5367 9739 37156 41417 18891 4694 8877 8348 -3312 -6497 3149
15867 3149 7074 1108 2753 17200 29634 33996 39134 47253 55464 72574 102298 120218 105111
15854 105111 80250 78402 80020 43258 -13460 -27151 8402 29944 8733 -7269 16883 44250
15842 44250 37523 22323 29360 34127 11470 -4244 22015 54296 43647 18049 35929 78388
15830 78388 72965 13912 -24413 911 50138 73979 72771 64324 49619 32875 29654 35915 28503
15817 28503 8804 5056 21962 32158 27024 27813 35147 21373 -9094 -9036 34439 67485 50671
15804 50671 21439 31239 65033 74463 56019 42833 44145 43988 40445 39570 29754 7770 7615 51502
15790 51502 93608 73348 10580 -18606 4935 26557 19226 24104 65518 98671 84115 54263
15778 54263 54964 69209 56109 29084 32692 62796 71056 42053 12708 14102 38027 63615 80009
15765 80009 82126 75954 81305 97111 83309 24099 -16109 27130 96950 74504 -24881 -32683
15753 -32683 131645 307746 291842 115494 -5617 31820 117654 131215 99822 97589 106736
15742 106736 72837 21163 19068 64380 98366 103382 108332 115153 97820 67315 63769 82760
15730 82760 79731 54894 62361 115173 148737 112773 45373 15731 34694 62552 73620 72532
15718 72532 67183 60734 58269 57772 48662 34994 37651 56717 60472 34561 11802 24364 55659
15705 55659 73306 80671 94664 98786 68955 29040 25531 53475 63602 45031 42932 79452
15693 79452 112312 100004 63143 45933 51242 52864 47559 53100 66540 63092 35923 8116 2342
15680 2342 19173 45797 68277 75473 66743 54775 48224 38594 20714 14950 42004 81199 87652
15667 87652 55080 26335 29603 41641 37611 39323 73359 109058 92819 35347 7281 39717
15655 39717 83400 88162 71952 75557 91424 85355 60890 50485 57897 59460 55125 68745 97860
15642 97860 110785 99246 89240 90833 80937 48531 15872 1354 1292 18958 63798 106687 92347
15629 92347 24931 -14202 26973 99002 130892 128709 134295 134754 92380 35526 33679 88842 129695
15616 129695 117566 87386 74821 71101 65617 69149 74085 50987 8536 550 46098 95712
15604 95712 106700 100235 109130 118658 101860 73063 61628 63406 58960 53354 60143 69767 68062
15591 68062 63776 68133 71569 67325 68483 75126 61371 27309 21824 70535 121003 112028 63660
15578 63660 40984 56949 73507 77169 86585 96968 82710 52244 41719 56548 73028 89545
15566 89545 117263 130758 97299 50322 56904 108351 125028 82839 47357 56596 62213 31780
15554 31780 19355 68261 120875 106258 57377 51949 81410 75539 32501 25291 80614 140937
15542 140937 159500 154333 147497 123353 79584 58606 86850 126478 127023 92578 62793 54864
15530 54864 58912 69168 85499 97702 97321 94535 98682 93771 61000 18858 11655 54674 112816
15517 112816 141313 132749 115081 112958 122388 123104 107188 86956 74772 66833 56367 52823 70117
15504 70117 99276 113842 105297 91733 84759 71979 47023 33839 56354 97958 118468 105695
15492 105695 84793 78358 82544 85489 85398 83167 77825 77516 95358 125464 143491 141066 135709 132222
15478 132222 104220 42597 -4424 16747 85323 126144 109540 82125 87187 105897 105050 97617
15466 97617 113544 141828 149400 139258 142177 159240 158447 127890 91507 69767 62082 69371 94366
15453 94366 116920 112218 99391 123794 179125 201189 162712 118842 120997 138396 118025 78804
15441 78804 79040 116917 136210 122117 119130 146248 161548 132737 87107 63842 63936 76685 110133
15428 110133 157794 175524 138460 91596 92139 121633 113425 61233 37223 85928 155763 170501
15416 170501 129075 90712 85559 90613 88105 96111 125689 147941 132562 95778 79833 96647
15404 96647 119044 122090 108083 91624 82142 83105 90740 92855 84631 81800 98968 121091 122434
15391 122434 110041 115763 142791 156066 135958 106243 93790 95195 102377 125049 160901 176962
15379 176962 155005 129130 141301 178994 193564 166735 125063 98593 94723 104478 111207 103858
15367 103858 97851 121827 167770 187033 159028 124064 117091 116060 98729 97957 140725 182456
15355 182456 175670 157569 182584 211454 173243 105035 106081 167625 184500 140498 133921 188718
15343 188718 196667 111556 49806 101347 174960 153670 90398 106129 179666 194875 142783 119319
15331 119319 147479 152219 110493 88198 112238 128183 110604 107494 144198 177462 176568 167519
15319 167519 169510 164439 151625 156808 168156 141996 90090 78093 116451 140397 124510 124763
15307 124763 170075 204616 186487 157622 160639 167298 149671 145183 183518 218636 204730 177385
15295 177385 186930 209608 200475 180897 193862 218739 210927 186341 187069 199647 187226 168570
15283 168570 182644 205729 189591 155770 162251 196267 193343 152133 136485 164006 183332 169770
15271 169770 158763 172174 189024 200214 217153 219422 175040 121423 137579 218105 265653 234098
15259 234098 185989 173875 163347 125225 107632 145858 184265 168804 144682 172573 211067
15248 211067 185085 124309 120661 172553 188057 143163 122994 178145 240188 230135 173523 145627
15236 145627 156461 158539 139454 138422 172298 200172 181458 137697 128881 176032 230851 232791
15224 232791 183368 141990 147733 173329 173771 154094 154508 182134 201436 195943 194783 216957 227677
15211 227677 187946 125871 112182 165205 223045 225977 190649 173643 188012 198127 187197 181075
15199 181075 194949 201967 181182 159901 171681 199480 203771 188235 188512 205663 205441 185868 188800
15186 188800 227923 257826 242007 206603 192926 195684 187903 175077 179202 191098 185181 168921
15174 168921 172503 194718 202175 183791 166178 167092 169728 158078 148085 161982 189992 201184 187223
15161 187223 175820 194087 228156 233398 189446 132199 115160 146248 185468 202829 208604 219069
15149 219069 224789 212028 190269 176964 174947 182758 203890 226269 219991 181254 151477 162311
15137 162311 188429 191036 181514 196084 227084 232443 205702 184261 186345 187805 169841 147981
15125 147981 142503 154822 181518 218496 244196 233136 196134 176062 193773 225302 238690 226327
15113 226327 198569 174577 178587 211895 232021 200268 146666 137461 176129 196324 166222 134926
15101 134926 147551 178779 192922 209656 252556 282362 252941 201665 206833 267298 300292 264731
15089 264731 216542 218173 252001 262583 244904 242479 272413 296555 275350 222643 188609 199149
15077 199149 231874 252731 255789 254145 249862 238061 230761 243939 260573 242349 189755 157120
15065 157120 186756 253557 298553 298158 276524 263810 265598 267204 253286 227619 216050 236037
15053 236037 265538 268180 249056 248036 270870 274026 238239 207465 220823 251861 259340 256206
15041 256206 273522 290859 267812 223642 216776 252382 277140 269025 267356 298192 328392 320777
15029 320777 289557 269994 265347 254249 230155 207759 200581 207988 218516 220534 216643 225018 254803
15016 254803 285732 287554 255463 213480 190540 202887 243285 275146 262019 220302 211119 256545
15004 256545 304563 310918 305502 324105 327418 268044 198699 214078 300573 347338 309333 256677
14992 256677 246547 250311 239164 241043 266206 268385 233778 222530 262785 288734 252812 216410
14980 216410 246717 299270 297964 266403 273423 300441 280133 233185 243291 307642 333549 292332
14968 292332 262363 292955 329702 317331 288295 295575 325939 335998 324760 319248 324020 327577
14956 327577 330497 333179 321220 291162 267067 268876 287974 311458 341726 372208 373439 329301
14944 329301 266772 228594 232070 266992 312890 345006 344953 320319 297450 287646 280170 271617 274589
14931 274589 289970 299693 298367 305196 331836 362250 375720 368461 346035 318321 306069 324150
14919 324150 352444 352524 319661 289540 289995 317344 359994 405125 420009 376206 304606 277291
14907 277291 316320 367389 382452 376006 374008 363922 335459 320701 344391 372860 362528 328836
14895 328836 318842 340641 365488 377295 376640 357753 324621 308978 329540 353595 341324 307637
14883 307637 296684 315811 339627 358370 374726 373993 349096 335512 365141 402739 389579 338025
14871 338025 316585 345396 374441 368994 349280 334804 315846 298388 313553 356704 375031 345504
14859 345504 312689 317558 339236 343981 344518 365848 389312 379384 343245 320770 329330 351938 367521
14846 367521 365889 346516 325725 329711 359664 381727 371903 350584 350637 372548 395556 412425 425263
14833 425263 423947 397957 359764 333487 329034 342313 364447 375778 354568 312817 297835 331706
14821 331706 375173 384003 375016 393823 436299 452248 421484 378528 358126 358594 367136 382103
14809 382103 397049 397418 389282 400073 431377 440603 397772 340054 335041 393808 451607 444743 385410
14796 385410 341838 353987 393106 409615 395547 376807 361337 334184 305245 317681 384879
14785 384879 452081 455911 403789 359402 360333 385407 399592 395620 385021 376074 371793 372793 375661
14772 375661 379241 389945 407718 415362 401306 383422 384927 395150 385134 356522 338749 338948
14760 338948 336607 333718 362074 420988 454799 427178 380730 379532 418977 441347 425680 409466
14748 409466 421539 443294 449040 442701 434688 418027 393210 387310 416183 448508 443651 413969
14736 413969 411389 453707 501428 514112 493868 460159 419150 382998 384871 434921 482998 471057
14724 471057 413766 380552 399167 428143 433837 437822 459071 462351 414839 359000 367179 435991
14712 435991 486590 475455 449132 466785 513672 528775 493199 450434 443514 466118 485952 492813
14700 492813 501553 514937 510455 476597 442746 446562 478139 487942 455308 417282 415511 444559
14688 444559 472728 484851 479151 451668 417572 420189 475862 530682 520283 458992 419263 432410
14676 432410 465228 490788 519023 547536 545590 510482 485048 491463 498330 484095 481353 517002
14664 517002 554449 546158 509675 497591 514809 519444 494735 470981 476986 507451 539623 554782
14652 554782 546302 528011 525548 541340 546553 528119 515165 528099 534841 503592 470146 492825
14640 492825 556739 589131 567455 544424 555401 568395 551898 531419 538419 550130 528780 490823
14628 490823 487763 529920 570029 562707 513565 467632 464721 504920 549315 560343 544323 539720
14616 539720 560577 576594 561755 535372 530802 544791 548755 537958 535786 551054 562612 553790
14604 553790 537205 532943 541130 552006 569348 602132 636729 641507 609014 574776 574424 593626
14592 593626 588898 556860 546904 588894 641712 646253 607366 582073 595630 613860 603611 579368
14580 579368 573055 588860 608725 620860 623888 619001 613535 618757 632249 635625 618306 589699 563827
14567 563827 551046 566973 619869 678822 688013 634722 575253 566946 598731 619108 611199 602634
14555 602634 612888 629596 636542 633244 622977 606608 592625 593183 607711 626707 648747 674709
14543 674709 690767 683002 667285 674589 701255 705647 669191 631332 637722 674296 687640 664295
14531 664295 651211 685128 734499 741400 703809 677569 696296 729779 738733 732494 738722 746268
14519 746268 726913 697396 701749 732016 729038 679771 652062 696406 766168 785493 755206 731826
14507 731826 730357 716034 682629 670797 698842 730842 731265 707804 683478 665919 662324 686967
14495 686967 731162 757959 750509 736823 742139 746384 721798 689030 693694 735516 762953 745129
14483 745129 713350 711731 732813 733564 705279 689527 713402 743705 736703 709377 713785 748127
14471 748127 752499 708199 679740 719110 781975 796484 773592 777213 811462 820672 794330 784736
14459 784736 807651 810601 770322 742693 770102 808980 806929 792044 816106 855007 844785 790884
14447 790884 762347 785364 815683 821077 823839 844092 857978 839860 806310 791392 804694 832607
14435 832607 858429 867208 852446 830316 827862 848206 866650 866416 855441 842769 825674 809672
14423 809672 812679 834245 847564 841235 843525 880024 928056 944343 926067 911230 920141 928585
14411 928585 908880 873248 858603 879972 915927 937058 934892 920132 903830 890022 882802 888083
14399 888083 902889 911575 903562 892043 902119 936466 964926 958696 926779 903400 902698 907063 905905
14386 905905 919254 959351 989550 962179 894692 862148 899183 954469 971347 968839 994178 1030800
14374 1030800 1021704 970514 944829 970841 995510 978173 955193 974380 1017904 1037605 1027776 1015854
14362 1015854 1011468 1009214 1015369 1029529 1025869 994854 975471 999596 1033296 1027839 1003290 1017182
14350 1017182 1065396 1083672 1047197 1003917 999772 1027248 1059716 1085572 1095211 1079984 1056322 1050898
14338 1050898 1057949 1054273 1053009 1086760 1137599 1150530 1125899 1125101 1163144 1174029 1122197 1074021
14326 1074021 1101168 1172783 1208834 1194898 1176305 1172263 1164922 1153839 1157548 1170672 1172798 1171018
14314 1171018 1185601 1204635 1202566 1194597 1219989 1272645 1299505 1275491 1236221 1224195 1238501 1252513
14302 1252513 1253713 1249427 1248229 1247764 1238853 1223379 1224427 1258237 1294235 1279058 1216784 1182530 1223390
14289 1223390 1287565 1299440 1268860 1264375 1301263 1326064 1307417 1276469 1269518 1286650 1317601 1357809
14277 1357809 1387031 1379636 1348615 1334800 1342455 1334331 1303877 1298287 1343992 1398386 1411200 1395602
14265 1395602 1398488 1426392 1440994 1416686 1371612 1343624 1351639 1378255 1386979 1366114 1350807 1380593
14253 1380593 1440432 1476118 1469074 1457010 1469928 1485829 1471944 1437338 1417097 1425281 1447194 1463844
14241 1463844 1466957 1461366 1461905 1475672 1487235 1481564 1477283 1505209 1553922 1576244 1558002 1539121
14229 1539121 1551450 1576236 1584011 1578582 1576338 1575862 1574979 1588022 1618891 1642695 1639004 1620060 1606185
14216 1606185 1599633 1601818 1625846 1668745 1699667 1699817 1689381 1695190 1716783 1738738 1747388 1726565
14204 1726565 1675609 1638972 1666652 1733336 1759752 1733806 1733846 1795825 1843885 1814365 1765676 1780057
14192 1780057 1826647 1825005 1791117 1804079 1858958 1873974 1835751 1820509 1861387 1903798 1914379
14181 1914379 1931424 1972526 1986111 1942654 1896738 1906192 1949875 1973583 1966975 1952456 1942677 1947308
14169 1947308 1981039 2030633 2051601 2026880 1993301 1987736 2005723 2031423 2063923 2094817 2106339
14158 2106339 2109284 2132623 2161723 2148959 2104445 2102062 2162145 2206677 2181156 2145150 2174656 2240065
14146 2240065 2261342 2234764 2219063 2228803 2227712 2211667 2218961 2260553 2304530 2329354 2339658 2334813
14134 2334813 2312125 2294031 2304227 2325451 2326323 2316828 2328950 2357008 2370014 2371371 2391165 2426710
14122 2426710 2445308 2441962 2443001 2456703 2469765 2485904 2516802 2543245 2539333 2525447 2538874 2563544
14110 2563544 2556728 2536387 2561768 2624874 2649315 2615779 2599526 2647575 2703044 2703163 2678423 2690139
14098 2690139 2728572 2743689 2733736 2732249 2738136 2728879 2723077 2760528 2827462 2865016 2854491 2838768
14086 2838768 2851732 2877294 2892279 2903945 2922302 2931983 2920888 2912638 2938739 2989042 3019748 3012736
14074 3012736 3002372 3029595 3084221 3115256 3097867 3066887 3072039 3118300 3169385 3196571 3200564 3194396
14062 3194396 3192272 3211974 3259743 3310695 3330851 3323413 3328914 3373756 3440086 3489987 3498801 3466512
14050 3466512 3422884 3418939 3479588 3562535 3600087 3585994 3580388 3620310 3672563 3695051 3698126 3712666
14038 3712666 3735239 3744381 3746526 3768062 3814808 3866452 3900864 3908591 3900161 3908438 3957282 4019767
14026 4019767 4045322 4040200 4069650 4154763 4226609 4228844 4209237 4242889 4309870 4333287 4314116 4333126
14014 4333126 4414926 4482150 4476507 4449510 4481379 4561948 4613527 4606630 4591979 4616896 4661385 4681629
14002 4681629 4685137 4721537 4801065 4864774 4861683 4826053 4834894 4902275 4968122 4992686 5003049 5028884
13990 5028884 5053325 5062464 5088212 5154380 5225242 5259338 5274893 5308136 5346246 5363101 5384916
13979 5384916 5449303 5527411 5562375 5564284 5589348 5642181 5682031 5713308 5777640 5858429 5892298
13968 5892298 5887193 5927634 6035319 6124441 6138668 6138739 6196066 6282672 6336885 6370275 6431856 6514855
13956 6514855 6573505 6599623 6619748 6645358 6681001 6751609 6866845 6983849 7054636 7086524 7115569
13945 7115569 7153356 7201083 7274575 7366082 7425356 7435869 7464990 7571196 7703360 7770505 7777572
13934 7777572 7805212 7878659 7950427 8003063 8072295 8162579 8232917 8284550 8374198 8511034 8622622
13923 8622622 8663337 8684679 8751171 8849174 8932204 9003925 9095903 9199895 9282886 9349159 9434320
13912 9434320 9547621 9664308 9770040 9874565 9981676 10079513 10167509 10266813 10391018 10521919
13902 10521919 10630571 10718958 10823055 10963240 11106399 11205989 11276756 11386444 11556089 11717754
13892 11717754 11812891 11888917 12034158 12243965 12427962 12543028 12639390 12764901 12902706 13031125
13882 13031125 13173070 13344754 13514258 13656533 13800502 13975761 14157500 14313454 14464949
13873 14464949 14646870 14840456 15005550 15157407 15350201 15592174 15832037 16031829 16208570
13864 16208570 16397218 16607995 16829690 17051058 17271873 17504834 17762143 18031003 18278820
13855 18278820 18497499 18721389 18980872 19261465 19534685 19805659 20098186 20412520 20732041
13846 20732041 21055005 21385426 21708581 22011951 22317808 22659927 23038891 23431117 23824628
13837 23824628 24212104 24573043 24909482 25278879 25734412 26241952 26715241 27132384 27558364
13828 27558364 28046197 28575331 29102831 29619548 30134197 30653026 31199975 31808118 32461573
13819 32461573 33092636 33674011 34273971 34975816 35770644 36574022 37330948 38063690 38826985
13810 38826985 39653789 40542808 41469712 42407901 43355582 44340105 45384309 46478731 47599850
13801 47599850 48742185 49916435 51129928 52387615 53700772 55075597 56502474 57972935
13793 57972935 59496100 61080697 62713535 64378833 66091988 67890985 69794411 71784923
13785 71784923 73834527 75934005 78100043 80364975 82755459 85268582 87871915 90539265
13777 90539265 93284916 96152765 99174161 102346622 105653119 109091302 112678024 116428474
13769 116428474 120339217 124401492 128630870 133066026 137725687 142584745 147616165 152840534
13761 152840534 158300456 163997844 169903063 176025873 182423228 189122305 196091698 203316497
13753 203316497 210844481 218711892 226874883 235279716 243966216 253024287 262459221 272177087
13745 272177087 282112984 292304325 302810389 313613113 324631717 335797018 347074477
13738 347074477 358434007 369822381 381149920 392287658 403093414 413451876 423272341
13731 423272341 432444711 440829744 448307818 454810794 460292424 464699126 467990941 470161859
13723 470161859 471213442 471133661 469928863 467651731 464365388 460100022 454878493 448766599
13715 448766599 441860658 434238317 425958796 417099494 407751244 397987462 387885036 377569540
13707 377569540 367181627 356789193 346390984 336027460 325826273 315897471 306238208
13700 306238208 296799258 287604722 278732901 270200281 261948080 253950764 246259499 238908956
13692 238908956 231849388 225019702 218437093 212153757 206155556 200369330 194762105 189372946
13684 189372946 184239316 179342634 174643726 170130579 165805805 161654981 157653567 153790434
13676 153790434 150066769 146482345 143031615 139698440 136449353 133255153 130131076 127131798
13668 127131798 124287954 121566177 118910754 116307011 113782160 111359935 109040590 106815820
13660 106815820 104676314 102606534 100594332 98647788 96787012 95018121 93326090 91691627
13652 91691627 90106061 88572465 87097847 85678952 84295442 82930985 81601006 80335174
13644 80335174 79126931 77933030 76738088 75581818 74495198 73447924 72398230 71358778
13636 71358778 70361274 69385958 68391367 67396057 66456477 65565405 64648852 63677546 62707756
13627 62707756 61786021 60884213 59966248 59052361 58167054 57281120 56365607 55457445 54605765
13618 54605765 53787146 52941202 52064956 51203947 50369741 49540398 48732870 47993725 47308292
13609 47308292 46595946 45822001 45049123 44343734 43688921 43033144 42377148 41759459 41186402
13600 41186402 40629912 40079871 39552136 39051055 38563561 38088386 37637261 37207493 36784377
13591 36784377 36371377 35987070 35628344 35267920 34898076 34547115 34235912 33943542 33639377
13582 33639377 33330690 33048921 32795734 32533632 32237213 31929854 31653160 31412728 31173355
13573 31173355 30905550 30618481 30339360 30073883 29803739 29519611 29235663 28961901 28681240
13564 28681240 28376123 28066527 27788985 27536918 27261262 26947257 26648208 26405652 26174317
13555 26174317 25886777 25569214 25311953 25122400 24899548 24590319 24280524 24061131 23880578
13546 23880578 23628457 23314428 23044571 22838945 22601849 22290711 21989540 21764312 21554831
13537 21554831 21284899 20991249 20751747 20549640 20307543 20016866 19738723 19499235 19272405
13528 19272405 19053814 18865727 18691791 18486764 18256378 18054978 17896689 17738292 17558343
13519 17558343 17382212 17215913 17028126 16819390 16638296 16499293 16350231 16156599 15956883
13510 15956883 15794305 15649704 15486265 15310557 15142275 14968315 14775769 14591068 14436834
13501 14436834 14285189 14104075 13917536 13766849 13639156 13490844 13322446 13173755 13053834
13492 13053834 12927957 12773981 12610055 12463015 12338594 12222813 12094153 11944007 11797770
13483 11797770 11692091 11616412 11513740 11362524 11211698 11099899 10993193 10854021 10716782
13474 10716782 10623836 10533973 10382610 10199904 10070972 9997575 9904314 9776964 9680468 9624088
13464 9624088 9526716 9357926 9204348 9133187 9084244 8974219 8828559 8720748 8642410 8532138
13454 8532138 8394696 8292350 8233030 8157582 8039943 7922072 7836826 7761032 7665113 7559012
13444 7559012 7466218 7386768 7304504 7209568 7105787 7010769 6943470 6895477 6830881 6737377 6653446
13433 6653446 6611182 6578963 6507808 6412486 6348661 6321695 6281757 6208245 6134337 6079818 6023685
13422 6023685 5959133 5912477 5884880 5837558 5763649 5710912 5695183 5657333 5559780 5463406 5437203
13411 5437203 5442126 5391747 5295226 5240834 5246404 5229730 5146532 5060830 5034673 5029790 4980309 4900459
13399 4900459 4847588 4820893 4774257 4706602 4662381 4647791 4618669 4559631 4509493 4490485 4472281
13388 4472281 4431343 4389331 4359150 4307743 4219732 4150289 4152039 4180628 4144526 4037966 3952727
13377 3952727 3949448 3982573 3977299 3926667 3876279 3850801 3835000 3806582 3756899 3693493 3642642 3630235
13365 3630235 3641150 3623034 3555641 3488979 3476896 3495263 3472805 3394250 3322159 3307587 3323790
13354 3323790 3312325 3263586 3219115 3206608 3203828 3172853 3111708 3057580 3041765 3054526 3061956 3048230
13342 3048230 3025353 3003761 2974809 2931214 2887773 2867617 2875522 2892156 2887329 2840097 2762698 2702398
13330 2702398 2693066 2704942 2680617 2626763 2615826 2670583 2708057 2652402 2552690 2513030 2538463
13319 2538463 2540275 2484904 2440624 2457343 2489318 2478635 2442286 2423065 2411210 2374942 2327962
13308 2327962 2305854 2302250 2285244 2259167 2255606 2272084 2269902 2233096 2188234 2162268 2154363 2153436
13296 2153436 2154966 2154697 2146359 2129557 2107589 2081682 2057645 2046361 2045394 2036705 2016042 2001873 1998491
13283 1998491 1980724 1940843 1916088 1931996 1951724 1930163 1888885 1877835 1885825 1861003 1809571
13272 1809571 1792366 1815449 1809573 1748713 1708981 1756627 1839596 1856177 1790955 1715924 1680860
13261 1680860 1669229 1655439 1644258 1643349 1642558 1636457 1636160 1645159 1647111 1629848 1603956 1587366 1584042
13248 1584042 1585659 1585297 1583006 1581850 1581458 1576252 1563101 1548132 1536530 1518889 1484419 1446721 1432483
13235 1432483 1440180 1438969 1419328 1411500 1433577 1455461 1444285 1414544 1395892 1380116 1346937 1319269
13223 1319269 1335430 1376590 1382575 1342448 1310333 1318875 1333861 1317352 1284891 1269892 1273182 1279250
13211 1279250 1286502 1291724 1279410 1255323 1252972 1275678 1275661 1231204 1198021 1227738 1276505 1266101
13199 1266101 1206948 1177870 1196410 1199197 1158644 1129138 1148785 1176216 1167571 1146227 1144910 1139936
13187 1139936 1102209 1062335 1061062 1077635 1074003 1070860 1104079 1137645 1107569 1036381 1011056 1045938
13175 1045938 1061462 1017089 973107 983524 1012075 1008463 996653 1020674 1056323 1049468 1007392 982161
13163 982161 984814 981180 960049 944187 938206 921534 895931 891738 919714 954171 968217 955561
13151 955561 921411 883417 873162 901484 932332 928340 907767 910547 923379 897644 837013 802761
13139 802761 823653 860999 876899 878421 876821 862254 841800 844874 865397 857463 816539 800125
13127 800125 830637 847353 807349 765934 786417 828721 813750 756419 739612 778238 805370
13116 805370 788935 769436 771324 763724 733374 719599 743105 765078 754249 738012 746927 759120
13104 759120 745636 729569 748780 786542 789654 745025 697674 692654 724764 748359 726598 673715
13092 673715 646468 678443 730141 735090 691273 661020 673099 681567 648848 613807 629914 677971
13080 677971 697626 678776 662394 665555 665660 656325 660896 680703 680765 646210 612164 614025 639024
13067 639024 651649 643686 634079 634943 641294 645848 644667 633024 611927 596104 600578 618123 622889
13054 622889 601866 573422 565396 579795 592242 587566 579964 587583 601839 601368 587424 580591 584642
13041 584642 581486 566454 559856 571878 582735 574368 558651 555013 560567 562880 563878 569727 573227
13028 573227 566840 557634 551246 540506 528514 536840 565188 572649 535494 496259 508941 556854
13016 556854 579632 568435 571335 604060 621993 597925 565941 557738 548841 509901 470512 482259
13004 482259 540853 591265 600686 587459 579992 580347 575039 559957 544761 540284 545241 546641 539818
12991 539818 543988 579136 625497 632374 581721 520705 509807 552988 600260 609457 584592 557391
12979 557391 549427 556104 560879 561936 577896 616871 649124 635748 584737 548496 557006 584037
12967 584037 593721 588248 587132 589709 588359 594930 620090 643478 637485 608471 584898 578158 584584
12954 584584 608468 645710 660372 624015 571948 570145 622402 661067 644314 612987 623243 664905
12942 664905 686716 675862 667457 683752 703980 700337 675986 656019 657267 677350 703545 723499
12930 723499 732614 737871 750956 771475 780591 761561 728103 719279 755449 808031 828884 805977
12918 805977 772439 762093 777804 806606 840347 870142 883534 882363 884219 893566 894264 883977
12906 883977 885729 904537 907383 878220 858099 886078 930454 934860 910631 916482 955852 969608
12894 969608 939640 923778 959988 1004589 1008053 993866 1008254 1036736 1033388 1005263 1002469 1033391
12882 1033391 1050453 1027838 1003325 1022455 1074870 1112337 1113681 1106396 1122701 1152423 1157322 1130730
12870 1130730 1116790 1150246 1199716 1208780 1180849 1172394 1200794 1218582 1198124 1180790 1205217 1242152
12858 1242152 1250252 1248129 1269761 1289082 1263600 1227012 1253715 1334960 1373995 1321738 1244741 1228250
12846 1228250 1271456 1316273 1332262 1330368 1325120 1324326 1337401 1361626 1373208 1355850 1325669 1308837
12834 1308837 1307729 1306453 1298070 1291190 1297534 1321377 1353473 1375483 1382886 1395494 1422614 1430629 1385416
12821 1385416 1321554 1315119 1376152 1426077 1409831 1373833 1386818 1430729 1432931 1380353 1334644 1337587
12809 1337587 1359683 1355165 1325972 1311644 1337598 1386156 1411576 1387576 1345387 1344444 1391441 1420018
12797 1420018 1380622 1316614 1304094 1343600 1372752 1369976 1372000 1386322 1366414 1301460 1259912 1296986
12785 1296986 1370640 1400428 1371897 1332722 1317079 1326584 1361694 1415399 1448893 1427842 1377873
12774 1377873 1355761 1371158 1387209 1392394 1409707 1429740 1405809 1341399 1313540 1362739 1418071
12763 1418071 1394753 1322591 1300314 1345793 1378143 1351798 1322094 1345532 1386112 1373965 1310623
12752 1310623 1257609 1245595 1249536 1243354 1231482 1226506 1232414 1250486 1272596 1274055 1243989 1214490
12740 1214490 1222911 1252209 1251654 1214091 1183417 1180871 1178730 1162224 1158941 1177452 1173803 1123873 1079956
12727 1079956 1097999 1145903 1150309 1111028 1096837 1133436 1166214 1145407 1088018 1037185 1012084
12716 1012084 1018524 1059787 1110007 1119635 1077732 1033397 1027611 1040038 1034148 1016697 1011092 1004001
12704 1004001 969162 925372 918812 953343 983935 979503 952319 924211 903772 901921 928952 963221
12692 963221 959855 909620 859040 851773 876377 893805 891276 881118 865981 838880 809785 800504
12680 800504 811503 817906 802183 771354 738853 709925 692067 699698 733428 766769 770191 744298
12668 744298 715973 703472 698588 686349 670233 667218 681240 692822 680730 648752 622581 619853
12656 619853 632058 640400 640030 637649 632081 615254 594010 591371 615379 641884 643197 622166 600510
12643 600510 584174 563818 544038 543203 560332 570276 563086 562187 585274 608668 595219 546102 502153
12630 502153 498697 535164 582611 606616 591344 555814 536980 543905 544901 517531 488630 494455
12618 494455 520796 524362 503321 498611 523460 540535 522978 494625 488670 503260 520860 537742
12606 537742 548298 531330 482883 439096 436446 466934 496649 508591 504065 485525 465206 467588
12594 467588 494197 509023 488987 462761 464444 478035 472903 466401 492799 528062 513765 454400
12582 454400 422432 452650 493837 489626 452650 427183 425043 435042 457631 489839 503381 477126
12570 477126 433951 412461 416298 420362 414722 413946 428962 451648 465357 460369 445405 444833 466864
12557 466864 477270 438007 375784 365433 425359 480488 466060 419825 416963 452596 459382 421411
12545 421411 393174 403746 416211 401821 388992 405122 422989 407637 377220 371117 385232 387541
12533 387541 381148 399591 439822 450089 403576 347500 347613 401444 440431 418666 370102 360954
12521 360954 402209 436136 411248 346888 307612 326582 375734 409770 416905 414660 411245 394541
12509 394541 362470 343564 367400 420101 452938 441704 414491 405733 407878 397591 388551 413121
12497 413121 457688 467988 429512 393443 401046 428487 437192 434856 444753 451807 430409 400485
12485 400485 402576 432078 448087 436437 416249 394489 364040 339011 340811 354984 353664 352954
12473 352954 388396 439019 445843 410211 397946 430532 452179 432501 418270 438993 444094 397916
12461 397916 362513 403057 469384 467284 408336 385335 416932 424757 373395 330785 354822 403173
12449 403173 405734 366239 338123 341123 354851 369378 392546 417412 422950 407574 394300 399807
12437 399807 417759 436113 455215 479294 496666 482549 431250 377936 367897 400489 427241
12426 427241 416682 393434 392185 403022 397143 382508 389365 414841 428890 427127 429299 430977 411261
12413 411261 388665 407783 458733 474351 432288 396158 417100 454514 447391 412754 406163 421421
12401 421421 407197 366336 357797 395374 421229 403369 390470 428071 475762 466130 411971 387919
12389 387919 415918 437704 415078 393448 425499 479279 481973 431897 399515 416801 434353 411753
12377 411753 387295 412622 465957 487409 469788 454757 458218 459592 453938 455217 454607 436234 428712
12364 428712 472621 535828 538430 475938 436448 466894 504367 485315 444973 446021 474021 476938
12352 476938 458598 456965 467132 460823 453316 477315 512746 513862 487616 475637 476990 462455
12340 462455 449607 482433 541215 555056 510819 472429 479068 497021 490600 473071 465310 464176
12328 464176 471348 497047 521108 509582 480532 487664 528421 543608 522454 520739 548775 539465
12316 539465 474360 441688 497547 558995 527106 444767 425922 476989 502251 464960 432902
12305 432902 458296 504709 515718 490139 466759 477913 526815 577163 573879 511571 461973 486030
12293 486030 544321 555462 519406 506974 539264 562401 547949 535222 552310 569320 561119 553082
12281 553082 569044 586382 578503 558664 548955 542662 525902 505335 493357 495093 520007 568417
12269 568417 600797 571118 502959 475793 516375 563901 568445 557022 563426 562087 529844 512972
12257 512972 558974 624618 631297 585134 561605 583629 596790 571019 549506 571013 605366 604933
12245 604933 579731 579006 616978 653777 649712 614405 591607 604124 628970 632963 618022 611144
12233 611144 618922 622932 619476 626735 644681 648715 638727 650192 691399 714918 686865 642153 627855
12220 627855 631735 618848 602823 618286 648346 647562 622740 622513 651956 665299 646306 629843
12208 629843 633491 631174 611922 605217 624003 636006 619696 601750 608761 622697 615791 595404
12196 595404 583995 582668 580839 577854 574846 569285 570767 591635 611064 589583 537405 521310 572670
12183 572670 632708 631056 582671 557258 577360 600558 593007 569521 555957 553272 554356 568784
12171 568784 608881 660063 684528 663805 629231 628174 654997 648669 584254 528279 550373 609976
12159 609976 609123 548398 534771 613976 693861 684750 627323 608873 626579 622444 598405 598120 609045
12146 609045 582517 534246 529191 571642 601665 603036 623170 672248 692742 657738 619244 621801
12134 621801 638429 634005 628867 650258 671470 651700 601860 566007 563282 582218 606417 617817
12122 617817 603079 581480 593492 637298 656193 620172 578087 587505 630389 648948 636691 637058
12110 637058 666028 692256 693794 685258 679276 662085 626582 600981 618253 666492 693281 667609
12098 667609 623241 619094 658722 683761 664105 650765 693464 744761 721617 644842 623286 687792
12086 687792 739979 705924 645778 644589 676478 665751 622790 618133 655159 668952 640309 620085
12074 620085 637738 664172 673905 676849 679861 676335 678689 704556 730723 719424 686505 678731 688562
12061 688562 667313 623810 622665 668855 686018 643536 616102 663762 729298 721948 646857 583637
12049 583637 576604 607683 646071 668340 655725 621896 619297 672870 733301 739172 697134 656175
12037 656175 633854 619369 621414 654370 693625 699574 676042 658271 655908 653626 653083 665764 677663
12024 677663 669748 659953 674602 692888 676112 640895 641421 682010 709805 698607 679342 677403
12012 677403 677671 667031 659527 662885 666438 673479 697131 716148 691295 637911 619912 651800 672751
11999 672751 647797 626058 653957 694466 691139 660711 656344 677425 683373 669364 661847 658782
11987 658782 640222 624946 650379 701389 723306 706614 695628 706893 704475 673660 656020 681300
11975 681300 718990 734482 745388 777021 801848 778989 730395 718236 752287 776368 756445
11964 756445 730757 746050 783491 788086 751946 724056 737424 767005 775995 771115 781830 803925
11952 803925 802191 767370 733836 730271 744525 755238 768865 797031 819942 810927 788208 799819
11940 799819 850577 883196 852870 791110 764409 786456 809094 799843 788522 816024 866639 889064
11928 889064 873325 861824 876656 883355 854957 828957 850969 890719 879075 819563 791001 827818
11916 827818 870318 863759 837653 839395 851501 838123 822669 843491 870571 851200 813343 829388
11904 829388 886117 893465 836049 811190 875252 946263 923946 834783 782920 806019 854469 881523
11892 881523 883492 869039 850397 853306 883749 899014 862062 808183 802963 846815 878838 868515
11880 868515 845222 837784 842175 853291 873589 883179 855240 809790 797918 822776 834326 816402
11868 816402 814617 852396 884019 869579 838818 834548 843860 836538 825404 832056 833974 807730 788061
11855 788061 814442 849115 827131 768866 756024 799435 821919 787807 759277 787889 830737
11844 830737 827433 795390 786630 800074 803441 804270 828337 853021 836683 802502 816208 876252
11832 876252 903040 860546 817017 840829 894117 893042 838952 815236 857633 899136 870693 803272
11820 803272 782691 830583 884341 892163 875092 874899 884611 870895 839872 831187 852122 866080
11808 866080 855354 850038 874277 904295 909651 902197 907344 914655 900420 879363 885606 912735 922163
11795 922163 907846 902416 915767 919272 902499 894343 909172 922602 925832 950610 1001628 1015558
11783 1015558 944836 846753 822677 885153 950894 961571 944729 943511 951157 947773 951102 983658
11771 983658 1017804 1002612 937766 879484 867542 879693 874685 855760 861642 900124 925122 898115
11759 898115 848204 836681 870292 892319 868843 839256 852920 893035 906537 886608 875818
11748 875818 894508 913727 905122 878874 860788 860461 872042 885011 889198 885921 889839 902866 902952
11735 902952 885195 887920 933854 972298 944339 887630 892858 956086 971906 899703 835563 862918
11723 862918 923952 921315 873792 869545 912510 925497 887425 862229 886803 922262 933584 937828
11711 937828 948665 942577 911254 890745 906437 934340 944278 941030 938522 931528 916861 909034 914289
11698 914289 919476 921619 935972 962354 978636 979135 981672 985749 966539 924779 898025 904772 921865
11685 921865 933978 954931 979211 969930 927093 910247 950624 994506 984920 950079 950447 980141
11673 980141 990114 979276 988165 1016435 1019167 985964 960156 969581 991063 997444 995979 1002833 1012358
11660 1012358 1009747 995087 982931 985183 994562 985707 948988 921140 946968 1005287 1024576 990508
11648 990508 972635 1007483 1030833 989209 942318 962740 1000055 963456 892320 902931 983789
11637 983789 999198 913133 853102 900332 963465 942803 890896 902371 947384 939083 894874 901391
11625 901391 960075 989209 962030 935223 943824 961161 966818 973866 981916 971861 951647 947221
11613 947221 951145 939295 927607 944931 961511 923751 857142 847757 909832 959002 942688 913115
11601 913115 930887 971684 981900 966254 960941 964105 951656 931874 930674 941907 937231 912275
11589 912275 888362 881838 898537 939307 984372 995405 964364 938851 965046 1023208 1054407 1036530
11577 1036530 998524 970711 958090 958593 972592 989955 992786 975681 948009 920202 904043 916807
11565 916807 961371 1007102 1015168 983266 945120 926656 924510 929403 945894 976162 1000202 991440
11553 991440 952773 924860 946471 1004892 1039789 1010871 951281 928729 957033 980782 957586
11542 957586 917582 914502 948055 973298 970115 961634 967600 977988 978784 972624 964938 956565 960036
11529 960036 995457 1052648 1081310 1046136 980258 954407 992292 1043884 1053704 1030390 1023502 1047420
11517 1047420 1066564 1058602 1050640 1070546 1097411 1095987 1075137 1069358 1079837 1082744 1085222 1116783
11505 1116783 1165660 1183706 1163257 1147616 1151379 1140360 1116432 1143378 1239317 1317305 1301369
11494 1301369 1240598 1230196 1272901 1307994 1331326 1379892 1426282 1407108 1350656 1355566 1428655
11483 1428655 1465000 1422715 1396479 1458353 1537015 1538994 1498540 1506904 1559208 1578542 1550709 1530662
11471 1530662 1536450 1533569 1517430 1523313 1551779 1562534 1549539 1550157 1570144 1569660 1539007 1520814 1534377
11458 1534377 1539943 1507110 1464421 1448765 1452227 1451711 1449335 1449745 1435174 1398624 1370013 1374552 1392426
11445 1392426 1392181 1377573 1368739 1363189 1350974 1344828 1357230 1368420 1357708 1348266 1375268 1421640
11433 1421640 1435409 1409043 1391718 1414918 1453129 1475404 1492186 1522511 1549052 1543157 1516528
11422 1516528 1511603 1545173 1590041 1613541 1611804 1602961 1606225 1634089 1687775 1748407 1783471 1776842
11410 1776842 1750640 1745866 1778609 1823646 1846509 1844359 1843966 1861238 1879092 1875458 1860590 1866068
11398 1866068 1897354 1919234 1900274 1856751 1834375 1852124 1882588 1889705 1870320 1850904 1852554 1868479
11386 1868479 1874254 1856829 1833081 1834420 1865645 1886419 1852647 1778030 1730865 1754775 1811622 1827290
11374 1827290 1784404 1740033 1747947 1791245 1810454 1783697 1753844 1770899 1824109 1851285 1818411
11363 1818411 1768909 1770983 1826474 1868784 1858550 1839157 1868794 1934352 1978855 1989969 2004604
11352 2004604 2035821 2057879 2068704 2102824 2162727 2199389 2193002 2195215 2247763 2311299 2329557 2320492
11340 2320492 2339842 2387056 2418121 2431246 2464729 2515918 2537414 2522203 2523189 2568787 2619829 2635563
11328 2635563 2629569 2631333 2638104 2636460 2635066 2646369 2663882 2678081 2686808 2678809 2644267 2611508 2625345
11315 2625345 2673739 2691497 2659506 2636727 2658938 2676368 2647518 2626413 2677380 2756033 2769709
11304 2769709 2723909 2706897 2741886 2761385 2738761 2739798 2805886 2875995 2880994 2847737 2847016 2887245
11292 2887245 2924123 2943880 2973896 3024341 3072422 3103220 3127953 3160566 3202041 3245619 3279924
11281 3279924 3296868 3312524 3361981 3451072 3532586 3559959 3549638 3557780 3605750 3664237 3706839
11270 3706839 3742063 3786292 3836984 3885114 3930527 3971774 3998586 4007556 4013100 4032120 4066061 4103852
11258 4103852 4132978 4143505 4133783 4119038 4121906 4144642 4161609 4151567 4127383 4116645 4119210 4108279
11246 4108279 4077808 4061096 4080810 4100417 4061690 3969525 3900253 3907528 3951887 3954510 3898697 3837841
11234 3837841 3811840 3801514 3774821 3737609 3715483 3712510 3713582 3710959 3705302 3692150 3668419 3644466
11222 3644466 3631516 3623702 3609211 3593692 3596218 3624581 3667246 3706647 3729526 3729161 3710276 3690312
11210 3690312 3686643 3703756 3736314 3776184 3810319 3824584 3822568 3830922 3871126 3931972 3983048 4009753
11198 4009753 4022576 4038552 4067517 4110760 4157931 4189095 4194799 4192160 4207903 4247533 4293693 4331990
11186 4331990 4364268 4397253 4432275 4468655 4506640 4544496 4580138 4616307 4657964 4705138 4753253
11175 4753253 4798405 4838705 4875386 4916677 4973402 5044365 5112045 5158541 5181453 5193074 5211747
11164 5211747 5251667 5306843 5347095 5350040 5336090 5345317 5378846 5398639 5392201 5392453 5414353 5421991
11152 5421991 5393436 5369032 5384812 5400781 5359703 5284823 5243833 5234926 5192715 5105948 5041825
11141 5041825 5033963 5027139 4968689 4884917 4821638 4768379 4695734 4621896 4581949 4558674 4500629 4397755
11129 4397755 4294597 4231786 4204864 4178145 4121245 4039294 3973957 3955557 3952426 3902922 3804846
11118 3804846 3725114 3701340 3688409 3637980 3577716 3560628 3578175 3581267 3556856 3527626 3501291
11107 3501291 3474533 3462590 3470433 3461003 3411356 3371959 3399941 3457191 3457269 3402348 3383220 3436886
11095 3436886 3494823 3497662 3478819 3494994 3541782 3583342 3611741 3632563 3635758 3622258 3623837 3662116
11083 3662116 3720240 3780352 3849642 3923513 3967878 3971238 3973794 4012720 4078527 4153858 4245938 4344644
11071 4344644 4402708 4405679 4410659 4460800 4512228 4512018 4500164 4550660 4644831 4696496 4688399 4688324 4726485
11058 4726485 4750575 4724783 4688838 4681397 4675471 4636268 4587145 4567103 4563247 4535482 4481027 4429339
11046 4429339 4391063 4351371 4302496 4249663 4191432 4120745 4041619 3965574 3896257 3831642 3774152
11035 3774152 3725522 3678245 3622501 3556537 3485901 3420068 3368812 3328536 3275835 3196040 3116372
11024 3116372 3082111 3094438 3101286 3059629 2978211 2888202 2805028 2736938 2697245 2680609 2653530
11013 2653530 2597412 2539881 2514963 2511549 2491482 2443547 2390131 2351690 2329844 2313711 2281807
11002 2281807 2216589 2141004 2113915 2153370 2190425 2148343 2050672 1992845 2010766 2039722 2014785
10991 2014785 1951784 1901952 1877240 1858378 1840525 1830575 1821875 1806234 1794098 1794191 1790342 1765356
10979 1765356 1729486 1698112 1662613 1615985 1585023 1594536 1615495 1598299 1550795 1528928 1546089
10968 1546089 1550192 1509736 1465417 1460137 1466065 1432289 1373201 1351621 1386603 1431147 1440091 1413384
10956 1413384 1369562 1322980 1296975 1314367 1356130 1367278 1324108 1261592 1215997 1181226 1148792
10945 1148792 1145900 1188691 1232153 1222260 1177973 1163640 1189241 1198217 1158265 1106451 1087607 1096159
10933 1096159 1100876 1088636 1063587 1036783 1031215 1059871 1086425 1054414 974625 929560 959189 998542
10921 998542 976372 922755 912764 943552 947645 910114 889609 918719 956454 957338 929115 901652
10909 901652 886992 887596 900661 901561 866985 823047 820782 856174 873276 857979 858096 887317 889886
10896 889886 843519 814982 848422 875834 826205 758585 776982 856403 878887 826371 803594
10885 803594 853692 885222 832320 765801 765033 779571 722801 633679 625899 707836 769673 749975
10873 749975 710287 718739 747577 734067 683426 655863 680745 728492 755678 747573 721116 704369
10861 704369 710645 725871 726424 707605 682997 662166 648001 648431 664451 673578 658721 647240 676593
10848 676593 720936 709771 636536 585294 610979 653013 628043 561002 544888 596047 638949
10837 638949 634864 634318 673575 701426 663937 602039 594948 639678 659930 626749 601555 642060
10825 642060 717226 747986 704418 630605 585080 584376 605436 621007 619742 601272 570066 540486
10813 540486 535474 565312 610684 640462 645234 638969 629915 611821 588316 580609 596599 613405
10801 613405 609185 594901 593326 601489 599037 584623 578258 590631 611347 625469 624127 604090 575613
10788 575613 563969 582030 608144 614632 610107 623732 651823 656409 623413 588272 588582 617173
10776 617173 639271 637502 624205 621307 637671 657557 652028 616119 587811 605725 654381 684106
10764 684106 681190 676636 684706 684937 677463 697948 749551 777317 751729 724799 749897 793745 794464
10751 794464 768617 781632 834407 864119 851305 840549 847891 835361 801832 814402 905181 1007156
10739 1007156 1045982 1038177 1042007 1063118 1075129 1092631 1148128 1219040 1251767 1249806 1268907 1325476
10727 1325476 1377802 1407137 1450470 1530193 1610762 1658341 1695016 1755576 1829323 1885844 1928604
10716 1928604 1981037 2042369 2099590 2165562 2261012 2369807 2457016 2525832 2609980 2709455 2784379
10705 2784379 2823518 2867715 2942255 3014452 3053983 3092696 3175449 3281166 3349184 3368796 3384665
10694 3384665 3417592 3439886 3438064 3441542 3467197 3486401 3475489 3453640 3438847 3410980 3357806 3314638
10682 3314638 3308742 3301557 3245062 3166333 3128059 3122535 3080016 2981297 2886949 2840681 2813553 2769261
10670 2769261 2720681 2685795 2642514 2571233 2500729 2467524 2459653 2438896 2392676 2330988 2258605
10659 2258605 2182595 2122788 2087053 2062145 2048642 2063964 2085131 2044219 1927698 1826708 1823609
10648 1823609 1872097 1866363 1796122 1744622 1748835 1755816 1723035 1673548 1631858 1584953 1535994 1524828
10636 1524828 1558411 1581775 1556001 1511101 1484737 1461761 1416799 1368957 1347490 1341256 1325499
10625 1325499 1304854 1291314 1275611 1257774 1264557 1294188 1290242 1224726 1161827 1170222 1209260 1185979
10613 1185979 1104786 1066596 1113990 1168906 1154683 1101815 1082643 1098654 1094504 1052696 1012910
10602 1012910 1004321 1009810 1007015 1006586 1027084 1053009 1046874 1001723 956055 944520 954040 950408 931444
10589 931444 920093 914232 888288 848423 835824 858627 872411 855374 848126 878123 900293 871173
10577 871173 832950 849408 894951 893148 844313 822599 851155 873447 858093 841103 843222 834225
10565 834225 810357 820925 876207 910531 886200 855998 866289 877249 849268 832509 882441
10554 882441 949037 950314 909476 911729 956640 967979 937185 938147 989344 1015926 981110 952693
10542 952693 989467 1046801 1054295 1020197 997298 997289 999428 1004269 1021565 1034209 1024568 1012636 1024820
10529 1024820 1048806 1058662 1057902 1057412 1040086 993697 951972 951195 967053 949317 903352 878947 886838
10516 886838 887236 862363 840344 836833 829260 806443 791662 793544 782278 742921 708234 705467 711037
10503 711037 697385 688073 717206 759589 756221 699507 642136 621641 622749 620466 616108 616617 616880
10490 616880 621282 648408 691451 705450 663949 604334 582703 600155 611103 596282 586350 607334
10478 607334 638712 642490 609690 560859 519093 500001 512641 549443 583367 593161 586048 580347
10466 580347 574784 557267 539269 551191 593576 620001 591930 535269 513141 545264 585110 587091
10454 587091 566758 568524 593712 600171 572065 547384 557876 578446 570475 549837 565320 617112
10442 617112 646504 617872 568550 554953 582371 616259 637955 655827 674396 683495 675559 653606
10430 653606 625848 605266 604066 616045 620770 619058 639454 686818 714438 685095 635471 631385
10418 631385 674307 706818 704005 698786 712118 722232 721361 740038 783995 805755 781590 763483
10406 763483 799954 849665 841280 790632 782814 845183 912306 930112 929778 967491 1038294 1089307
10394 1089307 1093839 1078603 1087761 1142083 1227119 1306516 1351467 1366007 1379684 1413594 1462478 1511329
10382 1511329 1556900 1607345 1669893 1744099 1822433 1896745 1968315 2047824 2140378 2238214 2335351
10371 2335351 2437572 2546131 2645787 2727026 2807711 2910962 3031721 3148528 3258306 3372950
10361 3372950 3490566 3600578 3711115 3838002 3969718 4078791 4168733 4273215 4404451 4537922
10351 4537922 4652960 4751031 4829049 4877893 4917610 4987061 5081220 5146551 5161511 5170866 5208456
10340 5208456 5239421 5225550 5198951 5208654 5229695 5196758 5109866 5033865 4996110 4954847 4878922
10329 4878922 4793044 4721094 4641810 4534373 4423742 4342245 4277040 4193411 4088845 3987484
10319 3987484 3894585 3793476 3685340 3597560 3540464 3478930 3369651 3222783 3104632 3064917
10309 3064917 3072482 3046720 2953048 2838796 2762972 2722618 2676062 2611670 2552137 2504882 2454186
10298 2454186 2401044 2367049 2351945 2327013 2281718 2240101 2216169 2187404 2132011 2064170 2012447
10287 2012447 1985415 1973671 1963879 1939382 1891859 1842736 1824839 1833220 1828021 1797263 1774835 1777401
10275 1777401 1771594 1735379 1703754 1708279 1714078 1674573 1616242 1601807 1627287 1627005 1579255 1537955
10263 1537955 1545657 1575269 1581827 1563319 1542157 1524461 1506763 1495620 1495491 1496384 1489338 1475390 1452051
10250 1452051 1416943 1390271 1398776 1426070 1418494 1360252 1303784 1298281 1325296 1339815 1340236 1351769
10238 1351769 1365273 1346439 1298400 1265770 1271686 1291059 1295009 1286737 1279938 1271060 1251842 1230553
10226 1230553 1222736 1230363 1242057 1247822 1246286 1242036 1240073 1240408 1238769 1235243 1236731 1245464 1253162 1254688
10212 1254688 1257826 1268251 1275404 1268172 1255437 1254612 1268167 1287865 1311016 1332201 1332494 1305286 1282377
10199 1282377 1299354 1339709 1353442 1333292 1327071 1360209 1392675 1382272 1352036 1353741 1389108 1412471
10187 1412471 1401846 1385541 1396088 1430796 1465274 1481750 1476642 1458430 1444255 1445288 1453358 1454221
10175 1454221 1451638 1462036 1486003 1503033 1498216 1479736 1465984 1466215 1475815 1481820 1474725 1463067 1469188
10162 1469188 1498106 1520491 1505596 1463511 1432714 1431866 1448248 1467438 1484161 1486998 1467926 1449846
10150 1449846 1466517 1507044 1520320 1488227 1451812 1444529 1445609 1431036 1423762 1446043 1460478 1418437
10138 1418437 1344061 1307317 1324049 1344971 1342033 1342553 1367458 1394235 1399942 1390883 1371557 1334126
10126 1334126 1297911 1304093 1343316 1345810 1283199 1224383 1237144 1284878 1289275 1255780 1253266 1288806
10114 1288806 1294925 1248015 1210776 1226567 1248433 1222037 1178472 1181337 1220584 1229419 1192345 1168131
10102 1168131 1196291 1237989 1237359 1201786 1182973 1197897 1210389 1193063 1171225 1184953 1229102 1259540
10090 1259540 1252333 1227844 1212996 1208503 1205902 1210218 1224772 1234822 1230905 1229999 1245755 1255937 1234869
10077 1234869 1204009 1206525 1236676 1243132 1209348 1182130 1200908 1240138 1249190 1218411 1178588 1159334
10065 1159334 1171674 1209089 1244040 1245803 1221084 1211648 1233204 1248750 1226820 1189452 1168751 1153830
10053 1153830 1126782 1116975 1159534 1220764 1230905 1184696 1144626 1141724 1139748 1113091 1094645 1114146
10041 1114146 1142420 1137671 1108472 1090038 1087240 1080686 1067651 1059878 1056597 1052276 1056053 1071883 1074568
10028 1074568 1040934 994811 983877 1014312 1042705 1034588 998961 959943 927028 906078 910398 938915
10016 938915 961920 952155 920856 902129 906561 912088 901960 888798 889210 892579 875730 840559 814234
10003 814234 812549 825634 843020 866096 885311 874807 831754 795116 795829 810106 797373 765274
9991 765274 753754 768549 781263 788575 812886 840587 824638 767358 736579 767048 805246 794075
9979 794075 755824 738276 731630 706603 691816 731216 789024 785019 720321 683049 716567 761093
9967 761093 752419 708609 681269 678647 681106 688201 704885 713478 700859 687795 694330 700592 679718
9954 679718 648569 645654 672496 695010 694977 685326 678445 671576 664591 665574 675029 683962 689054 693519
9940 693519 694000 682871 664337 655404 668681 699412 726462 725482 693172 660534 663161 693470 708456
9927 708456 695115 693292 729738 766908 758902 728965 735178 773103 777130 725197 679079 694259
9915 694259 742287 762306 750332 748265 767185 775297 758653 744845 753829 763909 749494 726378
9903 726378 731152 768387 805826 819329 818073 820639 827737 830447 829959 833233 837226 832658 820057 809927
9889 809927 809504 818976 835701 851401 852367 836818 825162 836263 860323 874229 875093 874249 867901 848011
9875 848011 837783 873138 941900 985383 976322 952770 953482 963710 955392 939334 938695 945748 945966
9862 945966 952531 974434 984488 966849 959374 990556 1012316 970424 911196 925655 1000865 1030043
9850 1030043 978494 932154 951089 981327 966045 945033 966365 983188 935491 873591 891859
9839 891859 974154 1014473 978873 940860 949493 964398 949054 937444 962591 992185 989142 979081
9827 979081 1000202 1030996 1028676 1006446 1008161 1027072 1018193 986033 989354 1043469 1082967 1056906
9815 1056906 1009112 1013031 1061747 1085042 1061939 1048275 1081419 1121398 1119941 1096974 1101001 1130148
9803 1130148 1147766 1151494 1165140 1176051 1149328 1104248 1103583 1151447 1175024 1137762 1098342 1111460
9791 1111460 1139538 1127650 1106362 1136912 1195174 1204006 1161879 1142952 1168862 1176541 1135447 1107235
9779 1107235 1144623 1202342 1205710 1159765 1133205 1162647 1221217 1263937 1265766 1229252 1185837 1176289
9767 1176289 1205595 1233551 1230003 1215248 1220790 1238062 1241617 1240857 1265319 1308774 1331081 1316747
9755 1316747 1294540 1291468 1298900 1297640 1291611 1297165 1312419 1317386 1303148 1285917 1285738 1300283 1311730
9742 1311730 1316037 1326644 1343569 1341691 1307672 1267877 1252736 1250967 1234344 1214194 1227683 1270649
9730 1270649 1293196 1270682 1233736 1215395 1212900 1216321 1228367 1237319 1218702 1185796 1186915 1226110
9718 1226110 1243777 1211191 1182143 1201751 1226951 1203587 1165869 1177522 1218639 1224047 1203621 1222400
9706 1222400 1274480 1284696 1243472 1233377 1292229 1346776 1328700 1274304 1252684 1262440 1262365 1252802
9694 1252802 1261118 1280366 1281737 1266941 1260031 1264139 1266101 1267624 1276909 1284667 1277951 1262018 1245788
9681 1245788 1227359 1214009 1225463 1251798 1244639 1185607 1128337 1128335 1161254 1161758 1121175 1090698 1098954
9668 1098954 1122412 1137647 1151110 1166393 1164604 1135245 1098841 1083593 1096137 1121640 1138120 1128875
9656 1128875 1094064 1050702 1014921 992608 990854 1016032 1048609 1049130 1011585 981630 993417 1019144
9644 1019144 1017090 997795 996313 1007758 1007053 1009850 1046754 1088220 1068907 991528 934442 939522 961461
9631 961461 954940 944377 964694 990453 979856 950516 952334 984427 992775 947033 879056 841171
9619 841171 852372 888558 909408 894907 863617 849006 856114 859426 847849 844499 866726 892760
9607 892760 891292 865490 844053 841472 846936 842274 816799 777524 754906 777868 829557 853201
9595 853201 822835 783530 793826 848468 890128 884280 849590 820159 807761 802890 792103 771953
9583 771953 756200 763269 789318 809004 812721 819956 839482 845467 821221 799185 817886 857845
9571 857845 864863 828073 790411 783353 794222 802536 807744 810125 799701 778147 762832 757333 745378
9558 745378 724957 719532 740506 764640 766410 751567 741967 745515 756398 767529 768033 746046 710134
9545 710134 691766 708719 739121 749379 736604 724754 726478 728299 713176 684294 663858 673030
9533 673030 710623 748984 757533 734019 704848 691464 687579 675815 654633 637220 631140 631536 632355
9520 632355 634894 643824 658413 668247 658974 627059 588891 568994 577496 604084 633571 658977 676396
9507 676396 675505 644766 588410 534178 515176 536515 565355 567178 548254 541914 552882 546257 505300
9494 505300 467570 475858 518044 548618 549959 536193 514725 486751 472437 487672 503708 481186
9482 481186 439924 436434 468990 471975 422961 386790 416812 473080 487990 464196 450692 458538
9470 458538 460858 452590 451060 451052 434397 416189 428707 461690 469404 441568 420566 437375 470980
9457 470980 486663 481114 470913 460420 440466 407674 374299 362952 388542 437015 471095 470379
9445 470379 454392 450782 456928 454518 444661 439832 434711 416412 393739 385661 390463 396497 410136
9432 410136 437437 451784 423329 373424 354125 375287 397163 395855 388590 388898 385488 377741 386703
9419 386703 414201 430597 419042 396870 382184 375932 384154 414631 442928 430529 389276 374915
9407 374915 399879 411357 381417 355965 375007 403815 394630 366498 366283 391270 409476 421629
9395 421629 441619 445926 408577 364111 367709 405760 413469 376319 347984 363465 396076 412620
9383 412620 416577 418788 410996 389323 370474 367934 376482 386940 392661 382443 353913 329308 329375
9370 329375 340951 342601 346737 373750 399962 385080 343085 326959 344830 353545 338718 333553
9358 333553 346820 343801 320843 325777 370150 392572 356076 315253 327125 353780 326795 265843
9346 265843 251820 303131 356519 366356 353641 349706 351589 349290 350173 357520 359367 353317 354011 365129
9332 365129 369876 358637 342178 328572 309843 282843 265265 277688 318222 361776 380343 365807
9320 365807 339402 334106 359601 389811 391489 357553 308652 275618 283663 331661 378232 375067
9308 375067 328547 299029 320355 355010 356738 338827 337925 344933 327974 300697 303921 329019 324939
9295 324939 284531 261117 285758 324924 339558 333684 320857 293336 256740 250724 294987 346652
9283 346652 351294 314026 283113 279579 279449 259358 229814 220514 247365 294133 323351 313811 285646
9270 285646 271819 271006 258751 241909 256463 299464 313494 268496 215245 216769 261001 288376
9258 288376 280646 270225 274445 273126 253103 232191 230654 249103 278761 306912 311438 278085 227126
9245 227126 199005 210080 241574 269515 283117 277569 255755 237733 243178 262799 270345 261895
9233 261895 257163 262786 265073 262543 272108 292049 291267 254227 210824 199033 216730 233675 236978
9220 236978 238789 244848 241913 223126 207497 219153 252437 273426 261947 238695 234790 243972 232756
9207 232756 199569 187841 221507 260751 254725 213781 189280 198157 212968 219349 233804 258865
9195 258865 265941 238430 198459 177706 188770 229382 281785 306259 277284 231506 230591 266039
9183 266039 260581 188787 130512 157514 225340 243329 208825 193728 220709 236439 209337 177465
9171 177465 179072 196851 199981 194377 199803 212297 219379 226307 240212 248676 238534 220801 216409
9158 216409 228369 242788 246530 233846 209370 193149 205829 238746 256520 240513 211169 194966
9146 194966 190632 185878 186812 205060 228598 232852 216395 201863 202444 209203 213439 220170 231592 234955
9132 234955 220497 201139 198727 213710 224449 220997 223418 250932 282381 272775 213841 153250
9120 153250 138243 160831 180516 183219 187609 203693 219636 228225 233992 232273 213119 189223 185841
9107 185841 197634 193558 173408 174773 205568 218713 186941 157507 185802 249474 282378 268929
9095 268929 246440 229870 198851 157802 144705 167033 185431 180936 186407 223582 256237 244139
9083 244139 208644 201779 230248 250036 228857 183690 157817 177940 228516 258925 230721 167795
9071 167795 137781 169297 215332 221420 199386 196674 216504 217103 182913 148823 147485 171807 200083
9058 200083 223696 235541 221719 184821 154035 153045 172165 185972 184563 175465 168798 172329 188125
9045 188125 203696 201259 186838 192337 231490 269288 258928 202517 151687 146891 175278 194503
9033 194503 183637 160166 152796 167767 185092 184403 167951 154822 158384 176799 199929 213437
9021 213437 201256 163237 130574 139641 181792 203896 176403 138576 148851 204533 244241 228329
9009 228329 184280 162885 176174 197437 206330 210813 225752 246820 253774 234348 197483 162221
8997 162221 140407 135532 150369 180824 204344 195065 158216 130991 137524 160640 172380 172286 174322
8984 174322 175061 163621 149598 149696 156121 150410 139669 143478 153950 151250 151245 184636 229142 226755
8970 226755 182072 171388 220710 248473 187384 99623 92118 160927 208486 190830 154546 135279
8958 135279 116763 102960 135242 204941 234837 194319 156394 182937 223410 200780 141402 131903
8946 131903 181155 216522 204659 188682 200428 215535 213734 213807 222172 207802 161681 129963 150486
8933 150486 197336 224579 228098 226617 216446 189432 169502 184117 215425 223631 207695 200600
8921 200600 212550 222391 221972 223955 222515 193329 146041 132042 174543 226393 229684 192384 170120
8908 170120 186610 209726 205337 181969 171836 188853 218420 237141 232144 208208 185216 184736
8896 184736 209956 237974 239101 208750 176429 175031 201372 218679 204038 179228 178582 198061
8884 198061 203474 187680 185235 215906 245872 234427 197717 188646 221681 256044 256417 234488 218808
8871 218808 214854 213405 214381 221703 231737 244082 266171 290428 288291 250110 211350 211034 240536
8858 240536 263763 270942 274646 268099 237370 209903 233244 295278 324056 290670 255688 276168
8846 276168 319139 319568 281955 261058 270564 280427 288746 321881 364610 365757 326691 312299 349379
8833 349379 383261 370818 349621 364616 386060 365639 328801 336526 382485 403211 377235 342734
8821 342734 322743 304497 294161 317583 354511 347128 298013 284892 340287 389277 362916 309931
8809 309931 320667 384195 408080 362421 317506 330882 372636 388324 376811 369780 374377 374177
8797 374177 365231 360571 368362 382994 391172 382080 363795 366910 409656 462329 477962 459473 456323
8784 456323 485217 501792 475740 446764 463840 505511 513056 480446 455148 459218 465993 457570
8772 457570 452399 463780 477890 489550 515490 550723 555402 515649 479168 492321 533049 549831
8760 549831 541982 549202 575039 579265 550963 533831 557917 591175 590238 566450 563415 587483 600362
8747 600362 578405 546055 540993 566954 594118 596626 578092 560264 553974 549837 540106 537116 553532
8734 553532 571688 559945 523883 509839 540872 579047 578278 547664 525179 511223 479205 442400
8722 442400 449515 502685 537786 513104 467576 454971 465733 461399 447726 453311 461546 433904
8710 433904 391826 400436 460158 488306 439181 377137 382308 435480 457709 430676 409326 426887
8698 426887 453694 457906 451175 454108 459399 454425 448903 454035 456942 440896 414834 399851 398579
8685 398579 400213 407383 434205 477182 507317 499355 461238 428077 426864 448724 460020 443967
8673 443967 424027 435450 479348 521460 534436 521349 496317 467275 447516 458106 499520 540202
8661 540202 554947 559329 583110 622815 647387 642540 621862 598139 572866 555663 564844 598522
8649 598522 627414 628987 613856 608376 622738 643546 647989 622356 578543 552970 572310 617452
8637 617452 641007 626745 609632 624517 656476 663529 635289 604056 599149 610727 606115 571750
8625 571750 529689 512469 527032 550977 564113 568875 570381 555873 518647 488029 498719 533627
8613 533627 539214 504352 477654 488445 500416 478775 457112 483600 531840 529990 468397 415038
8601 415038 417837 447969 457378 444751 438466 449121 466129 478212 476106 453690 422397 407096
8589 407096 415907 431279 437385 435308 427632 415381 414176 439659 470528 466637 435010 428940 460566
8576 460566 471259 427943 391738 428938 497252 499013 426258 370192 385995 426697 429137 396788
8564 396788 367177 352916 349934 360605 375905 372021 352726 355101 384086 388251 341641 302376
8552 302376 331529 390515 391864 333630 302744 339663 379195 356491 305808 302934 351380 383839
8540 383839 360796 316762 306135 339363 382387 397342 375334 341105 328478 344349 362119 358913
8528 358913 346028 345197 349062 334334 307794 303221 326989 342748 326048 300913 297757 305248 298375
8515 298375 290123 309936 342331 338391 293072 261544 280052 314025 313650 285355 271288 283815
8503 283815 301876 316312 334855 347594 331116 292997 274558 295826 326898 329862 306740 289132
8491 289132 296249 318398 332608 324767 302446 287942 290784 292644 274714 251502 252483 276048 294628
8478 294628 304229 327345 358292 353955 303842 264277 283517 327941 330525 288777 261634 280345
8466 280345 315526 332808 331552 320032 298063 279635 291545 328006 342289 309585 267986 266408
8454 266408 296258 310944 297758 289384 305231 320734 309534 287690 291744 325589 353450 345422
8442 345422 310952 280848 271439 278916 298121 327339 355304 363045 347031 327733 326004 339737
8430 339737 351117 348426 334424 321277 320820 330249 329066 307578 294508 324471 374131 375642 315535
8417 315535 271262 306182 371708 377320 328455 314509 365379 407154 383536 342152 352638 398248
8405 398248 409165 368357 324675 316317 332381 347748 356724 367013 383768 402525 408121 389342
8393 389342 361089 352405 363934 365696 350890 354634 393484 425923 412699 382022 384848 411782
8381 411782 412288 380951 362709 375531 388852 385504 386073 396087 385681 348351 329580 360179 401050
8368 401050 398314 366479 367862 418541 461707 445292 392435 370630 404786 449403 453676 428470
8356 428470 420641 434383 424941 380443 355838 387729 423010 392886 325449 308107 351361 376470
8344 376470 347454 325239 356223 390718 369817 326174 326695 363200 377962 366698 374774 404485
8332 404485 406483 367941 336611 340325 346711 329434 318043 343964 379616 376323 337560 311073
8320 311073 319866 340141 346542 344803 349727 356795 353985 347111 351006 359161 347037 314353 299559
8307 299559 329033 369919 369136 331959 317036 346517 372015 355883 337114 369000 425728 431317
8295 431317 369242 305197 297525 333994 366913 368530 338677 294535 267909 282029 318730 336454
8283 336454 327080 321245 331294 331906 312470 302315 316835 322371 292354 260546 271620 307594 317251
8270 317251 300656 304653 337421 348716 310439 263751 257244 279258 288312 281416 288871 315273 329970
8257 329970 317847 301554 301878 307372 300834 289140 282762 268266 234119 209193 234166 295806 332933
8244 332933 318441 292864 296164 310268 304439 296973 319442 347737 333254 291809 291278 342352 370735
8231 370735 325174 253122 229703 261016 304049 339493 368409 368569 320293 262873 260739 311427
8219 311427 345625 329025 307248 326939 363682 365241 329661 298499 295480 312611 341623 376912
8207 376912 394832 374824 343946 354851 405324 425866 377231 318365 328390 389173 410510 365998
8195 365998 330480 360041 404190 387719 328874 308287 346421 383418 377036 354671 355151 372937
8183 372937 381543 373017 356046 345774 364006 415706 462184 458651 420218 400920 405516 386948
8171 386948 342871 335529 383127 413587 380051 344031 370268 409752 382400 322546 329994 403844
8159 403844 442188 405556 367585 383127 410215 402047 386773 403218 428343 426696 419304 446102
8147 446102 495750 522749 510334 478751 452141 445960 465750 495071 505275 492603 481539 483395
8135 483395 483925 478373 478566 477645 454364 421725 418442 441216 447349 439016 468662 532010 542052 461644
8121 461644 379448 383035 429709 428463 386500 374188 392695 387805 367534 390843 446599 456542
8109 456542 410016 389765 436174 481102 457587 395593 361786 368234 387336 405222 417454 414708
8097 414708 407688 424967 457734 454596 403608 368327 399573 456451 465287 422511 386623 391069
8085 391069 415410 430619 429117 414162 393210 380698 384796 395540 400705 402304 404844 403766 398576
8072 398576 398224 401171 393469 379000 382017 402668 404209 369801 338029 348134 379487 386035 368437
8059 368437 366423 391022 409783 400229 379917 374068 379848 375414 352034 328893 335359 374010 406614
8046 406614 396343 361935 357478 390522 401756 351188 285426 278392 330634 373637 363496 327611
8034 327611 315961 337561 355750 334990 288698 274878 326863 396636 406440 357895 333009 368281
8022 368281 396610 358598 303543 308982 353361 357321 318564 308628 346460 371018 347748 315590
8010 315590 309768 315439 320248 339738 365196 357683 323598 324609 375837 406081 367165 314730 318865
7997 318865 352204 340388 284198 254358 283502 332457 358412 358398 343728 320155 300853 303508
7985 303508 327383 355011 373581 377002 359965 330784 313369 314834 312923 298293 298098 325212 340988
$$ [...]
##END NTUPLES=NMR SPECTRUM
##END=
