##TITLE=1H ikalashn
DE-77 F_NaOH
22.11.2024
##JCAMPDX= 6.0         $$ Bruker NMR JCAMP-DX V2.0
##DATA TYPE= NMR FID
##DATA CLASS= NTUPLES
##ORIGIN= UXNMR, Bruker Analytische Messtechnik GmbH
##OWNER= root
$$ TOPSPIN		Version 1.3
$$ 2024-11-22 16:00:54.968 +0400  Irina@DPX200
$$ Compression mode = diff/dup
##.OBSERVE FREQUENCY= 200.131300845
##.OBSERVE NUCLEUS= ^1H
##.DELAY= (6, 6)
##.ACQUISITION MODE= SIMULTANEOUS
##.ACQUISITION SCHEME= undefined
##.AVERAGES= 64
##.DIGITISER RES= 18
##SPECTROMETER/DATA SYSTEM= spect
##.PULSE SEQUENCE= zg
##.SOLVENT NAME= D2O
##.SHIFT REFERENCE= INTERNAL, D2O, 1, 17.49637
##AUDIT TRAIL= $$ (NUMBER, WHEN, WHO, WHERE, WHAT)
$$ ##TITLE= Audit trail, TOPSPIN		Version 1.3
$$ ##JCAMPDX= 5.01
$$ ##ORIGIN= Bruker BioSpin GmbH
$$ ##OWNER= Irina
$$ $$ F:/spectra/data/iren/nmr/1H/4/audita.txt
$$ ##AUDIT TRAIL=  $$ (NUMBER, WHEN, WHO, WHERE, VERSION, WHAT)
(   1,<2024-11-22 16:00:07.062 +0400>,<Irina>,<DPX200>,<TOPSPIN 1.3>,
      <created by zg
	started at 2024-11-22 15:55:54.359 +0400,
	POWCHK disabled, PULCHK disabled
       configuration hash MD5:
       BE 6D 3F 07 2A EA 11 49 91 17 2B D3 AF B3 58 0D
       data hash MD5: 16K
       72 E6 B6 D7 97 EF B7 A7 85 92 1B 15 ED D8 ED 26>)
$$ ##END=
$$ 
$$ $$ hash MD5
$$ $$ 13 BB 88 10 7F 67 E2 31 01 25 2C AB E2 AE 19 75
##$RELAX= 
##$RELAX= 
##$RELAX= 
##$RELAX= 
##$RELAX= 
##$RELAX= 
##$RELAX= 
##$RELAX= 
##$RELAX= 
$$ Bruker specific parameters
$$ --------------------------
##$DU= <F:/spectra>
##$EXPNO= 4
##$NAME= <1H>
##$PROCNO= 1
##$TYPE= <nmr>
##$USER= <iren>
##$AMP= (0..31)
100 100 100 100 100 100 100 100 100 100 100 100 100 100 100 100 100 100 
100 100 100 100 100 100 100 100 100 100 100 100 100 100 
##$ANAVPT= -1
##$AQSEQ= 0
##$AQ_mod= 1
##$AUNM= <au_zg>
##$AUTOPOS= <>
##$BF1= 200.13
##$BF2= 200.13
##$BF3= 200.13
##$BF4= 200.13
##$BF5= 200.13
##$BF6= 200.13
##$BF7= 200.13
##$BF8= 200.13
##$BYTORDA= 1
##$CFDGTYP= 0
##$CFRGTYP= 5
##$CHEMSTR= <none>
##$CNST= (0..63)
1 1 145 1 1 1 1 1 1 1 1 1 1 1 1 1 1 1 1 1 1 1 1 1 1 1 1 1 1 1 1 1 1 1 
1 1 1 1 1 1 1 1 1 1 1 1 1 1 1 1 1 1 1 1 1 1 1 1 1 1 1 1 1 1 
##$CPDPRG= <>
##$CPDPRG1= <>
##$CPDPRG2= <>
##$CPDPRG3= <>
##$CPDPRG4= <mlev>
##$CPDPRG5= <mlev>
##$CPDPRG6= <mlev>
##$CPDPRG7= <mlev>
##$CPDPRG8= <mlev>
##$CPDPRGB= <>
##$CPDPRGT= <>
##$D= (0..63)
0 2 0 0 0 0 0 0 0 0.06 0 0.03 0 0 0 0 0.0002 0 0 0 0 0 0 0 0 0 0 0 0 0 
0 0 0 0 0 0 0 0 0 0 0 0 0 0 0 0 0 0 0 0 0 0 0 0 0 0 0 0 0 0 0 0 0 0 
##$DATE= 1732276806
##$DBL= (0..7)
120 120 120 120 120 120 120 120 
##$DBP= (0..7)
150 150 150 150 150 150 150 150 
##$DBP07= 0
##$DBPNAM0= <>
##$DBPNAM1= <>
##$DBPNAM2= <>
##$DBPNAM3= <>
##$DBPNAM4= <>
##$DBPNAM5= <>
##$DBPNAM6= <>
##$DBPNAM7= <>
##$DBPOAL= (0..7)
0.5 0.5 0.5 0.5 0.5 0.5 0.5 0.5 
##$DBPOFFS= (0..7)
0 0 0 0 0 0 0 0 
##$DE= 6
##$DECBNUC= <off>
##$DECIM= 32
##$DECNUC= <off>
##$DECSTAT= 4
##$DIGMOD= 1
##$DIGTYP= 9
##$DL= (0..7)
0 120 120 120 120 120 120 120 
##$DP= (0..7)
150 150 150 150 150 150 150 150 
##$DP07= 0
##$DPNAME0= <>
$$ [...]
##$SW= 21.9926040160658
##$SWIBOX= (0..15)
0 0 2 0 0 0 0 0 0 0 0 0 0 0 0 0 
##$SW_h= 4401.40845070422
##$TD= 16384
##$TD0= 1
##$TE= 300
##$TE2= 300
##$TE3= 300
##$TEG= 300
##$TL= (0..7)
0 120 120 120 120 120 120 120 
##$TP= (0..7)
150 150 150 150 150 150 150 150 
##$TP07= 0
##$TPNAME0= <>
##$TPNAME1= <>
##$TPNAME2= <>
##$TPNAME3= <>
##$TPNAME4= <>
##$TPNAME5= <>
##$TPNAME6= <>
##$TPNAME7= <>
##$TPOAL= (0..7)
0.5 0.5 0.5 0.5 0.5 0.5 0.5 0.5 
##$TPOFFS= (0..7)
0 0 0 0 0 0 0 0 
##$TUNHIN= 0
##$TUNHOUT= 0
##$TUNXOUT= 0
##$USERA1= <user>
##$USERA2= <user>
##$USERA3= <user>
##$USERA4= <user>
##$USERA5= <user>
##$V9= 5
##$VALIST= <valist>
##$VCLIST= <CCCCCCCCCCCCCCC>
##$VD= 0
##$VDLIST= <DDDDDDDDDDDDDDD>
##$VPLIST= <PPPPPPPPPPPPPPP>
##$VTLIST= <TTTTTTTTTTTTTTT>
##$WBST= 1024
##$WBSW= 25
##$XGAIN= (0..3)
0 0 0 0 
##$XL= 0
##$YL= 0
##$YMAX_a= 5277621
##$YMIN_a= -4326758
##$ZGOPTNS= <>
##$ZL1= 120
##$ZL2= 120
##$ZL3= 120
##$ZL4= 120
##$ABSF1= 10
##$ABSF2= 0
##$ABSG= 5
##$ABSL= 3
##$ALPHA= 0
##$AQORDER= 0
##$ASSFAC= 0
##$ASSFACI= 0
##$ASSFACX= 0
##$ASSWID= 0
##$AUNMP= <proc_1d>
##$AXLEFT= 0
##$AXRIGHT= 0
##$AXTYPE= 0
##$AXUNIT= <>
##$AZFE= 0.1
##$AZFW= 0.1
##$BCFW= 1
##$BC_mod= 2
##$BYTORDP= 1
##$COROFFS= 0
##$CY= 7568.61572265625
##$DATMOD= 1
##$DC= 2
##$DFILT= <>
##$DTYPP= 0
##$F1P= 17.9538593292236
##$F2P= -4.03888763876832
##$FCOR= 0.5
##$FTSIZE= 32768
##$FT_mod= 4
##$GAMMA= 1
##$GB= 1
##$INTBC= 1
##$INTSCL= 1
##$ISEN= 128
##$LB= 0.02
##$LEV0= 0
##$LPBIN= 0
##$MAXI= 945.577
##$MC2= 0
##$MEAN= 0
##$ME_mod= 0
##$MI= -402.1523
##$NCOEF= 0
##$NC_proc= 0
##$NLEV= 6
##$NOISF1= 8.587773
##$NOISF2= 6.764455
##$NSP= 1
##$NTH_PI= 0
##$NZP= 0
##$OFFSET= 17.49637
##$PC= 1
##$PHC0= 97.09374
##$PHC1= 8.257627
##$PH_mod= 0
##$PKNL= yes
##$PPARMOD= 0
##$PPDIAG= 0
##$PPIPTYP= 0
##$PPMPNUM= 100
##$PPRESOL= 1
##$PSCAL= 0
##$PSIGN= 0
##$REVERSE= no
##$SF= 200.13
##$SI= 32768
##$SIGF1= 18.5376
##$SIGF2= -6.396296
##$SINO= 400
##$SIOLD= 32768
##$SREGLST= <1H.CDCl3>
##$SSB= 3
##$STSI= 0
##$STSR= 0
##$SW_p= 4401.40845070422
##$SYMM= 0
##$S_DEV= 0
##$TDeff= 0
##$TDoff= 0
##$TI= <>
##$TILT= no
##$TM1= 0
##$TM2= 0
##$TOPLEV= 0
##$USERP1= <user>
##$USERP2= <user>
##$USERP3= <user>
##$USERP4= <user>
##$USERP5= <user>
##$WDW= 1
##$XDIM= 8192
##$YMAX_p= 0
##$YMIN_p= 0
$$ End of Bruker specific parameters
$$ ---------------------------------
##NTUPLES= NMR FID
##VAR_NAME=  TIME,          FID/REAL,        FID/IMAG
##SYMBOL=    X,             R,               I
##VAR_TYPE=  INDEPENDENT,   DEPENDENT,       DEPENDENT
##VAR_FORM=  AFFN,          ASDF,            ASDF
##VAR_DIM=   8192,          8192,            8192
##UNITS=     SECONDS,       ARBITRARY UNITS, ARBITRARY UNITS
##FACTOR=    0.0002272,     1,               1
##FIRST=     0,             0,               0
##LAST=      1.8609952,     59,              -415
##MIN=       0,             -4326758,        -4326758
##MAX=       1.8609952,     5277621,         5277621
$$ Real data points
##PAGE= N=1
##DATA TABLE= (X++(R..R)), XYDATA
$$ [...]
2511B13Pn44N72n99m76O89J03q0J68o16N52J68o08K09O49j85kJ24m89K29j19K58
2533B23l68K56m19m06J058N00j046J16k28k11K39J01K20J09j56J79l41l73O54
2552A07m84l3L95J89p92R61L31q07K78p87L96M62K48j99K57p43M88o89N72k00
2572e0j86K86J89n7m6k12L72r20J453n91n79L91o36R05p01M04p82Q5Q57l79O7
2593a30n84K09Q89o15k17K26P53r66L12O55j116M61M39j95m41L3J26N37k33k20
2613g7Q9Q42r35K65k93L60r8j52j91K53k00K44l36M95l80R41j013N70j60m38P25
2634E11o46q7L74L1p1o94R16r36O07j9l33K31J90n99J019M2q35K40j42L16j06
2655IK1l18J94L06J8J88r43J322m44j96m57J33M01l09M75r74J006L36j408J033
$$ plain form
2511 213 220 -324 248 -351 -827 -138 -35 -115 53 -563 -11 157 -451 -242 407 222 220 344 -145 84 -35 223
2533 223 -145 111 -308 -714 344 844 -202 -86 -314 -525 -286 -185 35 144 -12 167 -174 -547 107
2552 107 -377 -410 -15 174 -618 343 674 -133 145 -642 -246 216 464 265 522 -221 267 -422 150 -50
2572 -50 -236 50 239 182 136 -76 296 -624 829 238 -341 50 -586 319 -382 22 -760 -675 182 -197 -130
2593 -130 -714 -505 384 -231 -448 -222 531 -435 -123 532 -584 -123 316 121 -320 -287 -161 376 143 -77
2613 -77 12 854 -81 184 -109 251 153 1 -190 63 -137 107 -229 266 -114 827 -186 384 224 -214 511
2634 511 -135 -222 152 183 112 -582 334 -602 5 -14 -347 -116 74 -525 494 536 -299 -59 -201 115 9
2655 9 30 -288 -94 212 230 418 -525 797 353 157 -300 -167 234 -75 400 -574 432 768 -640 393
2675C93m52J2l34J50K13l52N38J95k95k42O5n88O59K69M59q36qj38O38l77k38
2696b69R39j678J205k68L21k09M6l66m73P79J29K17j06p4L06j388J159mj24n80
2716d38K40K65j3L9MK48k66n53n8M27O6J96K18q82Q3l1j39O12j55j0j98J58j84
2739c71L57L41J17p0n12K43RL4l91jJ68O58j92l73j70L05j56N1l22J102o56L38
2761E09j17m02l58L71M33m37O3M70j303N45N84m36K33m74J5N43n62L74r44N63
2781c30O89l74o5k55N62n57O74n99l3R41o80J89k43L27pj44K98R4o24j91M60k40
2803a08M85J12l61m24O73ro47P08p48J081l82l86k64L96r7N9L72o54j35M63M3
2824A77k6O14q45l36M10l37M44q5j76K43N64p24P0l45L78O79m09K41j79j55m46
$$ plain form
2675 393 -59 -47 -381 -231 -18 -370 168 363 68 -174 -109 -697 -38 231 690 -146 -154 -292 346 -31 -269
2696 -269 670 -1008 197 -71 250 41 87 -279 -752 27 156 373 267 193 499 -889 270 266 142 -438
2716 -438 -198 67 54 93 97 345 79 -474 -532 -105 -39 157 375 -507 -424 -455 -594 18 -137 -147 -345 -187 -371
2739 -371 -14 327 444 374 -138 105 114 148 -243 -244 -76 582 390 17 -153 152 -4 47 -275 827 171 509
2761 509 392 -10 -368 3 436 -1 62 532 -771 -226 358 -78 155 -319 -304 239 -323 51 -893 -330
2781 -330 359 -15 -80 -335 227 -330 344 -255 -288 653 -27 162 -81 246 239 95 393 487 -137 -328 132 -108
2803 -108 377 489 128 -296 377 368 -279 429 -319 762 380 -6 -270 126 29 88 460 -194 -329 134 177
2824 177 151 765 -80 -416 -6 -343 101 16 -160 83 647 -77 -7 -352 26 705 296 537 358 203 -243
2845b43Q2J03L0L44k31j60K69l23L44J77r39O88J19Q3p89L1O61r66P96p76J90
2866e10R31n68K10j97n46N09K28K77n71r2J15J34M65Oj139N59N68j42l15m2N75
2887D55k69m90l4M87k17JR4k62J96L39l79O16p24k55K10J13J3m02L65O35p17M82
2909B57j66O1K21n65j29M07r48J104k4l55K24Q5n05O3O61j99o15O25o33L70m10
2930d71P44k9n28P09j76k77n9M44l39K34o28K15j46J78M56k84k02j2j38L14J25
2951A30j09j1j99P23q40K6M38l37R6o17N54J38L29l3k24p99L76L0L57j9M83l1
2973D61o04m8K7OM00J98J84j110K51M5j49K27K89Q3k50j13P05l49P6l30L31l59
2995b9L58k26o71N08j83j13J107p3q32M60n25K95oM72r20M03k90J78K30m59J92
$$ plain form
2845 -243 -161 -58 -28 316 85 -75 194 -129 215 392 -547 141 260 343 -446 -415 246 -720 76 -700 -510
2866 -510 421 -147 63 -134 -680 -171 57 334 -237 -329 -214 -80 385 391 -748 -189 379 237 -78 -120 455
2887 455 186 -304 -338 149 -68 -67 27 -235 -39 300 -79 537 -187 -442 -232 -119 -106 -508 -143 492 -225 257
2909 257 91 152 373 -192 -321 86 -862 242 218 -137 87 172 -333 -270 391 192 -423 202 -431 -61 -471
2930 -471 273 244 -284 425 249 -28 -87 357 18 252 -376 -161 -307 -129 327 43 -159 -171 -309 5 130
2951 130 21 10 -189 534 -306 -280 158 -179 -83 -700 -146 -8 321 288 64 -735 -359 -329 28 9 492 461
2973 461 -143 -191 -164 -158 242 440 624 -486 -235 -190 -339 -112 177 260 10 -103 602 253 329 -1 330 -29
2995 -29 329 103 -568 -60 -243 -356 751 678 -154 306 -219 76 70 542 -378 25 -265 -87 143 -316 -124
3016a24K08m69L73l8O37k25o02L35o71M60k69M97j40L46j60m12Jq8L20m04N71
3037A46m3j7o4l99O46M82o46m33J93q5M59r8o16J95M0N6J67J79m3p13Q48m73L31
3060A12l78L47k14n11L83MO78k71p35N44M48j152M52J52M28n30q39R89L01M8L55
3081F11p85k28J29m6P8O10K08n97k20M54L47k92K0n71Q8l64R02J79m24J12k05
3102Fj41O24l12r77J210l14M46o93P48j220K24Q41k51m26J96Q81l81m94K48m80
3122b65r5M38Rn9J46o41Q88m58j47L66O5n7q06Q16K48n32k66J262j121l17J49
3143c77l6J001m12K65k68j94l08n67J422l33J0o56P39K33p3J99r22M63k47L20
3163B59r64J034o13N1L83j5K80o92N02j50J24L50l09M5l53n19P74n51jO57p00
$$ plain form
3016 -124 84 -385 -12 -50 587 362 -240 95 -576 -116 -385 112 -28 318 158 -254 -253 -341 -21 -425 146
3037 146 103 86 22 -377 269 751 105 -328 -135 -220 239 141 -475 -280 -240 -184 -17 162 119 -594 254 -219 112
3060 112 -266 81 -133 -644 -261 -257 421 150 -585 -41 407 -745 -293 -141 287 -243 -1082 -93 208 256 611
3081 611 -174 -402 -273 -319 -241 369 577 -20 -240 214 561 269 289 -282 -194 -558 344 523 99 211 6
3102 6 -135 489 177 -800 410 96 542 -151 597 -623 -399 442 191 -235 -39 842 461 -33 215 -265
3122 -265 -360 78 87 28 174 -467 421 -37 -184 182 247 190 -616 200 448 -84 -350 912 -209 -526 -377
3143 -377 -413 588 176 441 173 -21 -329 -896 526 193 203 -453 286 519 446 645 -277 186 -61 259
3163 259 -705 329 -284 -233 150 135 415 -277 225 75 199 549 240 285 -68 -587 187 -364 -365 292 -408
3184d08J49J74K19L17p80Q04n33m5k22K0J39r2j9R6J22M10o78P4O77O8j50o54
3206c12N02K06m79M31k72m23N66M0l59j50m45N81N26k44j2p4L9K05p39L93q8K4
3228h4M83n91M63L30n57N73k59j39m27O8N84L92j013L32M08j038M30m22K21L0
3248b16L96J33l57n8K5J21k80N57r83R37m99L96L21j226K68M26L89p12J211j044
3268a95L27l81Q19p76L62n60N94L07r12K24L30l09r5L29L16r1j054K31R16p33
3288c51R0R10j356P58J31n43O18j16L58l26N12r76N33K47q02Q75m71l55l22O00
3308A4L0N18l01n23M6O0N42K13o02r34J022M60m51P1l96O69o15k32J83kj0N72
3330C34j007N21k42J007q53K03j91K23Lj15M58J9o11J00j67N34K55j030M91L2
$$ plain form
3184 -408 -259 -85 134 451 -329 475 -58 -103 -325 -305 -166 -258 -277 -181 -59 351 -327 -253 424 492 342 -312
3206 -312 190 396 -83 348 76 -347 219 259 -100 -250 -695 -114 412 168 156 82 121 326 -413 -20 -108 -84
3228 -84 399 -192 271 601 44 617 358 219 -208 -140 444 836 -177 155 563 -475 -45 -467 -246 -216
3248 -216 180 313 -44 -102 -77 44 -236 321 -662 275 -224 172 493 -733 -465 -39 350 -362 849 -195
3268 -195 132 -249 570 -206 156 -404 190 497 -415 -191 139 -170 -265 64 380 289 -765 -534 382 -351
3288 -351 -261 649 -707 51 182 -361 257 141 499 173 685 -291 242 489 -313 562 91 -264 -586 14
3308 14 44 562 261 -262 -216 -156 386 599 -3 -937 85 545 94 165 -231 438 -177 -409 -226 -228 -238 334
3330 334 -673 -152 -394 613 -240 -37 -228 -5 -2 -117 341 360 -251 -151 -318 216 471 -559 -68 -36
3350c6J92K95q84O51J39o26M71k3k14k4J36K98k96R8l20J40p97J378j531O90M19
3371A56n06J042l42q42L38pK55j04J80j59r38R08n81P87o81L84J2L61l47M17o1
3392B72l20k00K17j99M03n13L58k69O12m68L95k13l15M26K48n28r2j93J61N35
3412C17k88J70r55L93M48L29n41k86N88M44j413J329M4o29M98o28l42J282j099
3431c39Q59m71o6N27j059M45J12N02p20O04m03m42PJ040J29j144M63k98J75O54
3451E75j333N00N63l59k87p5K92m44l3J128p06P79p54K92m20L28k88P11j044M68
3471a07K33l73K2K03L41l53j63j34O16l74K18l47J75l90N88j99J94m44j8M09K58
3492C55k31m80N99k92n63k93O13M4m35P39J51K80j35q11Q08N14r47m3j70N80q2
$$ plain form
3350 -36 156 451 -433 218 357 -269 202 179 -35 -59 77 375 79 177 -143 -3 -800 578 -953 -263 156
3371 156 -350 692 350 -492 -154 -161 94 -10 170 11 -927 -19 -600 187 -494 -110 -98 263 -84 333 272
3392 272 -48 -248 -31 -230 173 -340 18 -251 361 -107 288 75 -240 186 434 -94 -186 -379 -218 317
3412 317 29 199 -756 -363 85 414 -127 -413 175 619 -794 535 579 -50 448 -180 -522 760 -339
3431 -339 520 49 -17 510 -549 -104 8 510 -210 394 -9 -451 -444 596 725 -419 44 -254 -79 575
3451 575 -758 -258 305 -54 -341 -416 -124 -568 -601 527 -179 600 -154 138 -282 46 -242 469 -575 -107
3471 -107 126 -247 -225 -22 319 -34 -197 -331 285 -89 129 -218 -43 -433 155 -44 150 -294 -312 97 355
3492 355 124 -356 243 -49 -612 -905 -292 -248 -683 56 207 487 352 -459 349 863 -84 -127 -297 283 201
3513B01K10J02p25R8J14K65O0l93l00J34L94M1k49l9L42k75o95M57K6k35N91j83
3535e9j43l26J159j087J128j028P49k44m32O57m96k33P3j20N33j64J82j65p39
3554g55J100J16M0n93O13k23k38m99N28O6L99l8N2n41n08R1N37J49J4j11j09p09
3576f19L65Q09r30K59l9j3k20K69M48On05P62o30K12j6k75N34l65P1LM94m11p09
3599e00N87n57L95M80r77M35K93m44N70K59k19n84o43O31J34O79q94M10J23m19
3619b41l1m5O28o15R3q5P13n38N84n05J89n22N17r93J154k46R0M52m75k99j56
3640c31k41O23o16L29N25M28j104J42L98r41J199L12q38K93n46Q39o96M44j21
3659I8K9l08L8O4O17k88n40k06M32K98p92N93K5n37P76l24J62L8K09m85N22K97
$$ plain form
3513 201 411 513 -212 -114 0 265 325 -68 -368 -234 160 201 -48 -87 255 -20 -715 -258 -232 -467 124 -59
3535 -59 -202 -528 631 -456 672 -356 393 149 -283 374 -122 -355 -282 -402 131 -33 149 -16 -755
3554 -755 345 461 501 -92 521 298 60 -439 89 155 554 516 568 27 -481 -390 147 296 310 199 90 -619
3576 -619 -254 555 -375 -116 -155 -168 -388 -119 329 335 -170 592 -38 174 158 -117 417 52 123 126 620 209 -500
3599 -500 87 -470 -75 405 -572 -137 156 -288 282 541 322 -262 -905 -274 -140 539 -355 55 178 -241
3619 -241 -272 -317 311 -304 -211 -296 417 -121 463 -42 147 -375 142 -851 303 57 147 599 124 -175 -331
3640 -331 -572 51 -565 -236 289 717 -387 -245 153 -788 411 723 -115 178 -368 471 -225 219 98
3659 98 127 -181 -143 -79 538 250 -290 -496 -64 234 -558 35 60 -477 299 -25 137 175 384 -101 421 718
3681G18q32j69M77N8l57K94J47q64J3Q21q67P52N3%m41K00J92k98J79n13P44m25
3703a18k63M00J96j77k61j97p6L06l6L23Q1RK15L7p67m03R25r04P77m74N12k41
3725a36j84M83M3p29Q79l63Q38j491J049l18K08l2k35N38j250N29O59j78o20Q02
3745D92l99J08K00j79Q7n78q73J680o51j29m79J070m0L94q2j301R73m49M78l81
3765e9N64j19q39N82M08n16n11N29J87k90M8m07J91j68K80M83J4l34r6j62M54
3786B39J49o61j46L21o1pM36n51N06j26l04j56M83O5J87p34J36n84J455n55N74
3807F66n64l66j5M38P0J45j021O64J223j639J64j70N14k64K99J52n9q27M14q25
3827a001J341n14r5J54M37l18L22l98J5R3P2N76j140M50J25m26P27nn24m7N6l85
$$ plain form
3681 718 -114 -283 194 252 -105 189 336 -528 -515 306 -561 191 244 244 -197 3 195 -103 76 -437 307 -118
3703 -118 -381 19 215 38 -223 -420 -496 -190 -226 97 178 187 402 439 -328 -731 194 -710 67 -407 105 -136
3725 -136 -320 163 206 -523 356 -7 831 -660 389 71 279 247 12 550 -700 -171 488 310 -310 492
3745 492 93 201 401 222 309 -269 -1142 538 -113 -242 -721 349 309 703 621 -680 293 -156 322 -59
3765 -59 505 386 -453 129 537 21 -490 39 226 -64 -16 -423 -232 -400 -120 363 377 43 -53 -215 239
3786 239 388 -273 -419 -98 -159 -166 270 -281 225 99 -205 -361 122 187 374 -360 -224 -808 647 92 666
3807 666 102 -264 -279 159 229 374 -647 17 1240 -399 -235 -405 109 -155 144 296 237 -590 -176 -1001
3827 -1001 340 -174 -269 -115 322 4 326 -72 -57 36 108 684 -456 -6 119 -307 420 415 -109 -156 -100 -485
3849d85P5N30J02j04k02J8j28j6l84K29O43L5n82Q06q33M27Nl24k98M79Q6m53
3871c74k36N15P47m55l20K01o40J22L03M75J36l19p7M7J73q72Q67r3q1o16P7M87
3893F7k85M94p28P9J162j186R21q15O6J65j02P40r00N42j3K18r30M61l51k24Q13
3914A94q33P67n74O56O27j177Q33q02M36L42n11J2m66J143p13n76O22K97m39J29
3934c3K71l75J91l6L99n34k1L42n58P06p44P59r46J71N3O55l63K16j71j01m04
3955e23M02M31l86L07p03J266q97k2p0L08o4k57L28r0KMm9m80N92O08j346J574
3977I35n18m25k54K12k62j11J051p5j035J90l44P87m30J12l11M55N59j153R18
3996C01j89O8k51m87J142j251O18N68p23j17j48J066q92J5K80J05j16j1k41O91
$$ plain form
3849 -485 -410 120 222 118 -84 -66 -194 -210 -594 -365 278 313 -269 537 -296 131 136 -188 -486 -7 79 -374
3871 -374 -610 -95 652 197 -123 78 -562 -440 -137 338 474 155 78 125 298 -574 293 200 119 -497 -420 67
3893 67 -218 276 -452 -373 789 -397 524 -291 -225 -60 -162 578 -322 220 207 425 -505 -44 -395 -619 194
3914 194 -639 128 -446 210 837 -340 493 -309 127 469 -42 -30 -496 647 -66 -642 -20 277 -162 -33
3934 -33 238 -137 54 18 417 -117 -138 204 -354 352 -392 367 -579 -408 -355 300 -63 153 -18 -119 -523
3955 -523 -121 310 -76 231 -472 794 -103 -125 -195 113 49 -208 120 30 32 36 -13 -493 99 707 -639 935
3977 935 417 -8 -262 -50 -312 -423 628 553 -482 -292 -636 151 -279 -167 -478 -23 536 -617 301
3996 301 112 180 -71 -558 584 -667 -49 519 -204 -321 -469 597 -295 -280 0 105 -11 -22 -263 428
4016D28k58k32k04L6N4M61J52m8r17L9Q88l61L37n92k84J084L21q41o96P75O0
4037B02n0J69n0m75j05M70R9r19M80j62R8K76J82o5l34L92K53n89m14J093n24
4058B7m16M84k45M96o89K89k05k29k74O92n4L37k34M46p47L52J43N5K77p36m0
4079b71K07j91M49l53J15K76n74N20J68q84N93J171j378l75Q57o44O44o30N61
4098B61p73P01K43r22O76j08l09M71L13q96J66M47r7m5k3M58q43m36Q75q16J189
4119E32o56j13N80r16O38M79n72k51L82j024J049o92R45q39R00M9q91J039j32
4138E07j39o72p56N69K65k54J113j102J77L00O13p60J55K89q69M87j17L14j78
4157e8L91r7O58j417J87L49M97j121O59j24L32k83J95L01n10O28l92R5M8n01k1
$$ plain form
4016 428 170 -62 -266 -230 -176 285 437 389 -528 -489 399 38 375 -217 -501 583 904 63 -633 142 202
4037 202 152 321 271 -204 -309 161 260 -659 -179 -341 -243 33 215 150 -184 208 461 -128 -542 551 27
4058 27 -389 95 -150 346 -343 -54 -259 -488 -762 -70 -124 213 -21 425 -322 30 173 228 505 -231 -271
4079 -271 -64 -255 194 -159 -44 232 -342 178 346 -538 55 1226 -152 -527 330 -314 330 -300 261
4098 261 -512 189 432 -490 186 78 -231 240 553 -343 -177 270 173 128 105 563 -280 -716 159 -657 532
4119 532 -124 -237 343 -573 65 544 -28 -279 103 -921 128 -564 381 -458 442 491 -400 639 507
4138 507 368 -304 -1060 -491 -226 -480 633 -469 -292 8 621 -139 16 305 -564 -77 -194 120 -58
4157 -58 333 236 894 -523 -336 13 510 -611 48 -76 256 -27 168 469 -41 587 195 290 338 -163 -184
4178a84L87m09J67M9m03N33k18M24n82L88m44J78j92L14M27q58N03k04K31M21
4198E28o04J25n77J86L72j68J54o4l22K72j20K11j99m91R67k67L14l56j26k56
4218d21K0L82l4k20N40J81n70J26j16q8r8M95m76KN60r25O30k34j15P97k05j13
4240A18o90R82j222J529o10l36K6K32o7N0k03J66L23o11L45j29K1K32J14n85M17
4261A02l44J39J45k31M37k12k6L88j259P24r2O81n49P67m84O04l66q54Q42k29
4281A83r73R16O22j203O75Jl24l87Q39j369J634k41J8q16R31p52r0L71j36L19
4301B18o03J268j597Q14J32j84K42n22M00oL72k79k91l98N82j63K49j60rj13P2
4322B4k48Q45j015p0J77R13j114J068j378Q6J55J40O62q40l91Q34m38R32o7r8
$$ plain form
4178 -184 203 -206 -39 10 -393 140 -78 346 -236 152 -292 -114 -306 8 435 -423 80 -124 107 528
4198 528 -76 49 -528 -342 30 -138 16 -48 -370 -98 -218 -7 -206 -697 270 3 317 -39 -165 -421
4218 -421 -401 -19 -53 -273 267 448 -122 4 -112 -200 -298 197 -279 -277 283 -642 -12 -246 -361 436 231 118
4240 118 -572 410 -812 717 107 -229 -203 29 -38 12 -191 -25 298 -313 32 -97 -76 156 270 -315 102
4261 102 -242 -103 42 -189 248 36 10 398 -861 -137 -229 452 -97 670 186 790 424 -430 412 183
4281 183 -790 126 748 -455 220 221 -103 -490 349 -1020 614 373 391 -425 506 -246 -336 35 -101 218
4301 218 -385 883 -714 100 232 48 290 -232 168 162 534 255 -36 -434 148 -15 234 74 65 -48 24
4322 24 -224 621 -394 -464 -287 626 -488 580 -798 -712 -557 -417 245 -595 -986 -152 -590 342 275 177
4342A77o56P18o48P70R4o33J78ko0m38R00p80K90r9j38L08k83q5j16R28o07M49
4364B67q95P78N23j057N62k82l61k19J46N03R9m00K42l72M89M87m18L36l71o78
4384f21O75n99J52m7l4K39K97o79R4O16R1j46O25m62J89k13n67Q49k55j08m61
4405c65J16Q25j000J018n13p62O83K95lk33j14j51l09L18K52n55L41k38J717j651
4425c29M25l81K73J5n93J043n04O0k39K50l81M18m75N42m92P33l70J21J66K11
4445D93r12R38r07O29m33L51m09R86K82j144Q13r56J399j099K8l16N02L6j64n15
4465c98N17l72l51J01K03K01m8Q28p99M08q77J270m12l43j1k00M67n91R03o61
4485a65Q09o25l68L34p3j71M18n46P8M07N6l97L46j38m31M41M8K83n57N18J52
$$ plain form
4342 177 -479 239 -409 361 455 -178 0 -2 -62 -500 400 -380 -90 -189 -327 -19 -302 -387 -503 425 -182 267
4364 267 -628 150 673 -384 178 -104 -465 -684 -538 -35 64 -336 -94 -466 23 510 92 428 57 -621
4384 -621 54 -545 -393 -440 -474 -235 62 -617 -523 93 184 38 663 201 390 177 -390 459 204 96 -365
4405 -365 -249 576 -424 594 81 -681 2 297 294 61 -53 -204 -513 -195 57 -498 -157 -395 1322 -329
4425 -329 96 -285 -12 3 -590 453 -51 9 -230 20 -361 57 -418 124 -368 365 -5 116 282 493
4445 493 -419 519 -388 241 -192 159 -250 736 1018 -126 687 -269 1130 31 59 -257 245 281 117 -398
4465 -398 119 -253 -604 -503 -300 -99 -147 681 -118 290 -587 683 271 -72 -83 -283 184 -407 496 -165
4485 -165 644 19 -349 -15 -88 -259 159 -387 -309 98 154 -243 103 -35 -466 -25 23 306 -251 267 419
4506D19r38P1L4N05k93N34n24k59Q50J97n40j98L55k91O10m95K02j95m27J321
4526I38p51p65P93j61M08r13J70N94o88k36L96J53j51n39J550q14J81m16O68p23
4546c06Q19m72o4k48L96L64o24n82O4O28m7Mj72M73r8J71j34r53O77k17Q0P83
4568E42l18k92p58J125j54j30L5J72k47M09p86Q9N12K50j0K93k24p87N17j62J46
4589B22L83p09J81J72k78M18j54p81L32M68L52j312Q31O7n01M21N2p19M52M22
4609C19n56N43p06L50K78L40k72N0j53l72M97l24k86j20Q47m71k08J31J81J91
4629B59r3L28o66K68l33J5L17l34mL28n46Q42m63m50J64N65q04O54j40L08k96
4650h1J18p23O83n42L09J83p3k26L41L20K59J27p69Q21K96j079l67N16j17p0N40
$$ plain form
4506 419 -519 -448 -414 91 -202 332 -192 -451 399 596 56 -142 213 -78 532 37 239 44 -383 938
4526 938 187 -578 215 54 462 -451 -281 313 -375 -611 -215 -62 -213 -752 798 -16 165 -251 417 -306
4546 -306 513 41 -23 -271 125 489 -135 -717 -653 -25 -72 -68 -240 233 135 306 172 -781 -104 -321 -241 542
4568 542 224 -68 -826 299 145 15 50 222 -25 384 -402 -313 199 449 439 732 508 -279 238 76 222
4589 222 605 -104 77 249 -29 389 235 -546 -214 254 606 -706 125 192 -309 112 164 -555 -103 319
4609 319 -237 306 -400 -50 228 568 296 346 193 -179 318 -6 -292 -412 435 -36 -244 -113 68 259
4629 259 166 494 -172 96 -237 -222 95 -239 -243 85 -461 381 -82 -532 -368 197 -607 47 -93 215 -81
4650 -81 37 -686 -3 -545 -236 -53 -126 -352 -11 309 568 695 -74 747 1043 -36 -403 113 -4 -74 466
4671D66L7k53J76o01O5n42P35l65M93N7m41Q52k74k93J79j91j79N51n39m99O31
4692F5j15K54J40l36k6P9j32q5J28j20p2J12l9l3N46l29L53M14j048J49R7m63
4714d61N77J27k08M29l84K55k38J65J64N7p03L97R1p05M00J07K3R9O26p95J4J44
4736A81n91K42l28K49k56j70R22j95j7K89n4n55L57j40N98o98N92q09M79n27K16
4757b15N55m95j62j4N12O0j99J97J82o44L79k44l99L61R08o8m08J8m26L62l64
4778a04J69N5l88j71J240j528j55P32k17L32K48O9r48L50M35q9K14l80l69L36
4798a69M98J25Q7j157L36L78J6j55k75k98P85j36M2j2m5K59l12K05l36L69j3n14
4820c22P3K00o84L54O28R9L69p46J07l92O63p64Q35n24J65L49n50j63K51N80j149
$$ plain form
4671 466 503 250 426 -175 -110 -652 83 -282 211 268 -173 679 405 112 291 100 -79 472 -67 -566 65
4692 65 -50 204 344 8 -18 61 -71 -156 -28 -148 -220 -108 -147 -180 366 37 390 804 -244 -95 2 -461
4714 -461 116 243 35 464 80 335 97 262 426 483 -220 177 268 -437 -37 70 93 192 818 23 37 181
4736 181 -410 -168 -496 -247 -503 -673 249 54 37 326 272 -283 74 -66 532 -166 426 -383 96 -431 -215
4757 -215 340 -155 -317 -331 181 241 42 239 421 -223 156 -88 -487 -126 782 714 306 324 -102 260 -104
4778 -104 65 120 -268 -439 801 -727 -882 -150 -367 -35 213 282 -666 -316 119 30 244 -136 -505 -169
4798 -169 329 454 541 -616 -280 98 114 -41 -316 -614 171 35 77 65 20 279 -33 172 -164 205 192 -322
4820 -322 -249 -49 -733 -379 249 348 717 -29 78 -314 349 -415 420 -104 61 410 -140 -303 -52 528 -621
4841f21O24J35k01N28q18M05l30L43j49N3O62j006J113q06Q22m95j014J115l32
4860B8k83Q8J28K07p39P75q08M17K36J50n5r57J158m09M21k20M23k87O77j543
4880e93L35K53J30K85n17N31n41L08l26K66O2K53m94m34K78j47m55M82M08j9m2
4901B3j51L95K23r8J03l57j88n7Q81q46o64N00M82r1M26m35J86k48k39J89j02
4922f8L90m47J23J43M65m42l57p5k35M71R62r42K05K74k62j20L28q09K47p15K81
4943e83J241j04k00m55K93L09L28j093Q28J56j287K37K50J20L65k96k62k70K82
4962a41M81Q2l10j40j66J82N00k59k51j80J005p44L43l47k29l16M22O7K42j05
4982A36p41R71q93P85p1J32l87O67k27q83J126q76o51J468o30J10J187p80n37
$$ plain form
4841 -621 3 138 -63 465 -353 52 -278 65 -84 -31 631 -375 738 -68 754 259 -755 360 28
4860 28 -255 -167 -39 168 -571 204 -604 -187 49 199 144 -813 345 -64 357 137 560 273 950 -593
4880 -593 -258 -5 125 410 -107 424 -117 191 -135 131 193 446 -48 -482 -204 -351 -806 -324 84 65 23
4901 23 -128 267 490 392 495 138 -50 -107 774 -72 -736 -236 246 155 581 146 332 84 -155 34 -68
4922 -68 322 -125 -2 141 606 164 -193 -268 -503 -32 930 -12 193 467 205 85 413 -396 -149 -864 -583
4943 -583 658 554 354 -101 192 501 829 -264 564 720 -567 -330 -80 40 405 109 -153 -423 -141
4962 -141 340 422 112 -28 -194 -12 488 229 -22 -202 803 59 402 55 -174 -490 -68 -1 241 136
4982 136 -605 366 -527 258 187 319 -68 599 372 -511 615 -261 -912 556 -74 36 1223 443 -94
5001i4K45m11L48J24O86j163l2K52K9N27j010P35p69N35L08L06m18n33M32k53
5021a56Q0J39K65o18N13O4o6r4l6o96R20l9l93L88N10n26K31k95l2M58m13q4k97
5044a77L27J54K76pm54L35j065R69n01M12j15l0j34l74N49m29O32o81M91N8L32
5065E68p22K66m90J52Q17j269L61L81K63m20J38j93k94k29P58j64J9JL42j47k51
5086a13L92m6K44r58J147r16M40PQ0o30L18J36L46n37N20l78M18l18k40Q7n88
5107e89O60K38k01J20M3j1l59O65m30k02m40O51j80J88l39K5j85P0P1J16L40K31
5129D82q4m01N33j126M16k7N4L24l20l05L78n95R49m54O74j010O25n82L29M82
5149C42m86m98J124m94o47L5R33J6k3N74j172O7J60K27k09m15K36m61N70M45j1
$$ plain form
5001 -94 151 -260 88 212 898 -265 -297 -45 -16 511 -499 236 -533 2 310 616 198 -335 97 -156
5021 -156 -76 63 328 -290 223 287 221 127 91 -605 315 276 -117 271 781 255 486 191 159 617 204 120 -177
5044 -177 150 304 580 573 119 454 -611 358 -143 269 154 124 -10 -384 165 -264 368 -313 178 236 568
5065 568 -154 112 -378 -226 591 -678 -317 64 327 -93 45 -148 -442 -671 87 -77 -58 -57 285 138 -113
5086 -113 279 233 477 -481 666 -250 190 197 277 -353 -35 101 447 -90 430 52 470 152 -88 -1 -589
5107 -589 71 309 108 228 271 260 -99 566 136 -66 -506 145 -35 153 -186 -161 -346 -276 -205 -89 251 482
5129 482 398 -3 530 -596 -180 -207 -153 171 -149 -454 -76 -671 278 -176 498 -512 113 -469 -140 342
5149 342 -144 -642 482 -12 -659 -624 309 325 302 876 -296 -229 -69 158 -51 -466 -230 -691 -121 324 313
5170C13j49q30J000j177R33k33M78r10L75k65M25N49k34k48N86p28K31n03N04
5189A17m02J033m80r72R38j055J095Jn09l64M56O58r73J84k94M0J67P40m39n36
5209e95N17J12k01l36n3O20K66p90M03J95nn39K77L0L6L18j40l95N47m30L92j19
5231A10j44K67J85m68k06J02J99l05K05l10O70j69n29P5J43M11k33M64j438P43
5251b28j78O84m54R8j20Q08j014O13L79l64j45l44O20l19m69N50J65k46K41r8
5271A79k50O65l67j08k7k10K92R3k50Q1L40j14q51O9M12j43M71n64M09M49r12
5292c36L20m26Q71l22m38L51o05L55k30N13M43l91p8k52Q87q29O13l25n3l93L25
5313@k6M0K08j85L44n89kJR63n62J8j00N22m36n21m6K41M98p40K22k21L18l28
$$ plain form
5170 313 164 -666 334 -843 90 -143 335 -575 -200 -465 -40 509 275 27 613 -115 116 -387 117
5189 117 -285 748 268 -704 234 -821 274 275 -234 -598 -142 516 -457 -273 -567 -527 -360 380 -59 -595
5209 -595 -78 34 -167 -503 -556 64 330 -460 -57 138 133 -406 -129 -99 -63 255 115 -280 267 -163 229 110
5231 110 -34 233 418 -50 -256 -154 45 -260 -55 -365 305 136 -393 -318 -175 236 3 467 -971 -228
5251 -228 -406 278 -176 -78 -198 610 -404 209 588 224 79 -265 355 36 -433 117 282 36 277 179
5271 179 -71 594 227 119 92 -118 174 267 17 98 438 324 -527 -458 -46 -189 282 -282 127 576 -336
5292 -336 -16 -442 429 107 -331 20 -585 -230 -460 53 496 105 27 -225 662 -167 446 121 68 -325 0
5313 0 -26 14 222 37 381 -208 -210 -209 754 192 210 110 632 196 -325 -371 -130 368 -372 -150 -371 -53 -381
5336c81K38K51k9k8l26L99O5p6L42p84K38J53o7m20M92j59O3P6o70K96O13k21
5358F5O4rk36J29M81l74n69O88j26l52k62N28K17l76j53P41p72J196k28j040L16
5379g2M89q41JK44L4n01Q57m65P49j312J257k00j27m51Q53n33P26j133N5P04k82
5400E2J52r01M85J01J72m18O42o96K05L07n49K10K27k95L19L06l32m4K29p23N82
5421C1m73j97P70j07M15K64q64n41J251j088O63rk03k27M80j09l56L99K81n82
5441b02P17j7r14K02M60n16j17K35M88J16n26R0M20l91n79J310m93k86M39n12
5461g6o52M07J99j77k57P72q1j6J55K58m49M83j71l11J15j81M15o42K81M21o64
5482a71j26M41K40n37o42Q89J06n0l39O43K11j388Q64Q4q89N87Q5K70n04J29p8
$$ plain form
5336 -381 -143 108 79 51 -275 124 189 113 455 -329 -91 62 -5 -425 67 -92 -29 47 -623 -327 286 65
5358 65 129 120 -116 13 494 120 -449 239 113 -239 -501 27 244 -132 -285 456 -316 880 652 -388 -72
5379 -72 417 -424 -423 -179 -145 -646 211 -254 495 -817 440 240 113 -338 515 -18 708 -425 -370 334 52
5400 52 204 -697 -212 -111 61 -357 285 -411 -206 101 -448 -238 -11 -306 13 319 -13 -57 172 -551 31
5421 31 -442 -639 131 24 439 703 -161 -702 549 -539 124 115 -88 -315 165 56 -300 99 380 -202
5441 -202 515 498 -416 -214 246 -270 -387 -152 336 452 -74 16 436 45 -534 776 283 -3 436 -76
5461 -76 -728 -321 -122 -299 -556 216 135 119 274 532 83 566 395 84 199 18 433 -209 72 493 -171
5482 -171 -297 144 384 -153 -795 94 200 150 -189 454 665 -723 141 225 -664 -77 8 278 -226 -97 -175
5503a75K03l86j60M93l62P38n10l4J82j58k85J76j78Q67m18J06k57O4J29K65l02
5524bP0j60Q27r81O14J09k27n25j12R61k33l11M26l01Qk07k17M89m71M3O4N26
5546C90M19j180N96O6o01K66p93J301n17J94Om27L51P7j09k41K48k46k29J22O36
5567C29j49q7j93j14l2Q70k25m35n89R69r4o55r0O28J06j50K34l93q0J88k2O5
5589H1m79M0J66L96r1k14M80j78m45K27rK19j36N6k94M44j49j9k59O97k65l39
5611g1M97K93r9n79N23o34M93j31J28p82M34l74O42n88K83o0k2J01o59J129q00
5632b76j3N52J73ll74R56j067n75K60M62m19k04R6M98q8O36r68J55N49p68N29
5653A11p41J51P97l95m92P46n07K14K61k61K11l20M8K33N7m42K93K6j11O38k90
$$ plain form
5503 -175 28 -358 -518 -25 -387 351 -159 -193 -11 -169 -454 -278 -456 411 -7 99 -158 -94 35 300 -2
5524 -2 68 -92 735 -246 368 477 250 -275 -387 574 341 30 456 155 163 -44 -261 228 -243 -200 -136 390
5546 390 809 -371 225 291 -310 -44 -837 464 -53 141 147 -280 71 148 39 -202 46 -200 -429 -307 329
5567 329 180 93 -100 -214 -246 624 399 -36 -625 344 250 -405 -495 133 239 89 323 -70 -150 38 16 81
5589 81 -398 -358 -192 204 113 -101 379 201 -244 -17 -26 193 57 113 -181 263 114 95 -164 533 268 -71
5611 -71 426 719 620 41 564 -70 423 292 420 -362 72 -302 340 -248 35 -25 -47 54 -605 524 -276
5632 -276 -289 263 436 433 59 1015 -52 -627 -367 95 -324 -528 -432 66 -22 614 -354 -199 350 -418 111
5653 111 -630 -479 318 -77 -569 177 -330 -116 145 -116 95 -225 -177 56 113 -329 -36 -10 -121 517 227
5674B27k02R8k64N06O3M19r41L49k20o3J71R5o42K87J90L62k92k56J31j22K61
5695A57k5k45k20J003m42n50L55K01K44p94M51l08k86O29k19M9j11M41l70N96
5715E56n54j29N39K61n18j47L7k51k35O13q2q4M17l02o48J83R94j239J095J19
5735F25n20R90j366Q09q6m29r9K18L30o39j42J22J03k30K17K47j22j63J43L62
5755C70m83J09M67p72Q3J56R7l8k10K2J244j472J56N47n62K11P14N6p22j75j1
5776b13K72J36J8p05N53l93M40l48N1k76R59m3k80m48R72q24N5J93n38k69O11
5797g7l03J25O41n26q3K41J63l56O25p06L89j00k95M66l70Q46n34l05J55N7k07
5818a54N51J30q65M01K48J069j348j010L06O29L94k56p12R00o97L91n2J02k98
$$ plain form
5674 227 25 123 -141 365 428 847 -94 255 35 -28 143 238 -404 -117 73 435 143 -113 18 -104 157
5695 157 132 -113 -333 670 228 -322 33 234 478 -316 135 -173 -459 170 -49 0 -111 330 -40 556
5715 556 2 -127 412 673 155 8 45 -206 -441 172 90 6 423 121 -527 -344 650 -589 506 625
5735 625 105 1095 -271 538 452 23 -76 142 472 -167 -309 -187 -84 -314 -97 150 28 -135 8 370
5755 370 -113 -4 463 -309 -226 -70 27 -11 -221 -199 1045 -427 -271 276 -286 -75 639 695 -27 -202 -213
5776 -213 59 195 213 -492 61 -332 108 -240 -189 -465 494 451 171 -277 695 -129 -74 119 -419 -688 -77
5797 -77 -380 -255 386 -140 -223 18 181 -175 450 -256 133 33 -262 204 -166 680 146 -159 -4 53 -154
5818 -154 397 527 -338 63 311 1380 32 -978 -672 -43 351 95 -617 283 -414 -23 -75 27 -271
5837b71L48j73J64k33k57M28q06P50k4R5J97k70j97k9j5j25k53O48O49n92j29
5858i5j28k36J212n23l99l22J097o72J185j272r0K50J60R6Pm96O41o02J89J68
5878A70M57j138P49j86o44J007n54L16l61n6L06j58K34n31M69l54M25k33N95m72
5898D1l9K83k75j52K91j23j85J55m43M16q48Q69M41o60M58m63K83j88M78p76J68
5919b69M90J98L39p58K02k8j63j61R20j158N88n8n65N25l27M41n17M07l11k5j29
5940c59p1L04N57p60p9k0J49l47P31L1J97m52P0J20k65O66p98P84p63O02K78k33
5962C42l79J38k87M45n63j33P49n75N52J67o98K96M4M13p97J75l66N03P9o0k02
5983a57o19P33K0K5l18Q92m23r4K30l33m61rN60M0RK06j72o98Q96k17m07N02j18
$$ plain form
5837 -271 77 -96 68 -165 -422 6 -800 -50 -74 21 218 -52 -249 -278 -293 -418 -671 -23 626 34 -95
5858 -95 -223 -459 753 230 -169 -491 606 -66 1119 -153 -243 7 167 263 270 -226 415 -187 2 170
5878 170 627 -511 238 52 -592 415 -139 177 -184 -240 66 -92 142 -389 80 -274 151 -82 513 41
5898 41 2 285 10 -142 149 26 -159 -4 -447 -31 -879 -10 431 -229 229 -234 49 -139 339 -437 -269
5919 -269 221 419 758 0 202 174 11 -150 770 -388 200 142 -423 102 -225 216 -301 106 -205 -230 -359
5940 -359 -430 -126 431 -329 -408 -428 -279 -626 105 136 333 -119 -49 71 -194 472 -326 458 -305 297 575 342
5962 342 -37 101 -186 259 -304 -437 312 -263 289 456 -242 54 98 511 -286 -111 -477 26 105 45 -157
5983 -157 -776 -43 -23 2 -316 576 153 59 289 -44 -505 -514 46 86 95 301 129 -569 327 110 -297 205 87
6006H7P11j144L13K60j72kq76J257l4k20n97O89n54M92p26P76n6j53L25o45j3
6027b82M7K54J2j29p5M8O7L22J56n1k75O7m98O70n32m56P50L13p04M72j49K52
6049B79j20j91K87o89Q43m32j77m16R20K84n06q95J43Q64k04j97jL76j9L9pl24
6071a43l4J83k20L25j94L71l61m70Q34p9l07q6k91L01L49J1j73o4L23l38q4k02
6093c49N25j05n1Ll47N84M99q49J25L25k07m29K71j09j88N48j88j26k68M37l27
6114b26M44J26n76N55n35j32J16L78q03P91m7P36p29o43p3L97m5J13Q8K80o77
6135d62K65R5K84L76j017K98m7P58j99k68O67p73M74j91K47o09M39k62l25M72
6155B22L38q51Q48r7o30j2k8K43L55k01m39l34N37R5m37N39K94j110O70M96o73
$$ plain form
6006 87 798 -346 -33 227 55 53 -823 434 400 180 -417 272 -282 210 -516 260 204 51 376 -269 -282
6027 -282 -235 19 31 -98 -173 -125 -58 264 420 369 94 161 -337 333 -199 -655 95 408 -296 176 27 279
6049 279 159 -32 255 -434 409 -23 -200 -616 304 588 82 -813 -670 194 -10 -207 -208 168 149 188 181 -143
6071 -143 -177 6 -214 111 -83 288 -73 -543 291 212 -95 -181 -472 -171 178 189 16 -48 275 -63 -147 -349
6093 -349 176 71 20 23 -324 260 759 -90 35 360 153 -276 -5 -114 -302 246 58 -68 -336 101 -226
6114 -226 218 344 -232 323 -212 -344 -228 150 -653 138 91 827 98 -545 -618 -221 -266 -153 -65 215 -462
6135 -462 -197 -102 182 558 -459 -161 -208 550 351 83 750 -23 451 260 507 -102 337 75 -250 222
6155 222 560 -291 557 460 -170 -182 -210 33 388 187 -252 -586 -49 46 -391 148 442 -668 2 498 -175
6176a75K38j49j78K94J67l6No1j27J95J93n11j03q3o14R94k72J92l0K33k75O21
6198E18r35L90J49m53q8p07J824p52Q18M0p56n69N05m92Q65k91K66k76o1L31j4
6219C12K6J78l71l36j31O79l42K73j54K4n68J33P8l18L4j21N47M6n00R22m20L17
6241C08j57p03J061q20O76k27M14o22p2q1j59M06p13Q91N33p93J97L91m51p8r2
6262i1J044r36K24J92l20k11J38n0k97M15j51l46L65q50R72R2r38P40O6k58K24
6283B4j57K03m18R7M11n21K52o04L50J79p2N02p12P17m0k16j22J95j47m32L60
6304a51M73k37j061J351j42r09R46m75J024j724P74q9L17o98O84m57j83K03k1
6323c75P81j46o54%N32j7J10p2j44n22L51j8L29j64Q3j36K77m63j11l59J59N67
$$ plain form
6176 -175 63 -86 -264 30 197 161 166 105 -22 173 366 -145 -248 -331 -945 49 -223 -31 -61 172 -103 518
6198 518 -417 -27 122 -331 -419 -1126 698 -54 764 804 48 -521 -16 -508 357 66 332 56 -5 326 312
6219 312 338 516 145 -191 -322 357 15 288 134 158 -410 -277 -199 -517 -483 -604 -57 -11 -511 411 -9 308
6241 308 151 -552 509 -311 365 138 552 -70 -142 -223 -382 24 -689 202 735 -58 139 530 79 1 -91
6262 -91 953 17 241 433 113 -98 40 -10 -307 108 -43 -389 -24 -874 98 190 -748 -8 58 -200 24
6283 24 -133 70 -348 -251 160 -361 -109 -713 -363 -184 -256 246 -466 251 211 -5 -127 68 -79 -511 -151
6304 -151 322 85 -976 375 233 -676 270 -205 819 -905 -131 -220 97 -601 83 -374 -557 -354 -375
6323 -375 406 260 -394 -394 138 121 231 159 15 -507 -156 -174 155 -9 74 -62 215 -248 -359 -718 -559 8
6345HM22l71n67L83O41n84L18k97l70M62m51N65o78K3M13L10P5m03Q53j005O72
6366D19l16p7N24o81l17MP36J00j7m10n02J90J24m30J83K24P87j082M80K82Q3
6387C04K27j15k52p95m0J131p57M38k96K72l09L38L60l21K8o18O00m95J24j01
6407b77NL45M5j90j46J35JM27p47M57ok85P80n53l19N1N6M98j20J2m56j81P23
6430B55j77q7o11R05k35m43O70l08m43R83o93K68R5k70Q21r01j51J13P25n19N8
6451E5L96j20k37M84o95q40J237n47J42l41J81L36k52k6L47j54L07l26L01k36
6471A2O3J57o43N01n06L1Q4M53N2K00n59J94p7j25K08K62m85M10l09K5P7O82j010
6494c03l52N34P7K6j16J93k80L49q52N27N12j62nm11J71J29Q7J09J35L23o76k54
$$ plain form
6345 8 430 59 -508 -125 516 -68 250 -47 -417 45 -406 159 -519 -496 -83 227 302 -101 752 -253 419
6366 419 103 26 550 -131 -448 -444 292 392 375 -35 -537 -347 -223 -653 -470 -246 541 -541 -61 221 304
6387 304 531 416 164 -631 -671 460 -297 141 -155 117 -192 146 506 185 213 -405 195 -300 -176 -277
6407 -277 -272 73 118 -72 -218 -83 -82 345 -402 55 49 -236 544 -9 -328 -277 -221 277 157 169 -287 -468 255
6430 255 78 -9 -620 285 50 -393 277 -31 -474 509 -184 84 179 -91 730 -171 -322 -209 516 -3 55
6451 55 451 331 94 578 -117 -957 280 -267 -125 -466 -285 51 -201 -227 120 -34 273 -53 248 12
6471 12 75 232 -411 90 -416 -385 -301 152 204 404 -155 39 -38 -163 45 307 -178 232 -77 -52 25 707 -303
6494 -303 -655 -121 -44 -18 -134 59 -221 128 -724 -197 315 153 148 -263 -92 37 124 233 368 691 15 -239
6516b39O28n91K37J85n3N4n41n2M72M1j83Lj51lj29L82o74P40J39m72R4j46k9
6539b88O38n89O90l90N8L45j15k34k30P09qp04P8n58q8L30J62j7n1P47j56j109
6561g80O33k3q4L91M59k82n49J65J45k38M78kr40N11P60n38m66L71l97L07j66
6582b45L70L12l00m4p62Q17O1o03qL86O5K17r69N56N94r3o75k19N54M69p97R33
6604F19o93O65j91m13o92J514j013K5M22O76r47k99j6%Q69p06j14K86J3n02J354
6625H57r73J50o55P65j53o65K0L2R93j52r2mk09K91m41P03k02j45J09m11N25k28
6647A15o65O49o69K55K59M06o40k9L98K55j182Q85N83j9q36Q7L71j36l35L68j38
6668a8j08j17L07K70n76K27M64k84k42j89j1K04K84j81m5J488j200m50L67L63
$$ plain form
6516 -239 389 -202 35 220 167 221 -320 -372 100 141 -42 -39 -190 -193 -322 60 -614 126 265 -207 -113 -259 -288
6539 -288 350 -239 451 61 119 464 349 115 -115 594 586 -118 -40 -598 -686 -356 -194 -211 -262 485 329 -780
6561 -780 -147 -170 -254 137 596 314 -235 -70 75 -163 315 313 -627 -116 644 106 -360 11 -386 -79 -245
6582 -245 125 437 137 93 -669 148 209 -394 -402 -16 49 266 -703 -147 447 354 -321 -540 14 483 -314 619
6604 619 -74 591 400 -13 -705 809 -204 -179 243 919 -28 -327 -343 -343 526 -180 -294 -8 5 -497 857
6625 857 -116 34 -621 144 -9 -674 -654 -622 371 219 127 123 -86 205 -236 467 265 120 229 -182 343 115
6647 115 -550 99 -570 -315 -56 350 -290 -319 79 334 -848 37 620 601 -235 -148 223 87 -248 120 -18
6668 -18 -126 -243 64 334 -242 -15 449 165 -77 -266 -277 -73 211 30 -15 1473 273 -177 190 553
6688E53m69m77l5j56K20P51pK51m77j07O8M69l51q49L55P18q80m6M01N27p24K22
6710d3M69k21J07q26J8L85j54M42q44P90L01o27Q9k92r4N97K41o17K49m83j87
6731g00M55L52j39O7m00O30q0L95j095J010J11r05J03K67J37l78J03K17K87l39
6751I8k94m80K11M55k12K76o47R30o07K02k94K28J043o37m55J91m59m06J210r87
6771f34Q80k58k77N15k28n19N45L05q01R67m03m72P97l28L47o10P67m57n41O9
6791c36L9O45r08M67K90n50J222l77j013L13l18Q77n34P57n57k01l70r3R85m83
6811a45Q37o40N0k36n34J099l8l88l84M13l71M41L22q20N02N2K3m18j7J01l4M46
6833B61k81K53P06j081O17p79O96l08m78j78O09j63j3J68L35k55K33l66n2J44
$$ plain form
6688 553 84 -393 -428 -584 -364 387 380 631 154 47 115 584 233 -616 -261 457 -423 -469 -68 459 -265 -43
6710 -43 426 205 312 -514 -496 -111 -265 177 -667 123 424 -203 -114 -406 -500 97 338 -279 -30 -513 -700
6731 -700 -245 107 -32 35 -365 265 185 580 -515 495 606 -299 -196 71 208 -170 -67 150 437 98
6751 98 -196 -676 -465 -10 -222 54 -593 337 -270 -68 -362 -134 909 272 -183 8 -451 -857 353 -634
6771 -634 246 -12 -289 226 -2 -521 24 329 -472 495 92 -380 417 89 436 -174 593 136 -405 -336
6791 -336 -297 348 -560 -93 197 -353 869 492 -521 -208 -526 351 -183 574 17 -184 -554 -647 338 -145
6811 -145 692 52 102 -134 -668 431 393 5 -379 34 -337 104 426 -394 108 160 183 -235 -252 -151 -185 261
6833 261 -20 233 939 -142 475 -304 392 84 -394 -572 37 -126 -139 29 364 109 342 -24 -76 68
6853F8o7J15m12J87l39N17q52J056J24j53K88p52M67p85j68L19M04j75Q68q32
6873a22q34R37J95p31P21K44m71o98J407j221M73P52j93l84o08M70M61l63o02
6892e67P79N4r8m13k8R3j38Q03j079O14O0K49j051M27L19p01J410p11pK55k31
6913C9K02k73L57r7l30M7j26J11k86j54O13p34K29L47L1J97j61R38j043j10N00
6934B97l00P8j19M6J15O18r02N2k8K87J1J93l18J87k15Ok51M94j63o49N92n8K09
6957A82o82O69j11L54o08j24K41l85P98o11K62n31j09P53M0O17n58o02P17K49
6977E61j137J30L89j43K24k8m09R49p01N13k04K02l97K49M8q55L38N2M46K06l58
6998G5P2L00j064P46j52M19m07k18J76J45L4R6m80M33o19J36K18o19N96M31l49
$$ plain form
6853 68 1 116 -296 -109 -448 69 -783 273 397 244 532 -220 247 -538 -706 -387 17 -158 710 -122
6873 -122 -956 -19 176 -555 166 410 -61 -759 648 -573 -100 652 459 75 -533 -63 398 35 -567
6892 -567 212 266 168 -245 -273 -180 -318 485 -594 20 80 329 -722 -295 24 -677 733 22 15 270 39
6913 39 241 -32 325 228 -102 -55 -181 -70 -356 -510 103 -631 -402 -55 -24 173 12 950 -93 -203 297
6934 297 -3 75 -44 2 117 735 -167 -115 -143 144 155 348 30 217 2 8 -243 251 88 -561 31 -27 182
6957 182 -500 169 58 412 -196 -320 -79 -464 334 -277 -15 -546 -655 98 138 755 197 -405 312 561
6977 561 -576 -446 -57 -200 24 -4 -413 536 -165 348 144 346 -51 198 246 -609 -271 -219 227 433 75
6998 75 147 447 -617 129 -23 396 -11 -229 -53 92 126 222 -258 175 -444 -308 -90 -709 -113 318 -31
7019c1q27J365k51r4n8k92r8l2p2M54M02n26j82L50k2m16j51M9P71m75J76L98
7041D38k50o06N46J67k51k28L21M34p07j79L51J08k13J22l82L11K25l6l2L13l57
7062I5r7J64l85kP96o30o27N21M29J98m69k04r6n92R98m50O69om00R3O70q18k19
7085c62j1L05j80l19R97j213R34M22k11n62L94j40J37n40K32M75n66L92q8k53
7105a57N79j55m16n8R1M05p10N65m89J87K23j3l96J51K04l87K5J71j46L75p6J93
7127A66m08J4M04n29J20O37l49j21K24k23J33K09n71O48p22K31L02o53N02n98
7147e84P30K21m96r1Q52m78K9j01K20n13j95K71l05Q03j7p02J235n09n52J16l26
7168c92k28J105r07R1N66J53q90L75K90K61o2m07j22K10K53m90K41o58K62K88
$$ plain form
7019 -31 -858 507 256 162 104 -188 -286 -318 -390 64 466 -60 -242 108 86 -330 -481 -432 339 -136 40 438
7041 438 188 -418 128 295 44 -184 137 571 -136 -315 36 144 -69 53 -329 -18 207 171 139 452 95
7062 95 -2 162 -223 -225 571 -59 -686 -165 264 462 -7 -211 -307 -899 99 -351 318 312 -88 5 675 -143 -362
7085 -362 -373 -68 -248 -567 430 -783 151 573 362 -200 194 54 191 -349 -117 358 -208 184 96 -157
7105 -157 422 267 -149 -207 -116 289 -421 144 -345 -158 65 52 -344 -193 11 -376 -351 -180 -326 49 -27 166
7127 166 -242 -228 176 -353 -233 404 55 -66 158 -65 68 277 -294 354 -368 -137 165 -488 14 -584
7147 -584 146 367 -129 -220 632 154 183 82 302 -211 -406 -135 -440 363 346 -356 879 370 -182 -66 -392
7168 -392 -620 485 -422 -331 235 388 -502 -127 163 424 362 -45 -167 43 296 -194 47 -611 -349 -61
7188f1j0j32q1R84p83J85J36j42m89M56m26P17R4l83L12o37J179j462J152k89
7208C20q97P00o02k9O36l5K00o24L81k50m69P34M2j02k70j0rk83P54l41J99l69
7230c24P28p55K56L88J64o24j136J166K28o40K70R03n04K46J37n18j11O62p97
7249b61M22m85j93N99j96K64l98K7L29o9N53p64K79m36N94j64n01N41j39K21j215
7270i92J113m97k10Q79q9m29J86j44J75k5k54J41L46m12J3j59O66k24l72j57N61
7291A16o44R7K67m66P14K04J92o59M82m94j31j57K92J61O2p15Q67m9m28O11M3
7312C65Jj23k17M03k13K55q49k38R15m92L41K14L0q34K87Q6K14m5o70J172p78
7333a76j36L54l0J68o14L24L3lj48o6J24J0j43Q98n75P4j51K81m66J19J85K0p26
$$ plain form
7188 -61 -71 -203 -284 700 -83 102 238 96 -393 63 -363 354 448 65 377 -260 919 -543 609 320
7208 320 -577 123 -479 -508 128 93 293 -331 50 -200 -669 65 107 5 -265 -275 -284 -567 187 -154 45 -324
7230 -324 404 -351 -95 293 457 -167 -1303 -137 91 -549 -279 624 120 366 503 -15 -126 536 -261
7249 -261 161 -324 -517 82 -114 150 -248 -221 108 39 592 -172 107 -329 265 101 -400 141 2 223 -992
7270 -992 121 -376 -586 293 204 -225 -39 -183 -8 -33 -287 -146 200 -212 -199 -358 308 84 -288 -445 116
7291 116 -528 -431 -164 -630 84 288 480 -179 303 -191 -322 -479 -187 -26 36 -679 188 139 -289 322 365
7312 365 366 243 26 429 216 471 -378 -616 299 -193 148 362 392 -442 -155 -69 145 100 -570 602 -176
7333 -176 -312 42 12 180 -434 -110 -77 -80 -228 -294 -170 -160 -303 595 20 94 -57 224 -242 -123 62 82 -644
7356f44N61l87N78l55R58p49N66K7j201Q62p13MJ97L65J63j224J174k81L54n83
7376c28j37M97j21j89L79n9q4k07Q4K71j76O39j093L45L61p50N16l63l53R96p6
7397A52N50p01K22k51L76o21K2M64l00o75J128n65P37p50K4J35k90K43L2k72K3
7418c17N16m07R2K18l20O96q55P2N0j79k08N34m55M94M72K56j456j31Q37L26m09
7439a74M12m82L03k09M7P03j2j048K88n22l6J260n86K20k25q43P51j10M1m68M30
7460b60k74J44P20j7k57m82O56J15l57k14M8K69K36q14M93K16k39o5K7M3J74m51
7482b89L77M8k13k96N74j29M02K43p76J93K0o2q12J109q04L67L47k64m28M79k40
7503a54j08J96L03p78M22Q55ol49k74J67j43J08r0l88J98k46n56J379l9m42K07
$$ plain form
7356 -644 -83 -470 108 -247 711 -38 528 555 -646 216 -497 -493 -296 69 232 -992 182 -99 255 -328
7376 -328 -465 32 -89 -278 101 42 -42 -249 -165 106 -70 569 -524 -179 182 -568 -52 -415 -768 228 152
7397 152 702 1 223 -28 348 -273 -251 213 -87 -762 366 -199 538 -212 -188 -53 -343 -100 -68 -340 -317
7418 -317 199 -208 -116 102 -218 478 -377 -305 -255 -434 -642 -108 -563 -69 403 659 -797 -928 -91 235 -174
7439 -174 238 -244 59 -150 -103 600 588 -460 -172 -694 -730 530 -56 164 -61 -904 -153 -263 -222 -690 -260
7460 -260 -534 -390 330 313 56 -426 230 345 -12 -226 -178 91 327 -487 6 222 -17 -82 -55 -12 162 -289
7482 -289 88 136 -77 -373 201 72 474 717 -59 134 154 92 -720 389 -415 -48 299 35 -393 86 -154
7503 -154 -262 -66 237 -541 -119 736 730 381 107 274 131 239 149 -239 -41 -287 -843 536 497 55 262
7524B62k89J83N72j90o45P4j77m44K70L03J52J6J04n83O10J11m33J83P0l64K06
7545iN33r67N73j89J8j59p5O52m24p8P50l5o78N12p92M47J87p03k52N40l36J93
7567b92J013o95j19k80K52j63j11M78k42Q46q29K01Q58r01K55q15M85j37NK61
7587G0J28l32m6M84Q3o44j49K60o2j27n11P0R35N37o28L10m40L93o96Q2L09k09
7609a83M63p88L41k92L97j57K62J86j043J259k28m80j0L79P4o78k75R99P0n53
7629b57L78M3J22J88o35N5j4K2N4K91l94m45J031o23K59l47m99R23N23k43j32
7650C00J93j39j18m96M6M53P6p84P70K79k70p53Q14q22L98K88k5p54J17R32k95
7671B10M24K2o47O99j66j783J468R0p05j8J07Q73n61K23n01O50l37k93O63m85
$$ plain form
7524 262 -27 156 728 538 -107 -33 -210 -654 -384 -81 71 87 191 -392 218 329 -104 79 149 -215 -9
7545 -9 524 -443 130 -59 -41 -200 -275 377 -47 -125 625 590 -88 424 -368 79 266 -437 -689 -149 -485 -292
7567 -292 721 26 -93 -373 -121 -284 -395 83 -159 687 -142 59 917 16 271 -544 -59 -196 -191 70
7587 70 198 -134 -180 304 387 -257 -406 -146 -208 -335 -846 -776 159 696 68 378 -62 331 -365 -283 26 -183
7609 -183 280 -508 -167 -459 -62 -219 43 229 -814 445 217 -263 -273 106 180 -498 -773 226 296 -257
7629 -257 121 164 286 474 -161 -106 -120 -98 -44 247 -147 -592 439 -184 75 -272 -771 152 675 432 300
7650 300 493 354 236 -260 -214 239 315 -469 301 580 310 -443 371 -451 -53 235 210 -544 -427 505 210
7671 210 634 656 9 708 542 -1241 227 317 -388 -406 -299 574 13 236 -265 385 48 -245 418 -67
7691f7M39J02j216J409j336M37J96ML24n09m4M0M72m39R1ON49m83L34n78M65l56
7713a60m92P62L8M63q63P64m11k1K2m99l67J102K74j263N00J39M19j90m15p9L92
7734A15L34o42L36N90j435O18N02r30P14n6k37K81n34j53J43J033p75k74R03m10
7754A23j2K55l18J79j61j90R40r94P99j416R84p03N47L77m53O01o74L41K81P2
7774E78j186P19k14k57j58O70l96j92L25K02k39J82K91l02J58N3n64P05p58K43
7794a40J51p77J610j332K18R50j094O45k52N22r94L26J29n88P06mK06n22K58k72
7814b54P2ql75Q12r84Q21K08o06q2Q43j470J033J05q94J235l06l40M59k52l81
7834c64N15l16q5K52j61M54j060R03m41k99R21J42q8k40M45q49p8K93n9M7J64
$$ plain form
7691 -67 372 474 -742 667 -669 -232 -36 -32 292 -217 -261 -221 251 -188 -97 -91 458 -25 309 -269 196 -160
7713 -160 -652 110 148 611 -252 512 101 80 102 -397 -764 338 612 -651 -151 -12 407 217 -198 -277 115
7734 115 449 -193 143 733 -702 -84 418 -512 202 146 -91 190 -344 -497 -354 679 -96 -370 533 123
7754 123 111 366 48 227 66 -124 816 -178 621 -795 189 -514 33 410 -43 558 -116 225 506 578
7774 578 -608 111 -103 -360 -518 152 -244 -436 -111 91 -148 34 325 23 181 234 -330 375 -383 -140
7794 -140 11 -766 844 -488 -270 680 -414 231 -21 501 -493 -167 -38 -626 80 76 282 -240 18 -254
7814 -254 -182 -190 -565 247 -737 84 292 -314 -396 447 -1023 10 115 -779 456 150 -190 269 17 -364
7834 -364 151 -165 -250 2 -159 295 -765 138 -303 -602 319 461 373 133 578 -271 -349 -56 -115 -68 96
7855I6l13P53m60k17P36n06J09l19l10M27N63r66N53K7j50m85M19m92N75n98K99
7876b59N0O48r5J4p24M45k36q81J878r64M7n9j44J68N59n45J58n19N00p2k39M10
7898A40M82o69R9k13N7O11r33K53L49l94O15p49J27M21m08o0K86L12M09p18n38
7919e21K21O94o00k08M93j27j9k37k26L15R47n56j98K59n72J255m19oj166R03
7939B32L85j184P89J28p63K65k50K41P36q95nN94O1J05k5l22N49j27n16N9j24
7960f7o31P42j86j77J223n25l94K32l99L62k84R1K64j99j70j01Q71n35p13K94
7980c02J74n8O13k30k94l61R61m6m91k70Q3j01N44n81M30qn11J138o82j75r7L37
8002G3l11JO02n21J96kn16L34j77L81n17N47l77O28l23j91N66j06N0k17k34M56
$$ plain form
7855 96 -217 536 76 -141 595 89 198 -121 -431 -4 559 -407 146 173 23 -462 -43 -535 40 -558 -259
7876 -259 -209 439 344 358 -366 79 -157 -1038 840 -124 -77 -136 -280 -112 447 -98 60 -459 41 -31 -270 140
7898 140 622 -47 52 -161 -104 507 -426 -173 176 -218 397 -352 -225 196 -212 -272 14 326 735 17 -521
7919 -521 -300 394 -206 -414 79 -48 -67 -304 -530 -215 732 176 -22 237 -335 920 501 495 -671 232
7939 232 617 -567 222 350 -413 -148 -398 -157 579 -316 -321 273 334 439 414 92 641 514 -2 57 -67
7960 -67 -698 44 -142 -319 904 379 -15 217 -182 180 -104 -13 251 52 -118 -219 652 117 -596 -302
7980 -302 -128 -186 427 197 -97 -458 503 457 -34 -304 -221 -322 222 -359 71 63 -448 690 8 -167 -264 73
8002 73 -238 -237 365 -156 40 38 -478 -144 -321 60 -457 90 -287 341 18 -173 393 287 337 120 -114 342
8024C42n37R4L37l09J34j04L02n19R0M93p65N41O06q82M66k91l2q9j82L14k3k17
8046b31j65L09p9K60M31l39l41K44n13K96j40N2J13p6j57M39p7l4j28M93lr23
8068e69K62M07J07j63J5O2N0p00M91k19K7m39M61m5m17N18k8N40n80lk87J129
8090F19p49J03L54l63K42j68q4M82q35J14N57m63O34j321Q58J55l52l28M60L10
8110B25l39M26l78o02J194l36m09O4N66l63k2N44q37j46j36O17M8Q2j65q19jJ324
8132E37m66K91l7k95l56L06k02k86M53l2N30o63Q9o3O71o49M69k45j2J62j53n68
8154e19J16L69O80p87K2M95k92m0k79O10l09n39J00J056j333P14q0N63l34k97
8174h4m7O59j231M25M33o91O82J17N09j21j97j22p28N08k34n5K36
$$ plain form
8024 342 -195 -101 236 -73 61 -43 259 -260 -170 323 -442 99 705 -177 289 -2 -34 -123 -305 9 -14 -231
8046 -231 -396 -87 -166 94 525 186 -155 89 -424 -128 -268 -216 -103 -179 -336 103 26 -8 -136 357 354 -569
8068 -569 -307 100 207 44 59 121 171 -529 -38 -257 -230 -669 -208 -253 -670 -152 -180 360 -220 -223 -510 619
8090 619 -130 -27 327 -36 206 38 -46 436 -399 -285 272 -191 443 -878 -20 135 -217 -545 -85 225
8110 225 -114 312 -66 -668 526 190 -219 -155 411 48 26 570 -267 -413 -549 68 116 198 33 -786 -787 537
8132 537 71 362 325 30 -326 -20 -222 -508 -55 -87 443 -220 -131 -194 477 -172 297 52 40 202 49 -519
8154 -519 -403 -34 646 -141 -119 376 84 44 -235 375 66 -473 -373 683 -650 64 -16 547 213 -84
8174 -84 -131 528 -703 -278 155 -536 146 263 772 651 454 332 -396 112 -122 -177 59
8191E9
$$ Imaginary data points
##PAGE= N=2
##DATA TABLE= (X++(I..I)), XYDATA
0@%%%%%%jJjO5j28J29j30J93l20L85m49N76p05Q34j026J218j410J710k030K371
26A282k756L196l686M207m810N495o261P105q014R040j0161J1391j2755J4231
40G504j5853J7621j9563K1678k3984K6511k9265L2281l5580L9206m3189M7573
52B4940n2437N7844o3895P0693p8400Q7223r7440J09442j23748J41182j62975
63h7571J91110k29043K83287l67845N19248q74275L249479K593231m238802j062967
73b4148n48850j403454k350306P80768K444935J504040j24806J003579J417804
82B699562K6322j448354o14022k85312j241785j607986J34911R63777R0875j12509
92a394521J749672K343738L89501j314157n63180o8585j521398k427462m97985
$$ plain form
0 0 0 0 0 0 0 0 -1 0 -1 64 -64 65 -65 128 -192 193 -256 320 -385 449 -577 641 -769 941 -1089 1282
26 1282 -1474 1722 -1964 2243 -2567 2928 -3333 3772 -4242 4798 -5363 6028 -6727 7504
40 7504 -8349 9272 -10291 11387 -12597 13914 -15351 16930 -18650 20556 -22633 24940
52 24940 -27497 30347 -33548 37145 -41255 45968 -51472 57970 -65778 75404 -87571
63 -87571 103539 -125504 157783 -210062 309186 -565089 2684390 5277621 1038819 -24148
73 -24148 -572998 -1976452 -4326758 -3545990 -1101055 402985 278179 1281758 2699562
82 2699562 2725884 1277530 663508 378196 -863589 -2471575 -2336664 -1372887 -1282012 -1394521
92 -1394521 355151 2698889 3088390 1774233 1211053 1142468 -378930 -2806392 -3304377
101c304377J594155J226372Q0048P34708J650134O01096j087000r95025j23546
110C76565m74787j233295n73694N77103M94163m1052N58125J349696P41715l44866
120A429673k64038J12225p27731j701862r87048M69377O44573Q0930N55275J459022
130A070396R46312m72540p89360j35541k46863j035495q60265K16444N74594Q7319
140f44999J46530Q12716P71442j5520k70678R1439r8817q39514q96381j75586
150a119368J46242r0603J53870R15140R97712K22956k40299m7927j49273p61227
160B7223q89899k41294K15334O7167R2634N99101P77255K77003j21571n488k1940
171G75525n04736p47000l49344L6727l2710j5632M48384P57026M47923K3203k0664
$$ plain form
101 -3304377 -1710222 -483850 -403802 330906 1981040 2582136 1495136 500111 376565
110 376565 -98222 -1331517 -1905211 -1328108 -833945 -874997 -316872 1032824 1774539 1429673
120 1429673 1165635 1277860 550129 -1151733 -2138781 -1669404 -1024831 -943901 -388626 1070396
130 1070396 2016708 1544168 754808 619267 372404 -663091 -1523356 -1306912 -732318 -644999
140 -644999 -498469 314247 1085689 1070169 799491 890930 792113 -47401 -943782 -1119368
150 -1119368 -973126 -1063729 -909859 5281 1002993 1225949 985650 937723 788450 27223
160 27223 -862676 -1103970 -888636 -821469 -728835 -129734 647521 924524 802953 797465 775525
171 775525 270789 -476211 -825555 -788828 -821538 -837170 -388786 368240 816163 839366 818702
182H18702m2272m03711o76695m38245n0491L6887O4147L46229N63728L73211P3818
193F65308K7963r49k89164n18380l56301q8521p5090q4445K04252N05889M15018
204D05580J33879P1164R5138j37157m62787m64119k03406n0525k8681J26482L66238
215a48194M10396K41589R3030J1314j41662l14221l23853k14455j43556p3163
225f02775J19541L15982L04741J71227J25604J19079m4777k83282l31478j88174
235b94312q8841q9549m283K00166L10717K27945J03877N1726l029j31017k31752
246E1648k22790j56085q1175J3268J19997J80832J83857J74853J36017K1002j28188
257B93236j91232j63414j48830j50870o9305R6236K06456J88060J36413J19773
$$ plain form
182 818702 776430 372719 -303976 -742221 -792712 -755825 -691678 -345449 218279 591490 665308
193 665308 693271 692322 403158 -115222 -471523 -560044 -635134 -719579 -515327 -9438 405580
204 405580 539459 610623 705761 568604 105817 -358302 -561708 -612233 -640914 -514432 -148194
215 -148194 262202 503791 596821 608135 466473 152252 -171601 -386056 -529612 -602775
225 -602775 -483234 -167252 137489 308716 434320 553399 508622 225340 -106138 -294312
235 -294312 -383153 -472702 -476985 -276819 33898 261843 365720 417446 414417 283400 51648
246 51648 -171142 -327227 -408402 -395134 -275137 -94305 89552 264405 400422 421424 293236
257 293236 102004 -61410 -210240 -361110 -430415 -334179 -127723 60337 196750 316523
267C16523P6046n0427j76240k02225j53042j01869n3795K9338J24998J76362J69691
278A55360J21733M9402l3526j01227j38674j55746j41281p2566K5810R7759J23249
289f9707J31603J35388R5501Q96q9020j23478j22983j19752r5984k6425O2643
300b21318J18218J28258J16658Q9045L4766l8033j00004j30295j23134r0151l4439
311b50429K8585Q4006J20304J25273R5115L7683k4697p7618j10134j18202r4624
322a84738m1398K1436O7724R7348J10947R3765M5403j4809o1257q6276r8402q9988
334a40245n1711M695N3937P8634Q6062P9602N9132J1880l9342p6842q5225p4008
346i3431n3487k2371K2183O4031Q6160P7943N1388K2685j0256m6560q1371q5507
$$ plain form
267 316523 392569 342142 165902 -36323 -189365 -291234 -345029 -315691 -190693 -14331 155360
278 155360 277093 326495 292969 191742 53068 -102678 -243959 -316525 -290715 -192956 -69707
289 -69707 61896 197284 292785 293681 204661 81183 -41800 -161552 -257536 -283961 -221318
300 -221318 -103100 25158 141816 230861 265627 227594 127590 -2705 -125839 -215990 -250429
311 -250429 -221844 -137838 -17534 107739 202854 240537 215840 138222 28088 -90114 -184738
322 -184738 -226136 -204700 -136976 -39628 71319 165084 210487 195678 134421 48145 -50257 -140245
334 -140245 -191956 -187261 -133324 -54690 31372 110974 170106 181986 142644 65802 -19423 -93431
346 -93431 -146918 -169289 -147106 -83075 3085 81028 132416 155101 144845 98285 16914 -68593
358f8593n9824j9568J2905L8877O4317P9668O8927L0190j3410m1918n5798o7441
370c1668o5780m0426K716M3824N8847N6369N2191M0080J1651k8475n7341o1463
382a9475m7906l2018j4706J2844M5869O3091N3006L1621R160p176k8936n2706
394A2668o0394m1446j2643J1134K6644M1098N3587M8753K3106r162l0338l8354
406B4653m3565m5664l2945k782K9369M4834M4300L7985K8910J0736j8603m3589
418C3639m9478l7520k2701r440Q651L3073M9505M3944K4672N269j0160k4670l9523
431E261m3435l1000q076J1047K2873L1915L7129L2479J6695o309k4803l1312l1038
444a8574k8155j9636k778J9406L2599L2760K4621J8570P846j3135l0278l5123
$$ plain form
358 -68593 -128417 -147985 -135080 -96203 -31886 47782 116709 146899 133489 91571 35773 -31668
370 -31668 -97448 -137874 -135158 -91334 -32487 23882 76073 116153 127804 99329 41988 -19475
382 -19475 -67381 -99399 -114105 -101261 -55392 7699 60705 92326 101486 94310 65374 12668
394 12668 -47726 -89172 -101815 -90681 -64037 -22939 30648 79401 102507 93345 63007 24653
406 24653 -18912 -64576 -97521 -100303 -70934 -26100 18200 56185 85095 95831 77228 33639
418 33639 -15839 -53359 -76060 -85500 -76849 -43776 5729 49673 74345 79614 69454 44784 5261
431 5261 -38174 -69174 -77250 -66203 -43330 -11415 25714 58193 74888 68579 43776 12464 -18574
444 -18574 -46729 -66365 -69143 -49737 -17138 15622 40243 58813 66659 53524 23246 -11877
456a1877k6609j6080o304Q064K4874L3244K8618J9032N122q637k0236k9709k7781
469b8279k0082r039Q296J9452K6262K4813K0984J1001m502j9103k4319k2699j8825
482c6040j1783J47J5157K4217K1077J7020J3265K363j1402k0782k1084j7695j3086
495c8626m258P240J8418K0438J7054J5202N802m197j6522j9118j8590j4947p505
508c9609L421J3867J8244J7364J6651P923l630j2668j5153j4897j7327j0832L216
521c3430J1171J4575J4025J4811J2430K0j0867j3671j3203j3642j1273k561O959
534b4656J3279J3323J3266R792M517n283r327j3558j4761j1219l022N010P056
547a5583J1066J3387J2930O263m990q122p741j2029j4822p769L277Q955Q303R880
$$ plain form
456 -11877 -38486 -54566 -60870 -52806 -27932 5312 33930 52962 58084 49447 29211 -498 -28279
469 -28279 -48361 -57400 -49104 -29652 -3390 21423 42407 53408 48906 29803 5484 -17215 -36040
482 -36040 -47823 -47676 -32519 -8302 12775 29795 43060 45423 34021 13239 -7845 -25540 -38626
495 -38626 -42884 -35644 -17226 3212 20266 35468 41270 37073 20551 1433 -17157 -32104 -39609
508 -39609 -36188 -22321 -4077 13287 29938 37861 34231 21563 6410 -8487 -25814 -36646 -33430
521 -33430 -22259 -7684 6341 21152 33582 33602 22735 9064 -4139 -17781 -29054 -31615 -24656
534 -24656 -11377 1946 15212 25004 29521 24238 14911 1353 -13408 -24627 -27649 -22639 -15583
547 -15583 -4517 8870 21800 28063 23073 14951 7210 -4819 -19641 -27410 -24133 -15178 -6875 3005
561C005J2608R337k79q236r695j0407j0455q034p08N523P968J0733J1840O157
575A9357k23k927n416q955j1925q476j64L827M061O766J1145R792J942l993m692
590A0119n982r005q628m257K642M120O425P494Q139M239r91j726o099q434q025
605i969l713M00O42M461Q319R292M051o78j004k770q264q797m389r35J676L395
621h283N847Q353N581R95j317l204n531o497n298j499N65J115N361P050M543K021
637I802O23m86n359o391n650j616j204N75L717O912N100K046R63Q8l197n326n599
654e002k894l55m21J852N432N226L310J433l57j750m155m629l583j724j589K769
670f437L620M994L285K092R02j092m863l994l294j015j700o6M441M350K921J412
$$ plain form
561 3005 15613 24950 24671 16435 6740 -3667 -14122 -22156 -22864 -17341 -9373 1360 13200 19357
575 19357 19134 16207 10791 1836 -10089 -18565 -18729 -14902 -10841 -4075 7070 16862 18804 14811 10119
590 10119 4137 -4868 -13496 -17753 -15111 -10991 -4566 2928 11067 15306 14315 12589 6490 -1944 -9969
605 -9969 -13682 -13282 -12640 -8179 140 9432 13483 12805 11801 9031 767 -8030 -12419 -13354 -11678 -8283
621 -8283 -2436 5917 11498 12493 11176 7972 2441 -4056 -9354 -10853 -10288 -9173 -3812 3238 7781 9802
637 9802 10425 9939 4580 -1811 -7461 -9077 -10281 -9706 -5989 923 6023 8069 9032 9120 5923 597 -5002
654 -5002 -7896 -8251 -8672 -6820 -1388 3838 7148 8581 8224 6474 2319 -2310 -5893 -7617 -9206 -6437
670 -6437 -2817 2177 5462 7554 8456 7364 2501 -1493 -4787 -5802 -7502 -7568 -3127 1223 4144 5556
686E556J698p59k782l694l738j520n06m53J841M116L173J796J923m61r87l739
702A464l812k235j886J02J571L421L006J877K245J226k486l153k855j531k187
717e233j089K195K071L111J415K316J122j251k694j754k051j890j330P21J669
732b672K884J614J855P51l65j342k616m78k817j143L68J190J698J958J184K389
748D458o20m15j894k163j249k385P0N32K347J514J810J714P00j261j728j650k360
765b580j97r36O74Q10J949K584J787m51n24q83k155j132j810k78m12J549J121
782h84J311K149J035n40j41k765l88j869j236N24N39J158J283J572J415m9j458
799A656K79j579j544k046J082r94J619J619P15J735J03l78n55j120k411p39R3
$$ plain form
686 5556 7254 6495 3713 19 -3719 -5239 -5745 -6198 -4357 -241 2932 4728 6651 6190 5203 1464
702 1464 -2348 -4583 -6469 -6367 -4796 -1375 1631 3508 5753 6979 4493 1340 -1515 -3046 -5233
717 -5233 -6322 -4127 -2056 1055 2470 4786 5908 4657 1963 209 -1842 -3732 -5062 -4341 -2672
732 -2672 212 1826 3681 4432 4067 2725 109 -369 -3186 -4329 -3961 -2771 -1073 885 2069 4458
748 4458 3838 3423 1529 -634 -1883 -4268 -4198 -3666 -1319 195 2005 3719 4419 3158 1430 -220 -2580
765 -2580 -2777 -3713 -3039 -2229 -280 2304 4091 3640 3116 2233 78 -1054 -2864 -3142 -3554 -2005 -884
782 -884 427 2576 3611 3071 2930 165 -223 -2092 -3328 -2804 -2265 -1107 176 1748 3163 3114 1656
799 1656 1935 356 -1188 -3234 -2152 -3146 -1527 92 807 2542 2645 2267 1712 592 -1819 -2558 -2465
816b465O51k10J787O67J214J643q40j204r63j035q61j221O84M33R27J388R19Q00
834B314K96p26j678j196l41j006J31O88P12J318M33J638q29rk5j771p45j969K72
853b493O84J207R93nJ164N74J69j211n40n41j300o92M3J247O81O61J731n56J39
872A955q23P4j161j244k77j68J90N47J955k44P27K2l03q20M93j417j792M80M37
891a369P54Q98j28J107R3J12q13j63j090o54N50j058m0P12J350R09O08r28K4j52
911G22j009p56J34q86J6J211N22J048rN73m88k10m90j059n62p0M04M36R16OQ48
932A297J29np9j005q97j24o57m44J312N21P73O33j81j31o89K30o64q26o90P83
952g14j73L47O41J56N92P87j053J01q75k57j72j14m07J023K31L11K96J85J10m10
$$ plain form
816 -2465 -1814 -2024 -237 430 1644 3287 2447 1243 280 -755 -1616 -2837 -2153 -1720 -793 595 1514 2314
834 2314 2610 1884 206 -990 -1331 -2337 -2206 -1518 -806 512 945 2583 1754 1745 1720 -51 -796 -2765 -2493
853 -2493 -1809 -602 391 386 1550 2124 2293 1082 542 1 -1299 -1991 -1948 -701 -20 641 2372 1816 1955
872 1955 1132 1206 45 -1199 -1476 -1644 -1454 -907 1048 804 1531 1553 1250 430 923 -494 -2286 -1806 -1369
891 -1369 -615 283 155 1262 1355 1467 654 491 -599 -1253 -703 -1761 -1801 -1089 261 1170 1778 850 874 722
911 722 -287 -1043 -909 -1795 -1779 -568 -46 1002 993 1566 1078 868 378 -681 -1243 -1313 -909 -473 443 449 1297
932 1297 1426 1421 1342 337 -560 -684 -1341 -1785 -473 48 821 1454 1273 1142 453 683 19 -807 -1497 -714
952 -714 -887 -540 101 257 849 1636 583 684 -191 -448 -620 -734 -1141 -118 113 424 720 905 1015 605
972F05m33j156M97K98p84j50R82N66k82N72M46m34m46p80K65m52L50r47J43R16
992b24Q46M63l43j74L16n29j190m67K81L94J32l0Q84l16R34n32m33k86N2l71j055
1013a648L12N92O58M0R5P94J93j73r37J185j535m58K93J76Q8R6K29L10L19K68
1033H97l52m29J42m67k4L76n76L64K32K53L50k10j30q86L75J61o34j44P0J8N85
1054b9N21k74P37n37P69q43q90O34n73K34o78J532l91l85L87k40M55n6j44n72
1074c43k93K88m43L8J090n75J131M75r76l80j063P63M2J34P1o05J357l00n76O82
1094E17m93J10k71o82O21k06kk1JJ159n67O42o68K34k18j063O26L05m88O61j25
1115G2l38M49K63l37l02m20J434p95k93J72m40KJ89N33P38r94L13L06m12K18j208
$$ plain form
972 605 172 -984 -487 -189 -973 -1123 -141 425 143 715 1161 727 281 -499 -234 -686 -336 -1283 -1140 -224
992 -224 622 1085 742 568 884 355 -835 -1302 -1021 -627 -495 -525 359 43 977 445 12 -274 -222 -593 -1648
1013 -1648 -1336 -744 -86 -46 49 843 1036 863 -74 1111 -424 -882 -589 -413 -325 -229 0 310 629 897
1033 897 545 116 258 -209 -233 143 -433 -69 163 416 766 556 426 -460 -85 76 -558 -702 -632 -614 -29
1054 -29 492 218 955 418 1187 344 -546 88 -485 -251 -929 603 212 -173 214 -26 429 373 229 -343
1074 -343 -636 -348 -791 -753 337 -238 893 1368 392 12 -1051 -288 -246 -112 -41 -646 711 411 -165 517
1094 517 24 134 -137 -819 -198 -404 -406 -427 -426 733 166 808 140 374 156 -907 -281 24 -464 197 72
1115 72 -266 183 446 109 -193 -613 821 26 -267 -95 -535 -533 -344 189 927 -67 246 552 140 358 -850
1136h50N27j66J91Q00k94L58k70j78M08N06q39j512N39O02R3j04J036p77K46K08
1156E24K12j04o77K49n73J35j56K75o5M05l17P12o78K09K84m84m76P76o94K1K39
1177a83N77o83N06N70o89j93m05k12l12O10N17q52K40L63N76o9k69k85J50L94
1197C51k72j73q4K3o32Q09m97L62P42n8l64K14m84n8J21j92J19M13k63m3k7l9
1219c2l35N67q43N07j058J645m30n75M03L81m98M54l53K17l7l82P18o06l05J04
1239d58N75M8m61L71q40m8J036M2k45j51o42N25q2Q83l81n86Q76m76L43p8j9M46
1261F78j014N41J98j07j82m05P65j1k97L82p24R0n40P70K45J27m04M10o21k93
1281c92Q00k03q31N55M05q27R94q85M78M1k08J7L70j09K74m22M92n15L9j32J93
$$ plain form
1136 -850 -323 -489 -298 502 208 566 296 118 526 1032 193 -1319 -780 -178 -85 -189 847 70 316 524
1156 524 736 632 -45 204 -369 -234 -390 -115 -180 225 -92 620 -58 151 435 -49 -525 251 -443 -422 -183
1177 -183 394 -289 217 787 98 -95 -500 -712 -1024 -414 103 -749 -509 -146 430 361 92 -193 -43 351
1197 351 79 -94 -178 -155 -787 22 -475 -113 629 571 207 421 -63 -121 0 -192 -73 340 77 34 7 -32
1219 -32 -367 200 -643 -136 -1194 451 21 -554 -151 230 -268 186 -167 50 13 -369 349 -257 -562 -458
1239 -458 117 165 -296 75 -765 -813 223 265 20 -131 -773 -248 -330 553 172 -414 462 -14 329 251 232 678
1261 678 -336 205 403 296 114 -291 474 463 166 548 -176 -86 -626 144 389 516 112 522 -99 -392
1281 -392 408 205 -626 -71 334 -493 501 -384 94 135 -73 -56 314 205 479 57 549 34 73 -59 134
1302A34j61N1J27J93n61K16M4K31k50n13N08j47j48l93J319j221Q17o34j36l21
1322h45J341n07N6K24q34J206k04L0n06P29n45K94l78k52L27o8k52M01o05l2J23
1343b97O84m53j72K56J26O4q1j46L16r62R62n10M40n09L3j64k03N58k85K30m60
1364e73P67K61j092N43M95o2K94l61n00kR5L15k98K7L8k02P72n88K07k24N46k98
1386A60l69M46q74J22m94J129j09n77L86n45N58l5O29m21L00n79N32p43R44l3
1406D27p31L49o09N77M87R2l74m44l55N32Q3J7j88m48N30j32j84N58p0m65N53
1427B05r34P54k98N07J99r86P76J40n98R5P99m77j265J133j130J713q75o9Q87
1446E76p39N79j093J358k56m58l24R51m81n99j69J697j73j583J836r09L8l88p4
$$ plain form
1302 134 -27 24 151 344 -217 -1 43 274 24 -489 19 -128 -276 -669 650 -571 246 -388 -524 -845
1322 -845 496 -11 45 269 -565 641 437 467 -39 690 145 439 61 -191 136 68 -184 217 -388 -420 -297
1343 -297 387 -66 -238 18 144 208 127 -19 297 -665 297 -213 227 -282 -249 -413 -616 -58 -343 -113 -573
1364 -573 194 455 -637 -94 401 339 633 272 -228 -230 -135 180 -118 -91 -53 -255 517 -71 136 -88 458 160
1386 160 -209 237 -637 -515 -1009 120 11 -566 -180 -725 -167 -202 427 6 306 -273 259 -484 460 427
1406 427 -304 45 -564 13 500 592 218 -226 -581 -49 34 51 -137 -585 -55 -187 -371 187 117 -348 205
1427 205 -729 25 -273 234 433 -553 223 363 -235 -140 659 182 -1083 50 -1080 633 -242 -311 576
1446 576 -163 416 -677 681 425 -33 -357 594 113 -486 -655 1042 869 -714 1122 213 251 -137 -211
1465b11q31L88R51m66o39Q82J60m06r3m49R03K58l24k23p0K59l27M00O4J80n64
1486a58j58J110j281k4N35R3n13J011j082N19kK31n2p22M01L57k53L61m77n05
1506f09o2k48J213l01k67J80j31R16n79L69L2l38j002Q73L07q00K92O43j021J033
1526E00n64O82J99j362O86k68p82O87M60k95M58j19l75O97l50M7J69k65Q2n20
1546b33M34K34k42M30r18J85L22r21J95N19J50K17m08m31N54n6n64O68k75R3K90
1567B43q37P42M14k14m91N60j93K89o53K18p8j30M40O87p85M97j172L82K35n88
1587d34L85j06O57m86K77k91L07n01K89R6m82N43m55l14J60O00j86N75m69j68
1607cK40p28P86m18K86o84K03J5R02P4p17m82Q60m90J08k52L48m37K45L44o6n82
$$ plain form
1465 -211 -1042 -654 297 -169 -808 74 234 -172 -265 -714 189 447 123 -100 -170 89 -238 162 226 406 -158
1486 -158 -316 794 -487 -511 24 117 -396 615 -467 52 50 281 229 -493 -92 265 12 373 -104 -609
1506 -609 -671 -919 294 -7 -274 -94 -225 691 112 481 513 175 -827 46 353 -447 -155 488 -533 500
1526 500 -64 618 817 -545 141 -127 -909 -222 238 -57 401 282 -93 604 254 301 470 205 287 -233
1546 -233 201 435 193 623 -295 -110 212 -709 -514 5 155 372 -36 -467 87 31 -533 135 -140 -47 243
1567 243 -594 148 562 348 -143 417 224 513 -140 78 0 -130 310 997 212 709 -463 -81 154 -434
1587 -434 -49 -155 502 16 293 2 309 -192 97 193 -289 254 -201 -515 -355 245 59 634 165 -3
1607 -3 237 -491 295 -123 163 -521 -318 -303 599 673 -44 -526 334 -156 -48 -300 48 -389 -144 200 134 -448
1629d48J14K77j4N79n23k86MK84L34n72J88j87m95j79R56q0M16j28j16n96O34
1650A62M12j32k14m96R6L03O98r96j02J58n7M8J27N08o85K36L73n35K82l15K2
1671a07p9L80l66K21K35r35P10j58L46o16N86K26r47M08K80j80K61o12J85L54
1691A92p94L38K44k68j13K88o85J104J0m18j13j176J870j325J024J11o93N48r0
1710E4J9k83N19j98o43J95M35o71Q12q70P12j72K1m0O42m68P9o10N5N35J4j75
1732c8m59Q91n99P05o34J03m4l18K70K18k04K86o0k65j93P35l77M35m76J1j25
1753a38k1j99N35q6j255P64P74k73n32M21N25k34o3p33K74l3R72q82K54k05j16
1774b51J89Q4l05M92K92j00j61k44p6J95J1lo60K97K15l09J90j58k50N45L67l89
$$ plain form
1629 -448 -334 -57 -71 508 -15 -301 -297 -13 321 -251 -63 -250 -745 -924 32 -48 368 240 124 -472 162
1650 162 574 442 228 -268 -172 131 829 -167 -269 -111 -168 -120 7 515 -170 66 439 -96 186 -129 -107
1671 -107 -186 194 -172 49 284 -651 59 -99 247 -369 217 443 -504 -96 184 4 265 -347 -162 192
1691 192 -602 -264 -20 -288 -401 -113 -798 306 316 -102 -215 -1391 479 -846 178 289 -404 144 54
1710 54 73 -210 309 111 -532 -337 98 -573 239 -631 81 -91 -70 -110 532 64 143 -467 -412 123 137 -38
1732 -38 -497 394 -205 500 -134 -31 -75 -393 -123 95 -109 177 117 -148 -341 394 17 452 -24 -13 -138
1753 -138 -159 -358 177 91 -1164 -400 374 101 -431 -10 515 281 218 -515 -241 -274 698 -184 70 -135 -251
1774 -251 -62 22 -283 209 501 401 240 -4 -80 115 126 123 -537 -240 -25 -334 -144 -302 -552 -7 360 -29
1796b9J15J00k20r9j44J05k71R80q7r49O48J8k94K95P6o31P01p52o4N20n30j3
1818e25J06K52q5N98k59l05m19L30J29j86J149m90n53Q05n46K89j250O08rK2O54
1839C15o58K87J64L26j058J154o33k4m17K14N46L51l12o47N49j10J49l55M44o53
1859c68k31Q57l10K61L44m03o27N22K29j72j90J62J62L49j61m37L08n76L37Q8
1879A44l73P47k55n23m63J250m81L35p40P76n62p73O16j68O75j67L02L59n71j12
1899A6p8K79r2l22K14L13j43j70o92J274l21k11j80R6j33N4J30j0K73j55l60N29
1921C11l55L99j41k44l30O4k29N62L4K22n21P68l5k20m72j21L2J37l2O88j069
1942e52P26m05O86M73r07j55k95k10O49l21N95k34k58O0l16N45n52L70j96j53
$$ plain form
1796 -29 86 186 -34 -133 -277 -172 -443 537 450 -499 149 167 -127 168 244 -387 314 -438 -502 18 -512 -525
1818 -525 -419 -167 -252 346 87 -218 -637 -307 -178 -364 785 295 -258 547 1 290 -960 -352 -361 -339 315
1839 315 -343 -56 108 434 -624 530 -103 -127 -544 -330 216 567 255 -392 157 47 196 -159 285 -368
1859 -368 -599 258 -52 209 553 150 -477 45 274 102 -88 74 236 585 424 -13 295 -281 56 144
1879 144 -229 518 263 -260 -723 527 46 381 -359 417 -145 -918 -302 -470 205 38 340 699 128 16
1899 16 -62 217 125 -197 17 330 187 17 -675 599 278 67 -113 -17 -150 -96 34 24 297 142 -218 311
1921 311 -44 355 214 -30 -360 -296 -525 37 71 293 -228 540 505 285 -187 -308 -276 -139 -171 517 -552
1942 -552 174 -231 455 928 21 -134 -429 -639 10 -311 284 50 -208 -148 -464 81 -471 -101 -297 -450
1962d50J53Q18n14j08k23O22o3K65k62M9k44K89r5k95M50m05M9m52p4P76n06J2
1984b08l7j62L65j64N11n49Kn33Q83lJ94j56k60q9K65K96q33N16k40J85K06k65
2006g6l65m7K20K85o08k6K55L9L04j74J20J95N69p34J97l18l63N05l26K09K70
2027A31k58J81k03K5K56L94l53k14J15M75o58J97l05O86q71O13N3l33N60m25j22
2048e6N09k69l95N30k50J20l90J35L70J63q66k14P24Q9P8j40o0J55J31r41M60
2069a17N12k02m88Q67o16O12m27n75M42Q7j1K82l91J78O9Q77q59j77O98n54m60
2090b53j54j86L6R80m01N1l82M88K83q46K66k76K61K51j6m0p2J93m57N08m44J33
2112g7M87r5l03P82l38r5n99P53p31O1o3J88P48n43o52P24r9J38k51N69m56j74
$$ plain form
1962 -450 -297 521 7 -101 -324 298 235 500 238 287 43 332 237 -58 392 -13 36 -416 -490 286 -220 -208
1984 -208 -245 -407 -42 -206 305 -244 -242 -775 108 105 299 143 -117 -206 59 355 -478 38 -202 -17 189 -76
2006 -76 -441 -488 -268 17 -591 -617 -362 -323 -19 -193 -73 122 691 -43 154 -164 -527 -22 -348 -139 131
2027 131 -127 54 -149 -124 132 526 173 -41 74 549 -109 88 -217 469 -402 211 264 -69 491 66 -56
2048 -56 453 184 -211 319 69 189 -201 -66 304 467 -399 -613 111 200 278 138 78 233 364 -577 -117
2069 -117 395 193 -295 572 -44 568 141 -434 8 95 84 366 -25 153 222 1099 240 63 761 207 -253
2090 -253 -407 -593 -557 423 22 73 -309 179 462 -384 -118 -394 -133 118 102 62 -10 183 -274 234 -210 -77
2112 -77 410 315 12 794 456 361 -238 515 -216 -155 -218 -30 718 175 -477 247 148 286 35 604 148 -26
2134b6j10J63l01K6P54l72Q16n92q98L84M33L02j139P48o86P47R2j0j45l7k44
2155i5L76j89o89P76p50J248l77m01o86J064k51P7M0K65j14j34p07N01K00j29
2175B5j61j65n8J65L45K29m84L15l6l63M09l38j18n8m48J22P56J44m70J70K42
2196B23j23l96L23R9j11j18O42m66p6K32m35J42k1J78j30l59M06P52j003L05L74
2217D38l69k39j29Q82l69j23l7n66J116j06j083J296o09l66q3P25L95m02m41P
2237f3J94m94K63N71n95Q4j37J28L37L97r38j99O43o20M50j38M85m82N33k39k26
2258d6P48n37k77K25J62m17k82l11M01L72Ok20J90nj22L35k58K19l5n62L58q7
2280a43k40J77M61k20o27O28J41m08J01J25J52J29M50p76K34j93K7n88J82K83
$$ plain form
2134 -26 -136 27 -274 -248 506 134 950 358 -540 -156 277 579 -560 188 -498 249 341 331 186 149 -95
2155 -95 281 92 -597 179 -571 677 300 -101 -787 277 26 103 143 408 294 160 -547 -46 154 25
2175 25 -136 -301 -359 -194 151 380 -104 211 175 -188 221 -117 -235 -293 -741 -619 137 281 -189 -19 223
2196 223 100 -296 27 126 15 -103 539 73 -3 229 -206 -64 -85 93 -37 -396 10 762 -241 64 438
2217 438 69 -170 -299 583 214 91 54 -512 604 498 -585 711 102 -264 -347 378 773 371 -70 -63
2237 -63 131 -363 -100 471 -124 -40 -177 -49 288 685 -253 -452 191 -429 21 -117 368 -114 419 180 -46
2258 -46 702 165 -112 113 275 -142 -424 -735 -334 38 44 -176 14 9 -113 222 -36 183 148 -414 -56 -143
2280 -143 -383 -206 255 35 -592 36 177 -231 -130 -5 147 276 726 -50 184 -9 18 -570 -388 -105
2300a05K24P7l09jl39N53m6K9p09P98m92R16j064M78r7J85k70n3J73j87L55n30
2322d14M08r5J59P1l94M14p4o50O97k45M2J4Qk42q8K21p3O53J83j022j70P69J052
2345A224j050m24P67r95J072o78L19P7j44o33L36N02m10r94J300J8l1p78L6P88
2365C02m48P4K70k65L87l43K24r0l10p7M20j91M1N9L07m95m27N82l89Q50p21M7
2387a93r8M76L47l13k05O35k77p08K15kM52j099L64K25J71q4O06q33K39l86j13
2408e81M08N23P6n13o3On6Q34m34n9p6J99N0j98j67n69O51j14L74K37q03L98n86
2431d63M76k58K03K1k75K99r19J52J194Oj04k45K1p77J033n83J074j163N44k84
2451d8J20K39K10o22j27L88J06N4m88N57m6P0l16J51o18M26m22N82k90K46j91
$$ plain form
2300 -105 119 196 -113 -114 -453 100 54 83 -626 172 -320 596 -468 10 -87 98 -172 -225 -52 -239 116 -414
2322 -414 -6 -101 58 129 -265 149 75 -575 122 -123 -81 -67 -59 -301 -389 -168 -241 412 595 -427 -597 172 1224
2345 1224 174 -250 517 -478 594 -84 235 312 168 -465 -129 373 -37 -1031 269 287 256 -522 -486 302
2365 302 -146 -72 198 -67 320 -23 201 111 -199 -276 144 -47 -6 53 360 -135 -562 20 -369 481 -240 -193
2387 -193 -291 185 532 219 14 649 372 -336 -121 -123 329 -770 -406 -181 -10 -94 512 -321 -82 -468 -581
2408 -581 -173 350 426 -87 -150 -144 -200 634 200 141 65 264 314 116 -51 -620 31 -83 291 528 -275 123 -463
2431 -463 13 -245 -42 -21 -296 3 -916 -764 430 436 332 87 108 -669 364 -219 855 -308 236 -48
2451 -48 72 311 521 -101 -228 160 266 320 -168 389 343 413 97 248 -370 56 -366 216 -74 172 -19
2472a9M06m35m40J40L42l22P48m46m43N09O04m39l63M50m11K45Q7n64N05l52L34
2493A36n23J81M45%K96r03J57nK99K68j29k73j06K67l49K43l99P7L75%n29M91
2515A9M83l70Ll14m90N59O2P01j487K15M57j39k86L79Qm30O84K30n18R2n19Q26
2537A65J31o98J57p2p0L65RM70p58O55m57J1M11K45m58Rn27Q45n81p7O13l56K46
2560B78n51j70R35m25m91P39q39N23L28j234N78K95j56L98M86p61N14j169J107
2579C85n8j81j36l28lP71k42k70Kk84O57J74r2m72k94Q11j3p79j54O51q07K92
2601c70%Q03n03O6j35P99j101J90N81J70K36l58p17L9r0J20J91M23m02M88j059
2622f29L38O61l97K09k04k80k76L85j37N14J47j80r2M54r98J246j019k80nO76
$$ plain form
2472 -19 387 -48 -488 -348 -6 -328 420 -26 -469 40 644 205 -158 292 -119 126 213 -351 154 -198 136
2493 136 -387 -206 239 239 535 -368 -211 -216 83 351 222 -51 -157 110 -239 4 -395 -318 57 57 -472 19
2515 19 502 132 135 -179 -669 -110 -48 653 -834 -619 -162 -301 -587 -208 -200 -630 54 284 -234 -142 -661 165
2537 165 296 -402 -245 -317 -387 -22 -13 457 -301 354 -103 -92 319 564 106 115 -412 433 -148 -225 388 32 278
2560 278 -273 -443 492 67 -424 315 -524 -1 327 -907 -329 -34 -190 208 694 -67 447 -722 385
2579 385 327 146 10 -318 -321 450 208 -62 -60 -344 313 487 395 -77 -371 440 427 -352 -506 145 -662 -370
2601 -370 -370 433 -70 -4 -139 660 -441 -251 330 500 736 378 -339 -300 -390 -270 -79 344 -58 430 -629
2622 -629 -291 370 -27 182 -22 -302 -578 -193 -330 184 331 151 59 513 -485 761 -258 -538 -543 133
2642A33L5r44J319p72J31K70M94j267L18O82m25k51j33J14J02L30LjO88l83m70
2663b7N4M76m81j47o12L31J42L92L1N12j080O63p47J71M29n00O24N6l52L1J36
2684A02p84P27k00K68o37K77Q14n40L19k12N5Q3q66o53J523n05Q49j070M61k51
2704b40J07J81R2p59J329r86j0j80J63K34K62j65j84P20o42K05k77O8m6L87j34
2725A25K16r93L02O55m0K6k77n11j57O08l63L47j66l19P89l76L80K47l79j77r9
2746a62j92R28k48k60K70n36J056p42n84N07K55m60J92N05k13m47j54L08n07L87
2766i7l54Q61n62J56j07n7J61Q2K89o25M12Qq37M98M66m70P4l40K36j93J226m99
2788C28o79J260j014Nl67J4K58J03l85M93J23l49P73o32N61k94r8j118J024k56
$$ plain form
2642 133 168 -776 543 -229 -98 172 666 -601 -283 399 -26 -277 -410 -296 -194 136 139 138 826 443 -27
2663 -27 27 503 22 -125 -737 -406 -264 128 159 671 -409 254 -493 -322 107 -393 231 287 -65 -34 102
2684 102 -682 45 -155 113 -524 -247 567 27 346 134 189 272 -594 -1247 276 -229 620 -450 11 -240
2704 -240 -133 48 140 -619 710 -276 -286 -466 -303 -69 193 28 -156 564 -78 127 -150 -82 -128 259 125
2725 125 341 -652 -350 305 265 291 14 -497 -654 -46 -409 -62 -228 -547 242 -134 246 493 114 -63 -162
2746 -162 -354 574 326 66 336 -200 856 114 -470 37 292 -168 24 529 316 -131 -285 23 -484 -97
2766 -97 -451 410 -152 4 -103 -160 1 83 372 -253 159 167 -670 -172 294 -176 -102 -442 -206 -399 827 328
2788 328 -351 909 -105 -100 -467 -453 -195 -92 -477 16 139 -210 563 -69 492 198 100 -1018 6 -250
2808b50K95L0K77Q4l82K36j290J170K48l11m8L56m7j85N66m42k96L6n78N07K79
2829B55m1n22J01M33k2m55K72M56p41k86J178k25p74K70l24L84j41K27j64k45
2849c64K85O48r62K44Q15o48R9m59M73J20o20K57l16O07k55K85n09M95j33L58
2869D20q48P40l78Q9M68n27R6o12l3P27r0J92m37l93M50L72l95L64M34k96k59
2890H4j19J30l57Nm22J176k76n56J96Q20m15L6j08Q0L73l99o11K05K62n59R57
2911E02q29Q39m51J06o27N07o09P81l83N87o15N76j79j82O1K14p11k70R92j08
2931B01m47J29n14O43J03K3l34O1m69O61k35K09j03L83m26j78%J14J176j316L1
2952b88K41K08n05Q1J73K32K79o40P94j222N34J6K45k91M47j12k14j85L38R7m49
$$ plain form
2808 -250 45 75 352 436 54 290 -1000 170 418 107 59 415 368 183 749 307 11 47 -531 -24 255
2829 255 214 -308 -207 226 204 -251 21 477 -264 -550 628 403 -371 -101 -425 -41 -182 45 -119 -364
2849 -364 -79 569 -393 -149 666 18 117 -342 131 251 -369 -112 -428 179 -76 209 -300 195 62 420
2869 420 -428 312 -66 23 491 -36 60 -552 -585 142 52 244 -193 -586 -136 236 -159 205 639 343 84
2890 84 -35 95 -262 -257 -679 497 221 -335 -139 681 266 302 194 274 647 248 -363 -158 104 -455 502
2911 502 -327 512 61 167 -460 47 -562 219 -164 423 -192 384 205 23 84 298 -413 -683 309 201
2931 201 -246 -117 -631 12 115 138 -196 -135 -604 57 -178 31 -72 311 -115 -293 -293 -179 997 -319 -288
2952 -288 -47 161 -344 -263 -90 142 421 -219 575 -647 -113 -97 148 -143 304 192 -22 -207 131 228 -221
2973b21J4O57o79J47m07K83O37k30K58l64j70P36j043N23n24J049q75J63M17M3
2993D14n12l0J001j333R35m94l02N10p1pm05O6M04K35o3j78K31M52n53m51N59
3014D08r82M86l99M49M6j40K84l98K75l90L52J19n08P41j21K64n81l55j29R85
3034D06o47J79k55M14n04l43K7J79Q88p25L96l2K05m70O20n20J18j16J039j111
3054b52J012o87K18n9n47L31m53P96m13m62N07j49J17n18L53N21n99M12j87q67
3074i26J410l95j69N38o92M00q0N15r88N63j34K45m4J39j78j345R39N05n56L39
3094H6j9M46m62L86p47K65P98p69L56l51O0J47n67P29j9k50J38L12r43K71N9n06
3116e80N64j57k68N68j02j74M04n79k66J069m30l44l97J625k15n16j259J286o93
$$ plain form
2973 -221 -207 450 -229 -82 -489 -206 431 201 459 95 -75 661 -382 141 -383 666 -209 -46 371 414
2993 414 -98 -128 873 -460 475 -19 -321 189 118 111 -294 -228 176 411 348 170 401 853 300 -151 408
3014 408 -574 -88 -487 -38 8 -132 152 -246 29 -361 -9 110 -398 343 222 486 -95 -450 -579 406
3034 406 -241 -62 -317 97 -407 -750 -723 -544 344 -381 15 -17 188 -282 338 -182 -64 -180 859 -252
3054 -252 760 73 291 232 -315 16 -437 359 -54 -516 -9 -158 -41 -559 -206 315 -284 128 -59 -926
3074 -926 484 89 -80 458 -234 166 86 601 -387 176 42 287 243 382 204 -1141 -202 303 -253 86
3094 86 67 513 51 437 -310 -45 753 -16 340 -11 49 196 -371 358 339 89 227 539 -404 -133 -74 -580
3116 -580 -16 -173 -441 127 25 -149 255 -324 -590 479 49 -295 -692 933 718 202 -1057 229 -464
3135d64J33r3K55L30r9J89n86M65q64N26j41L75k84L46K11l77q2Q8M0j85K6M02
3157B11j18n37K24P1j90K9P71r28L29J20J84j85j99M78K86m14j76j92L53j39L07
3178B85n73P16k45j45l23K92l0n43M64L1L00J63l73N63q57K84N1k47M14o27M42
3199D2j68r8L03Q1L69q31L09k18k06P42j40m49O17p02J75K69L02J8n0j34k65k13
3221b47l15P10k90L11j45K62j95K29J65jk70M86j053P26j25n19Q4L42k95P3l04
3242c71O34K01l60l58Q64j77l03j9p9j62RJ03l46P48j82l50R14r30j87M55j01
3263Ck6K3PK13J33m08O78j6k39o76O59m94O07n41O78q09l40P42j91K4n00J12R26
3286E65k54J3l79M20m94k69M33L4k36L34L68o72o2J13O86j164P26n66l7K70L0
$$ plain form
3135 -464 -331 -424 -169 161 62 251 -335 130 -734 -208 -349 26 -258 88 299 -78 -160 -72 -32 -217 -191 211
3157 211 93 -444 -220 -149 -339 -310 461 -467 -138 -18 166 -19 -218 260 546 132 -44 -236 117 -22 285
3178 285 -288 428 183 38 -285 7 -23 -566 -102 -71 229 392 19 582 -275 9 60 -187 227 -400 42
3199 42 -126 -224 79 160 529 -302 7 -211 -417 325 185 -264 353 -349 -174 95 397 415 365 231 -34 -247
3221 -247 -562 148 -142 169 24 286 91 320 485 484 214 700 -353 373 248 -271 -187 155 -140 -67 -371
3242 -371 263 464 104 -254 610 433 130 111 32 -130 -121 -18 -364 384 202 -148 766 -164 -351 104 3
3263 3 -23 0 7 220 353 -55 623 607 368 -308 351 -143 464 -77 601 -208 -548 194 3 27 -473 -361 565
3286 565 311 324 -55 365 -129 -398 35 69 -167 167 535 -137 -199 -86 600 -564 162 -404 -441 -171 -141
3307a41J45J1L67j48n33m9K08L38J2p77O69k3O10q57m25M45L17k30j84O24k25
3328A54J64p7P1o62J60O09j15M63r82O79o8R0m78j76m3P29j91j85q6m35q4l86
3350h49J014l2j02J16L28j117N54K47J71l29O43l78K06J21j18o35NQ91j153N26
3370A09j77J49P1k39J18j12l09L2j8K61j47m0J5P58j098J79J533r71n13R44p30
3391a85Q7L94n31M10k90K4l47J12j8K54L30k06n64Q84j129P97K8q60J426m72O37
3412G81o26n84P62o31Q59k74p05J92M15p69K73L95q88J247l93k14K13J28m22L28
3432H7k44P62q27M64j27l14L59k73L97J70K67j095j16O36l76L38n14L25k47P24
3452C96j228O44J93m74M09j71O37lOk35K1j132M07N47k74J96J09j71O36q38K97
$$ plain form
3307 -141 4 15 382 234 -299 -348 -140 198 210 -567 102 79 689 -168 -593 -148 169 -61 -245 379 154
3328 154 318 241 312 -350 -190 419 304 767 -215 464 396 486 8 -168 -211 518 327 142 56 -379 -463 -849
3350 -849 165 133 31 147 475 -642 -88 159 330 1 644 266 472 593 475 -160 -155 736 -417 109
3370 109 -68 81 152 -87 31 -81 -390 -358 -376 -115 -262 -302 -287 471 -627 -448 1085 114 -399 545 -185
3391 -185 -98 296 -235 175 -115 -91 -438 -326 -344 -90 240 34 -530 354 -775 22 50 -810 616 144 781
3412 781 155 -429 333 -298 561 287 -418 -226 189 -580 -307 88 -800 447 54 -160 53 181 -241 87
3432 87 -157 605 -222 242 115 -199 160 -113 284 454 721 -374 -490 146 -230 108 -406 -81 -328 396
3452 396 -832 -188 5 -469 -60 -231 406 403 409 174 195 -937 -530 17 -257 -61 48 -123 513 -325 -28
3473b8j24j98k7R72n00k72M55j19N21q00O6K54J33p93O67K40l03r6m08M49k08
3494a19K67l85M85k20N36r99k32N05j15K94O70n11p5q2j26n7J35j7N73p50J090
3515H67j033p5k50M38j18Q71n07J03K36K30j003O79q12N76m08O19j86k66M73n97
3535a63P71q24K85o02O07p4K53k80L11k47Q08m36n83J17N04m45J2l04n4J71K02
3556B9p66P14k05M02J00p0q51M29M07L15m26N6J57p40K31O15m13l3Pq0M68k72
3578G4J67n27K99K27M22r27O13p67P55l80Q11r01q19R91O20p91P10m91J38m33
3598b09R6J83K35j24j047J450n63j73J47M69j10j46l56J71K18l93O99j014R2M85
3618A10l70J33L32O1K02n50k55M00j42r1j61J6N4j29Q11p94M30l8J28N68r00K95
$$ plain form
3473 -28 -152 -350 -377 595 95 -177 278 159 680 -120 -54 200 333 -460 207 447 144 48 -360 89 -119
3494 -119 148 -237 248 28 564 -435 -667 -162 -277 17 687 176 101 19 -107 -164 -29 -46 527 -223 867
3515 867 -166 -241 -491 -53 -171 700 193 296 532 762 -241 438 -374 202 -206 413 227 -39 434 -163
3535 -163 608 -216 69 -533 74 0 253 -27 284 37 845 409 -174 -57 447 2 14 -290 -344 -173 29
3556 29 -737 -23 -228 174 274 204 -647 -218 189 504 78 134 291 -449 -218 397 -16 -49 -42 -122 346 74
3578 74 241 -286 13 240 662 -265 348 -419 336 -44 767 -134 -953 38 658 -133 577 86 224 -209
3598 -209 -113 70 305 181 -866 584 21 -152 -5 464 354 208 -148 23 241 -152 547 -467 -375 110
3618 110 -260 -127 205 266 468 -82 -337 63 -79 -170 -331 -315 -261 -390 421 -373 57 19 147 715 -185 110
3640A10J62o54n07l6J662o92K11l25M87l82k90J82K92o05K76J18m20R21l49M35
3660E96m43L47o85J01m3L73l23J79k28L65j48r8M87j71j29J6n21R9k38LJ83K38
3682d0m95O73j51J47l28L66J03j50M47j115O03m8J83q57O7K12O01m54j00Q73p41
3703b04O17p95L5j9q2Q04o2m87M54j069R48J32M1n13j65L70k41N47J49k78N5q69
3725f32Q81k04P3K40l17J0M31m56l4K69R7j40o50L84p83J059j95o34J301n49m08
3746b57j50Q23k70n05k7j00L08j6k49k01J298l28l94J72m22J48L51m01Q71q79
3766b28K14r3J83k01l81K85J45J29k27J03l87K95l55K20p1N75k45O35m72m18O6
3787b28K00q7k29K28m83N37L75o84J56K9l21P60q22Q24K1l42n63L71J032j153
$$ plain form
3640 110 272 -382 -889 -925 737 45 256 -69 418 36 -254 -72 220 -385 -109 9 -411 510 161 596
3660 596 153 500 -185 -84 -127 246 -77 102 -126 239 91 -7 480 309 180 196 -325 -226 -464 -461 -278 -40
3682 -40 -535 138 -13 134 -194 172 275 125 572 -543 60 12 195 -662 -595 -383 218 -236 -336 537 -204
3703 -204 413 -382 -347 -366 -448 356 294 -193 261 -808 140 272 313 -200 -365 5 -236 311 460 182 237 -632
3725 -632 249 45 118 358 41 51 482 26 -8 261 358 218 -432 -48 -831 228 33 -601 700 151 -257
3746 -257 -407 416 146 -359 -386 -486 -178 -194 -443 -644 654 326 -68 104 -318 -170 181 -220 651 -228
3766 -228 -14 -107 76 -125 -506 -221 -76 53 -174 -71 -458 -163 -518 -298 -369 206 -39 596 124 -294 -228
3787 -228 -28 -115 -344 -116 -599 -62 313 -371 -215 -186 -507 253 -569 255 276 -66 -629 -258 774 -379
3807c79P01l61k17N9l9j53O46j11j58N75o42O31o07J28j19l62M97j67o39O99K67
3828B49n52L29l23L42m89J09K62r1nK29l01J91J83J42R2M98j268l92Q63k30l27
3849d89J52m49L67M59N21l01l98M18p47O80j081P39M10r8m7n8m31k70L20J31J17
3870e5k25j15O97O79q56N2J02p54N55j115N03J37Q39j258M75L62l20M01L76m16
3890F4J70R1l44K49m41L21J84l46L65o6J3p62J23n0J19l71MO67J00p5n69J96L44
3913a4Q4k6nLM05q62N18Q10j276O88o04l28N81K17k71O01k26m72J208o60j02O0
3935C29j31k98L3J40J6o7j28m4J079j053j8J53o01Q50n13N61l66N4K26o21N09
3956A10J91n40K88l5j60K0o6K5J67l69Q50j171J025q36N36J04M8R7j47o58N83
$$ plain form
3807 -379 322 -39 -256 -197 -236 -389 257 146 -12 563 -79 552 -55 73 -46 -408 89 -78 -717 -18 249
3828 249 -303 26 -297 45 -444 -335 -73 -164 -169 60 -241 -50 133 275 367 865 -403 -795 68 -162 -489
3849 -489 -337 -786 -419 40 561 260 -138 280 -467 213 -868 -129 281 183 136 78 -353 -623 -303 -172 -55
3870 -55 -280 -395 302 981 125 177 279 -475 80 -1035 -532 -395 444 -814 -339 23 -297 104 480 64
3890 64 234 325 -19 230 -211 110 294 -52 313 247 260 -502 -379 -429 -310 -681 -677 -10 90 15 -554 -358 -14
3913 -14 70 44 39 42 447 -415 103 913 -363 325 -279 -607 -26 191 -80 521 295 -177 1031 371 269 329
3935 329 198 -100 -67 73 89 22 -106 -150 929 -124 -142 11 -590 260 -253 308 -58 -4 222 -399 110
3956 110 301 -239 49 14 -146 -126 -192 -167 0 -369 481 -690 335 -501 35 139 187 284 137 -521 62
3977F2L13O7n24k74R57n76L47l58n30K2N56l49L38o7J60j87J72j37j49M32j27
3998A48m11L18m27O81m85l97P40k88O52j014L45K56o48N72J27P7rm71M97q9n3
4019A21M37k42n42n4M81k3M25o07j75j00J98m98Q05n77P85p27l18P64L61m10N3
4040A57l71Q47q39Q3j80O5K21K81q12M95k59J74r0O16o01K35k22M2P92r99L94
4061B9o63N67k80O74j134R48K12K70r90k0K42k64L91J36o06J72L3M43J56m33J26
4082In34M55j73M96p5m09M58j66M14k83j41J09j9N38l28m41P8r7n09J105k48l51
4104a12K51q49J46N94N5r3m00P69m37j41L66N2j99j65J73J95p69O68k75J49M17
4125C95r28L84k51N56K76j9r3K98j96j53k00m14L4j27J64L44L8k76m16Q03l24
$$ plain form
3977 62 375 442 -82 -356 601 25 372 14 -516 -494 62 -287 51 -16 144 -43 129 -8 -157 275 148
3998 148 -263 55 -372 309 -176 -573 167 -121 531 -483 -138 118 -530 42 169 246 237 -234 263 174 121
4019 121 558 316 -226 -280 201 178 603 -4 -179 -279 -81 -579 226 -351 434 -293 -611 153 514 104 157
4040 157 -214 633 -206 -123 -303 -238 -17 264 -548 -53 -312 -138 -228 388 -213 22 -200 -158 634 -365 29
4061 29 -634 -67 -347 327 -807 141 353 623 -367 -387 -145 -409 -18 118 -488 -316 -283 160 316 -117 9
4082 9 -525 -70 -243 253 178 -231 227 61 475 192 51 160 141 679 351 -90 -12 -109 -618 487 239 -112
4104 -112 139 -710 -564 30 85 -8 -408 361 -76 -217 149 201 2 -163 10 205 -564 104 -171 -22 395
4125 395 -533 -149 -400 156 432 413 320 618 422 269 69 -345 -311 -438 -274 70 108 -168 -584 219 -105
4146a05L89l18K48k77J80Q1N1J70j92J31o4K57r1k68R3K5j42M26o28P16j015k67
4168f00Q88q8m23m00j75J298m73m44M42J91k07J05j87l32Q23j47m50P9M06o94
4188c88K82M02j059N08O35P9n81L44J57m06l61J211j186N33j21o6j90M14k94l53
4208d40P29j00m87L0k55L55l76O05R22n92r53P86n75P3N86K41p22J16j56l00J062
4229E49q64Q41n8j468M49Q67p60O01m85j24M47l32M98j71j48K16N0J77r15N02
4249a28p3L41j77M11o09N13r08O31P93m99l83L70j12j11K11j35n86M02j50R14
4269G15k87k45L53p09O35l96r41Q90L91m70j1L07k53J6J70l51K89l46J64K21m42
4290c00L66o8l0K20q3L43j003O65o5m11J92K44N9j81P3R45p3q57l3J53o32O27
$$ plain form
4146 -105 284 -34 214 -63 117 198 249 419 227 358 294 551 460 192 285 310 168 594 -34 682 -333 -600
4168 -600 288 200 -223 -623 -798 500 27 -417 25 216 9 114 -73 -405 418 271 -179 -100 306 -388
4188 -388 -106 296 -763 -255 380 459 -122 222 379 -27 -388 823 -363 170 49 -17 -207 207 -87 -440
4208 -440 289 189 -298 -268 -523 -168 -544 61 983 391 -562 224 -351 -278 308 549 -173 -57 -213 -513 549
4229 549 -315 526 468 -1000 -551 316 -444 157 -328 -452 -5 -337 161 -10 -158 58 108 285 -630 -128
4249 -128 -201 140 -37 374 -235 278 -630 1 794 295 -88 282 170 59 270 135 -451 -49 -199 715
4269 715 428 183 536 -173 462 66 -875 15 406 -64 -75 232 -21 -5 165 -186 103 -243 -79 142 -300
4290 -300 66 -2 -32 188 105 448 -555 110 45 -366 -174 70 129 -52 21 966 893 36 3 156 -476 151
4312A51l76L3k35K06P6K16k4j88q2K17N26j071L28k17L18M11q44K05J76j62r0
4333d26J147k57l23o87N97j68Q6k69L93l14r1J077j124J37j50Q44j93m13N99n69
4353a04q2M66k02l45k50qQ05J49m39k77L09J00m83k30L82K86k73m0M76k88k85
4374c33N37L26n63L61p07L4L31m03J89Q10p15J6K36M80n25k46J37q9L31m57J90
4395f0q61J111k22p8Q9Lj012J125l5m9L4n64N78m18M10K0m20N93M11r44k42k43
4417g74R96j51n17J76O45p7k55j93r2M19K22mj111L39k44M05J15L99J88l20j23
4438D3m14p4M46j95L56m07M41o52J367j095K26o65N80K98n13Q08m99J58l4M5j15
4459A05O1n1Q8P60q45L95M1k25l13N2o47P12m16R17k98J98p73P61j43m76n2n92
$$ plain form
4312 151 -225 -192 -427 -221 -145 71 47 -141 -223 -6 520 -551 -223 -440 -122 289 -555 -350 -174 -336 -426
4333 -426 721 464 141 -546 51 -117 -31 -300 93 -221 -312 765 -359 -222 -372 472 279 -134 465 -104
4353 -104 -186 280 78 -267 -517 -525 280 429 -10 -287 22 122 -361 -591 -209 77 -196 -236 240 -48 -333
4374 -333 204 530 -33 328 -379 -345 -14 -417 -228 582 -133 -117 119 599 74 -172 -35 -124 207 -250 -60
4395 -60 -921 190 -32 -110 -21 -18 -1030 95 60 11 45 -519 59 -359 51 71 -349 244 655 -289 -531 -774
4417 -774 222 71 -446 -270 375 298 43 -150 -242 177 399 395 -716 -377 -621 -216 -101 298 486 166 43
4438 43 -371 -445 1 -194 162 -245 196 -456 911 -184 42 -623 -43 255 -258 550 51 209 175 220 105
4459 105 166 115 203 963 118 513 554 329 16 68 -579 133 -283 634 336 534 -239 522 379 -97 -149 -741
4481g41L87J94N54m71K11j47L50l33l54L81lj87K09j0J95n96M21l50O88p58m4
4502d04M84j4k13j60J47j51l6L16J49j20l15N03M12p76O92n49L83k21l25L17J34
4523B53m78p09J110R5K60j52m01l27L05J21n91N15J0R1p42O84J63l11k49P52m59
4544f0K70j94M62m47j51j15J7L33n6k3J06r6jM21j066M34P9r4L98k62L39k22n39
4567d67K61M33l71N61n28N01p25K47LR7Q3l54P03j92q56J16M50n4m0R9J68O9m53
4590b49j3k4J029l25k90k70j77O36j76k47M49j480J435j50q65Q00k90M33n90J37
4610b27Q6l7R1n21L9O13m40O0L56K62o82N82k09N66p08J86n79M95P47r03J51l2
4632a04J90K24j93l6L54p10L26o00M31M63k89M55j365J264n32o22N51j26L75K47
$$ plain form
4481 -741 -354 -160 394 -77 134 -13 337 4 -350 31 28 -159 50 40 235 -361 60 -290 398 -360 -404
4502 -404 80 66 -147 -307 -160 -311 -347 -31 118 -2 -317 186 598 -178 514 -35 348 127 -198 119 253
4523 253 -225 -934 176 271 531 379 -22 -349 -44 77 -514 1 11 102 -640 44 207 -104 -353 399 -60
4544 -60 210 16 478 31 -120 -235 -218 115 59 36 142 46 45 466 -600 -166 -87 -181 217 -45 294 72 -467
4567 -467 -206 227 -144 417 -111 390 -335 -88 -85 12 95 -259 444 252 -604 -488 -38 -92 -132 -33 135 204 -249
4590 -249 -262 -286 743 418 128 -142 -319 317 141 -106 343 -1137 298 148 -717 83 -207 226 -364 -227
4610 -227 -141 -178 -87 -608 -569 44 -396 -336 20 282 -400 182 -27 539 -169 17 -562 -67 680 -223 -72 -104
4632 -104 86 310 117 81 435 -275 51 -549 -118 345 56 511 -854 410 -122 -744 -193 -319 56 303
4652C03o06P34l81M7L34l23l07L49l2p05O03o7K71n48lJ43J26rk27L70L24O09
4674A005r13l21M35k81n82P76N26m52j56M42n7p56P72r15J68K70o98O47N16m96
4694g0J64J69Q6l47J40j71j5M78K95n27j8j20l37K43k54M17M52p29rN0j65j6N43
4717B59Ml27k29Q0Q62o30K76l98o2K2J9M35j13n3l95R33n03k38l54N45p61J084
4739D56j87n88M50k19J044j422Q6M63K75J43p90j34P06r42Q94J63P4j83p8j70
4759D1l96M67n3L8L13q2n99l21R0L56r5P06p7L95o15K95j194O51L26K91p41k0
4781b24l1Q28m03l14L48M0k20M4j39K67p56L00L30O8j98j45M91l20j75l21J653
4802A123p96L93n72m49M60m67L40l79j40O24N15m99M67m48M3j98N90r62M41J66
$$ plain form
4652 303 -303 431 50 97 431 108 -199 150 118 -587 16 -51 220 -328 -331 -188 -62 -71 -298 72 396 1005
4674 1005 92 -229 206 -75 -657 119 645 193 37 479 422 -334 438 -477 -309 -39 -737 -90 426 -70
4694 -70 94 263 349 2 142 -29 -44 434 729 202 184 64 -273 -30 -284 133 585 -144 -153 -103 -268 -284 259
4717 259 263 -64 -293 -213 649 19 295 -103 -165 -143 -124 311 198 145 -250 683 180 -58 -412 133 -628 456
4739 456 269 -319 131 -88 956 -466 -380 83 358 501 -289 -423 283 -659 235 398 472 289 211 41
4759 41 -355 112 59 97 410 328 -271 -592 -502 -146 -241 465 388 783 168 463 -731 -80 246 537 -204 -224
4781 -224 -255 573 170 -144 204 244 24 68 -71 196 -560 -260 70 138 -60 -205 286 -34 -209 -530 1123
4802 1123 327 720 148 -301 159 -308 32 -347 -487 137 652 153 620 172 215 17 607 -355 86 252
4822B52J74j31j19M48p73P00p51%k83L67J050j018N64m87L17j81l75L85j61J40
4842A18j61k00K27J42o04J054m78j4k97r0O70o05L55j49j94P55o59j22J72L93
4862C13j26l69l28M91K61k46J04R7j5N71p57k87M45l81J25K05n83R32j113Q86
4882B25o4l76l0K07pN5Q0l67L82M36o17m27N85o19J098j108N36m96O39j53k12
4903b33O59L37l69p59J73M97J71m54J08l85q0K57M43j95M4m80J74q7m07J14Q1
4924c91j1M74K26m79m54P45o40O24k35j0l5K1K80n1m7N36K69j654J250n24r9n67
4946g72Q36J23p74N6N46J8k85l12K33O47o00J07K93J70n35K2L96k39O31n74P40
4967G27p86J95L75k18k24k69J38k6M55J02j28J02L9m72j12Q5k79mP66n86l31R45
$$ plain form
4822 252 426 295 176 624 -149 551 -200 -200 -483 -116 934 -84 480 -7 310 129 -246 139 -22 118
4842 118 -43 -243 -16 126 -478 576 98 84 -213 -303 367 -238 117 -32 -226 529 -130 -252 -80 313
4862 313 187 -182 -510 -19 242 -4 100 197 182 753 -4 -291 154 -227 -102 103 -480 452 -661 225
4882 225 161 -215 -245 -38 -45 10 90 -277 105 541 -76 -503 82 -537 561 -547 -11 -507 132 -21 -233
4903 -233 426 763 394 -365 -192 305 476 22 130 -255 -335 -78 365 170 214 -266 -92 -179 -586 -472 -391
4924 -391 -402 72 298 -181 -635 110 -530 94 -141 -151 -186 -165 115 64 17 553 822 -832 418 -106 -205 -772
4946 -772 64 187 -587 -531 15 33 -252 -564 -331 316 -284 -177 116 286 -249 -227 169 -70 561 -13 727
4967 727 -59 136 511 293 69 -200 -62 -88 367 469 341 443 482 10 -102 -17 -296 -300 466 -120 -451 494
4989D94n20m54L18M13K60k27j76p00N25K24r0J65K78k68l69J12j13k84K88j74
5009b98M68N07n15o91K33M37j001N14J97K82m95P89k39n5K23o62R8L36l94J48
5029a18J75m9m36O31J22l03m22L86N12n30R71q62j8K22n73P67q70O8m80N92N71
5050C56k46J44k54j08L4l85N53P70o99K47l11J54l28N43q9j073Q70J78q31M64
5070a1J14J1j17L37j359R24j6J77L6K86m13M6K94m50N03m77j27k82J35N30J18
5091B59k59l36M42Q12q66p29Q73j05k78K63J1j55j71K12o5N31l27l69n4P51p84
5112c44K58k26K39O11r98P34m74j59N70k63l20Q53q27N31M36p86L37l32j70L34
5132Dm79J059j186O38R3J53j41j01m5Q9m62j47N61m16L20k72j88Q91q58L2Q70
$$ plain form
4989 494 -26 -480 -162 251 511 284 108 -592 -67 157 67 232 510 242 -127 -15 -128 -412 -124 -298
5009 -298 170 677 162 -529 -296 141 -860 -346 -149 133 -362 427 188 133 356 -306 -208 128 -266 -118
5029 -118 57 8 -428 203 325 22 -400 -14 498 -32 939 77 59 281 -292 475 -395 -327 -807 -215 356
5050 356 110 254 0 -108 -74 -459 94 864 165 412 101 255 -73 470 381 -692 178 356 -475 -11
5070 -11 103 114 -3 334 -1025 -101 -117 60 96 382 -31 15 309 -141 362 -115 -242 -524 -389 141 259
5091 259 0 -336 106 918 52 -677 196 91 -187 76 87 -68 -239 -27 -92 439 112 -257 -311 440 -344
5112 -344 -86 -312 -73 538 -460 274 -200 -359 211 -52 -372 481 -346 185 621 -165 172 -160 -330 4
5132 4 -475 584 -602 36 129 282 141 40 -5 84 -378 -525 36 -380 -60 -332 -520 371 -487 -455 415
5153D15l44n74J10M93r0m73Q54L40k91n76N05l54p1l34O14r80Q23j7L20J26k44
5174B52k22N11M6j055M74J05m80j2J009q31K44p8p85J716j196j68P51n64j12M46
5194E1K32l64l19P24j16j280Q17M88j90M25q62N25p53P11J78l06j71J73q7J07
5214a7Q6r6n59L93L00n68J087k57O1m05j29n93N81K30l01N67J08m33l13j18L63
5235a3J70m77k30P1K00J85N16n55N54o30L51O0n3L50j83k78m2L09m84M87l96n80
5257f68P25nj53m55J02Q90j003O93l1n28N23r67J503j78k63L00k83N35n25n02
5277b90R10m42j24j4m34N4M29m1J68q22J132m98M49M82j462M86k44m88R90o88
5297d47J86Q61l40J7m66L66Lk34K95k86j66P28j11o89R1J08j75J5M18k83N67o94
$$ plain form
5153 415 71 -503 -393 100 10 -463 391 731 440 -136 369 15 -56 -390 224 -756 67 50 370 496 252
5174 252 30 541 587 -468 6 111 -369 -381 628 -203 41 -37 -822 894 -302 -470 281 -283 -395 51
5194 51 283 -81 -400 324 208 -1072 -255 233 43 468 -394 131 -622 89 267 -39 -210 -37 -124 -17
5214 -17 69 -27 -586 -193 107 -461 626 369 430 25 -104 -697 -116 114 -187 380 488 55 -258 -376 -13
5235 -13 157 -320 -550 -479 -279 -94 422 -133 421 -209 142 202 149 499 316 38 -4 305 -179 308 -88 -668
5257 -668 57 52 -101 -556 -454 436 -567 126 95 -433 90 -877 626 448 185 485 202 737 212 -290
5277 -290 620 178 54 40 -394 -340 89 48 216 -606 526 28 477 959 -503 -17 -261 -749 241 -447
5297 -447 -261 600 260 277 -189 177 180 -54 241 -45 -211 517 406 -283 -192 -84 -259 -244 174 -109 458 -236
5319b36P67q48M7J62mo32O25K65L27J31o19K28N5l89n61J022k26q4j00q8m4k3
5341b25j1JO19J22o73J12P56m14J01j11k2n40J56L99p05N88o13M76l36P12o81
5362b89j90P08q38R82q40Q06n7n11M33k42k15L83K47l01j57n33N77kM82l86q6
5383b9j04L74M34q71Q2o7j016J619q87R58r72Q32o72K89O23j047M50J65N79n53
5403A87l10k96J83K43p26P74j25l26R7K94p42k1R52m35J258q56n56N35k86j6n7
5424b29O1N65j72J5p55Q67k24n68J25M24O31j179L35N46n09L15o35N93j43L9J00
5445B02o94K42J026r31L7M58n50Q6l29M32j42N12k86l14N75k18J48k59O1k87q6
5466c17R57p96N56k45K19m88k49J53Q7M7j20l79L61k26O56l74o07K77J46O17r41
$$ plain form
5319 -236 531 -317 -270 -108 -112 -744 -119 146 473 604 -15 213 268 -121 -682 340 114 30 -70 -158 -202 -225
5341 -225 -236 -235 384 506 -167 -55 701 287 388 277 255 -285 -129 270 -435 153 -460 16 -320 392 -289
5362 -289 -479 229 -609 373 -467 339 282 -229 204 -38 -253 130 377 76 -81 -614 -37 -39 443 57 -29
5383 -29 -133 241 675 -196 -114 -181 -1197 422 -465 493 -479 353 -319 -30 593 -454 -4 161 740 187
5403 187 -123 -419 -236 7 -719 55 -70 -396 -299 -5 -747 -768 184 -251 1007 151 -405 130 -156 -172 -229
5424 -229 -168 397 225 240 -515 352 128 -440 -315 109 740 -439 -104 442 -67 248 -387 206 63 102 202
5445 202 -492 -250 776 -155 -118 340 -210 -124 -453 -21 -163 349 63 -251 324 106 254 -5 56 -231 -317
5466 -317 640 -156 400 155 374 -114 -363 -210 -123 -76 -196 -575 -214 -440 216 -158 -765 -488 -342 275 -666
5487f66M78J51K13l82L14o04J19Q95j13l27m51K47k56K54O59l91j80k87N13q57
5507f71J266r67N47o00O76K77j90p90jJ011l06p7L61j44p91L43n7M36L56q61k18
5528d00K98L73n02N27l09j5l9M68p78L34J53k14n02R23o31P66o47k86L19J39J2
5549a1J6J32k63N24r86N71K54J26j10M5k87O2k87J14l5j56Q53L6p71J69K52J74
5571D22r7j50m76j44K72j34L72m7J7Q8k19k35K50J40l69O4O52m55j40L86j80l35
5593c18l35J16k58P58J60L95o72k67P51l51K22o46M39Q4O40r86J70k25j2N98J23
$$ plain form
5487 -666 -188 -37 176 -206 108 -496 -377 518 405 78 -373 -126 -382 -128 531 140 -40 -327 186 -671
5507 -671 595 -372 175 -425 251 528 338 -452 -453 558 252 175 536 392 -399 -56 -113 323 679 -182 -400
5528 -400 -102 271 -231 296 -13 -28 -67 401 -377 -43 110 -104 -606 317 -314 452 -195 -481 -162 -23 -11
5549 -11 5 137 -126 398 -588 -17 237 363 253 298 11 73 -214 -100 -135 -291 562 598 -173 -4 248 422
5571 422 325 175 -301 -445 -173 -307 65 18 35 123 -96 -331 -81 59 -310 -246 406 -49 -189 197 17 -318
5593 -318 -653 -537 -795 -37 123 518 -154 -421 330 -21 201 -445 -6 78 718 -268 -98 -323 -335 263 386
$$ [...]
8191d15
##END NTUPLES=NMR FID
##END=
