##TITLE=1H ikalashn
DE-76w_TFA
13.11.2024
##JCAMPDX= 6.0         $$ Bruker NMR JCAMP-DX V2.0
##DATA TYPE= NMR FID
##DATA CLASS= NTUPLES
##ORIGIN= UXNMR, Bruker Analytische Messtechnik GmbH
##OWNER= root
$$ TOPSPIN		Version 1.3
$$ 2024-11-13 15:04:31.625 +0400  Irina@DPX200
$$ Compression mode = diff/dup
##.OBSERVE FREQUENCY= 200.131300845
##.OBSERVE NUCLEUS= ^1H
##.DELAY= (6, 6)
##.ACQUISITION MODE= SIMULTANEOUS
##.ACQUISITION SCHEME= undefined
##.AVERAGES= 64
##.DIGITISER RES= 18
##SPECTROMETER/DATA SYSTEM= spect
##.PULSE SEQUENCE= zg
##.SOLVENT NAME= CDCl3
##.SHIFT REFERENCE= INTERNAL, CDCl3, 1, 17.49637
##AUDIT TRAIL= $$ (NUMBER, WHEN, WHO, WHERE, WHAT)
$$ ##TITLE= Audit trail, TOPSPIN		Version 1.3
$$ ##JCAMPDX= 5.01
$$ ##ORIGIN= Bruker BioSpin GmbH
$$ ##OWNER= Irina
$$ $$ F:/spectra/data/iren/nmr/1H/4/audita.txt
$$ ##AUDIT TRAIL=  $$ (NUMBER, WHEN, WHO, WHERE, VERSION, WHAT)
(   1,<2024-11-13 15:03:52.796 +0400>,<Irina>,<DPX200>,<TOPSPIN 1.3>,
      <created by zg
	started at 2024-11-13 14:59:39.578 +0400,
	POWCHK disabled, PULCHK disabled
       configuration hash MD5:
       BE 6D 3F 07 2A EA 11 49 91 17 2B D3 AF B3 58 0D
       data hash MD5: 16K
       D5 DD F0 77 17 E2 82 EE 35 44 BA B5 92 65 C7 B9>)
$$ ##END=
$$ 
$$ $$ hash MD5
$$ $$ 52 BA EF 59 53 B9 FB 90 19 A5 75 79 B6 3C 5C A1
##$RELAX= 
##$RELAX= 
##$RELAX= 
##$RELAX= 
##$RELAX= 
##$RELAX= 
##$RELAX= 
##$RELAX= 
##$RELAX= 
$$ Bruker specific parameters
$$ --------------------------
##$DU= <F:/spectra>
##$EXPNO= 4
##$NAME= <1H>
##$PROCNO= 1
##$TYPE= <nmr>
##$USER= <iren>
##$AMP= (0..31)
100 100 100 100 100 100 100 100 100 100 100 100 100 100 100 100 100 100 
100 100 100 100 100 100 100 100 100 100 100 100 100 100 
##$ANAVPT= -1
##$AQSEQ= 0
##$AQ_mod= 1
##$AUNM= <au_zg>
##$AUTOPOS= <>
##$BF1= 200.13
##$BF2= 200.13
##$BF3= 200.13
##$BF4= 200.13
##$BF5= 200.13
##$BF6= 200.13
##$BF7= 200.13
##$BF8= 200.13
##$BYTORDA= 1
##$CFDGTYP= 0
##$CFRGTYP= 5
##$CHEMSTR= <none>
##$CNST= (0..63)
1 1 145 1 1 1 1 1 1 1 1 1 1 1 1 1 1 1 1 1 1 1 1 1 1 1 1 1 1 1 1 1 1 1 
1 1 1 1 1 1 1 1 1 1 1 1 1 1 1 1 1 1 1 1 1 1 1 1 1 1 1 1 1 1 
##$CPDPRG= <>
##$CPDPRG1= <>
##$CPDPRG2= <>
##$CPDPRG3= <>
##$CPDPRG4= <mlev>
##$CPDPRG5= <mlev>
##$CPDPRG6= <mlev>
##$CPDPRG7= <mlev>
##$CPDPRG8= <mlev>
##$CPDPRGB= <>
##$CPDPRGT= <>
##$D= (0..63)
0 2 0 0 0 0 0 0 0 0.06 0 0.03 0 0 0 0 0.0002 0 0 0 0 0 0 0 0 0 0 0 0 0 
0 0 0 0 0 0 0 0 0 0 0 0 0 0 0 0 0 0 0 0 0 0 0 0 0 0 0 0 0 0 0 0 0 0 
##$DATE= 1731495831
##$DBL= (0..7)
120 120 120 120 120 120 120 120 
##$DBP= (0..7)
150 150 150 150 150 150 150 150 
##$DBP07= 0
##$DBPNAM0= <>
##$DBPNAM1= <>
##$DBPNAM2= <>
##$DBPNAM3= <>
##$DBPNAM4= <>
##$DBPNAM5= <>
##$DBPNAM6= <>
##$DBPNAM7= <>
##$DBPOAL= (0..7)
0.5 0.5 0.5 0.5 0.5 0.5 0.5 0.5 
##$DBPOFFS= (0..7)
0 0 0 0 0 0 0 0 
##$DE= 6
##$DECBNUC= <off>
##$DECIM= 32
##$DECNUC= <off>
##$DECSTAT= 4
##$DIGMOD= 1
##$DIGTYP= 9
##$DL= (0..7)
0 120 120 120 120 120 120 120 
##$DP= (0..7)
150 150 150 150 150 150 150 150 
##$DP07= 0
##$DPNAME0= <>
$$ [...]
##$SW= 21.9926040160658
##$SWIBOX= (0..15)
0 0 2 0 0 0 0 0 0 0 0 0 0 0 0 0 
##$SW_h= 4401.40845070422
##$TD= 16384
##$TD0= 1
##$TE= 300
##$TE2= 300
##$TE3= 300
##$TEG= 300
##$TL= (0..7)
0 120 120 120 120 120 120 120 
##$TP= (0..7)
150 150 150 150 150 150 150 150 
##$TP07= 0
##$TPNAME0= <>
##$TPNAME1= <>
##$TPNAME2= <>
##$TPNAME3= <>
##$TPNAME4= <>
##$TPNAME5= <>
##$TPNAME6= <>
##$TPNAME7= <>
##$TPOAL= (0..7)
0.5 0.5 0.5 0.5 0.5 0.5 0.5 0.5 
##$TPOFFS= (0..7)
0 0 0 0 0 0 0 0 
##$TUNHIN= 0
##$TUNHOUT= 0
##$TUNXOUT= 0
##$USERA1= <user>
##$USERA2= <user>
##$USERA3= <user>
##$USERA4= <user>
##$USERA5= <user>
##$V9= 5
##$VALIST= <valist>
##$VCLIST= <CCCCCCCCCCCCCCC>
##$VD= 0
##$VDLIST= <DDDDDDDDDDDDDDD>
##$VPLIST= <PPPPPPPPPPPPPPP>
##$VTLIST= <TTTTTTTTTTTTTTT>
##$WBST= 1024
##$WBSW= 25
##$XGAIN= (0..3)
0 0 0 0 
##$XL= 0
##$YL= 0
##$YMAX_a= 1037918
##$YMIN_a= -1124874
##$ZGOPTNS= <>
##$ZL1= 120
##$ZL2= 120
##$ZL3= 120
##$ZL4= 120
##$ABSF1= 10
##$ABSF2= 0
##$ABSG= 5
##$ABSL= 3
##$ALPHA= 0
##$AQORDER= 0
##$ASSFAC= 0
##$ASSFACI= 0
##$ASSFACX= 0
##$ASSWID= 0
##$AUNMP= <proc_1d>
##$AXLEFT= 0
##$AXRIGHT= 0
##$AXTYPE= 0
##$AXUNIT= <>
##$AZFE= 0.1
##$AZFW= 0.1
##$BCFW= 1
##$BC_mod= 2
##$BYTORDP= 1
##$COROFFS= 0
##$CY= 7568.61572265625
##$DATMOD= 1
##$DC= 2
##$DFILT= <>
##$DTYPP= 0
##$F1P= 17.9538593292236
##$F2P= -4.03888763876832
##$FCOR= 0.5
##$FTSIZE= 32768
##$FT_mod= 4
##$GAMMA= 1
##$GB= 1
##$INTBC= 1
##$INTSCL= 1
##$ISEN= 128
##$LB= 0.08
##$LEV0= 0
##$LPBIN= 0
##$MAXI= 945.577
##$MC2= 0
##$MEAN= 0
##$ME_mod= 0
##$MI= -402.1523
##$NCOEF= 0
##$NC_proc= 0
##$NLEV= 6
##$NOISF1= 8.587773
##$NOISF2= 6.764455
##$NSP= 1
##$NTH_PI= 0
##$NZP= 0
##$OFFSET= 17.49637
##$PC= 1
##$PHC0= 114.3601
##$PHC1= 14.01638
##$PH_mod= 0
##$PKNL= yes
##$PPARMOD= 0
##$PPDIAG= 0
##$PPIPTYP= 0
##$PPMPNUM= 100
##$PPRESOL= 1
##$PSCAL= 0
##$PSIGN= 0
##$REVERSE= no
##$SF= 200.13
##$SI= 32768
##$SIGF1= 18.5376
##$SIGF2= -6.396296
##$SINO= 400
##$SIOLD= 32768
##$SREGLST= <1H.CDCl3>
##$SSB= 3
##$STSI= 0
##$STSR= 0
##$SW_p= 4401.40845070422
##$SYMM= 0
##$S_DEV= 0
##$TDeff= 0
##$TDoff= 0
##$TI= <>
##$TILT= no
##$TM1= 0
##$TM2= 0
##$TOPLEV= 0
##$USERP1= <user>
##$USERP2= <user>
##$USERP3= <user>
##$USERP4= <user>
##$USERP5= <user>
##$WDW= 1
##$XDIM= 8192
##$YMAX_p= 0
##$YMIN_p= 0
$$ End of Bruker specific parameters
$$ ---------------------------------
##NTUPLES= NMR FID
##VAR_NAME=  TIME,          FID/REAL,        FID/IMAG
##SYMBOL=    X,             R,               I
##VAR_TYPE=  INDEPENDENT,   DEPENDENT,       DEPENDENT
##VAR_FORM=  AFFN,          ASDF,            ASDF
##VAR_DIM=   8192,          8192,            8192
##UNITS=     SECONDS,       ARBITRARY UNITS, ARBITRARY UNITS
##FACTOR=    0.0002272,     1,               1
##FIRST=     0,             0,               0
##LAST=      1.8609952,     12,              -56
##MIN=       0,             -1124874,        -1124874
##MAX=       1.8609952,     1037918,         1037918
$$ Real data points
##PAGE= N=1
##DATA TABLE= (X++(R..R)), XYDATA
0 0 0 0 0 0 0 0 0 0 0 0 0 0 0 0 64 -64 64 -64 64 -128 128 -128 192 -192 256 -257 320 -384 447 -512 576
31 576 -640 735 -833 950 -1055 1194 -1335 1489 -1664 1851 -2059 2275 -2525 2789 -3085 3404
47 3404 -3755 4135 -4557 5021 -5533 6102 -6729 7440 -8236 9145 -10187 11406 -12837
60 -12837 14568 -16687 19367 -22880 27703 -34765 46149 -67581 122241 -566399 -924955
71 -924955 142391 180945 -284121 -748727 -472430 101347 519489 204800 -407491 -550768
81 -550768 196030 895854 658752 -231198 -441775 319255 975992 529151 -348640 -449032
91 -449032 287000 682120 164953 -571626 -608809 -131313 34920 -383896 -736140 -504104
101 -504104 -12689 86137 -174809 -246977 81546 410530 397401 194491 171144 401717 604968
112 604968 474042 70936 -200775 -78444 159965 34482 -432889 -666564 -348868 70276
122 70276 -12186 -457537 -575778 -141138 302442 267918 -32464 -89587 190107 456310 411060
133 411060 131835 -63541 16953 216480 227418 -1232 -199011 -155312 -9252 -19348 -179884
144 -179884 -254305 -147444 -32381 -57483 -124002 -74575 35273 43537 -44062 -54520 77112
155 77112 201620 169339 40487 8509 126595 221384 136289 -39918 -99577 -7051 75048
166 75048 21171 -124775 -223095 -190662 -74930 -19548 -96427 -192723 -137460 46360 153392
177 153392 84672 -12765 34493 171466 213996 132846 70076 87051 92073 26378 -34653 -40108
189 -40108 -51131 -119251 -174909 -147031 -75963 -56570 -98596 -123829 -72491 29297 100226 95396
201 95396 52621 47482 109917 180180 165303 58772 -35675 -18188 64088 68147 -49009 -162391
213 -162391 -145227 -43340 -5243 -76216 -144795 -103451 205 51196 27619 2549 16772
224 16772 46927 70112 83478 76224 44323 19384 29036 48340 34047 -7199 -33387 -33578 -29085
237 -29085 -27881 -21900 -25443 -53968 -81363 -58956 -1916 13932 -34340 -67015 -20036 59536 80200
250 80200 32706 -4524 23031 81783 103441 68796 18469 -3060 8604 24240 6977 -45996
262 -45996 -94858 -95913 -54796 -27282 -47140 -78987 -68260 -13196 34962 44685 35208 38705 57911
275 57911 77336 83854 72170 40657 1418 -14126 -413 5067 -28492 -75252 -84117 -51146 -20774
288 -20774 -22447 -39972 -40306 -13357 25901 47963 39826 14693 4591 26669 53147 44898 4094
301 4094 -23460 -9865 17391 17548 -9725 -30759 -27070 -8683 5480 5462 -8542 -24264 -25234 -6186
315 -6186 11786 3976 -20327 -28773 -5912 23296 26813 10432 -949 7945 26324 38751 33187
328 33187 12788 -8274 -11051 4391 10728 -14815 -50345 -56127 -26771 13 -8056 -30811 -28834
341 -28834 1788 31252 37965 29062 20245 22080 32530 41714 33483 4475 -23298 -25406 -8913
354 -8913 -6538 -28079 -50444 -45821 -20761 -2513 -3305 -7852 -3880 9512 25772 38079 36584 20203
368 20203 6465 10585 24509 22012 -2186 -25894 -23840 -6211 207 -12944 -27366 -26953 -13299
381 -13299 1232 6464 441 -10067 -9967 5779 21457 18244 -488 -9619 4920 23531 23876 7421
395 7421 -4434 -852 10203 14535 7682 -5824 -16907 -16819 -7474 -1914 -12557 -29066 -31499 -14364
409 -14364 4137 4273 -6362 -7563 6407 24562 30347 24711 16117 12002 16435 22714 18884 216
423 216 -19357 -22274 -11865 -7590 -19884 -34044 -32705 -16628 -3123 -198 -3460 -2733 5760 18400
437 18400 28063 27255 15853 7242 10375 19398 16996 -138 -15619 -15139 -6573 -3857 -11264 -19791 -20801
452 -20801 -13690 -3936 2869 1502 -5995 -6278 5003 17299 16379 3126 -3729 3611 15008 15322 4433
467 4433 -4461 -3980 1883 6076 3971 -3902 -12170 -11762 -3608 2273 -3495 -15731 -17327 -6292 5806
482 5806 4423 -3549 -5064 2353 12547 15676 12440 7476 3591 5731 10941 11276 632 -11235 -14426
497 -14426 -6206 -2168 -9074 -18501 -18577 -8938 149 2346 283 -372 3886 11286 18004 17703 10402 2972
513 2972 3770 9206 9248 -2101 -14125 -14648 -7996 -4323 -8184 -13450 -13249 -7403 667 5626 5300 2406
529 2406 1008 7594 15112 14602 4597 -1618 440 6753 6345 -956 -7707 -8097 -4485 -232 -640 -4764
545 -4764 -8753 -7893 -1170 4050 1116 -5011 -6998 -501 6507 5947 1097 -1585 1641 7303 9974 7969
561 7969 2881 -51 1440 4796 4858 -1866 -9027 -11103 -6227 -3394 -6379 -11978 -12249 -5468 500 3367
577 3367 3339 2163 4321 9395 14292 13986 8495 2648 2553 5787 4961 -2911 -10050 -11802 -8324 -5908 -7419
594 -7419 -9339 -9384 -6258 -199 4548 4939 1737 1297 5974 11346 10500 4004 -431 917 3867 3348 -720
611 -720 -5010 -5603 -3412 -944 -523 -2249 -5717 -4969 -1608 2136 834 -3670 -5227 -794 3364 3402 920
628 920 -515 1046 4477 6079 6250 3358 837 860 3264 4061 -329 -5667 -6964 -4070 -1930 -3747
644 -3747 -7254 -7542 -3985 589 2700 2337 1501 1869 4897 7966 8477 4330 300 728 2596 2349 -1846
661 -1846 -6491 -7164 -4595 -3041 -3324 -4539 -5112 -2794 317 4103 4382 1754 708 3336 6151 5542
677 5542 1596 -1405 -529 1120 997 -979 -3471 -3929 -2950 -626 402 -998 -2754 -2052 969 2566
693 2566 2362 -900 -1612 174 2417 2232 400 -938 -414 1233 2533 2358 62 -1599 -1620 278 1529
710 1529 -543 -3725 -3769 -1966 -338 -1140 -2496 -2981 -1194 1360 3023 3125 2111 1350 2704 5198 4662
727 4662 1805 -809 -1152 844 559 -1514 -3986 -4924 -3114 -1852 -1424 -1939 -2250 -1289 1302 3444 3854
744 3854 2160 616 2801 4465 4206 1466 -380 -1351 -126 295 -1587 -3110 -4101 -2843 -2118 -350
760 -350 -998 -2008 -1801 -58 2492 2191 916 -96 959 2507 2472 1068 166 76 302 1118 934 -298
778 -298 -1486 -2085 -69 494 -444 -2309 -2684 -851 429 -292 -1037 -1359 -762 181 1223 1777 1029 -30
796 -30 1144 2780 2948 881 221 -535 280 799 -963 -2416 -3544 -2793 -1344 -813 -1828 -1681 -1263 -99
814 -99 1991 2885 1546 607 1059 2902 2978 1163 -782 -926 -170 -90 -960 -1615 -2430 -2085 -703 373 320
833 320 -1077 -626 293 1749 1771 616 127 -35 690 1203 332 -664 -1128 -901 -16 184 -388 -820 -1277 -64
853 -64 763 739 -992 -835 -394 278 786 108 -1089 -494 346 683 874 266 -155 -107 1047 1926 948 -372
873 -372 -633 -278 402 -302 -1046 -1650 -659 -856 -549 -198 -1173 -291 462 1816 2405 861 546 498 884 1884
893 1884 570 -654 -1171 -1571 -225 -744 -1778 -2149 -1864 -614 -106 253 -54 -139 520 1342 1984 923
911 923 198 863 351 983 -39 -648 -1083 -1247 -196 47 -549 -1342 -1042 226 600 441 -206 -592 -261
930 -261 744 1152 495 87 -268 330 709 606 259 -605 -60 475 494 294 -689 -318 -356 -355 -392 -541 -1038 -1071
952 -1071 166 105 146 -287 77 311 822 1066 1070 399 279 1001 872 -81 -603 -600 -664 -518 -399 -1180 -1246 -620
974 -620 -706 16 79 -148 -111 698 1127 1415 594 522 565 585 825 302 -355 -1192 -765 24 -49 -428 -843 -627 -224
997 -224 340 39 186 -383 -225 282 324 81 -89 -225 -288 78 320 110 -37 -5 -34 92 -280 -384 -643 -483
1019 -483 -39 3 372 -387 -629 11 -18 228 393 -188 176 584 972 488 -81 539 636 491 251 -378 -313
1040 -313 -385 -250 -366 -402 -320 -310 -326 106 125 801 51 330 738 631 175 66 23 332 475 -187 127 -424
1062 -424 -1076 -820 -370 -647 -759 3 123 77 192 216 382 2 668 334 696 375 -150 48 -38 739 -132
1083 -132 -642 -741 146 258 -469 -400 -337 84 -7 45 92 -372 -142 342 536 172 395 -280 85 -453 526 581
1105 581 -74 69 -341 129 260 -291 64 -887 -695 200 -306 139 -18 -442 105 199 -19 -58 553 856 961
1126 961 350 390 -356 318 102 43 -143 -669 -853 -88 -163 433 -427 -269 -26 16 -214 352 -97 182 567
1147 567 457 956 -40 -273 295 148 147 -134 -296 115 -512 111 -132 129 -92 272 198 -192 197 -252 101
1168 101 226 -137 68 -252 372 10 404 504 114 -28 303 83 -159 31 -68 -97 -233 -113 -440 -50 -402
1189 -402 -245 -38 179 541 33 177 186 -164 426 36 53 -12 -190 499 -105 -315 -169 -901 -561 -157 -462
1210 -462 -265 -274 319 -281 -56 12 477 269 427 231 -269 -229 -374 -123 -239 -103 -192 -301 -498 -151 -300 -48
1232 -48 -164 -310 318 131 -314 -7 112 -388 515 645 499 -40 -267 -122 41 -202 162 67 -725 -111 166
1253 166 182 -381 -208 265 -168 -183 -353 272 -384 -155 155 133 202 173 -4 259 87 228 316 19 170 96
1275 96 -274 -55 -185 -360 -393 -45 72 -303 363 -36 -285 62 165 84 208 52 -91 688 13 -461 175
1296 175 -281 8 231 275 -542 -479 422 128 368 -170 -23 -7 348 -73 -265 -110 -112 25 -257 -172 33 -174
1318 -174 626 81 -277 41 -218 -143 -26 -584 -190 -30 -285 177 -361 -66 -494 -171 -19 -48 456 -346 180
1339 180 288 -602 539 484 -22 157 353 465 -45 -87 -834 217 26 182 164 -87 200 -211 60 209
1359 209 200 89 96 -75 -26 352 -14 24 -336 -319 332 -689 -414 138 87 -464 -161 -558 -281 660 153 159 589
1382 589 235 412 269 100 286 24 -96 -343 -204 98 357 102 168 -336 7 461 -4 301 -254 355
1402 355 179 -148 122 -4 -349 7 595 335 50 -172 -121 318 199 -195 -29 -147 28 666 74 -532
1422 -532 -170 -319 135 51 283 -149 -145 93 25 -284 357 116 -33 -61 42 -45 145 68 154 103 186 -5 -225
1445 -225 125 366 108 -104 -146 476 294 -176 -111 -117 -35 -130 -74 600 -255 -307 -277 185 138 -10 -432 -12 -220
1468 -220 -338 -77 -39 269 -155 457 553 532 -75 -480 -110 -376 -31 483 181 81 698 207 306 198 -51
1489 -51 299 -333 -462 -420 -554 -173 203 215 -96 -650 -179 -21 177 161 56 -47 175 -30 18 -128 285 -387
1511 -387 -343 150 19 -23 -380 161 -330 231 -218 -406 73 -34 374 -235 398 -48 -198 613 -238 -46 372
1532 372 -188 97 160 -126 -499 -263 -327 -64 -172 -90 11 -99 -226 -44 -267 254 23 242 85 -74 131
1553 131 -40 -282 386 -230 369 -687 249 145 -491 422 9 -375 165 196 411 -13 227 79 332 -154
1573 -154 137 16 81 -130 -333 -108 130 126 -151 251 344 -213 -636 -124 102 97 -85 11 44 224 -509 -52 146
1596 146 308 92 473 215 120 126 -122 7 -16 -34 -205 -206 186 -284 281 1 -441 356 -157 -97 -160 20 -263
1619 -263 -120 -81 -42 -97 91 435 -463 -240 233 0 186 76 -274 67 90 -207 -374 150 -126 -108 -145 -4
1641 -4 410 -466 123 206 88 398 165 80 189 -219 -55 -360 300 -237 293 -1 -446 -51 -410 217 -133
1662 -133 -490 75 -350 -352 150 371 369 -406 38 -47 -12 -369 242 348 -168 -12 -24 212 8 -752 -39 -246
1684 -246 146 88 -146 2 -145 96 -229 14 302 -152 -123 -75 128 -54 346 17 24 129 497 397 72 211
1706 211 -48 -273 -10 -133 -185 360 216 310 45 -225 162 133 488 -138 169 -40 -152 -379 282 -34 -526
1727 -526 -32 7 -99 191 -58 -151 -184 53 -134 121 -68 -267 338 233 -94 63 145 45 353 -372 381
1748 381 -342 -298 -148 -42 216 -215 90 -24 11 93 147 101 114 -123 77 -16 68 -261 158 287 -48 -87 -47
1771 -47 -126 -63 -383 -11 -211 142 -22 -213 -16 312 -223 -90 -334 -42 -369 -395 -191 -16 420 273 583
1792 583 148 267 -238 -237 -9 184 -278 -67 221 393 267 -160 311 -306 -37 -219 -5 467 323 199 765
1813 765 -56 261 -228 45 51 484 -260 -354 -464 18 -648 93 -51 -413 -89 -42 323 41 -173 -66 62
1834 62 317 112 137 101 -191 -90 -44 -150 483 -257 -43 158 192 53 -326 -116 -194 -224 -87 145 -340 10
1856 10 170 100 140 -418 365 348 386 154 172 -173 435 -212 87 209 49 -217 -231 -328 236 -297 12 296 107
1879 107 -75 261 13 -291 -82 384 190 -356 150 481 79 -116 190 -19 462 -116 -6 -43 -97 49 -2
1900 -2 193 291 256 66 148 -247 78 278 -104 -400 -365 -96 -238 116 22 -80 -57 22 -103 -11 -375 124 145 235
1924 235 31 103 -146 -359 -129 395 354 -446 -207 256 120 -27 -275 -159 380 -65 133 181 415 -119 18
1945 18 334 474 566 452 -233 -175 -12 -348 -408 267 89 -198 31 107 79 -3 270 -26 -97 276 -40 261 -138
1968 -138 -208 154 372 -283 -133 447 -167 101 -213 -221 386 -86 250 257 274 -225 -634 -357 435 -59 199 -311
1990 -311 -473 -28 120 172 -242 221 -203 108 63 213 -242 -499 -390 -172 440 213 266 292 566 -323 -245 -240
2012 -240 613 235 18 167 254 -255 270 64 -265 -434 -378 -82 221 -80 -25 112 158 -136 -332 101 -124
2033 -124 -312 -56 86 34 0 247 -203 -86 142 465 -8 -260 -106 -89 -20 70 84 30 -87 237 -51 136
2055 136 -135 10 -83 133 -94 -316 11 386 117 663 16 -107 375 96 -136 372 587 235 290 -41 194
2076 194 237 126 -91 -155 356 51 -220 115 -234 -508 148 37 28 46 119 -283 210 105 306 -340 -487 -206
2098 -206 -118 -517 293 -92 99 62 442 251 163 5 514 222 160 -47 143 313 7 265 -52 316 390 -195
2120 -195 -349 -233 250 248 -455 54 243 -282 -309 -49 138 197 174 -798 -128 73 322 -521 -148 78 -212 -197
2142 -197 -141 -916 421 30 -350 -214 154 127 -288 -271 11 290 35 144 11 200 -47 237 -167 20 255
2163 255 -252 -195 23 -275 -235 95 -57 87 -215 440 -217 218 -55 464 389 -199 -61 -27 523 227 141 179
2185 179 -223 22 -564 -401 -395 -160 -167 -132 659 -237 -208 122 156 394 -513 -153 -158 -72 197 83 -32 -96 6 300
2209 300 -460 312 -115 -27 279 29 -147 -631 50 -37 360 262 304 -301 192 60 1 643 235 -77 133 8
2231 8 -33 -39 -106 10 -213 297 -160 -381 -22 65 -58 103 135 -259 95 -314 -40 130 -164 -615 -214 -27 -287
2254 -287 270 242 -170 422 510 -577 -251 511 -177 -438 -216 -71 83 -386 -269 -232 522 416 -187 -253 -93
2275 -93 257 -176 -175 -189 -367 -230 65 -72 125 100 -118 -235 -208 491 70 -111 -139 -368 187 -278 42 -83
2297 -83 521 -228 -315 345 -139 219 142 -128 179 -426 -369 467 24 308 -68 -83 -340 -410 -33 -52 291 477
2319 477 167 246 22 -98 229 33 -161 -25 -186 82 -384 -11 197 318 159 196 -39 -191 185 -268 -36
2340 -36 -173 -69 76 -105 -782 51 272 -221 -20 43 -368 -398 -145 -167 380 418 201 -212 171 276 -21 -271
2362 -271 258 89 -182 114 155 -161 -272 -125 105 -220 -371 -197 8 -129 -127 -131 6 -584 -184 -15 99 361
2384 361 -376 -2 -86 -127 -31 -232 73 -308 -342 57 -275 -256 -267 -90 -91 262 -411 48 -277 -179 -159 -308 -436
2407 -436 -65 -382 -91 209 -450 -230 -154 212 -109 48 607 -60 -88 -21 103 250 420 -64 295 253 -154
2428 -154 300 0 69 240 -99 210 342 223 -64 -100 -216 -188 201 -78 -7 89 307 231 42 13 -102 -309
2450 -309 -99 -319 172 -97 -151 541 -119 -62 278 104 90 207 365 -66 38 -71 254 253 -286 504 514 418
2472 418 190 157 -1 119 -252 412 0 275 -91 291 81 -68 -417 176 409 364 -50 90 -66 -752 -87
2493 -87 -403 249 -147 -450 -304 98 -158 266 -108 -315 -183 245 356 693 -346 117 1 -256 113 -68
2513 -68 150 -225 63 90 310 316 -41 460 235 -97 198 255 -284 110 527 -95 -73 161 -138 100 -312 338
2535 338 -80 187 -458 -48 -361 -85 222 -74 -200 210 -38 -190 -20 312 355 -129 -419 -239 -17 -180
2555 -180 -177 101 -232 552 -26 343 371 -162 469 18 -462 237 -102 21 -286 238 685 255 -128 105 181
2576 181 -351 172 -239 -167 269 -101 309 141 -155 334 -114 -157 636 196 308 -44 -336 -180 148 -86 -71
2597 -71 30 -138 -414 -155 -46 -5 -48 -450 -127 -338 371 -148 -513 242 397 308 69 -105 -278 -61 -122 255
2619 255 256 -321 -182 -162 37 176 116 -194 -142 -208 -150 295 94 157 -400 428 -183 417 -136 -131 28 -46 351 -481
2643 -481 381 383 -249 142 29 -341 -175 -26 -68 50 -22 -112 -169 64 319 201 -192 263 -82 -599 -112 -42
2665 -42 523 -281 195 -63 7 -70 18 229 -230 -71 -816 276 108 -41 -92 336 6 404 71 154 165 -198
2687 -198 207 483 -178 -113 90 338 204 -62 -156 413 237 258 25 281 387 273 -241 -176 -153 -123 -66 -138 -106
2710 -106 145 93 61 -212 -91 -87 40 499 -18 -69 -168 193 265 -202 347 581 349 -334 -94 101 45 124 -108
2733 -108 209 178 330 -283 69 -575 -147 -196 -88 166 219 -333 188 214 -317 -344 -88 -52 -84 255 -109 123
2755 123 423 -210 -422 -188 -430 183 -174 249 -385 -116 -295 -348 -74 176 6 297 -201 -214 127 56 120
2776 120 -27 172 283 -142 78 -243 -361 29 -109 -129 -253 282 251 -205 180 52 -148 -25 -199 311 -373
2797 -373 -129 -175 38 164 -8 279 129 -164 -236 34 -249 231 112 -273 163 30 -98 -262 -189 11 123
2818 123 199 33 293 172 314 28 256 134 -371 -531 330 -190 -92 -18 -35 -15 230 -89 129 -66 170 -49
2840 -49 -270 -215 -85 -72 0 127 126 468 -229 -188 122 -359 -81 275 280 359 224 -143 -3 -60 -215 -148 -308 -369
2864 -369 -13 -282 291 -87 -252 508 72 -122 -128 210 104 -129 -234 397 262 182 349 -269 28 8 444
2885 444 54 365 -183 92 24 291 -122 -47 -100 -371 278 -136 319 47 -130 197 11 -95 51 -115 134
2906 134 -119 -123 150 -329 -472 22 0 -291 487 -426 -138 -356 -294 130 -344 -346 47 -366 213 -171 36 -45
2928 -45 17 220 -490 256 -34 -148 -86 211 37 -144 8 -126 -48 362 -125 -286 -141 282 122 -110 -441
2949 -441 -231 -488 -203 -271 50 -98 -401 -30 -170 62 173 299 -55 304 -126 105 189 148 -411 -147 209
2970 209 14 117 80 283 268 292 -36 502 193 202 11 501 242 114 306 145 -390 -343 -184 -166 -89 -334 -172
2993 -172 -255 154 127 -227 -165 -98 77 -49 -438 -10 207 63 -106 54 10 -423 29 -113 15 -18 -192 -211
3015 -211 6 231 40 318 309 -180 -220 -278 189 12 -80 -89 16 61 111 -101 -559 101 36 426 5 26 -153 340
3039 340 83 162 60 400 -249 241 -242 272 -603 191 223 -4 349 14 327 -110 151 -53 -145 -241 -154 -134
3061 -134 532 -349 -160 260 -401 153 -416 -249 -155 41 147 -124 106 -160 238 64 148 -177 313 490 -358
3082 -358 271 -189 -193 -117 171 40 89 98 144 -206 -329 -325 -184 140 314 425 -255 137 116 511 -611 -186 -282
3105 -282 455 145 -422 -95 158 -39 -213 -149 -481 -397 -228 84 -78 -104 -91 9 347 142 75 -25 -219 -23
3127 -23 58 48 -17 -106 361 450 -80 249 235 225 216 -118 422 234 -226 246 91 191 137 -175 -177 412 -202 260
3151 260 44 -38 -212 179 -252 -220 59 139 -155 229 274 97 -280 -15 189 126 -118 -105 68 -261 71 -2
3173 -2 251 52 62 410 58 44 -229 -316 -76 -122 122 -432 78 -200 -4 130 -19 44 -296 -473 -177 136
3195 136 -223 398 91 252 221 -360 85 -139 -179 174 -75 -384 -245 -203 -56 -325 -369 -70 252 322 -134 -115
3217 -115 -92 -9 -74 88 -22 248 -330 -22 112 137 -368 -42 -403 281 187 122 -390 166 132 91 -214 189 -101
3240 -101 -97 -260 16 78 -532 168 -152 349 32 203 -251 -5 36 -225 187 -321 -147 208 689 -23 34 122
3262 122 448 -118 -404 -60 207 -275 107 33 -21 -210 -229 -160 311 -131 -127 -428 -78 21 -4 123 25 697 56
3285 56 -23 -478 -334 16 19 235 122 -471 -179 -205 -118 -165 -291 -102 -111 115 -101 200 -353 315 64 275 380
3308 380 -146 -28 -89 156 -72 -75 173 449 122 -62 -176 157 408 -199 -151 -460 -422 145 311 19 -24 -302
3330 -302 228 233 84 127 73 251 -283 128 -142 314 434 166 376 190 300 -68 -9 -90 76 204 473 234
3352 234 -144 -227 246 55 33 113 56 155 559 190 -231 -260 -147 -281 -2 -198 88 286 8 82 118 88 -103
3375 -103 -62 296 431 511 13 227 -465 157 257 618 -255 423 218 -50 134 193 -15 212 -275 -364 407
3396 407 353 415 -513 61 221 -78 201 137 -119 -152 -171 -94 -68 263 -97 257 -483 -27 310 -301 -260 8 -139
3419 -139 199 -501 -112 196 234 178 21 311 -240 421 105 142 147 -491 132 -132 243 198 -129 19 487 385
3441 385 -231 -113 248 -327 215 69 103 181 31 -135 -212 456 573 177 -216 -48 -51 -81 6 272 8 -311
3463 -311 3 75 -105 -347 -112 -206 -527 -17 14 295 349 -184 -24 -46 143 385 326 -404 274 -120 -309 -171
3485 -171 -455 357 -226 -80 133 253 -335 382 -339 435 176 4 -266 -81 376 -194 -146 -133 -76 31 558
3506 558 -101 43 -211 -789 7 -213 -10 -94 -187 -10 -292 -60 -112 67 -656 -335 -715 354 118 -478 -32
3527 -32 -339 13 -75 -264 138 141 -256 174 13 358 -67 -349 73 82 32 124 52 375 156 113 270 -270 41
3550 41 102 207 -177 232 -16 -110 -265 -39 142 140 -366 214 -45 68 -333 -123 97 63 -73 -431 135 -285
3572 -285 -365 87 -42 -89 34 -160 -125 27 119 -168 -157 -405 -132 -141 118 -126 654 -419 272 228 -34 -29 342
3595 342 -108 -287 0 56 301 101 -24 -364 -92 136 -190 -106 -81 370 192 -648 62 107 334 138 -2
3616 -2 -237 35 -367 144 -217 112 398 -743 -300 -275 -346 -321 -91 -114 -214 523 33 304 86 268 -443 -151
3638 -151 30 -121 67 24 -60 135 518 -436 305 194 244 67 164 -134 95 188 410 -183 -276 -104 234 -18
3660 -18 61 79 -722 -72 -105 -399 304 280 -263 -341 -114 354 320 148 74 -82 -458 131 220 -367 -299 -108 -137 -4
3684 -4 162 -357 255 305 15 -69 150 170 -340 -242 221 185 -320 44 -58 -88 335 91 30 15 46 60 124 242
3708 242 70 -295 -92 -50 -316 -283 149 -161 -130 426 62 240 146 193 -432 -203 122 -123 -116 -86 -200 252 -224
3731 -224 38 -144 -396 7 172 -210 43 -188 -133 384 128 57 -316 131 -65 -402 207 13 277 -494 -9
3752 -9 161 -7 -9 -326 83 145 352 118 -188 -153 -276 -123 -203 -231 -17 -79 79 176 -30 338 369 -223 50 55
3776 55 -74 267 188 -172 222 373 -135 125 -33 146 -341 0 606 679 104 188 -570 -258 -104 69 -330
3797 -330 -241 -160 214 241 60 -235 -1 136 -503 -138 282 30 -188 26 244 261 -236 -188 -403 382 0 -237
3819 -237 -565 -190 -284 -183 -439 -72 50 -157 -93 -261 -96 262 -555 255 362 -133 -3 -71 106 199 -81
3840 -81 -202 76 187 -13 94 -222 63 528 -51 293 -41 -56 -77 -149 304 65 551 -133 188 281 -154 -106
3862 -106 -58 -112 -217 -299 134 132 -241 -75 209 -379 -228 -351 -141 -88 137 -190 88 -459 21 443 591 -80
3884 -80 297 -66 405 423 -751 1 242 -80 325 56 -345 -53 398 346 -171 -45 17 -39 240 -166 -317
3905 -317 39 74 -102 290 -283 151 -100 36 -135 -52 324 -45 8 453 389 -328 -313 81 146 224 -181 -61
3927 -61 126 49 144 -51 29 -168 183 -98 -161 232 -196 13 -231 -62 -335 1 -15 97 -172 -240 -84 157
3949 157 138 324 -36 345 -240 60 55 353 66 -379 201 -25 -527 16 135 110 63 264 173 74 127 129 -134
3972 -134 99 14 -421 84 -478 -126 20 -139 331 -131 80 304 -362 -263 15 -440 -362 -373 284 -395 -590
3993 -590 -5 243 406 -151 217 71 -481 -89 -324 103 -139 205 -214 58 -124 336 -156 -416 687 -232
4013 -232 -83 549 2 -101 408 219 57 -138 -339 -124 80 229 37 228 48 12 42 -248 63 -446 111
4034 111 -53 201 -133 -121 563 -518 -8 -409 -121 189 364 264 -27 -505 131 338 153 190 842 -194
4054 -194 19 563 -58 214 -166 255 163 263 209 -391 -270 120 -217 -139 -284 339 233 -48 -248 -120 -11
4075 -11 225 -62 -184 -373 -152 -600 -49 -356 303 242 158 312 160 -213 -94 307 -65 29 -355 292 -17
4096 -17 -50 204 -161 -74 49 -231 -84 490 -137 -23 112 110 -141 -7 213 185 -310 -261 -38 -354 -13 -550
4118 -550 400 -43 162 149 -153 -190 -326 -192 -96 92 -69 93 336 -138 -155 189 -216 -282 -572 -347 147 -410
4140 -410 -538 -184 -71 -336 -307 -115 46 -225 -145 126 214 202 -65 31 -53 -523 336 198 -258 98 174 -96
4162 -96 -134 -36 40 16 -168 -131 -5 441 -439 218 431 -47 -93 301 -8 -92 289 -258 298 -427 35 -228 -58
4185 -58 -400 -85 -162 55 375 92 15 182 41 -97 165 -260 -122 -137 356 257 82 154 -138 125 95 611
4207 611 -168 -160 -30 -271 -229 -1 -102 43 156 269 -440 -470 -473 133 13 -101 -327 -79 180 347 380 168
4229 168 -266 -68 445 -145 -74 180 42 -159 171 -272 440 138 294 209 -204 114 -71 91 355 225 -203
4250 -203 102 -183 168 68 -71 237 173 -231 45 317 238 188 245 95 -163 357 -141 -173 -66 194 272 562
4272 562 221 -150 -40 -7 -286 131 -200 335 -49 -352 -159 164 235 253 -201 -338 55 101 494 430 183 -250
4294 -250 56 19 7 86 -87 440 32 127 260 44 -258 55 89 138 437 -207 -478 -135 -162 331 58 138 32
4317 32 146 387 463 265 20 -241 40 -364 -47 58 137 -262 -222 -150 -216 -429 142 -367 154 -242 180 624
4339 624 -86 -133 -488 144 -140 29 243 34 -32 -436 536 -315 -118 120 46 -291 214 -448 483 66 -136
4360 -136 -254 135 525 19 36 11 350 -62 -76 -208 -19 -1 56 88 -58 -145 274 368 -71 236 -143 -266 144
4383 144 -319 -271 -399 -18 181 -12 -431 -71 -22 334 461 -316 -303 49 -436 241 -68 -103 170 -177 -439
4404 -439 -113 -233 106 -75 182 -119 103 -11 180 -267 96 4 689 335 353 634 367 0 57 -262 78
4425 78 485 -144 27 -257 185 -377 -512 -609 415 121 -44 147 -383 18 336 -47 367 -333 365 -202
4445 -202 6 -358 247 -160 62 448 -211 73 -9 408 218 -152 -214 185 39 350 -32 0 -253 280 324
4466 324 -140 269 20 92 -336 -316 -123 -465 309 -319 -243 165 28 -76 322 -5 88 216 -203 38 10 -214
4488 -214 -41 171 -153 -42 -52 458 396 46 96 -283 -53 -151 42 -369 62 237 45 -216 345 -153 31
4509 31 -42 -487 63 204 -110 150 23 322 309 409 124 35 93 452 443 -245 128 87 124 607 -97 384 -410
4532 -410 169 189 -182 350 -140 -531 -31 540 -211 207 76 412 -161 240 -131 -330 172 10 -512 59
4552 59 144 259 -326 175 -407 -179 -23 571 -372 426 45 214 337 -126 168 -164 597 36 190 -261 199
4573 199 -36 -218 -477 51 90 -14 -83 -103 -260 -102 86 -240 -226 -50 -169 -96 -104 -56 -375 -254 -564 -405 -30
4596 -30 -290 116 -53 -188 359 -226 96 -94 391 -259 136 150 29 179 776 98 164 -19 218 598 -152
4617 -152 -148 -190 35 -127 -65 389 147 92 334 -48 239 353 -6 89 236 -65 -350 296 -118 -131 -177 -333 -203
4640 -203 -623 -462 17 -457 -525 -35 -401 -55 -59 -2 244 17 -187 43 -160 496 -13 -265 163 -151 -75 -142
4662 -142 130 14 -41 -76 50 -266 -371 73 269 176 -298 -76 -499 393 487 -119 518 209 138 -85 -116 -401
4684 -401 -93 -137 290 87 7 -59 -111 240 -213 -303 301 -204 103 -179 -70 104 -190 -174 485 -243 215 65
4706 65 262 -139 244 233 258 467 -42 -130 91 195 -185 295 -64 -118 -134 -235 230 26 -255 110 -292 58
4728 58 -317 284 -184 -223 -120 -70 -52 225 -62 115 172 -84 -134 112 122 68 279 171 -68 284 -138 -150 -291
4751 -291 35 -25 -275 -549 38 -62 -260 103 343 174 -174 7 260 24 -91 226 351 -29 -227 97
4771 97 68 127 193 115 452 366 199 -464 -20 517 117 60 282 157 -100 6 446 -80 251 340 -167 46 19
4794 19 91 126 401 -29 370 45 50 -315 53 -376 -168 -227 -304 -37 212 206 -311 202 202 -204 90 468 712 -155
4818 -155 -181 -53 -290 -51 248 370 37 1 202 -69 389 76 139 -261 442 87 -103 -251 352 -304 -674
4839 -674 -12 -159 -57 -44 -27 -109 224 231 -34 172 -195 -192 121 14 -471 -314 92 -355 -241 -93 15 460
4861 460 -361 190 29 -171 112 -445 -59 245 -79 368 438 -145 166 272 -65 248 -287 -5 -265 -114
4881 -114 -249 -162 -236 -126 230 -217 -128 -27 344 -185 232 56 282 357 -31 -157 67 330 -139 151 350
4902 350 -418 205 90 60 -317 -315 -92 181 486 172 -234 303 -177 -437 -211 -204 -42 29 -142 -72 -344 79
4924 79 -92 288 -154 330 -86 -296 -323 359 43 -402 30 -119 159 132 -301 103 6 -410 495 176 -135
4945 -135 155 160 106 133 -277 -212 -69 -459 126 -302 194 -180 182 -90 -14 378 -248 -232 143 286 0 -383
4967 -383 -220 107 -39 -107 -186 88 -283 369 -38 168 310 32 -335 426 361 -191 537 -257 -470 -297 106
4988 106 113 -213 51 -495 -112 -170 -234 40 -87 190 108 146 641 -350 -233 315 480 -392 46 14 173 -142
5010 -142 -464 -96 -220 -284 82 -304 -144 -127 265 313 172 94 98 222 77 231 -48 469 538 -224 147 -105
5032 -105 50 -206 261 296 -228 -8 -48 -319 527 -97 -265 -469 -19 133 59 339 56 -22 355 147 435
5053 435 797 -49 -116 -383 -247 -20 11 -234 62 -252 -73 -269 -140 -126 425 421 -475 -346 16 405 -171 77
5075 77 -39 -162 49 -14 133 -158 -267 -9 -162 -189 -141 -219 225 68 183 -483 438 -145 -205 245 421 77
5097 77 -395 -187 405 223 -186 -38 147 87 -13 95 -33 -440 110 139 104 322 -348 -286 -481 -255 -20 208
5119 208 -213 -264 -253 102 -93 236 -74 319 97 -100 -232 68 381 306 -44 269 501 -511 330 45 299
5140 299 -203 -29 -429 -1 673 292 380 368 -525 -423 -159 -8 121 -459 170 23 195 263 151 346 607
5161 607 -219 281 3 -103 -158 434 -28 157 346 68 -351 -6 455 -21 -185 413 244 81 207 202 -168
5182 -168 -365 -68 192 70 210 58 -157 88 -268 -543 -140 216 -35 134 304 238 182 512 545 -401 -449
5203 -449 433 -74 -73 620 -36 193 138 168 -491 124 -103 -361 375 -67 561 -202 -102 -241 109 -238 -202 154
5225 154 90 48 365 125 -146 -49 77 174 -262 45 297 239 294 -53 94 -102 142 -271 -66 184 -166 427
5247 427 -142 -151 242 279 -430 152 232 14 287 37 -185 -397 -66 -88 456 17 -2 -82 111 -293 -453 -177
5269 -177 -91 -42 -230 -174 -130 114 -90 293 109 362 -90 210 526 343 161 44 223 -144 64 348 175
5290 175 -324 66 180 -250 10 -49 18 -131 -23 98 26 9 10 568 -101 26 375 -203 58 -54 143 168
5312 168 -584 12 280 62 -227 -28 55 181 -547 249 -334 46 287 352 15 58 207 -93 159 30 -239
5333 -239 22 -83 -54 -383 212 4 185 794 402 143 97 -172 37 -216 -301 -229 223 -238 -443 164 -315
5354 -315 320 -44 -297 -594 169 -263 -323 199 -371 44 -165 304 -68 150 -45 -175 202 -109 486 501 -202
5375 -202 318 78 -170 -209 -108 -9 231 -244 -227 -81 -177 327 -754 -162 123 105 -227 152 75 11 -66 235
5397 235 -307 372 -9 -232 246 174 -196 87 -308 11 120 -14 -447 -426 -15 -102 170 -21 35 -397 -100
5418 -100 -245 69 -284 -386 114 -303 560 507 154 263 454 298 117 -379 -127 -15 108 -215 575 262
5438 262 -202 561 -174 -175 -137 -46 -85 223 -42 -29 492 144 -318 -262 186 408 169 -623 98 -128 121 150 286
5461 286 -536 -167 -70 -356 108 -204 243 -70 148 -164 -321 -7 -182 -99 21 393 -63 92 -203 -284 -149
5482 -149 -268 -143 386 226 286 213 187 513 -37 320 363 241 183 532 460 159 -290 -52 -48 -407 230 -11 -162
5505 -162 59 189 -238 -50 -287 -435 315 -115 -26 44 -41 -522 -185 359 3 -119 463 -55 307 -218 -576
5526 -576 -451 -311 91 192 -119 45 145 -318 -193 -382 -197 235 -142 -210 -58 -425 372 58 -144 154
5546 154 448 56 697 129 -193 -215 -438 204 -332 -33 78 -103 -92 -701 208 -196 -112 -337 95 170 -64
5567 -64 -247 -46 -300 43 -450 -249 218 291 -67 192 -108 -131 -311 450 265 8 -52 100 -40 -14 -59 191
5589 191 726 23 -24 204 -97 353 121 125 345 -350 157 67 -210 -196 -272 -346 -507 -361 116 -102 -304 -190
5611 -190 71 5 11 42 -154 -442 -194 52 -250 -198 -168 51 322 15 -396 106 298 -39 249 -266 -178 107
5633 107 209 221 143 118 -67 284 194 70 200 516 -35 78 229 45 211 52 403 -72 -195 77 368
5654 368 86 -295 83 -10 -306 65 -193 -198 -203 -47 127 -430 56 -47 -495 -736 -1 87 4 -129 26 90 184
5677 184 -516 -9 97 225 -214 -315 31 221 -239 -196 -373 -155 -139 321 69 -427 111 17 428 121 233
5698 233 146 -84 250 204 -179 -97 464 -288 -85 -268 181 -246 -176 134 84 -96 -155 73 -297 -260 -205 138 129
5721 129 156 165 -101 333 -334 -245 68 -70 290 19 -194 83 128 -43 215 -100 -305 510 136 319 133 -105
5743 -105 217 182 -254 -620 -87 -232 -459 186 92 13 377 449 -17 -169 -364 17 -30 517 146 -353 -18 90
5765 90 211 -107 128 -26 30 -865 279 -258 -25 259 78 15 -141 99 107 136 -203 -295 208 201 -121 -31 13
5788 13 70 -154 309 152 -7 280 23 -196 -132 -44 156 282 -99 -120 -213 -22 314 -266 -339 135 -146 -453
5810 -453 -73 -350 280 -101 46 -143 -375 -190 -3 41 207 -117 386 -262 -12 181 -419 -205 131 -169
5830 -169 254 -161 261 -83 -85 -14 -36 100 -324 -140 -173 117 203 48 57 300 155 -413 33 91 -140 53 -132
5853 -132 -397 67 -137 108 -207 -255 635 122 -436 -122 -545 -175 1 -185 -69 0 10 57 -213 -172 -143 -141 -69
5876 -69 -121 213 271 157 95 139 -273 -343 151 202 -25 -358 25 -55 -255 462 469 -279 -50 -130 -35 -282 14 21 119
5901 119 85 -400 28 61 -298 180 -545 229 -60 207 294 197 200 89 44 -103 114 -420 -196 -426 -84 96
5923 96 -148 312 -491 261 63 -350 -32 174 -239 -224 -152 -463 -65 166 384 107 419 -160 -31 50 416
5944 416 -132 -238 -68 298 -83 47 244 55 -384 -117 271 101 271 -130 271 -146 175 -148 263 279
5964 279 106 114 -126 -287 -595 -108 395 111 -281 74 -889 13 -266 -244 16 -209 -53 111 -390 297 -244
5985 -244 9 -63 80 202 -16 305 -40 97 -190 -309 61 58 -30 -387 203 -78 227 644 243 330 -321 -90
6007 -90 -213 404 377 -205 518 -333 -56 -247 -110 -33 -443 35 356 192 153 -68 -182 -68 -217 -226 -83 308
6029 308 -627 -225 -7 244 -22 182 87 412 -246 394 -158 179 -240 -195 67 60 -40 -473 -26 303 -127
6050 -127 -155 341 229 171 -366 232 -77 31 324 444 -73 -106 290 -131 153 -16 68 -276 409 108 247
6071 247 90 -47 320 -42 -220 220 181 -119 -69 -232 -124 -199 -408 -324 -377 -315 -562 179 -279 430 -270 -192
6093 -192 -47 382 -34 -340 -240 -157 161 -265 -66 -72 43 -209 -167 -343 345 -262 -349 -78 296 64 38 -18
6115 -18 -183 391 -81 -26 -6 -122 43 -29 261 -21 70 -40 72 115 -139 -526 175 11 -193 16 -194 -297
6137 -297 -25 192 -314 -130 -475 457 -8 -81 -292 91 347 247 110 -271 102 123 -205 -246 380 -52 -53 -70
6159 -70 349 -547 133 -52 82 364 326 403 35 15 64 187 -458 239 -379 46 220 -192 29 -497 -131 -164
6181 -164 -266 58 -11 62 498 143 -71 -327 109 -16 -536 -549 39 206 270 -25 -35 170 -51 100 -136 333
6203 333 238 -92 332 149 -282 -164 -455 -104 82 9 -110 -54 178 20 -374 -289 60 -259 -127 24 84 -200
6225 -200 193 11 -283 -164 368 408 -234 265 -281 288 452 -483 -342 -540 -52 247 -127 -23 -26 -53 -343
6246 -343 -506 343 -302 -171 -80 -112 489 113 73 117 139 -700 504 215 -313 -283 -64 284 -468 -277 218 -171
6268 -171 -38 -730 -260 52 -424 15 26 -297 -311 164 177 92 -72 -50 -18 11 101 -292 360 -100 209 163 247
6291 247 -325 -62 -197 -14 -59 420 179 5 -51 47 -130 412 -19 94 -247 259 -306 -83 47 213 261
6312 261 272 297 -513 64 228 -90 32 64 -199 293 38 118 -148 -128 163 631 -317 178 -152 -157 121 -221
6334 -221 -101 -179 295 -233 280 -494 -22 -642 -358 116 11 -220 43 48 100 -258 -119 435 206 -80 -290
6355 -290 24 269 -236 263 -90 320 101 58 -109 96 -100 350 -24 -24 -194 -20 -138 -80 -134 268 -157 -46
6377 -46 143 -81 -625 308 -459 -38 627 -307 54 325 16 128 93 135 -480 -52 -53 -102 -214 -220 83 -48 -174
6400 -174 -670 -48 386 -44 189 -195 72 -70 -8 -498 -103 -241 -340 161 8 -37 191 350 -100 -153 649
6421 649 46 -388 -34 -38 126 -186 -355 350 151 360 -41 -566 -370 151 -24 -411 266 -22 162 -237 -160
6442 -160 -180 -108 332 -142 331 -308 5 163 50 284 10 309 -321 306 26 539 -240 -31 -169 -387 -130
6463 -130 -272 12 -410 92 -428 -321 -271 80 -62 94 13 -44 -64 77 282 -102 -144 -282 62 -697 503
6484 503 359 -616 -207 266 -292 -387 -493 209 -156 -371 -14 92 -231 98 -60 -218 -392 -266 432 -75
6504 -75 32 -126 39 -107 277 529 66 277 235 387 24 197 681 15 -184 247 127 -274 -412 82 -186
6525 -186 -218 177 13 -487 181 60 -362 74 82 -480 -50 43 -203 -163 -409 -172 -250 -91 -85 98 -154 -18 -126
6548 -126 -310 -119 345 35 -171 438 -92 355 313 24 -393 109 169 -13 -41 486 -663 -329 103 -273 -105
6569 -105 -132 -34 414 483 -220 -154 52 -373 -453 93 -194 81 280 11 -85 -13 -119 -173 114 274 -72 -403 -164
6592 -164 -185 51 69 180 -32 -224 -240 -101 153 -99 -167 -14 -86 -42 -196 19 187 -73 255 -162 -531 44
6614 44 231 -421 62 71 -324 61 -175 241 176 34 -371 -233 -257 132 576 241 35 -155 -201 136 -165 -357
6636 -357 310 -153 -431 -566 198 350 306 273 56 -229 -282 -134 91 416 -346 78 190 271 -253 -111 -1
6657 -1 -196 -159 235 265 33 212 10 -180 610 266 9 -80 -457 163 -322 -281 270 -450 449 -375 -47 15
6679 15 176 -150 -68 319 -219 25 336 -8 -199 47 -194 346 87 -334 -107 266 10 203 -302 204 -61
6700 -61 -350 -312 83 -233 90 -279 -151 183 -157 -74 -191 350 212 -146 -34 -62 -18 15 -103 -182 -142 208 -409
6723 -409 378 106 -110 133 126 -57 125 -112 -74 37 -146 -397 362 -476 78 268 -146 142 -414 -277 -52
6744 -52 51 -414 -161 -352 -220 203 -8 -86 -308 -75 174 107 -411 251 -121 -284 54 -51 310 295 314 -223
6766 -223 500 329 -509 165 302 66 -170 103 -43 47 240 232 -347 279 -148 452 -309 221 154 678 -43
6787 -43 337 -102 183 -95 442 89 -392 260 107 282 229 -11 -562 -172 -487 -87 5 -397 -25 -228 30
6808 30 96 79 305 -5 398 -195 -225 -79 -396 -137 -306 180 -39 229 239 479 -309 -219 -149 -320 -135 -252
6830 -252 -328 -17 -380 -388 4 -393 -26 -94 313 -72 204 101 62 373 197 72 -331 97 259 84 139 -152
6852 -152 463 -2 -422 67 27 -231 25 80 449 -72 -337 133 -91 -292 273 467 -1 -149 -47 -249 226
6873 226 -204 -259 154 -108 -8 -55 155 360 7 -167 -87 -208 -6 381 -579 -338 -401 184 324 87 148 -340
6895 -340 382 -41 -204 -75 32 -103 129 1 -210 -212 146 -163 -135 -3 444 81 84 196 629 -120 204 549
6917 549 270 66 202 560 -124 -666 -270 -212 444 87 2 364 10 -220 81 249 -19 583 -222 169 -228
6938 -228 122 -204 -329 547 140 -33 251 81 -35 115 117 109 -463 -260 -506 120 -2 -191 -19 481 -8
6959 -8 -44 -112 413 278 -238 -73 122 -16 -132 45 61 -216 -92 -124 -262 264 -184 -75 -75 1 160 -344 72
6982 72 -175 167 10 -276 262 23 -569 -48 310 196 -141 243 256 201 69 28 -33 241 -389 327 -137 140
7004 140 140 245 -217 -244 -159 348 18 420 231 -9 -161 -550 176 106 105 99 137 207 157 234 131 394 -18 78 327
7029 327 53 689 -83 -325 -443 -93 -51 -67 -123 -292 190 -317 204 275 2 552 143 10 236 -213 25
7050 25 199 116 19 -65 -211 -193 269 -48 105 -26 -370 -42 -13 -205 71 151 154 -251 -375 -129 -667 -166 421
7073 421 -265 -443 -390 3 -152 92 269 -72 159 -317 284 164 184 337 -170 228 -97 95 286 -21 36
7094 36 -137 -103 -16 32 -15 -353 -180 -723 -82 -345 -153 457 186 -365 -42 -507 -204 66 -154 -72 -100 -304
7116 -304 -229 166 -73 -108 478 -58 -158 -15 -381 36 -79 -44 162 130 -237 76 57 155 -214 171 50 185
7138 185 223 426 445 -38 79 102 135 205 -116 -35 304 301 6 -139 43 -122 16 183 107 112 -166 -370 -43 129
7162 129 469 -44 187 -201 -275 -182 216 165 -681 -561 3 38 -228 82 112 128 31 108 -90 161 -28 -354 -30
7185 -30 354 -525 -51 203 48 67 -117 344 -297 -62 9 -432 241 -530 -176 -299 59 -11 29 -260 126 460
7207 460 208 -330 -236 -168 -388 -193 -29 -82 142 231 363 268 57 -86 -464 157 48 -142 -214 133 -450 -286
7229 -286 -10 -89 -312 -233 -69 -29 278 259 -54 338 -250 240 -394 -192 94 79 15 -97 7 -98 -26 -76 42
7252 42 -88 160 303 43 -215 215 -189 -45 102 -74 61 145 -21 78 138 -251 165 -367 -238 -172 175 -196
7274 -196 250 126 -387 -123 202 -354 -88 -272 -126 1022 112 494 -5 -9 -63 -180 -71 -196 -109 343 -327
7295 -327 102 -260 241 -122 14 -11 7 -281 -379 322 -278 -42 201 -30 -496 -47 68 -453 -333 -212 3
7316 3 -46 -76 -448 -265 172 137 293 22 9 259 129 201 -108 -113 533 -134 -129 457 -217 -36 -13 -237 -140 104
7340 104 -27 -491 -285 57 182 257 70 368 -22 43 -126 51 -429 -340 -108 -63 274 85 260 -485 -85
7361 -85 -140 33 50 291 -128 -253 -267 24 7 134 4 -480 141 2 -230 -139 -12 -36 300 -463 -332 -89
7383 -89 74 406 102 -213 30 2 -366 304 319 37 -30 0 -269 -73 -615 99 82 270 -102 128 237 -35
7405 -35 -174 -187 592 286 149 -32 7 -574 -328 -128 279 -218 210 -37 166 -83 145 358 -384 167 264
7426 264 26 21 -104 83 158 388 29 414 167 -230 -15 253 353 258 247 -165 -72 -133 -391 176 -146 -382
7448 -382 143 26 299 181 9 47 -152 -427 -167 -151 338 -251 -454 -54 164 -586 45 -268 121 -280 401
7469 401 80 -99 117 -108 -370 -251 -141 -26 47 445 9 -227 201 323 -94 319 -73 265 -38 -170
7489 -170 285 247 469 -248 18 508 86 -659 -62 -41 491 225 -1 -473 -346 268 -114 -158 -126 -181 -637 305
7511 305 -69 189 -250 -257 -121 -348 -57 104 517 -530 205 497 -117 85 114 58 -32 549 -314 31 -146
7532 -146 -440 -67 92 -215 -517 538 -14 347 -346 -63 159 -225 -314 99 -427 -274 136 232 246 -245 -42
7553 -42 -13 -322 56 272 -43 -37 -31 32 -113 -20 -7 143 310 -149 -285 -92 -51 212 5 357 -43 83 359
7576 359 297 -308 -217 145 -374 -497 -11 232 189 -401 334 457 15 147 138 256 -160 222 -83 -197 -54 75
7598 75 438 -121 -179 -3 -172 -508 -9 -42 52 64 297 69 -200 -18 45 286 -87 -32 -73 -256 -260 96 -212
7621 -212 -284 -21 84 204 -296 -194 -56 -404 -366 -95 -462 387 -115 -104 184 -260 41 290 -326 -538 428
7642 428 -255 188 -292 136 19 -80 322 192 -3 -43 -179 -200 208 0 -62 -212 381 -541 -348 267 -302
7663 -302 -92 27 111 -249 96 222 -299 39 -314 -239 195 -73 74 -349 -182 -132 -330 406 175 -341 -175
7684 -175 -82 115 105 -114 -588 -347 366 286 126 112 -305 -67 -129 346 486 -330 24 -160 -331 106 -36 102
7706 102 282 -177 -211 -121 -88 -468 42 -96 15 -254 -140 -417 -538 361 -457 -183 -214 494 126 -100 389
7727 389 -47 67 120 -109 276 82 145 294 -330 108 -331 -330 -235 -270 -275 227 -92 209 -79 -9 297 294 153 -246
7751 -246 -36 80 174 117 -86 143 -89 -120 -203 478 -153 -453 264 478 -188 -343 -33 -250 -335 -395 -677 -1
7773 -1 -77 -361 115 -27 277 355 208 41 -178 -245 25 276 -161 -253 1 396 349 -513 -157 4 13 -223 -82
7796 -82 282 166 422 26 -118 -236 315 -58 210 -114 127 128 -255 44 195 -83 -72 -245 358 -231 115
7817 115 -227 -417 -45 190 203 -101 386 -101 -171 -191 74 123 270 -150 -122 -52 -205 120 -404 -28 83 -73
7839 -73 -95 122 301 -210 -65 -117 -138 71 -62 -446 -17 465 -85 -685 237 282 -374 406 -73 -140 71 -115
7861 -115 -48 135 -231 296 611 101 68 -79 -182 376 114 71 74 -689 -91 -203 257 -26 189 -165 -11 -46
7883 -46 640 -456 -112 404 99 -65 271 -72 288 -314 306 10 -321 449 -28 -167 -101 -275 121 -143
7903 -143 -163 -459 -277 422 -83 293 -405 -10 -651 202 -5 -351 232 -451 141 58 406 464 -261 153 149 -214
7925 -214 -425 -213 393 -126 144 164 -78 72 118 -262 -82 173 -329 175 -233 24 -9 300 -241 -94 -9
7946 -9 -134 -67 591 53 54 -212 -155 -23 -137 74 -678 8 -255 -59 424 -64 55 159 172 -553 -307 -42
7968 -42 70 4 -219 -87 79 -343 250 77 -344 -43 -54 -269 60 98 -243 -201 -294 -138 -454 -106 -106 88 -337
7991 -337 -204 17 114 -63 171 -221 184 -270 -175 -575 -169 -189 -169 -15 -487 -25 -92 33 59 -218 -96 -193
8013 -193 -275 -122 51 161 -200 150 187 255 331 162 202 -198 -159 428 -180 -91 157 5 13 350 285 39 258
8036 258 499 -102 -384 56 10 188 497 -213 78 247 0 465 61 32 -4 185 -24 262 -263 53 741
8057 741 256 54 -466 25 -20 -45 -240 157 172 145 542 -150 -10 159 -104 -1 327 -279 -49 83 -461
8078 -461 -168 -238 -40 -224 -48 391 187 130 397 -180 -453 -548 35 -578 174 154 -194 11 -28 79 -113 -171
8100 -171 115 -422 -135 98 293 537 232 -56 384 296 -422 34 236 380 117 391 488 -245 9 353 450
8121 450 -467 445 -244 -525 397 63 -51 -493 51 82 -51 -114 -80 -141 -148 -286 350 -182 3 98 -228 368
8143 368 180 447 233 91 -187 -199 -542 124 -281 596 -225 -78 340 142 -179 -119 -335 210 -451 95 116
8164 116 227 249 -369 338 400 97 235 143 -67 -389 54 167 176 -380 43 -349 22 170 619 83 60 300
8186 300 334 432 -52 -264 12
8191A2
$$ Imaginary data points
##PAGE= N=2
##DATA TABLE= (X++(I..I)), XYDATA
0 0 0 0 0 0 0 0 0 0 0 0 0 0 0 64 -64 64 -64 128 -128 128 -192 193 -256 317 -322 385 -449 523 -640 705
30 705 -833 944 -1061 1209 -1347 1530 -1719 1920 -2140 2386 -2668 2956 -3276 3636 -4022 4435
46 4435 -4898 5398 -5957 6554 -7225 7955 -8776 9683 -10702 11848 -13149 14656 -16400
59 -16400 18461 -20940 23975 -27817 32840 -39719 49774 -65907 96115 -172296 766532
70 766532 1037918 -609285 -382923 568153 808904 -392195 -1124874 -695682 78832 -164288
80 -164288 -847214 -965174 -295699 146071 16387 -236897 35373 542161 760196 473693
90 473693 152916 167162 484436 587094 242458 -248666 -313990 25561 223625 -120216
100 -120216 -632012 -679304 -172315 227911 10041 -489619 -490131 70339 444265 158000 -277873
111 -277873 -193302 283832 486784 227772 -42031 33162 255228 281863 109489 -15485
121 -15485 7397 62862 26782 -97575 -204726 -200539 -132940 -159956 -297361 -320634 -110769
132 -110769 79781 -9697 -203757 -122240 214992 397671 230113 7123 73987 341476
142 341476 427267 186884 -113716 -164596 5485 99678 -54519 -307854 -380745 -208710 -26476
153 -26476 -61770 -229194 -254315 -52699 166041 190762 74712 33895 144774 258527 215993
164 215993 78894 34352 100910 108424 -11264 -109353 -78045 -33415 -106905 -215851 -194731
175 -194731 -63466 3945 -58746 -126306 -77106 44612 114730 85559 19577 5155 81050
186 81050 181965 181074 46292 -72480 -28258 101589 109609 -39748 -157004 -104724 17749
197 17749 29316 -78455 -158806 -119768 -26455 12285 -12818 -34934 -18841 16149 48850 73170
209 73170 79047 61163 45552 60832 93730 97028 50881 -8666 -36728 -32906 -28696 -42254 -73435
222 -73435 -112588 -128504 -90386 -26005 -13442 -62958 -79287 3951 112784 129454 64459 31772
234 31772 77919 131303 115844 49297 -2110 -15664 -14002 -17370 -39052 -80947 -119107 -114112 -66788
247 -66788 -29116 -33364 -47971 -29016 19363 56793 64231 54431 45570 42824 49610 62845 62718 27175
261 27175 -24271 -39920 -6462 20723 -8494 -64622 -74007 -25674 17161 3677 -41118 -58231
273 -58231 -27916 14572 26978 5672 -21416 -19842 14777 51795 49165 13013 -5985 21194
285 21194 59682 58690 19381 -13006 -13231 -1800 -4976 -22374 -43735 -59207 -59160 -40332 -18312 -15524
299 -15524 -28398 -27327 5817 46753 59979 46166 32020 34370 46660 51760 36218 2141 -28923
312 -28923 -34171 -17571 -11470 -37060 -69402 -66742 -26917 6758 3914 -14774 -10723 20410 48267
325 48267 49513 32300 15261 10220 18152 27183 18905 -9981 -35125 -31142 -6807 2735 -16276
338 -16276 -36529 -28572 -2186 15081 9484 -3030 -8192 -2765 11265 22514 17852 -1425 -15076
351 -15076 -2115 23260 26815 2507 -17306 -7646 17333 24322 4670 -16348 -19533 -10088 -2133
364 -2133 -4365 -16136 -29201 -28669 -10013 10083 10732 -5102 -8140 12913 37187 39309 22459 10126
378 10126 12598 19657 17239 4748 -13592 -27983 -30959 -21990 -13822 -21336 -36785 -35744 -12601 11491
392 11491 15822 4932 3734 19283 36097 39021 27990 13363 5642 7914 12850 8346 -11035
405 -11035 -30400 -30461 -14241 -5220 -15454 -29018 -26545 -6342 8926 9271 1811 -1498 4639 15809
419 15809 22669 19815 6538 -1417 4234 16606 16789 991 -12760 -10195 2383 6226 -3117 -14842
433 -14842 -17987 -13540 -5861 -1956 -7467 -15949 -16371 -3473 11624 12333 1129 -2867 8934 23215
447 23215 25444 14326 4880 4758 8854 10154 3958 -7816 -19301 -20918 -12949 -6761 -12696 -23308
461 -23308 -22743 -7774 6944 8589 1998 1789 11207 21725 23983 19092 10406 3528 3446 7700 6536
476 6536 -5704 -19576 -20779 -10163 -3179 -9298 -18500 -16013 -3818 6479 7695 4376 2159 4429
490 4429 10428 16559 13867 4961 -3691 -1289 7125 7744 -2684 -12507 -10587 -2293 1964 -2214 -8627
505 -8627 -9364 -5090 923 3809 1337 -5012 -6297 254 9063 9622 1116 -4293 1370 10373 12287 4897
521 4897 -1567 -1566 2186 3810 1537 -5285 -11412 -12635 -6572 -2262 -3906 -11469 -12361 -3291 7142 8728
537 8728 4654 2800 7403 13788 15796 12280 4656 -564 -201 2071 781 -7099 -15859 -16088 -9818 -4688
553 -4688 -6518 -10782 -9497 -1362 5833 9278 8043 5659 6472 10005 13700 11097 3597 -2770 -2570 1743
569 1743 1903 -4692 -11230 -10415 -5373 -1609 -2441 -4792 -6440 -4071 1244 4969 3539 -1083 -2581 1456
585 1456 7410 7538 2192 -1497 1378 6514 7466 3525 -820 -1616 -203 1994 857 -3932 -9161 -10094
601 -10094 -5923 -2004 -3647 -8084 -8126 -1743 4883 5943 4415 2894 5838 9474 11459 8801 4373
616 4373 93 -1243 848 416 -4874 -10549 -11248 -6294 -3605 -4511 -6542 -5054 -1237 3511 5948 5210
632 5210 4389 3506 5373 7589 7144 2292 -2217 -2319 473 1318 -2657 -6571 -6036 -2763 67 -108 -2081
649 -2081 -2905 -2224 1341 2993 2192 -526 -1889 249 3548 4073 -47 -2097 -431 2841 3998 1959
665 1959 -754 -1516 -943 1261 1328 -1560 -4857 -5332 -2559 -80 -801 -4162 -4101 -985 2632 3803 2237
682 2237 1231 2162 4211 5171 4378 1613 -1631 -1629 -192 218 -2657 -6473 -6161 -3195 -641 -671 -1724 -2020
700 -2020 698 3111 4739 4672 3056 2010 2497 4389 4146 590 -3047 -2890 -674 -671 -2449 -4488 -4722
717 -4722 -2899 -382 215 -244 -1321 -620 1597 3681 3390 979 -615 1102 3738 3111 909 -1662
733 -1662 -1477 204 825 167 -1399 -2240 -1996 -765 347 -996 -2411 -3446 -714 1199 1009 -623 -1962
750 -1962 414 2856 3132 2033 989 901 2141 2630 2389 571 -1882 -2076 -363 227 -1863 -3892 -4653
767 -4653 -2503 -838 -648 -1312 -1109 486 2100 3652 3317 2549 1859 2221 3367 2940 1132 -1313 -2602
784 -2602 -802 -367 -2183 -3475 -3388 -2202 -749 73 -679 -1166 -248 1116 2333 2912 1558 365 234
801 234 1766 2239 622 -1173 -1458 -274 631 -108 -1183 -2113 -1025 -408 130 211 -1074 -1609 -405 1590
819 1590 1321 -768 -1111 -305 1492 1675 1144 -88 -110 777 1962 1799 527 -539 -1459 -57 378 -689
837 -689 -2411 -2674 -1525 -162 -123 -908 -1072 -252 1378 1999 2506 1214 803 720 1824 1279 327 -1150 -1651
856 -1651 -695 -711 -1096 -2114 -2231 -1481 144 233 708 393 745 955 2011 2345 1079 -33 47 463 382 -40
876 -40 -1265 -1534 -961 -478 -222 -646 -639 -1196 78 1476 652 -122 -350 227 1587 1025 257 -577 -668 657
896 657 1080 92 -208 -599 -404 -24 590 300 -430 -1435 -449 259 125 -841 -1468 -711 -299 590 674 -17
916 -17 342 721 1286 1497 1066 84 514 500 728 80 -1823 -2262 -735 -704 -490 -1370 -1346 -718 -348 529 357
937 357 552 484 1006 1739 2036 583 269 -23 735 389 -427 -1101 -1193 -954 -773 -478 -513 -831 -905 65 411
958 411 329 375 -223 -115 1031 1190 -13 213 -144 651 384 755 179 -190 -510 103 537 -3 37 -990
978 -990 -537 -751 156 -592 -956 -307 372 562 255 -104 708 470 250 1061 199 20 129 193 486 158 -798
999 -798 -482 -1219 -90 -383 -657 -438 -930 -191 137 676 451 -242 754 1039 1028 249 244 -88 -99 251 -309
1020 -309 24 -710 -901 -558 -157 -393 -564 -786 193 584 729 -78 100 77 651 694 461 -68 -411 -46 245
1041 245 34 -331 -582 -733 50 318 -192 -320 -892 -275 391 269 406 -355 99 284 424 246 -356 -246
1061 -246 -218 249 414 -11 282 52 -256 23 37 -253 -216 -777 212 -16 -190 -363 -197 -92 57 369 246
1082 246 -43 73 269 905 290 7 -60 -644 -224 -136 -442 -174 -312 -631 69 -82 -332 -591 -158 485 576
1103 576 512 -21 120 446 302 394 4 -177 138 -83 109 -49 -495 -442 -232 241 91 -499 -372 -138 34
1124 34 87 101 -24 -610 365 431 -497 20 101 265 751 334 -178 -266 -549 324 -47 -358 21 -100 -292 -582
1146 -582 -507 -109 -395 -338 156 -89 485 82 56 126 181 320 502 -545 -442 -171 131 106 -164 -232 -423 140
1168 140 -358 -68 53 31 -489 -132 -7 595 112 11 390 308 377 323 123 -149 -115 -86 -211 -435 -366 54
1190 54 -123 -79 454 -139 -228 243 244 -538 -413 99 -309 -59 321 -372 -434 -375 282 156 212 478 -98 342 761
1213 761 -48 -80 -195 -100 -150 73 -51 -222 -70 -160 -106 443 243 -338 451 -140 401 -89 190 -317 -126 209
1235 209 -264 1 -735 -131 -489 202 -137 -385 137 -180 197 91 382 -396 -320 24 102 -161 90 -100 -318
1256 -318 -217 -4 21 -926 -276 -578 309 -606 -159 353 5 -116 -111 -150 367 -264 26 138 239 -25 154
1277 154 42 -117 465 -660 -288 -308 -50 231 -185 -88 -213 -496 -26 86 -560 282 -47 42 313 509 119
1298 119 -75 178 282 445 81 24 -54 -8 8 -190 -169 -581 -432 -178 -89 190 355 210 333 305 78 -328
1320 -328 318 158 313 -277 126 132 -142 180 -176 -147 -483 -361 -59 -727 81 -245 -50 -396 -253 -29 78
1341 78 -292 176 -36 -38 93 -193 -54 -425 -276 74 253 -26 -76 253 -253 20 508 -64 -458 -117 -88 -590
1363 -590 -317 -333 32 -65 252 371 127 349 -281 274 244 14 -338 -359 -434 76 -243 237 -31 -574 144 254
1385 254 -422 79 -435 -315 295 416 260 459 -46 103 -377 151 120 -257 228 146 307 448 -359 -400 -132
1406 -132 11 148 -438 251 288 -58 448 578 -116 77 184 477 -186 65 -507 46 125 -493 27 -247 -95
1427 -95 -349 234 -228 -102 273 -377 -69 -33 12 435 213 645 -84 219 -58 114 -278 354 -420 -556 102
1448 102 261 157 203 -100 -226 -446 -291 -332 339 174 732 -226 214 460 298 -95 -35 -32 -152 -4 214 -137
1470 -137 -466 152 -37 -816 8 -3 -173 -188 308 242 518 171 247 198 -66 321 -30 -41 122 18 142 -394
1492 -394 203 -454 123 53 -13 -350 -161 -61 178 404 17 -274 -51 -356 176 386 -96 11 211 -129 -116
1513 -116 -45 176 -535 123 358 -15 -207 -284 -162 -87 438 -492 106 -720 75 -188 280 -252 -72 302 144
1534 144 396 485 -433 -97 -477 -37 301 279 98 -432 407 -49 120 -209 261 -165 425 113 139 521 133
1555 133 230 84 -121 340 -554 -518 194 -293 -167 -236 -454 112 111 55 286 51 136 298 51 235 -5 209
1577 209 80 154 230 -220 -472 -150 207 100 140 -22 -308 386 -250 121 181 80 22 -222 22 -108 60 302
1599 302 -130 152 283 -27 18 17 -208 -475 -145 424 200 -385 381 346 -269 -371 -280 -68 -175 112 -119 -118
1621 -118 -370 577 -89 -704 -357 -136 242 178 372 -97 -161 342 -98 -51 -283 -421 -185 -453 -261 113 23
1642 23 -371 213 -324 79 95 194 383 -10 610 -196 -363 -76 -69 253 127 -122 -446 -296 -560 -448 169 173
1664 173 17 175 -27 102 -93 -423 169 -170 -448 122 72 644 44 263 -224 -107 -203 286 196 315 -254
1685 -254 -455 -396 -670 -368 -312 169 -230 226 74 -171 -16 -5 96 -4 -77 141 -203 410 -38 434 26
1706 26 270 -348 -401 -553 99 92 -290 310 -527 -255 -40 -182 146 -152 -14 -200 -38 -99 161 40 159 -62
1728 -62 -450 -63 -82 -282 -409 -273 7 -161 405 -194 -289 203 -458 97 -28 711 34 399 199 69 91
1749 91 -249 395 205 119 136 118 59 75 436 -18 31 59 -82 127 -298 76 -283 152 206 109 477 -330 -200
1772 -200 -52 258 246 -75 278 -460 -110 -182 -220 -130 -89 -153 125 -43 253 -233 206 -268 -203 -150 44 545 113
1795 113 281 602 102 248 -25 -188 -97 -34 -280 -288 -9 -203 47 28 111 -206 314 108 -67 -644 -107 383
1817 383 91 -14 298 94 106 245 -9 -117 24 140 -815 127 51 130 -82 175 235 -426 -427 232 -157 -317
1839 -317 301 -50 -83 44 84 248 -28 -67 390 -110 -52 -26 -13 58 -186 -193 663 -56 -569 278 -199 100 179
1862 179 -109 23 49 -172 -199 -99 252 -223 151 -126 159 -14 -301 -103 168 625 -30 -36 -35 210 314 240
1884 240 35 76 -76 -225 232 -44 104 142 -53 397 -446 178 100 72 9 300 501 71 242 274 -311 31
1906 31 -109 126 -23 -49 52 -226 372 5 153 84 -408 53 54 370 -139 -124 155 235 365 121 438 -24
1928 -24 127 -41 170 -306 690 -219 54 104 -159 300 -249 102 -634 -56 128 -74 -160 -188 27 729 -235
1949 -235 205 3 -3 221 233 -139 79 137 469 366 -102 49 483 -156 -235 238 17 -90 72 170 324 -105
1971 -105 -33 -59 433 -22 -11 -200 -99 -50 -78 -401 -236 -248 -163 79 -392 -435 153 -3 -528 -139 -41 466 -83
1994 -83 -229 293 38 -88 -96 -332 -291 -84 287 -208 -59 -201 -203 82 -304 222 -316 -17 -92 -598 -171 401
2016 401 158 187 -184 268 -117 -309 345 -199 273 -303 225 75 492 -140 398 -179 402 82 -272 -46
2036 -46 -192 92 79 139 -99 -211 -72 -36 116 -266 -446 -37 -222 -361 200 -70 -199 368 113 37 248 80
2058 80 124 165 -164 -436 -231 -110 -503 46 80 -15 -51 47 -92 209 114 -601 -308 -262 -414 51 9 -73 442 153
2082 153 -352 7 -27 548 200 152 -189 178 -340 -264 246 194 121 -48 -19 549 -197 281 -395 237 206 -13
2104 -13 -325 102 41 -269 -325 -768 -302 -3 207 39 59 -158 -251 233 57 -4 -218 172 -437 507 -211 62
2126 62 -205 -114 428 -1 -1 350 285 294 -608 66 -8 319 -329 -53 226 -478 74 -422 193 -452 -10 389 11
2149 11 99 123 -187 -111 878 196 80 127 482 480 88 185 -155 55 381 78 54 -90 338 154 137 -390 -114
2172 -114 63 -212 471 -192 -415 160 331 229 99 -13 -387 326 -40 -229 -72 -114 -106 22 50 348 -31
2193 -31 -163 -505 -77 474 -263 -27 -327 181 -117 -275 55 156 -229 340 -202 151 45 -509 470 370
2213 370 349 -206 -169 393 203 292 3 -150 -261 53 62 294 -123 -91 -139 66 359 -7 -91 -68 -215 -48 -109
2236 -109 -81 109 -454 19 75 105 313 111 280 254 34 -476 -123 -404 379 -501 -209 89 -412 -144 -72 125
2258 125 86 -96 209 201 598 131 -156 60 -138 -152 152 -602 75 324 -80 -242 -76 -213 -229 266 -11 -86
2280 -86 2 175 580 -107 318 349 184 -186 -145 -465 -152 -35 -401 262 31 121 -155 96 127 287 29 53
2302 53 219 -189 94 -295 337 305 -148 -199 -85 117 -355 54 235 -259 52 -54 -26 -360 -377 -30 499 -342
2324 -342 178 580 199 91 -82 -207 -313 -231 499 -87 62 -225 -129 614 -554 187 -5 57 -261 84 -102
2345 -102 -319 455 -269 195 -434 -252 52 -1 -84 196 241 -332 -30 -278 186 -123 434 88 183 -83 -384
2366 -384 -311 97 -227 158 -300 178 157 -13 235 23 105 -89 -50 126 37 348 -84 627 223 -151 131 33
2388 33 -47 -135 -438 -704 209 -105 -91 -333 -356 -13 -92 187 -336 70 -292 102 -35 304 57 -57 71 191
2410 191 104 42 -523 -205 -94 -189 326 201 -55 -246 144 -99 622 151 -120 392 -297 64 98 -597 -22
2431 -22 387 146 56 -169 345 89 -258 -370 365 454 165 384 -225 -26 206 16 -231 238 -114 226 -374
2452 -374 -89 183 -103 93 34 139 156 37 -311 -222 209 341 -838 8 218 -65 -163 -347 -111 -189 -442
2473 -442 459 434 163 245 -310 -285 -196 -264 343 225 -80 -45 334 -353 -538 244 9 20 -90 -35 -297 -189 -38
2496 -38 211 55 -106 -217 314 -244 264 -164 -28 1 -90 125 74 311 79 131 -4 231 321 459 -293 47
2518 47 -159 -145 414 -34 -198 127 41 -99 111 93 -352 223 75 218 377 780 85 114 66 -106 143 309
2540 309 -106 -212 91 -575 130 -59 182 -422 204 -182 82 61 152 110 -359 -148 32 -508 23 -349 -157
2561 -157 -118 -263 361 -433 383 0 61 224 140 155 196 -6 -291 -14 -70 255 243 -432 173 459 -75 193
2583 193 -81 -220 115 -176 -420 14 357 91 220 -334 22 -181 137 -373 219 88 -186 144 -287 -5
2603 -5 -109 82 39 -164 -506 239 134 135 -172 -162 19 -243 -230 -63 64 180 -45 287 -154 45 292 -697
2625 -697 237 678 -43 442 295 -76 189 2 -33 155 365 -131 -406 65 -57 -87 261 -117 -482 263 16
2646 16 -153 399 343 184 -318 -164 113 317 -258 -127 335 131 -197 -73 -428 322 134 -40 -218 -336 293
2667 293 -80 -67 106 33 84 7 -273 351 138 55 -174 -124 -236 -136 327 -296 -85 297 -131 -366 -202 420
2689 420 -232 -584 -65 268 218 -263 -83 352 -147 -98 87 -110 -63 -115 -4 121 -90 94 65 3 -80 226
2711 226 -177 -399 -155 94 203 -186 71 -361 261 -107 -221 111 303 -9 279 259 71 -172 196 -40
2731 -40 605 183 -173 40 469 466 77 376 284 368 -70 39 60 190 354 -100 -42 335 78 692 189 -439
2753 -439 51 -11 63 65 492 -322 -137 188 200 -90 -406 -84 116 147 -169 115 -60 284 -462 57 -329 -211
2775 -211 323 148 122 -257 382 -388 78 -288 120 -36 92 -68 -23 25 -332 -535 -222 -61 81 167 266 55
2797 55 -24 -109 -219 -174 126 -242 191 147 209 88 374 43 -104 -94 -125 77 -178 646 202 160 -45 -168 292
2820 292 -202 -387 -182 297 -199 -77 560 221 165 -68 -371 62 197 206 77 -39 -525 184 85 143 -72 219
2842 219 -189 -247 -199 206 -276 -29 240 135 -417 285 114 -74 488 -220 4 153 36 -25 258 518 188
2863 188 -373 199 -206 97 188 -1 -34 -395 -300 -21 -7 167 -52 502 140 -85 45 181 257 462 -192 159
2885 159 -238 96 58 -7 334 66 147 390 -235 -129 -414 -243 -464 21 -177 -325 -435 -335 2 -296 152
2906 152 162 -45 -725 -261 -35 -221 -152 71 -121 86 159 -515 185 176 65 8 32 -105 408 82 138 434 -361
2929 -361 -353 -490 -29 99 21 53 -15 -218 483 -186 115 74 -289 44 353 -89 1 76 -546 30 -136 -343 -160
2952 -160 235 325 -124 -161 332 -157 310 -131 -63 -85 -120 -59 -12 -630 -462 -117 159 263 167 358 104 -115 -562
2975 -562 -26 -237 -238 -508 44 153 -360 -435 67 487 82 -367 168 176 217 223 -95 17 -258 -105 138 101 72
2998 72 -130 -363 -62 -433 -219 -96 -46 -73 -172 -298 69 -8 -179 -400 -89 255 103 333 31 241 -8 704
3020 704 -534 -161 152 -117 94 417 374 -31 363 14 33 189 239 306 -151 -207 -419 41 225 -61 -299
3041 -299 205 193 -102 102 135 54 1 121 -29 -25 -141 79 -247 -23 326 0 157 -606 148 52 -275 81
3063 81 55 115 317 -208 123 4 -2 204 138 -193 57 -223 -115 -34 -61 -87 96 417 -37 -335 -284 -226 292 -51
3087 -51 -350 -83 362 35 -45 -4 302 126 442 -271 267 31 -99 -92 -213 -240 16 -175 95 -228 243 -72
3109 -72 -321 -194 -18 576 -172 -65 93 288 134 -314 -31 -27 250 -156 48 -99 57 20 160 -214 -289 -55
3131 -55 -126 291 314 378 -274 230 138 10 358 400 65 -35 -86 -155 -207 800 -406 331 -74 -82 -95 160 -100
3154 -100 315 197 343 -93 -39 -114 -465 -311 -131 85 -140 -206 72 229 -198 -278 -7 -139 -28 382 40
3175 40 -136 -525 457 -295 -198 -126 -12 -3 -117 -186 -134 -264 -172 404 -199 421 -457 -242 -154 458 314 264 80
3198 80 -363 502 154 -464 -51 59 99 -96 151 -469 -78 175 -16 103 -49 -439 227 282 -414 -35 -118
3219 -118 338 210 -6 77 139 -46 119 221 -128 -225 -477 -266 -292 -148 414 -4 17 142 -44 8 333 -264
3241 -264 -78 59 -317 72 -69 -102 435 -212 -162 211 -564 119 23 272 -132 102 135 74 -282 39 49 201
3263 201 16 -71 -101 -177 107 -11 232 348 181 588 87 137 349 8 194 309 131 366 56 337 -38
3284 -38 9 105 -224 -176 40 249 34 145 -295 -40 -258 -308 -309 -144 -526 -197 140 -240 -302 -166 277 55 -14
3307 -14 285 -158 -53 31 224 44 256 462 -225 152 -49 -438 348 42 -378 4 157 36 -61 -67 -87 208
3329 208 -77 -156 114 347 451 107 -250 -53 446 -134 170 -452 21 676 68 -152 45 28 -154 -364 -143
3350 -143 21 -155 -136 -11 151 231 505 188 -31 -6 208 217 -59 -330 192 306 -98 259 -177 287 288 -162
3372 -162 -345 348 566 -125 -207 -415 -197 -333 -199 -213 133 383 56 -121 20 35 -49 -529 325 123 -41
3393 -41 -263 29 -79 430 94 -299 -166 557 109 556 -373 -60 13 -52 -368 258 489 -82 55 154 84 -399
3415 -399 -126 117 234 20 189 11 -60 132 -254 -49 -195 -434 89 -360 -224 -249 230 476 -373 151 103
3436 103 -137 -100 86 332 -14 -64 201 432 150 -205 36 -349 -249 160 141 355 -244 217 241 67 103 -40
3458 -40 -306 438 21 300 18 191 318 -319 78 -54 -250 23 -773 -208 226 435 118 47 332 144 144
3479 144 115 556 39 -33 -112 194 -102 244 112 23 -131 -9 -404 -171 -72 -344 545 105 -302 -1 -2 -144
3501 -144 -18 46 181 -95 -76 146 402 -126 -252 88 -236 219 -40 167 397 -169 11 118 -339 -204 18
3522 18 -500 -112 -129 501 -193 172 106 -35 234 -105 290 30 -128 239 -140 191 -256 706 311 -394 79
3543 79 -582 -35 -251 80 33 127 311 -223 172 -177 500 -149 313 -224 30 84 -660 98 20 -262 58 314
3565 314 -309 53 -68 33 -473 12 102 215 -419 0 -8 -71 613 84 -143 2 213 115 -231 -7 -145 64
3587 64 -103 135 204 522 -70 474 400 -87 -317 466 -726 85 -44 555 -228 -180 -64 -149 383 -78 109
3608 109 369 61 -392 241 -455 103 248 175 107 -491 -177 231 469 507 70 -60 -492 385 278 -243 202
3629 202 -285 -44 -35 -256 619 -278 227 -19 -8 1 168 374 -11 -90 -442 -12 -42 -48 14 49 -506 574 704
3652 704 26 -436 28 336 374 108 -98 -98 251 376 23 -230 -257 347 -380 163 468 -125 -208 -375 -65 -106
3674 -106 -225 -433 -24 82 -196 -632 -374 -316 286 80 132 -84 306 90 97 349 313 751 -379 -4 -379
3695 -379 672 353 172 -64 156 -7 -96 6 -653 295 -709 431 201 294 294 60 356 -152 39 -109
3715 -109 424 -9 176 289 -3 38 312 67 -76 -38 77 -219 -58 -381 -148 -173 6 -139 211 -63 -14
3736 -14 -73 139 -170 -313 340 37 -237 -20 69 87 -513 297 -133 -169 -244 -241 -157 -87 185 128 -20 -211 75 368
3760 368 204 202 415 499 453 12 87 461 -415 16 -149 66 -189 544 61 -62 53 -84 255 266 105 233
3782 233 -539 -91 -35 -93 -203 32 314 144 69 -275 -513 -326 90 202 252 -693 -391 156 -318 203 247 -144
3804 -144 667 147 91 243 100 304 306 -439 31 407 -96 96 198 262 225 -187 -289 64 -357 210 -352 -142
3826 -142 278 -13 -236 -163 485 157 -163 -270 -289 -624 -173 -167 801 140 243 -408 -233 -498 -43 330 -95
3847 -95 403 113 247 105 145 -283 99 213 -36 398 381 -350 -277 35 -16 279 -202 63 -178 266 -53 -223
3869 -223 -82 -35 233 -476 -466 395 165 -108 -68 287 66 78 -182 -9 4 9 -325 135 581 -10 182 -106
3891 -106 69 232 -242 349 29 -239 312 -362 58 79 -370 -19 -23 215 -440 -226 -352 -223 92 36 -318
3912 -318 -14 -180 37 -153 -282 -518 -137 -153 230 -448 164 -102 418 97 -301 -22 -424 86 -151 -239 -229
3933 -229 60 -345 -317 -166 175 -28 -3 120 -202 527 164 -110 -646 147 49 -496 -296 -76 143 -12 -163
3954 -163 303 -193 -55 78 -102 203 19 137 -454 -139 -108 -222 26 -53 57 -2 -118 -505 -15 156 165 -24
3976 -24 -301 98 546 -193 393 -311 199 -13 -24 92 -209 632 -538 -32 -261 -120 -198 181 171 113 86 104
3998 104 -368 23 -850 655 242 -175 147 41 -18 305 -443 -404 -61 44 31 152 -203 -33 224 -185 5
4019 5 97 -18 190 109 244 270 -123 -60 -185 -83 -167 34 -555 60 131 414 168 222 167 -616 208 714 -107
4042 -107 -120 -22 43 -32 -65 -52 292 98 197 133 -275 207 -42 209 129 -518 160 -340 40 -2 -63 -3 -68 92
4066 92 31 107 -328 452 -108 -36 -371 -519 -9 -125 241 -170 70 -50 -404 164 467 -49 -327 -80 -291
4087 -291 525 -41 8 -376 330 116 -485 -241 66 -535 -61 88 199 -217 -11 -285 -236 205 40 -95 211
4108 211 360 -181 525 -278 342 47 -205 75 -663 -390 552 -33 -331 -172 -121 -127 -573 61 -162 -549 144
4129 144 -235 -236 271 -52 -194 133 -279 2 -94 -136 23 342 -502 -172 347 -186 675 220 283 -314 -209 397
4151 397 -469 63 -113 -55 -324 3 73 159 -470 -28 -74 -85 114 -30 34 158 41 -55 196 -103 -142 -56 345
4174 345 91 15 99 183 176 -7 -156 -248 75 57 -116 126 -159 -29 356 390 72 56 333 -275 741 -35 289
4197 289 -22 9 255 -26 151 44 25 -159 -174 129 314 60 384 -460 -8 94 -556 48 228 221 43 -102
4219 -102 -167 -23 -18 55 -84 -105 -296 -102 -103 108 -37 -16 -286 -86 -41 64 133 97 106 -104 46 210 -180 -81 28
4244 28 -113 -298 -14 -264 301 17 -253 517 288 -34 185 84 157 239 -137 116 183 -127 -150 137 391 -88
4266 -88 -26 123 -323 -66 161 -184 588 118 -79 212 -489 -241 159 -116 29 -183 264 -266 -523 600
4286 600 -563 188 -154 181 175 199 37 -60 453 -130 -343 -85 40 -412 -62 15 62 103 440 -275 110 372
4308 372 169 51 222 178 1 55 77 -319 -392 13 25 13 57 41 -251 154 298 334 70 -96 65 -176 433
4331 433 -272 -240 -197 276 10 -452 -69 -265 -231 57 -378 69 201 334 -512 -265 296 463 -20 59 -17 397
4353 397 144 207 173 -280 -360 -184 228 99 93 -248 431 30 63 -68 -203 335 -97 -95 204 108 190 68 406
4376 406 -90 -347 70 43 -359 -86 159 -132 367 -231 -183 -126 80 -114 -18 165 -307 -166 -621 -16 40 371
4398 371 -77 -87 -99 -510 549 56 262 375 446 -258 -307 204 59 121 -30 467 -19 124 -165 119 167 118
4420 118 -236 -106 -1 125 26 64 0 -115 333 51 276 -40 -206 -400 -71 4 -33 -85 148 -347 -354 -178 -7
4443 -7 112 -288 638 219 -20 -226 266 -175 165 432 257 -159 -51 458 147 321 318 -315 514 -108 205
4464 205 -23 73 -91 -171 87 -169 -272 184 75 -378 263 81 298 -372 -547 136 -126 -111 610 -204 -105
4485 -105 317 -34 355 -518 141 61 86 -155 -206 364 -23 158 -199 52 478 153 -130 59 332 -121 -81
4506 -81 -382 17 115 -110 46 264 -428 -29 184 182 -333 120 -76 296 -154 158 16 566 275 -116 -349
4527 -349 -488 -178 -383 199 -482 138 -296 149 -26 -254 -140 -556 -352 -195 61 227 -10 -335 -524 413
4547 413 85 -204 -250 385 -176 -32 377 26 -72 452 186 -323 -189 197 -188 79 365 484 486 -292 24
4568 24 588 330 235 239 10 105 119 83 105 -15 48 -398 4 81 -294 -19 -412 354 252 120 222 179 -107 65
4592 65 107 163 -438 207 -391 -407 -77 -192 84 91 185 -276 -268 161 -6 -182 -222 -597 -290 -94 76 -75 61
4615 61 -94 -337 59 284 131 77 -110 550 108 417 100 284 255 3 -307 -191 959 -219 -262 248 -222
4636 -222 -141 -227 -154 -215 333 -467 16 -427 106 -89 -789 -132 464 -247 -272 -112 -284 63 222 487 135 88
4658 88 115 5 34 292 -215 23 143 -160 25 -236 184 -129 -165 -55 -174 233 -45 200 46 492 -584
4679 -584 -103 -640 669 -279 238 -61 -306 342 314 140 96 -160 29 -155 -124 104 -111 507 104 137 411
4700 411 55 -27 80 -84 -289 64 -309 147 -90 -234 75 -111 168 -387 -131 12 251 82 -250 335
4720 335 -108 299 -176 -5 352 465 -244 -255 -219 176 217 383 244 443 -79 98 54 569 1 -100 -57 -326
4742 -326 191 -22 -116 34 290 -33 453 330 99 -506 330 -75 198 -8 142 348 417 284 -205 -25 117
4763 117 51 22 -313 -540 -296 -97 -69 188 -488 9 -66 229 -23 266 197 -154 -622 85 10 161 -24 35
4785 35 86 -146 -160 68 -33 -190 -148 -68 -13 -279 -188 -60 36 79 -118 58 22 -394 -134 17 81 85 -350 232
4809 232 56 -223 456 238 -79 -133 427 135 -124 -103 -89 60 -306 -387 -469 -140 -492 -471 386 -363 199 144
4831 144 7 -28 -320 160 253 71 22 -336 182 -156 27 11 16 54 172 503 134 -184 303 -289 225 -186
4853 -186 291 -3 -503 -130 257 136 -28 216 160 -325 -237 16 215 -245 -412 359 -388 -177 305 47 218
4874 218 5 -80 1 520 -83 91 53 462 16 287 -144 90 194 170 388 37 275 362 -239 -223 -76 -145
4896 -145 -48 251 101 -313 -181 -451 -180 15 -253 -102 71 -61 -547 377 314 -167 -332 -327 -148 85 78 -100
4918 -100 106 354 -105 -133 -306 301 -323 345 193 274 93 372 445 -510 215 -227 29 -530 -339 -261 -318 280
4940 280 189 46 -197 -346 -472 -37 -298 -184 24 -62 176 -267 251 -63 -346 68 -118 89 -167 395 72
4961 72 -24 -86 106 -132 33 348 -299 140 443 131 -13 -243 49 218 -157 388 -48 47 -215 447 -107
4982 -107 299 4 -205 -79 145 -44 -133 134 -125 -180 -542 237 -190 -380 377 -129 2 245 -454 -377 -355
5003 -355 -16 13 2 -92 142 -249 -190 -25 31 -128 -8 -261 173 134 -590 -67 35 -291 479 294 -211 89
5025 89 70 69 -291 -561 121 231 37 -123 -16 245 -212 -646 -61 277 499 109 -288 157 -73 239 237 -77
5047 -77 268 160 135 133 44 -381 398 -258 -72 331 -36 40 -109 -14 -366 48 -167 -62 -38 238 -138 -9 370
5070 370 463 -29 427 -215 86 -264 335 70 41 344 -127 341 -249 -455 71 -156 -56 92 105 117 142 -37
5092 -37 -155 471 94 -389 -215 216 -170 -3 -226 133 304 238 -82 -29 -77 156 -126 -463 -148 -315 -283 -380
5114 -380 -185 -62 -84 648 -50 0 -107 -137 -42 -15 -255 -89 -28 32 -221 384 -398 -11 62 466 81 52 219
5137 219 -163 290 -316 46 -87 -363 599 29 -104 -522 -3 100 136 53 -219 -246 -234 -120 -63 -420 -89 -200
5159 -200 -274 109 -300 -169 -60 37 -141 237 84 264 26 -42 251 77 210 39 283 -235 -278 -50 72
5180 72 96 367 251 -560 83 345 135 -702 60 -395 436 -219 7 -51 -80 -413 -537 199 -39 -170 -134 52
5202 52 -118 -347 188 112 104 -66 222 286 -181 -6 -325 286 -609 11 172 -6 -375 314 375 124 -175 120
5224 120 452 -162 -363 -249 -5 -322 17 161 -76 435 650 262 193 -430 67 166 67 54 166 135 -104 -279
5246 -279 -210 -228 205 47 161 -167 117 536 142 505 -257 -234 161 14 31 -372 21 -99 142 -71 57
5267 57 8 -2 31 -69 -32 -193 213 -407 -104 338 -40 -128 -196 20 317 124 -89 143 89 333 397 -473 -139
5290 -139 -226 10 -67 -172 49 335 118 -189 -173 333 40 -331 56 -433 -234 410 228 206 215 61 108 -331
5312 -331 -155 274 -325 -243 17 229 83 661 159 -104 144 19 -14 -93 423 -194 -85 -176 195 288 -153 -236
5334 -236 57 202 17 208 115 376 210 -271 152 -401 116 -233 67 -24 387 45 11 -252 -300 -318 250 162
5356 162 -256 -409 98 231 -291 -155 204 58 14 148 -209 -24 -80 136 69 -296 -27 305 -25 -86 253
5377 253 -108 -312 273 -316 -66 -228 111 -135 136 219 -217 408 -88 105 -267 -381 374 -120 71 253
5397 253 185 -138 -281 225 129 261 181 -122 -21 -377 30 -49 -8 337 -271 33 -263 -335 -365 75 -74 -227
5419 -227 -1 159 276 -287 -203 376 -24 105 -107 -321 -322 160 -252 453 -170 -430 -295 -70 390 219 -112
5440 -112 -375 -64 -117 252 -196 -391 277 -12 -148 -71 -435 -373 50 -379 -489 66 -120 198 21 52 -16 195
5462 195 -25 475 123 -319 -107 45 561 -409 -476 -167 -25 138 -21 -83 -172 -92 -3 129 -282 -176 102 -90
5484 -90 222 -40 -485 -495 -43 294 113 -399 -505 34 279 67 186 -4 279 -52 -72 241 207 275 -17 172
5506 172 38 -70 -448 -234 279 491 193 427 219 54 -60 -86 -327 221 -150 223 94 -147 -342 169
5526 169 68 59 -499 -524 128 158 121 112 15 247 -420 -454 25 347 510 90 142 -189 509 -129 425 -25 -305
5549 -305 -179 208 -133 153 -629 123 -18 10 -27 210 -187 402 255 -139 -85 -203 58 23 -73 175 -210 234
5571 234 33 27 13 140 330 -427 62 -248 -521 156 147 541 -199 -385 18 477 162 -36 -309 -91 76 33
5593 33 261 13 -282 175 257 107 -120 61 -305 210 85 -430 721 334 123 222 -161 -136 110 -155 257
5614 257 164 -112 138 -47 -374 348 15 -108 247 243 -487 58 -252 309 -43 20 -125 -7 -174 -494 -119
5635 -119 -38 75 -99 -151 -64 9 -207 -45 -298 44 -375 22 49 -229 135 -394 361 91 -438 -157 117 37
5657 37 -166 -75 -66 241 586 -13 137 234 -87 -183 48 -51 101 131 310 -388 38 -346 -231 283 -28 -48 -438
5680 -438 29 -407 -7 -220 448 -777 -99 152 -271 -134 -233 30 166 -18 -184 220 63 -66 -99 -437
5700 -437 -113 3 48 -182 -230 334 -59 202 83 1 22 -242 132 -353 113 -79 376 -155 -312 -24 -121 -156
5722 -156 -83 387 167 391 141 -289 56 51 -146 174 -319 333 -146 -154 -225 356 -286 -46 283 -43 17 281
5744 281 -20 148 101 339 201 -161 -100 48 315 -266 117 345 -108 240 -49 -230 156 -72 -286 282 -162
5765 -162 107 334 -240 209 -652 277 -300 -402 -282 -36 46 -181 218 -335 306 -135 362 62 -250 77
5785 77 -324 28 -87 181 376 -106 -111 528 229 -218 97 132 65 -80 141 175 44 -166 367 -29 387 223
5807 223 -174 -394 258 280 104 84 408 51 -229 177 -721 183 -240 193 1 73 -393 -432 522 -121 -266
5828 -266 -228 222 -221 -227 -24 -1 -245 -80 -15 -178 -188 126 -309 54 491 -225 366 410 -258 382 62 -375
5850 -375 250 -460 198 205 113 -316 -134 -198 -178 55 -224 552 174 -583 -83 -304 5 45 14 407 -5 55 -217
5873 -217 -232 -95 60 -276 282 -79 23 -255 111 170 299 253 -38 435 611 -81 190 -545 284 361 218
5894 218 35 -497 -154 -223 45 -104 397 127 -96 -143 -13 -107 -4 -520 -383 58 456 206 -145 -299 324
5915 324 -271 -185 -255 -330 -257 391 205 -259 -227 367 -223 -154 -135 -87 -30 46 492 80 62 -225 279 -107 -310 104
5939 104 350 -215 -7 -105 -58 214 217 6 201 -288 73 395 142 346 -99 -21 412 -64 -213 242 -174 -221
5961 -221 -15 34 50 -67 64 404 181 -37 130 -132 -381 -190 -163 -254 168 -150 161 104 -137 -191 248 -818
5983 -818 -273 229 -264 -4 -282 -36 -553 13 58 192 148 602 -42 676 32 159 366 -138 221 136 262
6004 262 -54 246 391 -190 157 -17 -434 486 223 -130 122 17 -94 289 395 245 182 37 -355 -343 -282
6025 -282 4 -58 -250 267 -43 -416 -85 178 289 -14 339 427 160 -257 -360 211 537 -185 206 -126 313
6046 313 -79 -437 153 115 323 -213 613 19 -185 167 466 263 242 -300 -321 -77 -5 308 -38 -170 -59
6067 -59 148 500 -440 124 497 -21 99 424 495 -206 69 -373 -4 -276 17 -173 265 -37 -513 325 250
6088 250 141 9 191 29 -14 46 111 258 -139 0 217 717 148 167 -190 59 -140 19 -35 -27 201 -37
6110 -37 256 117 -174 -107 60 -94 266 -53 21 198 229 140 168 167 -50 -496 61 51 327 -218 399 25 135
6133 135 -17 119 -468 -97 -161 -527 459 -215 95 -227 -82 -51 -7 -126 8 247 642 -417 -351 209 146
6154 146 -173 -89 294 348 323 -59 208 173 46 63 -10 479 19 -333 -227 294 -345 115 431 -82 -179 -532
6176 -532 376 -172 -210 -3 -255 115 63 -65 -304 -395 -294 47 -69 355 -443 -26 334 42 165 -260 5
6197 5 275 -486 -4 366 90 275 -3 -50 33 74 -250 165 -287 355 -48 -307 170 174 159 -175 711 -145 709
6220 709 112 13 197 -42 232 -96 -165 -101 -114 -80 315 108 -72 -31 -511 -49 -23 -162 -124 -9 73 -53 142
6243 142 204 80 10 6 144 76 193 -112 -234 -83 -492 -389 301 83 169 -72 -604 6 -191 91 -247 132
6265 132 296 133 318 179 240 199 -296 -590 -247 -281 155 -266 215 135 -64 -38 485 -247 -526 -273 -244 -404
6287 -404 59 46 427 -61 -339 291 89 -92 119 -265 -50 -30 310 223 270 -46 326 -215 -348 -465 446
6308 446 -171 -442 -574 -618 27 257 595 201 108 193 -188 85 700 -68 -94 -203 296 391 -420 -223 -371 272
6330 272 -222 29 335 -195 -303 100 133 -64 16 -213 470 28 86 -20 193 373 -147 -297 249 61 -168
6351 -168 205 314 -231 -32 65 -212 44 -43 185 139 -408 -339 -64 36 -253 -75 483 326 173 -93 205
6372 205 177 -21 330 407 -171 -51 5 411 115 407 -186 -49 6 -132 -472 -34 79 -399 9 -176 349
6393 349 369 -145 -245 390 -83 -423 258 4 -52 389 -294 151 -16 23 267 -53 580 433 -131 134 248
6414 248 213 -408 87 -131 132 -249 -266 107 23 208 -69 -322 106 -71 -171 305 -386 -249 433 332 290
6435 290 452 498 113 -321 405 -40 243 185 318 -291 210 218 -176 -192 26 95 70 -92 336 543 100 95 -108
6458 -108 -201 -257 -314 152 -291 390 -146 207 -150 -94 -58 -207 -423 27 237 126 131 -81 188 -56 247 -214
6480 -214 -393 209 0 174 366 -39 342 -183 234 -211 299 246 -63 -184 320 -264 176 -204 -192 483 -268
6501 -268 -562 -360 142 -123 -192 -104 -82 99 98 109 -28 295 -81 49 -67 -128 -211 133 279 -233 426 14 3
6524 3 -6 204 -99 86 -184 537 304 -310 20 143 7 115 -69 468 -224 35 -600 -203 -104 -581 -26 198
6546 198 228 -146 62 -39 179 320 -95 186 -245 439 7 -16 -286 -396 -333 -41 435 380 431 -231 -187 69
6568 69 419 299 284 280 388 67 153 66 2 24 66 -134 -221 -216 100 65 120 -223 284 -50 193 1 318 -196 -440
6593 -440 -375 345 383 110 -280 -563 67 91 146 155 -139 -12 4 -114 -190 329 -183 727 61 -123 201 -234 224
6616 224 289 -73 -322 243 -457 -11 202 -10 -403 -61 237 633 34 330 -155 -107 569 782 -62 -283 207
6637 207 61 -255 68 81 -83 -17 118 -299 24 512 -52 254 -197 30 -600 -85 -354 1 -171 -663 52
6658 52 268 -188 -336 -107 -162 -97 678 79 173 239 -1 282 77 -105 89 -113 212 134 -91 -68 -37 214 -282
6681 -282 208 136 121 -456 -52 236 358 -80 -137 52 14 -8 266 -31 -594 -27 92 -296 188 -41 -77 -340
6703 -340 -348 332 168 462 295 153 -315 -143 308 -143 214 -660 -326 470 62 -301 156 112 38 -176 -29
6724 -29 -99 379 -1 -299 106 393 -103 46 -44 337 -466 437 25 -144 29 -144 100 160 168 406 53 37
6746 37 -59 36 -48 -542 -18 -42 208 15 79 -399 273 34 46 0 -140 371 -488 144 75 -266 92 -134 317
6769 317 -306 -178 66 53 -30 47 48 -176 -124 359 8 61 104 -22 146 -188 -190 594 165 33 207 334 -187
6792 -187 151 -667 297 47 -212 2 470 19 89 224 322 -24 -350 480 -384 505 274 50 -194 419 -222
6813 -222 -340 -82 -173 151 -96 -116 244 -24 -353 70 1 113 -93 -438 435 130 -28 -109 2 -438 -109
6834 -109 169 227 91 450 -188 665 -25 160 -219 -11 -295 -186 -351 86 131 -221 94 -222 -190 -180 323
6855 323 -365 -400 -606 67 -128 175 240 123 -418 89 95 224 565 125 -33 174 460 142 362 -92 269
6876 269 -432 -1 192 355 -314 -291 431 2 215 -192 94 213 -36 -52 -12 -207 14 -328 -28 48 -213
6897 -213 -222 -111 203 -344 -88 -50 -359 123 165 63 436 -275 64 -483 134 82 -169 308 -28 360 -360 -33
6919 -33 -142 -116 -191 -48 -176 320 337 -66 451 -46 144 -129 -91 129 340 459 202 -40 178 193 245 -50
6941 -50 -575 -319 -79 85 -228 -437 -271 -54 466 199 -196 171 21 -6 -37 -441 258 -148 -6 -395 -363
6962 -363 371 -152 72 103 277 -213 -40 -207 131 608 712 -215 -59 295 -153 38 5 84 121 -32 -356
6983 -356 157 -294 -13 32 481 22 137 348 703 248 -39 424 -92 273 306 -265 -79 45 535 -392 -63
7004 -63 172 240 -14 237 815 -58 -100 -203 -181 133 -115 2 94 -85 -36 56 -102 -65 -171 -478 -230 -48 -22
7027 -22 341 -182 -411 265 68 168 -517 564 337 354 28 215 -113 -227 -68 -355 44 -186 -29 90
7047 90 -636 -254 -91 -69 -226 -76 -104 191 -6 -405 -296 42 301 -19 -49 -166 -71 -352 -134 97 246 -99
7069 -99 248 -209 168 -355 413 243 -158 220 -260 173 719 19 2 279 -273 309 -14 -65 250 372 -449
7090 -449 432 -526 -303 -447 -33 221 385 44 -128 172 44 594 8 306 98 -255 234 -178 -215 -333
7110 -333 64 347 28 256 -92 -112 -146 45 298 176 -305 130 329 -49 -31 392 247 377 122 233 166
7131 166 327 66 189 86 -611 -393 106 -94 67 -365 82 -141 -323 -90 101 134 265 548 -52 -356
7151 -356 -376 -197 -72 -66 416 19 83 112 -365 -155 99 107 159 -370 275 -282 -294 -7 -368 330 -302 33 -380
7174 -380 349 -311 83 83 330 189 82 -12 -196 65 1 -62 -142 10 118 461 67 -640 293 -107 -214 -80
7196 -80 -175 226 -379 223 -114 -131 -323 131 -420 -149 19 35 58 60 64 106 -412 -324 276 192 260 184 -162 756 -701
7221 -701 -259 37 47 -182 -372 -204 -223 -83 151 142 -311 -491 0 -13 -425 297 -63 38 428 -264 45 391
7243 391 -341 5 -113 42 378 205 2 -39 -195 -400 360 -82 29 -424 -35 81 4 -274 178 -233 370
7264 370 208 348 -220 -82 -442 432 67 -68 -301 137 271 -84 -197 -363 373 -17 282 -87 338 -110
7284 -110 -104 378 376 433 45 -46 27 308 -73 -90 197 4 -164 416 180 -52 86 166 153 91 -25 27 -64 -176
7308 -176 367 84 -103 503 294 -55 336 25 121 -330 199 -368 -313 -267 282 -317 187 208 175 -185 19 -20
7330 -20 -228 139 876 -489 237 66 -31 -60 -3 214 -76 -213 54 355 14 117 79 -301 271 41 -329
7351 -329 -298 469 47 -252 232 202 142 3 -133 -140 23 286 -433 296 -150 77 -382 370 186 -111 278 214
7373 214 73 -96 -204 -155 -411 -47 -126 -167 -245 -109 -383 -264 285 -361 -124 485 130 -417 -11 -178 237
7394 237 181 190 -155 241 488 137 -333 -422 -335 157 379 -106 441 103 -85 184 13 -402 -9 -247 -233 -186
7416 -186 -186 168 17 472 28 -318 236 -396 293 325 292 211 128 46 462 -164 -204 -119 -5 138 16 -9 -252
7439 -252 -207 21 25 -5 155 -194 -241 -90 163 -364 47 534 -118 -51 -436 392 -151 -12 -296 407 -138 -54
7461 -54 230 7 -163 -698 354 -183 -172 81 54 540 114 -95 -486 -90 -212 76 -239 -203 -163 187 123 -168
7483 -168 50 -239 55 563 -156 -40 -278 -313 -166 308 -362 -238 414 -309 -179 90 338 -210 133 -3
7503 -3 288 -76 207 13 242 -68 157 193 316 -58 -98 238 184 -176 -569 -474 276 -80 92 -103 -381 321
7525 321 -131 208 -93 76 32 209 82 -78 28 8 -321 -214 355 159 -197 -228 -224 524 -58 76 347 234
7547 234 188 -89 -171 -425 -13 -1 29 589 90 -649 289 -433 -281 -351 -18 -63 155 358 37 402 -147 93
7569 93 375 144 -9 126 77 170 132 36 -155 116 -155 248 -107 -371 -115 13 86 203 -92 -112 204 390
7591 390 254 420 93 171 -454 -24 453 140 95 -514 -174 -114 -9 212 -123 -91 -64 -305 -221 -18 -244 97
7613 97 337 393 -211 87 -92 -322 -213 197 247 -376 181 -60 -114 583 122 -277 -108 -198 302 -284 -80 -362
7635 -362 9 -96 272 102 -169 -78 72 39 468 147 -95 142 101 123 -102 -97 277 -264 196 -182 126 157
7657 157 37 -149 327 -312 -102 -58 136 -258 2 -620 151 -795 -451 -67 -29 88 -152 -232 -73 -148 111
7678 111 -52 24 474 -105 138 417 349 338 265 125 -186 -193 74 -149 859 119 -117 -132 -486 63 133 241
7700 241 255 -500 172 -123 551 16 -5 629 -94 -506 -268 6 112 61 -408 -15 -144 3 157 -38 -51
7721 -51 144 140 125 264 -266 -72 -107 359 -414 -644 174 129 407 82 -108 292 98 -309 -166 -315 112 308
7743 308 -12 80 -48 190 28 -167 60 -246 -381 76 59 -38 243 -76 165 202 98 -208 138 355 -416
7764 -416 -24 -39 49 -111 -141 -244 57 -72 324 -501 101 418 -556 -273 116 29 689 -435 174 178 152 257
7786 257 -191 200 297 491 355 44 -242 -273 75 -52 -27 -90 62 -198 241 127 -65 -244 -470 474 -487
7807 -487 229 93 -161 388 -64 466 288 -83 115 22 -52 -114 10 316 -165 599 -437 211 -296 -99 -863
7828 -863 16 -107 47 -77 -63 509 217 -646 -162 -7 -79 -475 14 531 -355 -116 -212 249 -6 223 -45
7849 -45 176 16 -333 1 -180 154 312 -283 247 194 -270 -448 -42 -263 -288 248 483 100 -558 75 270
7870 270 -259 81 -158 -100 -43 -175 5 -171 309 -502 -143 327 -306 225 116 -83 -1 172 -1 -17 -18 12
7892 12 -264 227 -191 383 349 596 -192 -10 -41 89 176 60 292 12 77 26 -167 367 306 -296 300 -132
7914 -132 -173 93 -45 167 472 -77 -151 198 154 24 -191 547 -292 -123 -461 -361 -115 -109 80 22 -403 -393
7936 -393 71 -78 237 23 12 -141 375 -144 282 8 489 201 -177 -126 110 -363 -9 -52 -559 139 -136
7957 -136 49 5 298 -108 41 24 321 143 -184 444 -77 121 68 181 146 212 -431 370 -110 361 134 126
7979 126 -129 -414 317 -473 72 -62 465 395 49 -126 460 -216 -678 -164 -55 -38 -87 -331 -22 35 441
8000 441 556 37 -88 210 183 -141 92 313 -81 -222 285 39 18 -18 73 47 43 211 -421 112 182 -322 80
8023 80 221 -106 -141 14 111 98 -356 -427 226 -91 -150 -99 537 -106 -271 289 290 167 -128 73 94 121 331 -25
8047 -25 226 -222 -110 20 327 -66 119 -273 -72 333 285 -134 -107 540 -238 247 -478 16 -39 11 -69 -94
8069 -94 320 -183 -223 51 314 8 -141 -396 -221 172 161 -100 75 -196 236 24 171 -163 198 -109 359
8090 359 119 -202 -189 192 53 -10 230 -188 -54 67 -407 -282 162 222 -20 509 -51 656 95 -68 372
8111 372 -232 -74 -364 79 296 156 -194 109 251 417 -181 19 -19 219 340 -97 211 206 65 27 80 291
8133 291 209 -239 -285 262 -60 240 334 93 221 -209 -239 44 48 -80 185 -188 60 268 -103 -139 -145 250 81
8156 81 288 -518 183 212 -313 326 -463 62 -125 -254 296 -101 225 -14 -331 283 -286 -256 172 -285 -465
8177 -465 5 171 137 89 -58 -94 -548 177 -169 -74 197 -87 -46 -56
8191e6
##END NTUPLES=NMR FID
##END=
