##TITLE=1H ikalashn
DE-76k_TFA
20.11.2024
##JCAMPDX= 6.0         $$ Bruker NMR JCAMP-DX V2.0
##DATA TYPE= NMR FID
##DATA CLASS= NTUPLES
##ORIGIN= UXNMR, Bruker Analytische Messtechnik GmbH
##OWNER= root
$$ TOPSPIN		Version 1.3
$$ 2024-11-20 14:55:16.609 +0400  Irina@DPX200
$$ Compression mode = diff/dup
##.OBSERVE FREQUENCY= 200.131300845
##.OBSERVE NUCLEUS= ^1H
##.DELAY= (6, 6)
##.ACQUISITION MODE= SIMULTANEOUS
##.ACQUISITION SCHEME= undefined
##.AVERAGES= 64
##.DIGITISER RES= 18
##SPECTROMETER/DATA SYSTEM= spect
##.PULSE SEQUENCE= zg
##.SOLVENT NAME= CDCl3
##.SHIFT REFERENCE= INTERNAL, CDCl3, 1, 17.49637
##AUDIT TRAIL= $$ (NUMBER, WHEN, WHO, WHERE, WHAT)
$$ ##TITLE= Audit trail, TOPSPIN		Version 1.3
$$ ##JCAMPDX= 5.01
$$ ##ORIGIN= Bruker BioSpin GmbH
$$ ##OWNER= Irina
$$ $$ F:/spectra/data/iren/nmr/1H/4/audita.txt
$$ ##AUDIT TRAIL=  $$ (NUMBER, WHEN, WHO, WHERE, VERSION, WHAT)
(   1,<2024-11-20 14:54:55.328 +0400>,<Irina>,<DPX200>,<TOPSPIN 1.3>,
      <created by zg
	started at 2024-11-20 14:50:42.171 +0400,
	POWCHK disabled, PULCHK disabled
       configuration hash MD5:
       BE 6D 3F 07 2A EA 11 49 91 17 2B D3 AF B3 58 0D
       data hash MD5: 16K
       95 71 5B 76 53 F6 EF 13 44 19 10 47 14 BD 2E 74>)
$$ ##END=
$$ 
$$ $$ hash MD5
$$ $$ 0A 01 B0 A3 0A 46 51 BF 03 EA 12 54 6C 69 39 A4
##$RELAX= 
##$RELAX= 
##$RELAX= 
##$RELAX= 
##$RELAX= 
##$RELAX= 
##$RELAX= 
##$RELAX= 
##$RELAX= 
$$ Bruker specific parameters
$$ --------------------------
##$DU= <F:/spectra>
##$EXPNO= 4
##$NAME= <1H>
##$PROCNO= 1
##$TYPE= <nmr>
##$USER= <iren>
##$AMP= (0..31)
100 100 100 100 100 100 100 100 100 100 100 100 100 100 100 100 100 100 
100 100 100 100 100 100 100 100 100 100 100 100 100 100 
##$ANAVPT= -1
##$AQSEQ= 0
##$AQ_mod= 1
##$AUNM= <au_zg>
##$AUTOPOS= <>
##$BF1= 200.13
##$BF2= 200.13
##$BF3= 200.13
##$BF4= 200.13
##$BF5= 200.13
##$BF6= 200.13
##$BF7= 200.13
##$BF8= 200.13
##$BYTORDA= 1
##$CFDGTYP= 0
##$CFRGTYP= 5
##$CHEMSTR= <none>
##$CNST= (0..63)
1 1 145 1 1 1 1 1 1 1 1 1 1 1 1 1 1 1 1 1 1 1 1 1 1 1 1 1 1 1 1 1 1 1 
1 1 1 1 1 1 1 1 1 1 1 1 1 1 1 1 1 1 1 1 1 1 1 1 1 1 1 1 1 1 
##$CPDPRG= <>
##$CPDPRG1= <>
##$CPDPRG2= <>
##$CPDPRG3= <>
##$CPDPRG4= <mlev>
##$CPDPRG5= <mlev>
##$CPDPRG6= <mlev>
##$CPDPRG7= <mlev>
##$CPDPRG8= <mlev>
##$CPDPRGB= <>
##$CPDPRGT= <>
##$D= (0..63)
0 2 0 0 0 0 0 0 0 0.06 0 0.03 0 0 0 0 0.0002 0 0 0 0 0 0 0 0 0 0 0 0 0 
0 0 0 0 0 0 0 0 0 0 0 0 0 0 0 0 0 0 0 0 0 0 0 0 0 0 0 0 0 0 0 0 0 0 
##$DATE= 1732100094
##$DBL= (0..7)
120 120 120 120 120 120 120 120 
##$DBP= (0..7)
150 150 150 150 150 150 150 150 
##$DBP07= 0
##$DBPNAM0= <>
##$DBPNAM1= <>
##$DBPNAM2= <>
##$DBPNAM3= <>
##$DBPNAM4= <>
##$DBPNAM5= <>
##$DBPNAM6= <>
##$DBPNAM7= <>
##$DBPOAL= (0..7)
0.5 0.5 0.5 0.5 0.5 0.5 0.5 0.5 
##$DBPOFFS= (0..7)
0 0 0 0 0 0 0 0 
##$DE= 6
##$DECBNUC= <off>
##$DECIM= 32
##$DECNUC= <off>
##$DECSTAT= 4
##$DIGMOD= 1
##$DIGTYP= 9
##$DL= (0..7)
0 120 120 120 120 120 120 120 
##$DP= (0..7)
150 150 150 150 150 150 150 150 
##$DP07= 0
##$DPNAME0= <>
$$ [...]
##$SW= 21.9926040160658
##$SWIBOX= (0..15)
0 0 2 0 0 0 0 0 0 0 0 0 0 0 0 0 
##$SW_h= 4401.40845070422
##$TD= 16384
##$TD0= 1
##$TE= 300
##$TE2= 300
##$TE3= 300
##$TEG= 300
##$TL= (0..7)
0 120 120 120 120 120 120 120 
##$TP= (0..7)
150 150 150 150 150 150 150 150 
##$TP07= 0
##$TPNAME0= <>
##$TPNAME1= <>
##$TPNAME2= <>
##$TPNAME3= <>
##$TPNAME4= <>
##$TPNAME5= <>
##$TPNAME6= <>
##$TPNAME7= <>
##$TPOAL= (0..7)
0.5 0.5 0.5 0.5 0.5 0.5 0.5 0.5 
##$TPOFFS= (0..7)
0 0 0 0 0 0 0 0 
##$TUNHIN= 0
##$TUNHOUT= 0
##$TUNXOUT= 0
##$USERA1= <user>
##$USERA2= <user>
##$USERA3= <user>
##$USERA4= <user>
##$USERA5= <user>
##$V9= 5
##$VALIST= <valist>
##$VCLIST= <CCCCCCCCCCCCCCC>
##$VD= 0
##$VDLIST= <DDDDDDDDDDDDDDD>
##$VPLIST= <PPPPPPPPPPPPPPP>
##$VTLIST= <TTTTTTTTTTTTTTT>
##$WBST= 1024
##$WBSW= 25
##$XGAIN= (0..3)
0 0 0 0 
##$XL= 0
##$YL= 0
##$YMAX_a= 1494473
##$YMIN_a= -1333583
##$ZGOPTNS= <>
##$ZL1= 120
##$ZL2= 120
##$ZL3= 120
##$ZL4= 120
##$ABSF1= 10
##$ABSF2= 0
##$ABSG= 5
##$ABSL= 3
##$ALPHA= 0
##$AQORDER= 0
##$ASSFAC= 0
##$ASSFACI= 0
##$ASSFACX= 0
##$ASSWID= 0
##$AUNMP= <proc_1d>
##$AXLEFT= 0
##$AXRIGHT= 0
##$AXTYPE= 0
##$AXUNIT= <>
##$AZFE= 0.1
##$AZFW= 0.1
##$BCFW= 1
##$BC_mod= 2
##$BYTORDP= 1
##$COROFFS= 0
##$CY= 7568.61572265625
##$DATMOD= 1
##$DC= 2
##$DFILT= <>
##$DTYPP= 0
##$F1P= 17.9538593292236
##$F2P= -4.03888763876832
##$FCOR= 0.5
##$FTSIZE= 32768
##$FT_mod= 4
##$GAMMA= 1
##$GB= 1
##$INTBC= 1
##$INTSCL= 1
##$ISEN= 128
##$LB= 0.02
##$LEV0= 0
##$LPBIN= 0
##$MAXI= 945.577
##$MC2= 0
##$MEAN= 0
##$ME_mod= 0
##$MI= -402.1523
##$NCOEF= 0
##$NC_proc= 0
##$NLEV= 6
##$NOISF1= 8.587773
##$NOISF2= 6.764455
##$NSP= 1
##$NTH_PI= 0
##$NZP= 0
##$OFFSET= 17.49637
##$PC= 1
##$PHC0= 321.7822
##$PHC1= 2.978387
##$PH_mod= 0
##$PKNL= yes
##$PPARMOD= 0
##$PPDIAG= 0
##$PPIPTYP= 0
##$PPMPNUM= 100
##$PPRESOL= 1
##$PSCAL= 0
##$PSIGN= 0
##$REVERSE= no
##$SF= 200.13
##$SI= 32768
##$SIGF1= 18.5376
##$SIGF2= -6.396296
##$SINO= 400
##$SIOLD= 32768
##$SREGLST= <1H.CDCl3>
##$SSB= 3
##$STSI= 0
##$STSR= 0
##$SW_p= 4401.40845070422
##$SYMM= 0
##$S_DEV= 0
##$TDeff= 0
##$TDoff= 0
##$TI= <>
##$TILT= no
##$TM1= 0
##$TM2= 0
##$TOPLEV= 0
##$USERP1= <user>
##$USERP2= <user>
##$USERP3= <user>
##$USERP4= <user>
##$USERP5= <user>
##$WDW= 1
##$XDIM= 8192
##$YMAX_p= 0
##$YMIN_p= 0
$$ End of Bruker specific parameters
$$ ---------------------------------
##NTUPLES= NMR FID
##VAR_NAME=  TIME,          FID/REAL,        FID/IMAG
##SYMBOL=    X,             R,               I
##VAR_TYPE=  INDEPENDENT,   DEPENDENT,       DEPENDENT
##VAR_FORM=  AFFN,          ASDF,            ASDF
##VAR_DIM=   8192,          8192,            8192
##UNITS=     SECONDS,       ARBITRARY UNITS, ARBITRARY UNITS
##FACTOR=    0.0002272,     1,               1
##FIRST=     0,             0,               0
##LAST=      1.8609952,     -29,             107
##MIN=       0,             -1333583,        -1333583
##MAX=       1.8609952,     1494473,         1494473
$$ Real data points
##PAGE= N=1
##DATA TABLE= (X++(R..R)), XYDATA
0 0 0 0 0 0 0 0 0 0 0 0 0 0 -50 64 -64 64 -64 128 -128 159 -192 256 -256 320 -384 448 -512 577 -704
29 -704 769 -897 1025 -1153 1313 -1473 1665 -1862 2108 -2357 2623 -2911 3238 -3588 3974 -4394
45 -4394 4854 -5359 5905 -6505 7172 -7898 8704 -9596 10593 -11707 12962 -14395 16045
58 16045 -17961 20233 -22967 26327 -30585 36168 -43853 55145 -73379 107882 -196080 903599
70 903599 1442709 -727709 -776670 712295 1494473 3035 -1261342 -615426 844215
79 844215 620727 -751493 -1171468 -44340 623623 -105819 -934713 -376192 598030 449024
89 449024 -537326 -624397 327944 785228 1350 -637284 -11241 964824 762415 -208732
99 -208732 -383835 449858 820064 66826 -660033 -290338 417128 209720 -634446 -784207
109 -784207 -70756 288000 -300429 -816920 -312810 533283 494695 -222775 -340505 418163
119 418163 884902 348116 -318226 -86440 586376 553362 -163380 -475831 -30608 287776
129 287776 -109147 -577530 -379752 93888 47401 -372244 -371705 120145 328994 -47982 -324915
140 -324915 37511 516675 363568 -168744 -216243 303810 550903 102754 -366480 -165700
150 -165700 329238 292965 -233633 -443822 -68369 231360 -28610 -398893 -279106 102865
160 102865 121939 -195135 -255359 81675 288326 69849 -149118 47221 366946 293731
170 293731 -56191 -124860 170762 312321 24855 -272219 -153357 128250 68399 -260168
180 -260168 -338886 -56960 113880 -89616 -290404 -104898 206734 169656 -115468 -137066
190 -137066 177488 340276 102294 -139737 -2379 276249 234540 -72600 -191252 942
200 942 134567 -24400 -224016 -169143 2743 -8111 -160696 -167516 200 69404 -53365
211 -53365 -111586 60293 231881 141562 -56679 -27596 194001 246344 20081 -156703 -42221
222 -42221 143686 81763 -147042 -212880 -56678 48001 -47520 -160522 -100594 34629 47629
233 47629 -36523 -40710 59916 105503 28280 -30223 39933 129269 83893 -37226 -51072 56696
245 56696 103726 20 -103112 -55745 52058 38960 -76513 -113888 -28025 26528 -41071
256 -41071 -108829 -53176 44107 33226 -50724 -42812 75732 134142 50620 -32459 28745 142775
268 142775 124851 -11495 -77265 -3208 59014 -10633 -119420 -119113 -39716 -19031 -71921 -84097
280 -84097 -20392 22197 -3477 -10471 58087 113240 68071 -4691 17940 100411 98671 -12048
292 -12048 -85246 -29991 50621 20723 -81370 -108956 -31189 31934 362 -55927 -41776 19137
304 19137 37089 3278 -11513 17245 31756 2051 -18304 13174 47162 21858 -28469 -20691
316 -20691 38625 57419 3142 -43938 -14909 38317 28022 -33060 -56986 -20283 6728 -19748
328 -19748 -49688 -28626 10371 7537 -19320 -6208 43930 57829 16269 -10424 27079 70122
340 70122 43596 -23352 -41375 974 24258 -16246 -62818 -54902 -14697 -2990 -21163 -25430
352 -25430 -3950 11691 9308 15355 36959 41847 16589 -3477 16713 43602 26242 -25321 -46175
365 -46175 -12297 21091 942 -45622 -53880 -14357 19301 8083 -21152 -20763 7185 26938 21976
378 21976 10019 7673 9753 9519 10329 16823 14519 -5014 -20845 -10181 13693 12150 -18240 -38256
392 -38256 -18504 14445 14190 -17714 -32110 -9849 16208 12657 -5816 -7226 7343 14204 8536
405 8536 9899 19405 16541 -595 -5788 12962 26088 6286 -25269 -25997 881 11896 -13025
418 -13025 -38111 -30822 -4877 4683 -6782 -13827 -5280 7022 13555 19748 25688 21830 10350 8243
432 8243 22284 29786 10253 -19029 -24691 -5560 5302 -12947 -38841 -40242 -16362 2842 -1205
445 -1205 -14686 -13734 5282 23906 26902 18913 11343 10949 16711 20481 16209 2665 -11911 -15403
459 -15403 -6519 1407 -6560 -23472 -28495 -12385 7346 7242 -9069 -15612 -1613 17086 17178 3206
473 3206 -4240 2208 10058 10055 5850 3256 -542 -3774 -156 8788 10275 -2619 -14722 -8902 7046
488 7046 8975 -8536 -22455 -15333 839 5409 -4745 -12629 -7462 4109 12017 13607 10697 6706
502 6706 5929 11345 18041 15558 322 -13496 -11715 -512 684 -14043 -29102 -24637 -6987 3871
516 3871 -1948 -10740 -5627 9882 22348 22448 14157 7953 10282 15516 15061 5751 -7570 -16036 -14044
531 -14044 -7409 -6963 -16071 -24018 -20000 -3795 7661 5363 -3467 -2031 11433 21976 18679 7499
545 7499 2433 5587 9053 7029 332 -6086 -10746 -9093 -3496 1221 -3383 -11385 -12086 -2034 7358
560 7358 4063 -7553 -11022 -2593 6981 6760 -1725 -5941 -1812 6547 12086 12024 6954 2686 4117 11438
576 11438 15169 6694 -8240 -13518 -5929 -368 -7891 -21401 -24864 -15663 -4416 -702 -4049 -5431
590 -5431 -97 11992 22525 23427 14990 7610 10861 18955 16339 1268 -13366 -14235 -7050 -5465 -13260
605 -13260 -21735 -21354 -13213 -3809 1458 873 -1625 928 9932 17927 16864 7131 824 5071 12320
620 12320 10540 -599 -9516 -7182 -712 1048 -2915 -7360 -7987 -6053 -1799 1233 93 -5766 -9118
635 -9118 -3387 5017 5152 -2587 -7310 -1546 8674 11427 6774 1381 2241 7362 11005 8795 1484
650 1484 -4432 -5546 -2196 -1531 -6464 -14114 -16327 -10647 -1609 1759 -2910 -7239 -1863 10595 17072
665 17072 12496 4429 4013 10577 13163 7505 -2817 -8264 -7823 -4530 -3509 -7726 -13547 -14778 -8397
680 -8397 491 4166 351 -3326 1310 10841 15015 9655 1731 126 6333 9492 4433 -5054 -9004
695 -9004 -6119 -2432 -2026 -4462 -6986 -7652 -4606 1562 5078 1096 -4074 -1785 6347 10418 5202 -2603
711 -2603 -2601 2653 6034 4698 -42 -3033 -1943 1492 4150 1481 -4111 -6695 -3852 844 350 -4849
727 -4849 -9345 -8104 -1607 3738 2202 -2661 -3207 3174 10060 10934 6337 2999 4076 7284 8063 3593
743 3593 -3543 -8469 -7793 -2866 -3633 -9529 -14445 -11634 -4530 287 427 -1157 25 5224 11673 13705
759 13705 9987 4565 3961 7783 8950 3633 -4644 -8814 -6712 -4443 -4756 -7959 -11010 -9381 -3547
774 -3547 1524 1636 -1495 -1677 2544 8638 9321 4580 213 228 4181 6673 3846 -1936 -4622 -1576
790 -1576 2498 2384 -1527 -5104 -4205 -1073 1292 -132 -4577 -7656 -5258 635 2192 -739 -4657 -2922
806 -2922 3466 7257 6780 3290 1858 5227 7963 8189 3272 -2155 -4539 -2259 -692 -3646 -8676 -11103
822 -11103 -8712 -3722 -1227 -1797 -3172 -1400 4310 9574 9511 5576 2844 5043 7410 6160 1086 -4329
838 -4329 -5837 -4722 -2839 -3692 -6544 -8595 -6247 -556 3077 1734 -940 28 4280 7547 6791 2195
854 2195 -1553 -140 2706 2787 -471 -4637 -4811 -2025 853 1394 -1961 -3774 -2071 1955 4301 1611
870 1611 -3014 -4156 -364 3059 1302 -2566 -3697 -1384 2788 4142 2864 530 -182 2216 5322
885 5322 4616 215 -3508 -3021 -795 -550 -3601 -6950 -7419 -4089 -650 152 -322 -896 1572 5689 7854
902 7854 6931 3996 2480 3518 4778 3311 -1435 -5853 -6172 -3922 -3122 -4597 -7598 -6947 -3249 1032
918 1032 2478 1038 369 1465 5817 7666 6208 1978 309 1934 3789 2402 -1667 -4422 -4328 -1873
934 -1873 39 -1530 -4359 -5022 -2029 1452 1749 -1412 -3351 -1517 1740 3278 1152 -1148 -630 1478
950 1478 3481 4221 2198 195 619 2736 3463 1386 -1872 -3516 -2327 -819 -1400 -3986 -5882 -4942
966 -4942 -2535 161 -447 -1599 -1022 1646 4442 5613 4573 2258 2205 3593 4987 3016 -810 -3537
982 -3537 -3006 -1242 -1805 -3981 -6338 -5551 -2889 -123 338 -868 -1786 923 4352 5921 3605 356
998 356 1013 3233 4399 1856 -965 -3114 -1917 -296 -117 -1900 -4514 -3556 -837 1530 927 -1380
1014 -1380 -2519 175 2772 2993 710 -1012 -270 1589 2590 1443 -757 -1686 -392 1693 2197 349
1030 349 -1611 -1580 249 1376 163 -2047 -2914 -2119 -20 444 -574 -1755 -1246 660 2302 2436 1288
1047 1288 572 1599 3051 3026 1405 -1105 -2094 -1528 -423 -1548 -2740 -4383 -3622 -1472 494 146 -859
1064 -859 -669 1676 4477 4770 2675 1201 1330 2879 2941 525 -2745 -3761 -2886 -1303 -1923 -3459 -4458
1081 -4458 -2921 -136 1587 1364 -375 319 2537 4419 3959 1213 -546 -32 1602 1218 -343 -2078
1097 -2078 -2352 -996 522 462 -1200 -1937 -1404 436 1391 142 -1811 -1561 -412 783 542 -647 -1302
1114 -1302 23 1659 2460 2248 1142 931 2100 2857 2659 559 -1484 -1843 -1204 -1111 -2099 -3927 -4851 -3087
1132 -3087 -1190 -161 -727 -1043 379 2634 3970 3966 2401 1391 2214 2610 2486 -107 -2484 -2943 -1676
1149 -1676 -893 -2073 -3801 -3884 -1584 314 1065 -183 -918 271 1867 3263 1809 436 -258 430 1217
1166 1217 1320 -278 -1535 -988 197 1157 528 -1035 -1185 -309 1062 1085 -739 -1684 -1079 -129 170 -570
1184 -570 -1168 -899 -160 727 1659 896 250 277 1253 2628 1730 -372 -1077 -708 162 -95 -1179 -2410 -2027
1203 -2027 -1208 -295 -252 -663 -914 517 1839 2142 1790 165 260 1290 2138 964 -632 -1653 -1189 -395
1221 -395 31 -1230 -2128 -1827 -541 1043 1348 -229 -571 456 2190 2507 1149 -110 -253 620 905
1238 905 261 -1028 -1767 -1468 -310 -56 -528 -2015 -1608 101 1157 1044 249 -490 741 1297 1243 1066
1256 1066 -213 -173 -68 590 411 -89 -711 -557 670 970 206 -849 -1291 -601 157 71 -509 -1558 -933
1275 -933 -300 888 691 -256 -342 800 1623 2218 1109 -38 195 1033 1619 296 -846 -1565 -906 -455
1293 -455 -859 -1832 -2386 -2257 -871 455 379 -268 -210 1287 2408 2540 1543 743 1270 1456 1104 -19 -1646
1312 -1646 -1517 -1144 -416 -865 -1846 -1994 -1557 -270 734 277 -254 76 824 1820 836 123 -554 451 1037
1331 1037 620 374 -504 -1084 -408 224 535 57 -577 -400 600 619 102 -988 -902 -596 -218 -240 -619 -1078
1351 -1078 -940 407 912 1305 240 245 882 1434 1158 568 -315 -527 -12 212 -764 -1472 -1595 -1252 -65
1370 -65 261 -287 -505 -374 766 1857 1424 890 306 693 1074 635 -765 -1110 -901 -731 -436 -679 -553
1389 -553 -1084 -283 492 873 636 -132 104 946 1032 660 -57 -441 -214 403 -53 -644 -814 -917 -387 425
1409 425 499 -393 -338 -148 420 788 276 -237 -81 73 699 180 -501 -330 -364 874 832 385 -184 -255 318
1430 318 484 309 -477 -286 -763 -438 -242 -765 -1004 -1124 -295 213 417 95 -51 593 1093 1640 1136 300
1450 300 193 138 490 57 -643 -900 -758 -719 -413 -754 -818 -541 -255 336 590 486 -166 880 888 1401 326
1471 326 86 -105 565 628 166 -35 -660 -396 -102 17 -121 -831 -740 -192 -281 336 -162 -431 -399 433 191
1492 191 34 89 -304 283 531 877 28 -5 -222 331 472 344 -655 -713 26 198 -435 -467 -1315 -767 -345
1513 -345 -132 -33 -460 -106 344 803 1136 304 443 393 574 657 300 -241 -846 -324 -219 -683 -730 -464 -471 -93
1535 -93 196 -114 78 -140 479 1123 892 516 85 62 390 634 353 -524 -410 -341 -140 -390 -447 -399 -746 -232
1557 -232 424 472 -156 -141 263 302 715 -13 -185 -277 80 116 505 -250 -472 -147 -80 491 -350 -394 -119 -54 503
1580 503 -152 -187 -266 -313 165 46 -193 -532 147 746 662 457 115 103 198 882 401 29 -154 -363 -162 109
1602 109 -296 -762 -984 -240 -14 463 395 282 450 754 1055 946 335 323 88 429 154 -568 -483 -522 -354
1623 -354 -243 -301 -539 -755 -38 340 -104 489 461 643 675 741 466 226 34 86 -165 -38 58 150 -290 -245 125
1646 125 9 -569 -173 -229 -107 -60 151 -475 -548 -16 -48 -70 -188 -43 -132 449 616 406 78 336 546 665
1668 665 790 38 -407 -284 -339 -140 -209 -876 -975 -488 -543 18 -331 125 253 643 784 535 552 -121 510 423
1690 423 246 -168 -36 -558 13 -248 -391 -519 -337 193 262 154 -50 261 28 285 209 246 29 -28 113
1711 113 197 -15 -37 -160 -61 171 535 -109 129 33 172 317 13 -148 -114 43 130 -205 -532 -178 -406 50
1733 50 542 540 377 35 23 116 504 271 -341 -54 -224 19 361 -228 -237 -609 -38 187 -364 47 -212 222
1755 222 358 368 459 -8 259 220 226 -89 -100 -270 -135 105 -226 -529 -68 -1 -118 440 206 -143 189 162 534
1778 534 469 419 -95 95 -102 505 -149 -93 -214 -20 -225 -180 -93 -169 -314 -93 440 -96 -398 143 -94 168
1800 168 -74 288 94 81 12 118 399 21 -449 -251 101 30 65 -279 -341 -151 -475 -415 -380 -617 170 -287
1822 -287 -10 9 -37 40 367 472 605 157 -57 363 236 472 170 -345 -8 -54 -60 -201 -540 -607 -118 -244
1844 -244 186 146 161 191 31 655 299 42 -77 -11 148 -5 283 -27 -48 -333 -257 -108 -374 -49 124 -18
1866 -18 262 -276 10 -15 144 392 79 -176 -243 -103 -308 -315 -63 -175 -327 362 182 292 62 -93 257 12
1888 12 54 -27 292 -558 168 -269 356 -302 -44 186 79 504 117 158 132 406 696 231 -8 -179 -159 201
1910 201 347 -224 -315 -550 5 34 -258 -22 81 336 231 385 -23 128 190 373 257 31 -100 25 -233
1931 -233 -338 -47 -195 -11 211 261 142 -34 157 -148 39 499 284 11 145 -468 -235 196 37 -380
1951 -380 175 -66 -206 -121 43 -123 4 -204 154 124 26 -113 -260 163 21 -504 -91 -3 33 126 273 189
1973 189 -97 14 -4 82 157 -161 -295 -547 -262 -104 -427 -211 -558 349 -104 -181 -36 -85 235 117 372 303
1995 303 357 171 243 172 -382 -184 -66 -635 284 -200 -177 -58 -294 -12 -56 35 220 -91 54 77 99 -139 0
2018 0 -75 6 300 133 98 9 -49 424 120 -311 -215 130 78 3 -4 -112 -105 -82 35 -36 -123 75 347 157 387 -1
2044 -1 33 -146 308 136 236 412 34 212 -202 66 -404 -348 -207 -31 -186 -156 254 -50 197 33 316 150
2066 150 -106 271 34 351 321 -7 -194 -118 105 127 -171 -480 -185 -409 149 -122 115 -161 -21 60 89 416
2088 416 -226 130 -59 138 55 -346 -104 -134 66 28 -252 -220 -42 -90 280 120 102 -193 252 80 -463 271
2110 271 -10 60 38 35 -251 222 117 84 91 167 61 178 429 -516 290 -232 71 -202 -232 -84 -39 294 56
2133 56 81 80 359 58 -17 20 284 470 159 -283 228 -77 -363 -558 -45 -209 -388 -55 118 -313 38 156
2155 156 244 -24 464 245 525 369 -158 59 34 -145 -271 32 -100 -13 293 155 31 115 62 -244 45 122
2177 122 4 6 29 219 -285 -228 192 111 -85 130 -148 -68 268 107 305 -204 -378 -321 -219 67 -66 -265
2199 -265 20 -181 -175 33 -105 -159 142 328 413 13 336 62 236 419 -79 -336 -42 -135 -348 -177 -73 -206
2221 -206 -328 30 -9 262 -279 -267 -249 436 157 119 124 25 230 -27 139 -248 153 32 -2 350 -199 -348 -127
2244 -127 165 -97 33 -1 -369 273 45 145 417 6 13 16 -53 -79 -123 -115 116 11 31 -254 -93 171 -135 -208
2268 -208 -251 -223 -407 -138 125 -265 -40 299 77 96 43 144 -611 -4 251 -326 95 229 25 -236 129
2289 129 -163 -126 51 119 471 24 54 212 -194 190 -71 -74 134 341 184 107 243 -8 -57 -12 -98 -275 49
2312 49 -232 -67 -86 64 -44 31 -140 -111 299 327 131 381 -147 106 -19 146 169 157 -71 5 -243 -8 65
2335 65 -174 -197 -197 180 16 84 253 4 -484 204 62 179 -93 149 -111 139 17 -254 -74 79 89 160
2357 160 -54 -125 -121 -143 -6 207 -141 -66 -162 -141 -7 134 426 -156 40 229 113 -259 233 -40 -148 285
2379 285 146 -165 374 -167 -129 394 -156 -246 -69 186 227 122 -51 -143 70 33 -42 353 -232 330 606 13
2401 13 -59 -274 118 -246 145 -5 162 45 -157 32 -307 67 27 -243 210 28 -151 -167 43 -139 268
2422 268 186 207 -153 -63 -137 -156 117 -181 12 2 -276 -114 74 357 114 232 -111 316 -12 -179 307 130
2444 130 -48 -41 -32 -282 315 -51 355 -61 -180 -7 49 54 -201 228 -212 -57 -53 121 209 63 -35 116 -89 67
2468 67 -50 -262 64 235 -280 127 11 -187 78 -54 -354 24 268 -208 -275 41 -107 -205 223 21 -120
2489 -120 -179 9 302 -52 -114 64 72 -370 -177 257 275 102 15 43 20 -118 -149 -161 -57 454 -310 64 66 70 -399
2514 -399 -80 -274 265 -99 180 244 377 128 65 -112 14 -277 221 -423 -208 102 9 442 -84 71 297
2535 297 -75 349 75 181 205 62 125 -10 167 -117 -136 107 97 101 226 424 43 84 225 132 7 -216 -243
2558 -243 12 389 163 39 -237 32 41 110 -36 -456 337 328 -56 5 150 -325 314 -250 181 -19 232 169
2580 169 -199 -149 121 63 210 -148 -19 -82 -141 217 -7 41 -18 -310 -3 -312 427 280 -12 -8 -261 91 83
2603 83 142 -180 164 -64 130 22 175 181 -1 -67 36 -136 135 -88 -63 28 217 128 23 -281 -264 -226 -55
2626 -55 -233 -75 228 -115 165 -62 121 -180 251 -178 -381 72 217 -83 47 70 -73 -163 41 75 385
2647 385 25 110 25 -134 -276 150 12 288 427 -119 227 -154 236 -28 -64 296 207 129 334 -407 333 -106
2669 -106 140 -240 164 -7 253 -226 111 -308 126 -151 43 76 -32 150 80 288 153 31 165 -30 -52
2690 -52 -191 89 158 -177 351 -63 -239 22 76 152 333 -27 94 -254 118 -139 -125 112 36 145 -38 -14
2712 -14 189 -126 57 140 -311 -158 86 88 -102 -242 193 71 42 -188 -178 80 119 236 76 162 151 -92 -71
2735 -71 -113 237 114 -146 -298 -37 37 -318 97 52 -200 220 -351 -52 -274 -297 139 -127 304 277 -233 -96
2757 -96 124 250 54 -110 295 -263 125 70 67 -82 77 199 221 -349 -46 -223 342 83 506 86 -67 -267
2779 -267 -72 192 268 -410 193 -18 -481 -284 105 -201 270 -75 120 -105 216 -180 -59 94 -192 155
2799 155 -395 261 -220 69 -126 -413 -115 -110 20 72 263 97 229 -215 -3 -234 -55 29 -11 77 362 -47
2821 -47 -161 111 -7 66 125 159 31 78 366 -74 -87 141 -53 180 -261 93 -279 -232 291 26 94 37 413
2844 413 -333 -147 118 314 66 210 63 -161 -1 48 76 -40 474 -195 95 -511 346 182 -1 44 -56
2865 -56 -206 -27 34 336 78 149 184 -114 -143 -287 -196 -192 193 -12 -66 -60 14 -120 -52 323 -450 -176 -27 -233
2889 -233 164 -145 14 270 145 237 1 387 -28 220 199 -5 538 62 -34 -135 345 41 -229 -4 -154
2910 -154 39 226 -303 8 62 -240 -270 -93 41 106 -13 218 247 166 -290 17 66 -127 289 175 -39 -295
2932 -295 7 145 -127 -238 377 112 -43 234 -158 -236 8 337 401 121 125 -255 349 221 92 -475 294
2953 294 -19 -25 36 -56 283 -123 317 368 -75 -330 63 -19 44 -163 -214 -16 96 -296 -255 290 171 -489 66
2976 66 63 -324 289 157 -83 190 -402 234 87 191 29 -344 -25 -150 0 253 -9 -126 342 81 107
2997 107 -127 65 -306 191 51 -440 177 -250 65 1 160 301 86 198 122 37 152 162 -122 -86 -83 -31 -304
3020 -304 -202 -309 68 118 -229 53 38 -91 182 49 -241 142 108 -27 4 -199 -301 10 96 -18 -150 -128
3042 -128 30 322 133 581 -81 284 26 -19 -79 -54 260 -80 -107 31 -350 -259 7 150 107 56 -20 5 -117
3065 -117 158 -53 -60 -238 -43 -148 169 -12 -326 74 169 -241 -269 -142 -206 -136 335 120 -192 10 -158 384
3087 384 247 -65 -142 -229 -221 -109 107 -177 364 -213 12 112 53 352 54 114 -214 -21 218 -129 -147 42
3109 42 352 -303 18 -147 16 -142 184 -46 -247 270 -159 97 35 -16 -97 -305 -199 -197 -386 123 69 -155
3131 -155 -109 -10 105 10 91 73 51 -4 296 95 -347 -82 24 -51 -169 -47 -145 -19 50 4 -100 146 285 27
3155 27 99 313 106 246 277 189 -200 362 -97 -2 58 36 -109 -319 -138 -236 -166 86 129 -171 -144 -56 -190 -244
3179 -244 370 184 -111 70 -47 78 -218 72 272 -123 1 313 -154 -203 -74 -219 37 152 218 -120 132
3200 132 52 111 -140 193 439 62 -135 103 158 266 129 -375 87 -144 -304 26 -78 86 46 210 -130
3221 -130 52 113 192 -148 113 -140 -136 -126 -183 218 25 -36 41 144 218 88 179 68 -87 -21 -15 87 143 18 180
3246 180 -237 449 18 105 218 103 56 -376 353 -287 105 -280 57 43 -69 58 -237 -175 249 258 293 -364
3268 -364 -176 540 -71 -200 -363 -347 -292 -144 352 -195 124 151 -28 126 -35 120 -140 116 -122 121 -112
3289 -112 -4 -101 -43 75 91 178 67 233 27 74 -152 -1 -79 -21 88 -309 -500 -69 -14 -225 75 -149 -139
3312 -139 -52 434 104 -150 152 -194 -37 58 121 33 -141 -378 -89 -61 183 -94 9 134 354 264 6 -359
3334 -359 345 116 -44 1 -398 281 148 102 314 131 -143 -66 201 346 127 183 75 -9 -350 -276 178 205
3356 205 -365 102 -307 127 -217 -22 -269 199 36 -40 -139 81 335 -43 -133 -206 275 61 150 118 143 -98
3378 -98 -460 149 49 216 287 -92 136 208 307 103 -12 -83 -170 -144 278 -586 0 424 -62 -115 -44 206 28
3401 28 58 -219 49 -275 -289 -171 64 267 -36 32 -227 60 24 207 386 -151 11 -57 -103 275 -44 -349
3423 -349 331 -130 101 -173 116 -205 -58 -192 -102 26 130 143 298 -21 -11 -364 -355 327 -120 -203 -48 161
3445 161 -198 441 216 242 104 99 -283 49 -105 189 220 353 -212 -16 -16 91 -50 113 -326 -193 -26 115
3467 115 207 296 -251 -105 -86 28 -464 116 54 -154 280 137 124 132 607 34 -335 -274 216 -285 -195 38 -104
3490 -104 -262 137 -238 -61 234 290 -37 -154 -374 103 61 -55 -111 -106 169 -150 -230 100 -261 62 145 -213
3512 -213 -150 -241 43 211 -57 -145 -30 -253 -2 -84 340 -130 -194 108 -113 148 -8 -109 106 17 -128 -26
3534 -26 40 -282 -152 143 -35 -148 -100 -2 -52 -68 -540 -254 27 -75 -341 -40 -205 90 332 -181 -129 38
3556 38 317 0 54 -288 -364 362 -148 -240 -99 -125 -41 174 -239 223 167 437 -187 -462 -190 201 30 110 169
3579 169 223 -108 -305 -123 6 -72 79 47 114 110 -199 2 181 -153 -191 -80 25 381 -31 49 -267 -305 199
3602 199 93 -90 187 -204 -395 112 370 -100 -109 56 -174 189 158 60 -308 -101 -55 192 43 -49 -42 82 -191
3625 -191 -174 -64 69 235 106 49 276 -50 -143 156 -266 30 75 -173 404 -87 184 207 -55 20 120 -105
3647 -105 250 -12 -215 -355 247 290 163 -79 -32 98 -349 -42 -2 49 246 -96 97 -13 376 68 -316
3668 -316 -20 73 118 116 -68 81 -12 83 185 218 -242 219 -50 -169 -118 -53 17 -686 158 -248 -113 -78 231 196
3692 196 -48 -177 -96 274 -234 -208 216 15 133 -378 184 -251 -172 -259 479 25 210 -59 -123 -385 -232 52
3714 52 32 126 21 -174 254 186 -277 210 -140 69 -252 119 -147 148 33 -10 -41 236 318 -134 -187 137 -222
3737 -222 -378 -205 12 -208 143 -98 105 -299 -115 -154 -403 -194 -57 10 -109 -334 -57 239 -325 -30 19
3758 19 26 -88 125 69 141 103 -198 -225 -287 312 -161 101 27 72 -61 244 58 69 -177 33 37 264 11 -147
3782 -147 -31 349 695 82 214 82 217 -140 56 -170 65 -139 -19 41 -190 95 4 -55 -388 148 254
3803 254 -310 22 -63 2 319 78 -176 -224 -337 -550 70 110 67 -8 -32 -119 216 417 -221 559 30 193 -283
3826 -283 -24 -175 56 2 286 147 -198 -179 213 -205 -2 -224 25 -224 100 34 -136 90 68 194 -82
3847 -82 -184 -144 -121 -60 61 267 164 -234 22 -78 118 -19 247 44 -292 -142 -37 -48 -108 -30 119 -266
3869 -266 175 -112 -215 -71 -328 -319 -166 -103 -21 -116 -122 -203 -122 -243 39 -236 -146 -288 183 -26 441 -16 -131
3892 -131 -219 -113 243 -90 -38 -155 495 24 -24 110 -262 234 218 307 -52 160 40 6 -346 184 -146 16
3914 16 -179 -149 -98 -198 107 290 -19 202 135 -55 153 -267 180 113 -284 -194 -32 52 -9 -162 152 -358 147
3937 147 269 151 97 174 254 -76 246 70 -147 227 -264 -190 257 191 344 170 168 163 -153 -90 35 -113 -117 141
3961 141 2 -115 311 -28 339 173 218 154 29 -209 -22 358 -330 169 -101 -153 -66 211 -156 114 -302
3982 -302 110 221 150 -113 148 -436 -28 126 -145 118 95 9 -329 39 69 265 -127 -129 -307 -80 266 126
4004 126 -271 40 168 -179 92 -231 137 -246 -4 -81 -146 -140 -36 11 81 -132 -99 -55 27 53 190 189 -160 -417
4028 -417 -223 -66 20 70 45 -128 -143 319 -371 6 88 -186 -108 -398 118 -186 -136 -113 117 -136 477 -325 36
4051 36 89 -89 180 -142 -403 -179 -67 -275 112 -84 -30 -193 -53 176 168 -18 75 153 -100 374 34 259
4073 259 37 -421 -61 -190 -304 -218 12 -7 -3 -188 -216 -2 -279 -128 -150 -329 -257 -310 2 -204 -460 -365 -225
4096 -225 80 10 -165 -95 -92 1 -71 92 -248 172 169 284 -101 19 295 -100 90 -118 489 -1 -92 3 -228
4119 -228 221 187 93 -77 136 137 -103 -126 -151 -473 147 -324 -131 -190 -482 -570 38 15 -283 -212 -44 149 8
4142 8 -154 63 -69 81 242 234 44 267 -268 -51 -37 -19 141 -165 66 -519 -449 171 122 -150 220 242 4
4165 4 109 -159 376 45 84 -430 106 111 -25 -103 -340 -116 -313 -353 -34 315 -108 -2 493 -278 -43 323
4187 323 -266 88 -165 -361 22 -49 232 -347 -94 216 -609 63 23 -24 247 -196 279 271 -417 -271 -29 -248
4209 -248 149 -135 -213 -105 -30 48 32 80 342 120 250 166 -117 -212 -200 4 311 158 -33 335 198 101 31
4232 31 347 -78 -86 156 -116 -115 238 -114 -2 249 -127 -210 -3 -54 159 -218 122 164 38 -53 -86 5 206 362
4256 362 -52 15 -31 165 285 -23 -39 -264 -278 -278 -272 -156 -132 -96 421 -114 -235 81 268 -27 -144 -17 249
4279 249 351 19 83 -144 86 -207 106 -163 7 123 -527 -225 -63 369 180 171 -82 -178 -108 -101 -16 -327 342
4302 342 206 -64 138 -26 -17 208 145 -142 189 139 -334 59 159 -206 -33 -100 126 -236 -145 -85 284 -161
4324 -161 -424 -46 -175 -175 -229 -39 254 -6 -351 -85 -90 -57 -28 96 132 304 162 140 -44 239 91 -185 31
4347 31 -265 108 -113 186 -65 20 -514 168 17 -368 -208 127 -342 -175 -72 -103 8 -12 231 3 12 -124
4369 -124 59 -13 -138 -300 -27 -90 264 -249 -96 -423 135 109 96 -180 -21 -116 38 168 -243 -338 -41 259
4391 259 41 140 -275 -10 93 73 -447 15 155 -93 184 -32 64 -250 -196 80 -321 84 -178 -4 176
4412 176 106 -23 -12 -241 282 -161 -80 1 315 79 -90 170 -309 79 -174 305 -185 327 -291 40 173
4433 173 139 149 235 44 444 -45 -355 107 166 -198 50 -14 -11 588 -172 172 -218 83 -181 49 235 96
4455 96 -217 -189 18 36 215 -35 -76 321 230 18 -431 -69 17 35 -93 -76 290 -214 -73 211 108 375 -208
4478 -208 90 189 -15 -69 -23 269 -44 -64 -73 -141 -30 -115 16 97 163 8 112 76 266 78 80 -160 -198 167 -33
4503 -33 -20 50 -530 -222 -58 -59 -22 -4 161 -52 -159 -20 -168 232 109 138 275 -98 81 -140 53 -114 -93
4526 -93 60 78 74 -206 -479 327 -132 -1 -274 419 -198 -217 -73 -38 -161 -144 -55 -12 65 -95 107 70 62 -140
4550 -140 -272 -38 -212 -237 67 -149 -106 47 -157 -98 -168 -131 -134 -139 28 138 -57 -47 185 238 79 184 -111 -125
4574 -125 42 529 -324 -252 208 124 158 -32 -114 -75 -283 -64 -299 -39 -80 -196 -18 260 21 -222 294 -138
4596 -138 -306 12 175 134 -105 237 208 -315 -353 68 321 -84 -235 -325 414 61 319 286 -69 27 9 249
4618 249 -52 -143 -141 9 -231 -244 131 55 -13 -84 74 -195 -161 -532 141 -248 17 -428 118 431 -110 -27 -78
4641 -78 -78 69 -22 -67 -87 -336 36 -59 -4 -300 87 205 -98 -151 -305 -385 105 443 162 1 410 -114 -41 120
4665 120 255 -27 229 183 229 143 -32 14 44 154 -225 -96 -65 -19 -282 109 -71 -184 -31 -32 -32 -132 -104 -108 -99
4690 -99 -300 65 -139 -311 -85 11 134 96 178 -242 -336 13 -45 123 242 -84 -111 -127 -331 147 189 -190 -25
4713 -25 -58 202 80 -85 -82 3 -4 378 -26 172 119 11 -214 -165 26 331 -35 -386 24 -21 -74 -106 60 -31
4737 -31 -202 -47 1 203 -60 -349 -178 -205 33 -83 195 141 -74 -62 14 -200 107 210 -68 269 55 103
4759 103 136 246 -149 -84 -122 -212 389 -8 -42 8 -14 -101 79 -319 -46 51 -125 -127 393 208 -247 -243 204 65
4783 65 -40 33 17 -126 495 -352 -169 336 116 -67 231 -162 -178 -188 81 -116 -51 -70 -190 137 -193 -181 -101
4806 -101 3 -254 174 93 -193 -13 -68 -204 -124 -2 80 -64 118 18 258 -170 -366 -34 165 -193 422
4827 422 7 -166 73 164 309 -28 5 -238 12 82 -146 367 165 23 -70 -22 -66 -228 -185 -318 211 -317
4849 -317 150 -98 -231 0 -210 85 54 138 -45 -225 84 -118 12 336 42 407 -91 -166 -17 128 -144
4870 -144 -549 75 298 324 101 -17 298 -194 -90 36 -121 -147 -309 -46 -138 116 -105 458 -147 -92 40
4891 40 266 -3 62 -143 -47 259 -52 51 126 -28 224 263 55 130 -76 -28 334 274 117 228 281 401 -1
4914 -1 80 -279 275 92 173 219 229 72 -298 195 -5 41 -29 -620 -256 71 -2 -122 43 -251 -223 122 214 195
4938 195 225 144 79 9 -68 163 -221 -326 136 -1 -30 -313 -135 -18 55 186 -84 -149 23 -44 -48 83 40 306
4962 306 -580 -148 -95 113 -197 247 -53 147 -16 -89 164 -43 -248 242 147 -230 317 -40 213 -106 143
4983 143 288 -3 -484 338 278 123 -273 -386 327 70 -230 -168 131 109 322 -449 -227 -166 -17 -21 89 -250
5005 -250 68 37 -402 84 -123 -132 14 -70 74 -104 93 -169 -76 -181 -67 15 56 -73 -107 37 55 -173 -62
5028 -62 184 334 -211 -229 126 -33 313 64 -99 -110 -427 -3 -141 91 -50 -416 -330 -41 -34 -173 -142 -334
5050 -334 -130 71 155 26 22 -141 -71 90 226 -122 -478 -306 127 209 -60 59 53 -123 162 -332 -132 214
5072 214 -201 -27 -114 37 -77 -160 119 371 13 -115 454 -20 -245 247 60 -244 177 -90 -420 -74 70
5093 70 281 -129 261 248 16 -68 -275 20 179 69 -120 -51 153 -204 -140 -64 207 -194 -52 31 -11 88 223
5116 223 82 310 260 -27 -176 278 -212 -46 313 4 -256 58 219 101 -300 -27 52 -80 37 -102 49
5137 49 222 126 80 149 77 -345 -34 -224 336 147 -154 85 -23 285 -69 -162 -179 -198 253 22 -373 -115 -11
5160 -11 -62 143 -156 338 -168 -44 312 -201 -15 314 153 -169 96 157 -187 -100 -384 -283 -232 127 -29 67
5182 67 339 -24 87 153 110 -226 -278 -352 -49 -350 -154 -206 152 10 276 5 73 -18 102 308 -145 64 -283
5205 -283 215 155 22 -70 -133 -23 -9 33 64 105 260 103 88 49 -241 -208 -49 -149 -118 -161 156 -123 328 -226
5229 -226 224 -103 164 -264 295 -42 -214 -114 82 149 -108 188 -362 183 111 242 -192 -136 -411 283 -171
5250 -171 -135 -260 12 94 328 513 21 58 -237 -91 -97 -36 194 -167 -2 -180 -20 257 49 -178 -303 -80
5272 -80 -40 -363 -145 -167 -144 -125 -94 129 199 153 245 185 40 77 107 -400 161 -211 120 64 -125 -80 -112 240 -77
5297 -77 -9 187 184 145 369 210 147 213 -147 -8 -39 -209 -27 4 -31 306 -52 315 137 -319 -270 61 -118 322
5321 322 -472 237 241 88 134 112 -337 10 111 -143 164 197 -213 -105 291 249 72 190 -153 -241 209 -415
5343 -415 -18 -188 207 202 117 26 183 -403 -6 122 362 53 319 104 105 -101 44 60 97 -245 -41 -110 -36
5366 -36 -351 -96 98 -61 -77 27 132 235 227 -164 -139 -246 9 157 -336 -152 -22 35 74 -266 156 132 132
5389 132 95 -79 46 146 -210 -112 90 31 100 208 224 129 116 -19 15 -96 122 81 -47 -432 14 121 -129
5412 -129 -127 69 598 -233 60 -24 -149 -146 -89 -295 358 -191 -10 215 -463 164 -115 -214 251 172 119 -161 176
5435 176 62 162 41 90 92 329 373 47 -52 122 48 15 300 -229 294 -199 -194 -77 43 87 -449 105 62 -100
5459 -100 -11 -230 190 -103 -172 -279 -241 -277 -179 -90 -19 -89 184 379 -9 27 -14 146 102 108 -128 -369 -141 279
5483 279 -194 -242 -101 -43 164 -451 -98 -98 -57 -46 226 -119 128 -57 -164 77 60 104 21 -302 98 231 7
5506 7 337 -45 -236 -47 172 17 -73 333 -15 -223 -149 -295 -165 280 100 123 -9 -293 21 119 165 -25
5528 -25 19 338 233 -112 266 -85 -18 -346 -3 46 -140 -195 12 217 -232 19 -238 -127 323 3 113 -114
5550 -114 170 -159 130 -351 6 238 304 54 -125 -21 -222 126 346 30 -77 -9 -41 257 64 301 171
5571 171 -87 86 -218 27 -176 -105 -74 117 36 -209 322 263 -151 -246 -17 48 -228 -112 48 -48 -273 122
5593 122 -4 -55 89 -22 -129 -155 107 -277 162 -180 -309 -281 266 77 -334 -192 -370 354 -162 -250 -124
5614 -124 -135 -408 29 -121 -5 -44 -2 40 -412 -46 19 57 -66 34 -148 -42 -41 104 -417 383 155 -169 156
5637 156 -322 -58 562 -1 -77 -121 -123 372 -225 -156 58 -34 185 11 -11 147 243 192 -231 -429 -120 177 286
5660 286 -263 323 370 -232 150 170 -27 -287 193 283 -73 -229 -239 171 -15 141 -257 -219 156 141 -42 -65
5682 -65 116 105 93 -172 -193 149 87 -193 -81 107 75 36 120 72 -32 -83 324 -165 -67 167 165 -117 138 -114
5706 -114 40 9 -486 323 -15 -298 26 -74 131 58 -23 -384 48 -295 173 -146 1 -54 3 191 -43 -302
5728 -302 174 -10 219 -172 132 276 83 159 -60 134 -258 327 -201 -90 45 24 146 -377 32 -330 -247
5749 -247 193 -182 215 117 -313 -5 -297 -128 -98 -224 48 101 -14 -319 -11 351 6 -426 20 122 57
5770 57 291 -56 213 -148 -191 -228 80 143 257 190 16 70 -280 -267 200 -242 -7 -264 -328 171 -251 93 465
5793 465 -1 -266 159 60 25 -118 -356 -121 -112 -45 -98 304 -36 -185 63 -257 70 -169 -84 78 322 -1
5815 -1 144 -77 310 -111 -38 -418 -162 -349 86 236 282 -353 272 183 -87 -96 -368 13 -83 -148 -327 190 -197
5838 -197 -24 34 96 263 14 -13 0 207 204 -153 8 -36 -167 -113 258 -132 -29 16 481 -51 61 -5 -348
5861 -348 -155 62 149 -305 70 -117 -308 -8 -47 95 -154 -217 -248 145 -117 -332 -142 34 239 394 155
5882 155 -134 -54 -374 -132 213 -101 185 85 536 1 -83 199 233 -341 -249 21 -14 -91 -75 154 -197 -38
5904 -38 315 112 -209 -18 194 230 -71 -26 283 217 314 69 221 -186 375 -58 22 -64 115 -82 -270 -336 285
5927 285 3 -68 16 233 -109 7 388 -59 50 113 -369 -192 35 195 -176 391 109 -9 -22 114 -119
5948 -119 15 421 206 191 151 242 -51 125 -74 -16 -5 -263 -175 228 -112 216 287 -31 164 -153 90 367
5970 367 -322 73 160 -262 -317 -75 -172 -161 229 -31 -2 -78 441 190 29 71 140 -3 -33 -269 -160 295 289 -133
5994 -133 -294 157 13 203 -79 -122 18 -44 -104 -110 -55 372 -173 144 102 -291 -209 267 69 -190 49 -59 59
6017 59 -91 64 -314 36 249 31 45 90 224 25 62 -187 -336 163 151 279 -255 -375 190 -379 24 24
6039 24 -176 -525 -70 -58 -48 118 -178 -128 1 -108 -57 90 63 -89 24 279 -149 -74 191 93 244 -120 -52
6062 -52 -212 -191 221 41 97 265 -72 -155 -28 99 -158 -83 -85 -2 -107 -246 -116 193 -211 39 -14 57 -210
6085 -210 -399 130 -5 109 -190 -85 -83 -377 13 -7 192 -397 108 -24 -53 -121 -254 31 309 19 152 1
6107 1 -129 -217 -158 -22 -117 -151 257 274 -230 -204 243 39 -156 239 240 -68 121 -6 -121 518 -121 15 80 -12
6131 -12 -178 257 -80 -67 240 -147 -239 -12 34 -44 375 -315 156 293 54 14 135 -119 185 -199 185 306
6153 306 -30 112 94 -265 -42 68 -68 -202 -251 86 -29 -90 57 -49 -98 -99 41 -54 336 -83 -248 -101
6175 -101 155 -43 246 -283 -302 28 -43 -201 -72 294 23 -21 45 70 -176 144 -79 68 -118 -22 128 -140
6197 -140 51 121 -47 215 -95 67 -91 -117 61 -479 110 -6 74 44 -74 -442 -193 100 -80 -19 -202 197
6219 197 -99 -378 -161 -231 -264 -130 -22 -36 156 -32 -96 -8 -200 -255 49 -159 -128 94 -298 -400 -96 -252
6241 -252 339 -172 142 -26 288 -264 -142 -178 77 -166 25 -160 100 119 -52 -279 -127 203 268 262 -109 244
6263 244 197 -170 260 158 -69 207 -34 -98 -126 144 -205 -101 91 -427 -132 -166 -439 -53 -419 284 243 311
6285 311 -162 -156 -76 -141 36 135 284 -39 47 0 -12 118 -5 54 -112 100 326 -10 63 350 -55 -570 -12
6308 -12 -119 -133 -413 -568 143 -201 391 -380 -85 106 -292 89 90 79 164 143 -88 -67 192 301 157 -233 -236
6331 -236 -24 -25 -277 217 46 -31 159 -212 94 112 177 243 36 -135 142 -156 -358 216 149 -218 -11 312
6353 312 -213 -260 189 359 237 92 -357 -409 -151 271 -88 -108 -123 87 2 157 90 -125 -42 330 -15 109
6375 109 108 265 -135 -214 -326 147 -14 108 75 150 140 135 342 64 -149 323 -104 20 -146 -195 -85 -206 -53
6398 -53 85 9 18 107 -7 -47 203 33 -35 -113 188 -194 445 -87 91 -173 -5 -10 227 22 -309 130 -92
6421 -92 -270 28 -72 -25 81 -205 -14 -201 410 172 -8 -53 8 31 -18 -135 -164 -183 120 -1 283 179 -163
6444 -163 -155 -1 309 -247 -167 82 93 72 157 179 241 114 -72 -403 -44 -63 -30 -278 218 -39 -112 523 -29 -8
6468 -8 211 -97 -290 50 38 -332 -92 116 386 278 -101 72 546 228 -176 79 -25 -113 130 73 -276 -22
6490 -22 165 60 39 -107 77 173 160 89 80 -214 -261 75 41 217 241 23 130 216 -23 -59 35 -219 -38 112
6514 112 97 -129 26 220 -19 238 -80 -85 -189 -105 68 4 -95 -15 -42 -152 305 115 20 -81 376 -225 -178
6537 -178 -213 -334 142 198 94 172 325 127 -42 373 13 102 68 350 513 53 -269 -141 0 -146 -207 3
6559 3 -24 -80 390 33 -303 66 -310 -116 428 18 -34 35 245 31 -17 43 -184 252 -28 -137 -238 -3 -231
6582 -231 -86 195 -190 167 160 118 256 64 -204 -324 211 56 223 -155 -226 0 -228 207 -42 -43 -256 170
6604 170 -59 -51 349 17 -47 161 202 -431 105 350 -445 222 49 120 368 117 -387 -207 55 -215 -238 -238 250
6627 250 -216 -152 103 240 -45 -132 -81 429 -94 106 67 177 22 191 -279 341 35 -89 34 -283 8
6648 8 -37 -239 358 -17 100 331 -4 37 -309 210 -62 113 -108 -167 -458 -118 -149 140 -142 65 -246 13
6670 13 284 114 19 -93 -93 -12 389 -123 -137 105 -210 -9 -204 -61 -5 -370 -18 -37 -391 244 -32 -145 -198
6693 -198 -4 -193 -112 9 -122 -121 -94 -20 -18 214 -364 -180 -133 -208 -152 -141 21 311 -110 -126 -124 237 272 -253 -13
6718 -13 121 115 -392 -9 -123 189 -39 -179 -92 15 22 -29 37 5 -35 -179 215 119 -45 120 -240 280 -100 -125
6742 -125 -138 -199 57 -315 167 -19 150 -66 20 -19 334 -432 -566 -239 -272 211 63 -142 49 -19 -104 -197 -155
6765 -155 -37 16 372 24 -83 -146 178 115 228 259 109 38 163 -337 -116 -452 331 -310 -333 119 8 144
6787 144 -487 -172 -297 162 -265 288 69 12 49 -131 288 -113 -63 -406 58 365 -246 -8 97 -47 112
6808 112 -176 410 171 13 -48 253 -250 -313 27 -81 -307 -131 -540 161 186 46 -72 -346 28 -2 282
6829 282 -175 -135 -275 -349 81 -229 45 -205 -283 -129 -176 -283 -59 6 -153 26 135 150 -41 269 -272 210
6851 210 17 21 -201 -48 33 106 183 161 -10 245 -119 -222 87 -35 125 139 -135 331 -12 187 3 28 -286
6874 -286 52 180 -242 -92 -38 -18 -13 -89 -166 -246 -109 -38 -498 526 -174 -54 -95 258 70 -135 50 -4 -320
6897 -320 -26 291 -387 -407 22 -243 -277 -2 -374 -260 -83 78 -110 -339 103 283 -85 -495 -307 -181 -399
6918 -399 -297 -69 112 40 123 26 -8 -67 -25 99 106 50 187 29 30 -53 -190 83 -119 238 341 -379 -44 -82
6942 -82 -43 236 -87 -72 190 -59 185 217 -89 -238 42 69 88 -19 -574 -209 -129 314 -397 -53 94 4 -24
6965 -24 68 -149 -147 298 407 -35 253 182 -222 193 201 -144 -292 -168 -315 60 56 -102 119 -43 -65 -49 46 75
6989 75 225 -334 -165 156 15 165 82 8 82 -50 -166 -91 67 -302 -24 141 -164 131 397 -40 101 0
7011 0 -359 34 -13 143 -27 -368 -371 133 -18 146 -58 -132 -95 110 -45 271 -51 -331 205 230 76 -405 308
7034 308 -162 29 -91 14 19 -143 -167 -225 70 -69 99 -57 -272 158 346 262 116 251 271 174 -130 -39 41
7057 41 359 141 91 -629 20 216 -108 5 78 -171 295 -8 -315 63 32 -79 60 256 67 99 44 -376
7079 -376 189 -172 344 82 -130 -175 -331 190 -22 -56 38 -155 -27 48 -358 118 117 -85 92 -69 -77 182 80
7102 80 96 -535 84 -18 -79 -193 -18 261 -204 -13 132 -413 -88 -86 -278 269 13 -203 161 -143 -214 200
7124 200 189 274 123 -63 -68 -24 -363 -215 -137 135 -210 79 223 -365 285 5 -47 -208 -31 90 196 24
7146 24 -69 -496 -183 12 -13 78 164 24 -53 -432 -226 190 217 125 -37 59 -156 166 -116 -329 56 323 -520
7169 -520 -29 219 -12 139 116 128 59 122 -70 259 -4 114 -16 -106 12 -170 -77 -396 279 -47 266 393
7191 393 -87 -55 -335 -524 243 124 -192 24 -58 289 -275 -71 123 -167 -249 -153 112 60 96 -62 -307 104
7213 104 103 98 309 91 -163 130 -17 -24 15 100 -153 86 41 67 300 324 77 -395 60 -37 421 -290 -95 120
7237 120 -104 356 -99 -278 -148 -66 -53 267 -133 -125 -114 -87 171 87 -212 176 -270 10 352 12 -86 107 58
7260 58 -75 31 289 97 353 217 -241 -122 98 -222 -235 54 148 -63 -213 -52 167 -68 129 136 -27 340
7282 340 178 163 -494 263 -227 366 -7 -262 -81 -81 182 -68 151 -152 -153 38 -369 -171 154 35 404 260
7304 260 8 185 95 294 -95 130 154 8 -145 79 104 140 88 -262 84 215 274 43 192 -103 269 113
7326 113 -43 -190 -49 312 25 273 223 363 -44 -27 -87 -98 -160 -112 -139 337 196 41 21 -124 -208 -40 -40 234
7350 234 -110 -191 117 -256 289 -35 -21 99 145 -194 129 -1 -283 -387 -147 236 153 330 129 -59 481
7371 481 -446 89 163 81 -58 263 69 152 70 -161 -60 208 321 3 8 22 245 93 410 -83 110 359
7393 359 109 -408 -131 -284 -353 18 89 -351 -455 -170 -280 -216 -222 452 66 149 -351 -354 15 168 160 -141 -325
7416 -325 -296 -189 -1 178 -257 237 259 17 -29 -181 251 64 146 208 -40 -196 -199 -9 -197 416 351 1 181
7439 181 96 127 73 -245 -193 374 336 -35 159 -183 116 -100 -89 171 -128 -100 9 -190 -150 149 30 -302 -312
7462 -312 255 274 106 157 -35 -44 -222 353 127 263 272 534 76 -224 -127 39 88 -122 125 117 72 -29 -69 133
7486 133 348 -170 114 -322 -57 -112 -15 181 56 1 -516 -184 250 -333 -159 -217 -366 33 -169 -160 23 381
7508 381 175 -23 70 126 180 -182 382 141 73 147 98 -193 170 -160 138 -164 -156 -35 304 25 -295 81 -84
7531 -84 29 -116 72 61 -191 -25 -450 -264 -9 389 63 90 8 -218 -166 -122 173 -263 -44 -119 -45 180 54
7554 54 403 142 -184 -172 244 -272 99 -55 -185 -298 -88 -281 -127 166 -65 206 74 20 -63 294 -24
7575 -24 161 8 -239 71 391 -40 222 101 20 -108 -38 2 141 -36 -28 -306 293 163 89 234 330 75 92
7598 92 194 -140 -194 -115 -319 -152 51 187 20 -415 409 199 2 305 -63 63 31 7 165 -81 -57 -472
7620 -472 140 -24 304 186 257 334 -304 37 436 -292 91 85 -111 35 253 43 -334 68 -274 -192 131 -52
7642 -52 -40 118 454 113 -54 -115 -76 -72 -331 -153 -205 -109 52 195 206 -189 -546 117 -35 392 277 164 30
7665 30 173 309 43 124 -7 279 -14 175 22 237 -160 -148 -67 0 341 116 3 -121 -102 217 -294 162
7687 162 -447 -213 111 22 188 -108 23 -5 359 -59 69 21 -19 -91 -186 -302 140 105 208 174 261 197 22
7710 22 138 -56 -235 69 12 114 61 217 -306 39 -292 153 217 93 -102 -402 35 -98 -110 176 -132 -582
7732 -582 266 -43 226 -145 -212 -18 -159 -335 103 -275 -44 -1 -216 48 3 -133 -16 -225 0 -168 56
7753 56 165 -3 36 -95 35 532 -72 211 323 -143 228 -237 129 -49 88 107 75 -28 -307 8 -24 -184
7775 -184 403 113 -191 -102 -179 -184 -375 -24 438 66 259 122 39 -35 -84 21 1 -150 -410 -48 -351 -249 85
7798 85 -114 -228 -138 -265 6 -151 -616 87 -126 -194 464 43 51 68 76 237 -301 250 -20 -66 -230 -196 399
7821 399 39 -166 77 -122 281 -146 -385 288 109 -141 -195 -136 144 268 58 143 -220 127 -260 -134 -63
7842 -63 -86 -133 -163 -141 228 130 -335 -118 -221 -82 -9 251 116 84 -27 -370 24 -35 -155 -388 -305 53 -145
7865 -145 160 -188 120 -95 272 43 161 -40 -336 -122 -155 159 44 336 106 -68 -9 -319 -142 79 277
7886 277 -179 -48 -6 194 -138 143 165 199 -310 -40 203 -168 158 76 235 -39 -211 -24 157 203 -199 -51
7908 -51 -28 -98 -166 -205 39 -18 81 90 209 -244 -315 271 245 98 -130 326 -63 -12 303 -129 -293 -62 -345 388
7932 388 -104 -90 -187 19 -91 -117 106 -143 -78 -13 284 -34 -75 211 19 320 -161 -219 -4 -21 -20 -243 -29
7955 -29 -17 62 -212 -282 2 179 -159 -196 359 240 316 50 -200 31 -68 37 145 -91 123 -3 -215 125
7977 125 68 27 116 -74 -137 12 1 -82 160 -337 -50 -507 -59 -302 21 27 136 -198 -317 -112 -450 -178 57
8000 57 -43 203 183 21 -478 83 504 -281 -238 49 -60 95 111 79 98 302 219 -100 7 -98 87 135 229
8023 229 -266 -136 -6 99 125 327 -60 -94 286 -11 182 232 -57 -306 267 -50 -121 181 -289 -105 -54 -123
8045 -123 31 -41 -37 43 -123 -326 187 -37 -476 256 121 22 0 -355 -94 186 -395 -42 -141 407 426 -51 182
8068 182 338 -130 298 0 106 294 -229 345 -62 -26 73 9 159 149 -31 353 -398 -403 14 -416 -165 119
8090 119 -217 162 -158 88 15 -111 -73 -97 -21 -4 -8 -179 -75 -42 72 145 78 21 7 -73 37 -8 -96 41 63
8115 63 -116 -83 -350 251 -7 -389 -13 125 24 -70 157 -155 76 22 -125 -57 353 -136 151 22 155 369
8137 369 -300 -166 -119 197 -77 172 62 -118 -289 68 231 42 -121 187 -5 -11 12 87 297 262 126 280
8159 280 45 -97 8 65 -5 -50 -78 123 -436 215 -65 -378 -8 -245 22 -86 176 63 -202 180 -342
8180 -342 -427 -7 9 -270 -223 152 41 263 321 -29 -29
8191b9
$$ Imaginary data points
##PAGE= N=2
##DATA TABLE= (X++(I..I)), XYDATA
0 0 0 0 0 0 0 0 0 0 0 0 0 0 0 0 64 -64 64 -64 64 -128 128 -129 192 -192 256 -320 335 -385 449 -513 617
31 617 -704 781 -897 1024 -1153 1281 -1437 1601 -1793 1994 -2224 2464 -2733 3022 -3332 3686
47 3686 -4063 4476 -4934 5438 -5989 6598 -7280 8043 -8896 9872 -10999 12298 -13824
60 -13824 15650 -17891 20699 -24344 29302 -36445 47714 -68189 117482 -480220 -109735
71 -109735 779951 -286893 -871129 -21138 1127662 615499 -425274 -173494 1119893
80 1119893 1172650 -163952 -840529 220969 1083788 173192 -1267646 -1037743 308393
89 308393 539072 -716473 -1333583 -296194 791116 316799 -691854 -431063 758606
98 758606 979340 -24722 -537872 290220 1033364 419358 -594974 -406880 567933 642451
108 642451 -365708 -865716 -146947 523881 44206 -742168 -533578 287668 365331 -355963
118 -355963 -609138 42998 518502 73245 -463459 -105786 629586 575196 -155819 -351027
128 -351027 315797 747250 202081 -494563 -277983 445573 461925 -301493 -687218 -180182
138 -180182 313254 -14920 -595536 -475525 133407 278439 -150010 -320697 103780 438380
148 438380 181781 -148522 66462 487548 397301 -78409 -181043 210700 376567 -51523
158 -51523 -468395 -269159 176008 125098 -346203 -479969 -65084 240894 -8098 -343247
168 -343247 -172185 261407 307280 -25632 -126892 186139 388416 142398 -148607 -28335
178 -28335 264466 209220 -135431 -246349 831 151591 -64977 -313682 -215131 47972
188 47972 62495 -147991 -197234 18275 164388 39516 -98993 22703 226378 178696 -42209
199 -42209 -63778 157047 244829 16987 -198749 -83859 158357 121748 -156577 -259338 -49881
210 -49881 129023 8109 -202297 -172677 34806 103681 -27034 -103465 8022 123337 73019
221 73019 -18407 34688 153266 128262 -12084 -34417 100371 148500 -15981 -171407 -93988
232 -93988 70067 32234 -168690 -226058 -56797 70525 -23038 -150053 -76165 101985 130497
243 130497 15855 -11449 108482 175451 77936 -25518 21788 113314 63375 -82695 -120888
254 -120888 -20644 29647 -66013 -161275 -105718 14713 27118 -52000 -65576 21492 78282
265 78282 35660 -7310 35047 88869 53886 -17602 -5308 66831 65646 -28294 -79940 -10954
277 -10954 70956 34649 -71743 -93029 -3435 58836 1705 -88409 -82271 1532 38010 -11183
289 -11183 -52687 -20617 32010 34896 14429 28364 60135 50971 15753 21436 62703 56328 -19213
302 -19213 -70195 -31507 22639 -8713 -91911 -106607 -33346 20724 -10109 -56680 -30113 40581
314 40581 65144 33322 16697 45310 64224 36076 3155 10978 28735 3491 -44162 -50811
326 -50811 -12478 3087 -32670 -64446 -38731 13744 24765 -6531 -21205 7124 36348 30029
338 30029 6300 4035 16945 15355 -31 -1689 13276 11650 -15040 -28558 -2117 28550 12950
351 12950 -31457 -39447 3885 35365 4881 -43123 -41077 7616 32535 5533 -26437 -14757
363 -14757 19037 28937 14602 7320 13607 13501 5360 8480 19768 8459 -24650 -39286 -11815
376 -11815 15475 -4936 -46614 -47632 -1882 29594 8721 -23310 -13573 26036 43018 25906
388 25906 7803 11658 21036 16144 6706 4507 -408 -16248 -29097 -21510 -4899 -9242 -31581 -39183
402 -39183 -16135 12962 13957 -4337 -9094 11472 33552 32594 17788 8668 12672 16774 13535 5121
416 5121 -2979 -12520 -20824 -20024 -9481 -4726 -16397 -30330 -23669 3047 18748 5235 -16118 -10232
430 -10232 18768 33941 17367 -5878 -4986 14094 22110 10167 -3556 -6557 -2408 446 3662
443 3662 3382 -5883 -19151 -18623 -1136 9949 -4662 -27397 -24780 2301 18409 3742 -16141
456 -16141 -10405 14942 28416 19284 5677 5924 13635 16858 12646 5487 -4510 -13906 -16477 -9982
470 -9982 -5843 -15737 -29197 -27694 -8894 6544 4541 -5233 -3194 13110 27804 26676 14978 6732
484 6732 8915 14231 12400 1810 -10696 -17444 -16061 -11799 -9154 -12537 -17977 -18978 -7160 8851
498 8851 12858 3498 -4212 4239 20494 24651 10313 -5062 -4739 7033 11269 802 -12015 -14807
512 -14807 -6783 1325 1785 -3781 -9904 -10051 -1945 7172 7717 -3344 -12103 -6468 8383 12901 1252
527 1252 -10629 -5628 10810 18402 9728 -1463 -1859 6184 11399 7571 -2647 -10602 -11608 -7919
541 -7919 -4710 -7631 -15871 -18407 -11894 -25 6258 4540 296 3643 15856 24907 22168 10654
555 10654 3279 6329 11342 6688 -6434 -17050 -18621 -14186 -11681 -13672 -17143 -16816 -10925 -76
569 -76 9494 11387 6058 3763 12001 23822 23866 9876 -2827 -479 9423 8471 -5641 -17735 -14951
584 -14951 -5264 -1783 -6152 -10756 -11109 -7648 -665 6253 5293 -3092 -8566 236 12551 12609 -770
599 -770 -8664 547 14858 15822 3729 -4168 755 8905 9401 2725 -4423 -8919 -9498 -7538 -5454 -8433
615 -8433 -16270 -18234 -9491 2250 4938 -1272 -3421 6125 19076 21860 14467 8277 8202 10758 9503
630 9503 3295 -4266 -11122 -14705 -11921 -8816 -10667 -16769 -16938 -8172 2816 7356 3773 1198 5543
645 5543 13806 17830 13530 4370 324 3045 6079 2738 -5717 -11363 -10253 -4677 -262 -1869 -7908
660 -7908 -10156 -4135 5133 8410 1737 -5167 -3099 5327 9241 3349 -4397 -4818 1436 7314 6729 459
676 459 -4266 -2876 3752 7226 2948 -4256 -8114 -4410 1189 726 -5975 -11226 -8251 41 4924 1578
692 1578 -3420 -2503 5610 11950 11101 6420 2659 2261 4603 5679 1608 -6173 -11700 -9447 -3742 -3383
708 -3383 -9632 -13366 -8663 114 4916 4471 2639 3583 7330 11972 13820 9248 2775 135 2887 4203
724 4203 -536 -8833 -12951 -9967 -4479 -2891 -6895 -10218 -7768 147 6239 5459 2241 1289 5403 9674
740 9674 10076 5763 350 -1361 2300 5562 3095 -4430 -8376 -4861 857 1284 -3573 -6903 -5961 -1361
756 -1361 1485 1192 -3110 -5707 -2453 3176 5981 2153 -2389 -686 5351 9374 8141 3759 702
771 702 2291 4810 5674 -509 -7012 -8779 -5619 -2616 -5235 -9847 -11728 -8063 -897 2731 2061 -100
787 -100 2176 8046 12799 11718 6604 3323 4381 6273 4696 -471 -7382 -10105 -7471 -4029 -4359 -9071
803 -9071 -11165 -6000 522 3903 2029 430 1802 6216 9073 8060 3461 69 -353 3164 3764 -492
819 -492 -5249 -6334 -2374 742 365 -2722 -4833 -2781 1585 3767 933 -3375 -4465 -944 2649 1784
835 1784 -1031 -3319 -1082 2494 5350 4658 1388 -255 2570 5748 5247 110 -4275 -4462 -1285 -239
851 -239 -3610 -7538 -8195 -4370 375 1521 -126 -720 1797 6561 8893 7314 3455 1278 2094 3929
867 3929 2751 -2782 -7861 -7521 -3995 -2233 -4539 -7201 -5687 -813 2817 4472 2994 2097 3028 6433
883 6433 7745 5721 639 -1929 -698 1385 283 -3918 -6574 -5844 -2314 -248 -657 -2824 -3182 -481
899 -481 3652 3758 1077 -983 -503 1987 3564 2466 -657 -2156 -135 2708 3986 1003 -1838 -1270
915 -1270 1464 3061 696 -2927 -4735 -3585 -704 -310 -3246 -5736 -5121 -402 2865 2149 404 668
931 668 3958 6902 7574 4958 1692 1013 2463 3223 742 -4520 -7350 -5282 -3423 -3359 -5377 -6398 -4384
948 -4384 -835 2218 2535 1647 1620 3729 6574 6748 4578 960 882 1715 2481 288 -2978 -4642 -3784 -1886
966 -1886 -1074 -2888 -4039 -3842 -1097 1321 1557 -292 -1481 23 2547 3906 2417 -396 -822 1674
982 1674 3356 2765 122 -1552 -767 1468 2101 -21 -2609 -3393 -1886 451 -151 -3048 -4999 -3121
998 -3121 307 1965 274 -1439 -655 2541 4565 4193 2260 465 1521 3153 3631 520 -2814 -3871
1014 -3871 -1855 -387 -1617 -4391 -5145 -3205 -432 1105 26 -546 892 3052 4840 4152 2188 635
1030 635 1366 2068 2117 -702 -2824 -3711 -2326 -1019 -1448 -2852 -3408 -1826 480 1963 1547 841 386 1828
1048 1828 3653 3513 884 -786 -625 405 750 -143 -1933 -2662 -1491 383 901 -512 -1948 -1693 550
1065 550 2025 1148 -880 -2081 -388 1806 1455 -269 -1772 -1332 1883 2927 1811 -127 -730 802
1081 802 2468 2462 -666 -2762 -2813 -792 -73 -1901 -3845 -3941 -1682 915 917 416 -27 1510 3650 4748
1099 4748 4028 1980 910 1599 2220 1089 -1748 -4143 -4093 -2634 -1928 -2932 -3732 -3012 -1177 1206 1760
1116 1760 1575 1121 1557 3228 3861 2812 540 -692 -86 934 420 -1177 -2763 -2379 -1391 167 46
1133 46 -1119 -1522 -539 877 1275 -65 -1481 -1435 68 1601 791 -853 -957 -246 1881 2688 1470 296
1151 296 109 1849 2575 1433 -831 -2147 -1737 -449 -520 -2427 -3376 -3147 -1356 696 338 -191 -299 1431
1169 1431 2782 3477 2652 860 837 1468 1693 632 -1627 -2610 -2248 -725 -779 -1940 -2476 -1615 -594 693
1187 693 1096 714 230 996 1976 2755 1159 -517 -996 281 1240 -8 -894 -1706 -1148 -132 682 -16
1205 -16 -713 -1077 -133 1791 1160 -207 -809 -840 1060 1428 610 -1143 -1317 -214 1157 565 -429 -892 -419
1224 -419 1012 1363 305 -843 -1299 -344 1009 219 -1450 -1565 -629 580 765 129 -786 -384 942 1748
1242 1748 1611 328 -278 -316 946 911 -119 -1446 -1920 -1157 -527 -769 -1653 -1989 -715 44 1120 1084 388
1261 388 298 1491 2557 2108 1042 211 141 200 428 -496 -1806 -2422 -1863 -929 -1044 -1086 -1257 -1344 149 1196
1281 1196 1168 301 -123 960 2051 2093 878 -809 -547 492 493 -267 -964 -1614 -904 235 368 -342 -1628
1300 -1628 -1268 -107 1121 402 -1012 -957 -620 775 749 -93 -364 89 682 1600 1284 641 -2 420 1495
1319 1495 1198 -76 -1365 -1309 -863 -278 -1148 -1758 -1798 -1153 -152 319 -283 -154 412 1239 2389 1412 1188
1338 1188 551 432 944 749 -546 -1415 -1380 -1063 -951 -1094 -1132 -1161 -976 162 774 745 63 247 1076 1901
1358 1901 1023 -150 -507 -67 90 -173 -523 -956 -979 -513 354 495 196 -461 -282 896 858 284 -416 -928
1378 -928 222 598 0 -801 -870 -468 505 667 397 17 24 513 1204 466 -150 -694 -54 240 -12 -700 -1623
1399 -1623 -1079 -46 547 419 -165 104 333 1188 873 812 304 -380 225 561 -76 -812 -1671 -1298 -576 -232
1419 -232 -659 -722 -237 200 754 1037 640 391 620 1100 1360 283 -590 -569 -252 -124 -409 -986 -1492 -560
1439 -560 -327 -310 -548 -340 -429 24 977 1122 11 -415 -20 555 997 243 -369 -155 497 527 337 -99 -241
1460 -241 -393 -137 284 -17 -309 -990 -593 17 -35 -803 -921 -479 220 370 469 443 252 442 1125 1391 969
1481 969 -88 197 204 170 -128 -676 -1045 -889 -331 -635 -742 -1194 -865 36 390 434 276 338 578 796 1210
1502 1210 475 167 -30 81 547 351 -617 -1021 -240 -283 -410 -622 -494 -500 7 133 264 300 -183 60 797
1523 797 779 244 -408 -250 536 239 476 -236 -578 274 189 157 -305 -131 -79 146 144 -71 -854 -690 -130 162
1545 162 525 235 -264 -376 258 717 451 -36 473 386 604 305 95 -572 -724 -209 -277 -348 -664 -673 -161 9
1567 9 391 376 -96 278 730 350 633 528 -227 109 656 -89 -407 -858 -994 -315 -303 -313 -447 -250 -29 416
1589 416 579 618 11 422 642 713 716 157 -391 -18 12 467 -217 -706 -515 -359 410 185 141 -376 310 341
1611 341 495 111 -322 -220 146 211 461 -262 273 177 278 433 149 227 49 120 449 302 -409 -584 -221
1632 -221 -249 -368 -339 -608 -404 268 -18 304 535 190 491 947 786 636 530 245 418 56 4 -682 -526
1653 -526 -686 -684 -467 -645 -550 -771 -610 249 377 352 225 209 684 800 553 -115 -128 0 224 -31 -34 -371 -498
1676 -498 -254 267 -284 -8 -200 81 103 -50 -49 -399 -165 -249 476 -126 -184 -410 128 244 473 143 105 167
1698 167 477 423 466 134 -544 -235 16 -422 -878 -374 -498 -231 -70 99 60 -102 60 502 583 383 0
1719 0 159 280 254 -42 -226 -891 -356 -105 -217 -352 -768 -372 -57 168 84 -63 -161 586 387 287 241 -11
1741 -11 -137 126 218 2 -273 -182 -448 195 -182 21 -363 5 145 659 360 91 -186 -180 312 43 -76 164
1763 164 20 246 78 -222 -281 309 235 -14 303 104 -493 -279 146 30 142 -19 -335 -61 392 -360 -141
1784 -141 -172 -234 -51 362 285 115 209 -174 288 181 -364 -340 -292 52 -312 -117 -548 -522 -357 15 433 63
1806 63 -242 -66 409 244 652 507 163 172 348 309 -51 -165 -581 -710 -40 219 -303 -596 252 63 336
1827 336 -45 -106 274 -293 365 12 -167 -59 -108 141 267 -70 -42 -170 -128 -22 109 -227 -226 10 221 106
1849 106 5 -389 -239 -248 314 -258 39 -266 -247 295 655 277 363 274 721 312 310 357 -513 -458 -150 -258 60
1872 60 -429 -438 161 330 29 -586 66 452 507 365 344 33 374 -68 13 187 -448 -276 -189 -56 188 -300
1894 -300 119 -7 -136 171 144 -201 -74 183 68 20 60 -234 -74 21 -279 -170 -110 -336 -26 391 289 -159
1916 -159 -172 44 271 534 164 13 44 -245 -114 80 241 -90 -161 314 -98 -211 33 351 138 37 -152
1937 -152 -26 -226 263 -346 45 107 89 -500 -99 99 237 48 -251 192 342 403 380 -36 16 -1 145 231
1959 231 -155 -358 -165 -505 142 103 -466 -2 -219 235 7 394 128 232 425 380 388 301 422 -35 157 92
1981 92 -51 -183 -283 -341 4 199 91 28 -401 -147 85 -36 -73 158 -47 -28 223 307 -13 222 100 211
2003 211 127 -438 -306 185 225 -64 -166 -18 -5 -263 -20 141 119 -5 -30 267 -158 -368 -88 28 84 198
2025 198 67 281 420 -109 -223 280 172 -367 -278 -331 -198 216 -190 -279 90 477 -41 171 76 234 253 228
2047 228 138 -236 22 -316 -4 24 112 199 0 34 -241 -186 -105 -15 221 -55 186 -249 35 -36 109 236 -20
2070 -20 156 -210 -121 297 -18 310 3 137 64 330 -204 71 404 -163 -99 9 75 -366 -22 -102 -116 -156 -57
2093 -57 109 -478 111 332 -76 -272 -223 12 -31 175 -69 -376 -65 -69 -57 -36 -218 -177 150 245 77 145 -154
2116 -154 -50 212 194 -135 263 -4 48 -124 211 -249 -509 -301 -203 -49 239 -145 -7 179 256 69 -123
2137 -123 -100 87 108 239 189 -100 -228 151 -31 195 -340 129 -340 103 69 33 -98 -152 357 -466 -148 58
2159 58 55 -58 -115 -235 259 -10 119 184 234 213 64 -152 90 -134 32 -337 -306 -193 -59 -78 -353 -28 -665
2182 -665 28 48 372 211 132 44 315 -64 281 19 -157 349 12 71 19 17 -306 -76 -430 98 -309 -156
2204 -156 -24 101 37 452 -219 -307 -125 25 -278 -123 57 64 -321 -37 348 -415 -373 87 21 48 -134 116
2226 116 -90 -10 -176 146 3 28 285 171 335 -390 236 197 255 341 -65 -58 132 258 -4 -63 -12 -419 -199
2249 -199 -308 50 -125 -18 -271 147 -49 -133 0 -68 -388 422 -292 2 302 -76 -29 82 110 100 -197 -11
2271 -11 -89 57 -249 -309 -140 -239 398 95 382 128 -12 -100 -174 -69 -207 215 -59 -88 183 -24 -123 -311 -291
2294 -291 -7 31 -131 51 332 52 72 -129 127 -72 -178 92 -132 89 -202 74 355 30 188 127 46
2315 46 15 -2 -196 -120 -159 -123 -293 -30 147 71 219 60 -17 175 -45 48 248 41 -10 41 -180 141 -376 -389
2339 -389 186 -117 -252 -11 78 -91 -473 -304 -94 108 -244 193 29 -1 132 296 208 386 276 281 -252 176
2361 176 55 -73 -66 -268 175 -314 192 79 -103 132 108 31 -229 -234 225 67 -279 -30 228 -60 113 -80
2383 -80 -79 48 202 297 -25 306 131 -301 -345 -113 270 -250 -55 -295 122 117 136 -18 -4 52 297 -150 -377
2406 -377 172 326 -432 15 -24 -30 -13 199 -24 -84 -360 22 223 -115 287 -7 -274 -84 99 166 -169 -45
2428 -45 198 256 21 259 -205 -272 49 -118 -284 132 71 -80 -77 112 -98 -425 252 -9 269 -41 -34 239 64
2451 64 -170 216 48 251 54 -150 121 -130 180 -185 -249 -392 27 -25 -32 -130 283 213 3 -54 120 -43 24
2474 24 397 -176 147 236 2 241 -122 179 124 105 173 -123 -113 213 -357 -281 -148 48 67 71 258 12 -52 123
2498 123 423 100 -50 173 -112 -194 -30 -58 162 -82 -3 -275 -175 72 93 194 100 -339 146 139 -93 117
2520 117 1 -43 -123 110 -19 302 266 -26 417 88 112 -247 -70 -112 -152 2 20 -142 -257 -110 -83 -62 62
2543 62 321 17 -367 30 190 -51 199 161 -147 251 -107 57 -97 -290 117 79 -182 58 -316 146 -205
2564 -205 -89 -175 13 13 50 39 -67 365 175 -176 108 278 -88 -138 132 2 190 -5 32 134 313 73
2586 73 18 33 -258 -226 -48 -2 -94 -4 97 -198 -50 -108 -39 -67 37 -21 24 -93 190 92 -164 280 39 195
2610 195 -112 161 278 -138 198 106 269 -53 -62 -281 49 -162 45 59 44 -167 -111 -290 -166 -173 -120 109 123
2633 123 242 -297 167 -68 65 470 31 -59 -126 94 -294 -37 36 1 -223 80 -10 205 -426 245 55 23
2655 23 77 -11 -275 49 198 143 92 135 383 -240 -248 -397 32 129 -129 -84 118 49 49 -227 50 -243 205 136 -309
2680 -309 -295 -176 -175 -238 101 212 -43 186 8 148 239 -260 21 -138 -481 -94 12 -267 -75 137 -138 276
2702 276 -129 169 -54 83 144 405 -77 8 44 -91 -97 85 -209 153 22 -267 348 16 -143 387 -89 -514
2724 -514 94 103 206 -41 118 37 126 -93 338 22 128 -261 53 195 -314 65 254 -109 330 96 64 60
2746 60 66 266 300 -339 -3 221 159 47 28 138 98 128 -287 373 -30 -268 -96 -220 52 -27 -143 -207 -183 -203
2770 -203 -23 -36 201 -175 -26 -170 -36 105 -5 16 -194 -53 -76 214 -104 193 -258 184 -47 16 35 330
2792 330 -48 -45 160 244 -121 -204 -166 361 -232 -132 114 -200 223 -74 -42 86 395 -217 -107 181 140 -156
2814 -156 130 323 -55 -74 -31 21 -85 -146 -2 -159 204 -417 -95 -232 350 179 160 83 -45 119 -351 -161
2836 -161 136 -324 -45 41 -284 -314 -18 136 238 -33 -31 -85 -43 200 -303 119 7 -90 169 151 76 -18 93
2859 93 -240 -6 -44 -129 -181 175 -27 165 36 44 -82 31 -113 -116 209 -122 -444 -99 177 50 140 121 -73
2882 -73 47 -34 -108 199 -346 74 -73 -64 -9 180 -49 -192 87 215 102 -166 -399 -287 326 50 304 -129
2904 -129 63 177 -224 -156 -166 259 60 -423 109 -98 -481 72 -128 -66 7 110 121 244 -107 -168 -147 -176 100
2927 100 -66 -389 -46 39 -4 -208 164 -63 -143 -21 26 216 151 -222 -160 175 -20 -81 -107 -287 46 36 221
2950 221 -14 176 -75 297 -54 347 -400 279 -313 -116 180 -162 -125 65 209 -438 50 79 -360 -3 -27
2971 -27 456 173 -67 -134 23 -56 289 152 -20 0 89 329 -212 -121 -124 -269 -212 -88 -63 -235 -33 238 -190
2994 -190 -72 140 152 141 -206 38 84 68 148 465 -74 -17 -94 -119 -7 -1 79 113 -232 -106 90 -116 350 186
3018 186 1 27 240 -50 257 -154 -102 -270 40 -151 64 293 123 36 267 244 117 -316 112 260 -83
3039 -83 78 186 194 90 148 386 -205 134 -225 65 182 97 316 478 27 -305 -80 216 57 58 327 -315
3061 -315 -208 -113 -86 -121 157 79 -404 194 -194 -218 -222 329 1 -175 -128 128 318 -143 -35 -41 -57 250 -109 -124
3085 -124 -180 -166 150 55 -60 6 88 -154 83 421 181 151 -155 -26 262 34 -287 168 -9 -76 -88 -292 -49
3108 -49 -17 414 -141 -21 -7 197 -140 145 28 -23 99 153 -383 -109 38 -54 197 -238 59 -202 -75 289
3130 289 176 -237 275 -313 -33 -24 315 -192 -186 349 132 -72 -193 18 -108 108 -224 -500 -358 81 323
3151 323 -28 109 165 137 22 -256 -169 -100 11 -734 127 115 -15 -222 -303 98 106 -136 -78 30 -267 75 -16
3174 -16 236 67 73 296 208 -208 -176 -171 -400 15 256 -124 -172 -73 -131 -173 56 -292 -29 212 -99 -29 102 119
3198 119 342 70 -331 68 2 145 13 50 384 85 16 235 136 241 12 49 -31 -180 25 224 232 131 241
3221 241 -7 212 118 318 49 243 131 -113 -32 429 -16 -169 153 -114 29 -44 -71 20 66 -18 340 12
3243 12 -38 28 -183 128 -25 -297 -184 67 -169 -125 -194 221 88 206 -110 -104 79 205 290 -191 -183 -235 -290 -38
3267 -38 -87 333 138 32 169 -72 -88 -311 10 93 133 178 -352 164 482 -42 77 214 -261 291 57 -41
3289 -41 -91 -80 317 -339 -49 13 -265 -71 254 47 -431 180 39 126 289 -144 -132 -23 -37 158 130 95 36
3312 36 277 -67 -37 105 149 -164 31 -216 -165 178 -154 -122 255 123 -215 85 -74 -51 26 -34 121 -134 -368
3335 -368 -165 40 -1 -89 -134 41 181 47 -238 249 -224 -63 -102 13 -101 309 148 -51 27 -22 53 120 -298
3358 -298 -127 112 157 202 214 -115 23 22 -52 -33 40 -108 48 -305 -238 -173 -142 -69 -426 113 -37 128 -100 219
3382 219 15 321 7 -284 -158 2 -172 136 -259 -262 162 93 99 -14 -38 -67 -83 -234 -160 32 40 -328 384 206
3406 206 -329 -65 -328 -76 -200 -132 -16 175 50 -56 85 -218 -9 -54 132 -420 84 -79 66 145 129
3427 129 -45 -67 -31 -9 157 -19 -50 -266 -186 -160 -314 -67 -171 -102 -167 -88 -281 169 57 -220 332 -200 216
3450 216 -66 -120 -53 -428 131 -28 256 -149 135 124 -42 277 -38 82 -83 -17 -123 38 212 -23 -189
3471 -189 182 17 108 -142 79 -100 127 212 51 -474 125 -236 66 -219 81 -71 -118 7 0 97 -183 -46
3493 -46 -42 76 51 175 -352 -186 -121 127 239 -111 -24 106 -221 -247 56 -18 -237 54 -28 -45 -82 -57 124 -63
3517 -63 -146 346 -376 16 388 -37 -40 300 -109 -9 123 -53 322 301 -455 172 281 76 92 29 -185 -116 -152
3540 -152 -281 174 354 -500 201 -13 227 -21 -87 258 -303 -357 -127 -330 290 256 -398 -220 -70 174 -117
3561 -117 165 -419 164 -188 -343 129 53 46 188 -40 -93 -178 20 -5 -37 -42 14 -25 -191 6 247 -22 402 25
3585 25 126 -173 51 227 -20 -271 -56 -19 -27 -60 313 -261 -188 -34 -238 -290 -21 87 -69 -297 507 174
3607 174 90 139 25 177 232 151 -264 89 -22 140 -6 125 -169 81 -102 112 8 148 160 267 -80 208
3629 208 84 -512 373 -130 -168 31 -31 -203 -294 218 -84 26 186 40 -15 -89 -177 294 152 105 97 24 -128
3652 -128 -207 -155 267 98 -165 -222 23 -63 -355 245 105 -128 42 107 304 -79 -270 26 -401 244 334 -349
3674 -349 -505 -47 280 37 223 -91 86 -141 311 -324 -197 155 -373 -126 -90 21 -86 252 -376 356
3694 356 -293 140 130 40 41 114 -220 -102 172 214 -202 19 -76 150 -265 87 -3 12 229 32 43 -67 52
3717 52 22 191 -327 75 -21 145 -171 105 -92 346 -75 -35 99 372 -71 370 -344 19 19 352 381 204
3739 204 213 162 -73 -14 357 173 -247 -9 -509 78 -163 -117 -56 177 83 185 48 207 -81 349 38 128 -97
3762 -97 174 6 -123 -267 -272 35 -192 22 156 -12 -145 -359 32 75 -42 142 40 326 -433 -119 29
3783 29 96 344 172 -150 56 -25 74 -132 51 33 161 -312 232 251 -84 8 -112 -316 -252 -33 -171 87 361
3806 361 -66 -92 -46 -73 199 56 55 -156 225 80 -75 204 200 -208 -111 112 56 31 176 36 -55 -266 -64 -255
3830 -255 108 -176 61 -205 48 124 83 -173 -286 145 -229 -152 -173 -44 343 -462 -70 -308 -136 -176 -120 308
3852 308 303 315 185 54 -240 266 174 162 153 256 118 340 166 46 -237 99 144 -25 -196 -61 55 125 22
3875 22 -166 -77 -113 335 101 110 124 74 -96 -79 -151 -87 -168 -244 -258 234 43 -252 -41 -237 24 -115 -119 -38 -38 -255
3901 -255 -72 -53 160 -137 -90 -103 -170 67 129 -274 -237 -330 108 -118 57 81 -124 67 -40 -195 -325 -13 -112
3924 -112 186 91 244 -17 -221 -249 -8 -201 255 240 319 -34 -146 -72 -117 -74 39 6 -129 364 -4 -71 140
3947 140 150 -146 85 8 -98 -168 -75 222 -49 68 -382 -298 -229 -548 224 -43 -98 -400 216 -20 -14 124 -54
3970 -54 156 78 5 -167 354 -441 119 458 75 215 -20 259 -270 387 188 -115 -185 -274 86 -314 -220 -327
3992 -327 -339 -85 -227 -37 -128 -210 116 245 147 269 348 106 -318 -66 26 124 -158 -11 -282 15 198 162 98
4015 98 -152 281 66 124 -49 117 -316 81 -137 2 -260 -115 80 77 19 -168 237 -64 -296 -407 87 -69
4037 -69 -221 171 -48 -125 -180 190 -132 23 -164 -152 63 -204 -133 469 339 -81 134 71 208 62 -35 106
4059 106 145 -187 473 -384 -19 26 -210 -21 -161 122 23 -151 139 -65 -92 -61 177 -92 -163 -160 198 -98 -122
4082 -122 -332 -126 -36 35 128 -41 -141 37 50 -109 174 -53 37 -81 300 69 -56 342 230 -431 164 -268
4104 -268 129 186 242 116 25 -1 269 218 -61 -199 33 -176 -73 -43 110 262 282 146 67 70 -19 -26 249 110
4128 110 123 -175 128 42 96 -156 -214 261 93 -28 -65 -120 -197 -320 183 -247 214 220 338 -266 118 136 53 -8
4152 -8 -285 -42 201 -373 -84 68 -94 216 30 -127 177 -158 140 145 -180 -29 -68 -38 -90 -94 190 -37 -237
4175 -237 313 -220 -475 -480 254 4 -38 197 183 89 130 -58 -15 61 38 -57 208 177 214 -190 343 -57 183 -156
4199 -156 -132 -29 53 -512 139 44 -169 92 -93 212 -10 153 -304 -49 -115 -191 -68 292 195 -77 -77 -199 103
4222 103 18 122 -70 10 19 -218 38 243 -37 347 597 219 317 27 277 65 152 100 9 -188 137 170 210
4245 210 100 -164 -9 -106 -230 -362 -3 114 18 -57 -141 58 -193 -115 11 54 -32 -192 -259 69 222 -192 -134
4268 -134 -366 195 236 -1 218 -253 324 -45 -79 56 -328 -426 70 -103 -286 305 58 63 319 40 -198 431
4290 431 395 -651 24 -270 87 97 196 -301 -88 -390 158 -226 395 -26 -321 -149 34 -300 170 -216 125
4311 125 340 -196 256 21 -391 -87 192 -203 -66 65 59 -64 477 -158 148 -25 -158 88 371 214 -91
4332 -91 -99 65 65 53 99 -166 96 96 -107 221 357 -101 -26 -61 -169 -206 -67 -239 208 -257 215 336 262 -163
4356 -163 310 -15 346 211 -156 -198 -51 -49 -4 16 255 220 157 134 -83 258 302 333 167 123 377 -59 -264 3
4380 3 -187 -81 391 -40 156 87 18 -187 -87 -305 193 -40 -65 -124 97 32 173 -184 -176 -100 -75 -42 368 32
4404 32 74 -111 -134 -147 113 342 -145 -236 57 612 338 153 -247 -292 -239 -75 30 -149 -152 -251 61 -65 -168
4427 -168 110 18 -60 -121 483 118 242 -168 157 243 -61 103 77 72 171 29 -61 111 306 142 123 201 75 -132
4451 -132 273 378 149 -95 -100 291 -115 -54 40 -224 -75 -268 -216 -138 -50 -177 172 212 -100 28 -192 39 133
4474 133 197 -107 351 42 -135 39 111 38 64 -122 -124 155 542 93 37 399 -71 103 -109 118 -141 48
4496 48 -129 -28 358 123 -40 65 103 401 129 33 -307 170 210 -197 -27 -99 -51 199 47 -47 -42 237 416
4519 416 -341 257 -41 -153 125 164 -92 -286 199 396 -185 199 -136 -92 223 100 241 -108 319 413 -228
4540 -228 -55 -52 13 78 182 -58 -2 163 -414 -125 123 -185 59 228 -495 -332 -150 239 -47 -129 279 257
4562 257 265 -78 292 133 -312 307 24 -86 9 -51 -12 30 177 -55 8 -343 -46 203 -38 278 -112 133
4584 133 192 268 343 -283 -149 230 153 -63 -32 -404 -192 -287 -81 378 -166 28 -134 40 -309 -49 191 -7
4606 -7 142 -154 -328 -24 -346 120 421 255 -130 254 194 -153 79 236 72 229 -168 276 81 24 -160
4627 -160 -136 -125 242 67 -88 210 -291 101 -289 -36 168 -130 -432 -112 318 -32 -96 95 -38 -98 145
4648 145 156 26 -109 329 1 158 -371 489 -396 7 -40 -145 -269 151 131 -58 140 44 258 164 126 -274
4670 -274 129 -82 -138 233 -110 -122 278 232 -124 522 253 470 204 -318 369 2 -332 155 284 364 23
4691 23 -62 -137 219 135 -466 534 160 28 67 -34 134 -129 255 126 33 120 -190 -248 105 -321 -188 161
4713 161 42 -325 21 89 97 -180 44 -208 101 81 259 124 -131 165 99 840 -26 290 -307 -279 182 91
4735 91 -7 203 -83 204 122 -94 -94 -131 96 -468 -73 -141 -46 -16 209 187 -431 295 391 158 -186 -405 438 -246
4759 -246 208 -20 -74 -19 159 109 285 94 303 -24 26 -13 107 171 197 45 544 71 -122 55 234 -141
4781 -141 79 331 106 188 248 -46 59 -45 -77 -353 -236 -75 -221 285 64 80 195 161 -197 -106 -198 -101 372
4804 372 55 313 358 -125 -4 180 361 324 -59 405 -425 77 64 -186 -377 -2 -78 -398 551 -69 97
4825 97 -250 -393 -37 191 -552 230 -235 -102 219 -78 -186 198 -85 -66 39 -229 297 403 -199 96 32
4846 32 69 -74 70 -135 -176 1 -33 133 -10 434 132 -24 -178 163 -54 147 80 529 -75 -146 12 -375
4868 -375 -148 117 191 -457 -246 -341 -314 354 -12 -72 258 -77 501 -390 349 -50 104 252 21 121 46 -183
4890 -183 309 82 274 179 -168 -4 46 257 -74 51 -347 -100 10 -216 274 -183 -19 -103 -76 -110 20 115
4912 115 184 3 -240 87 71 256 -435 -130 -375 -189 -103 102 -3 207 -6 228 -70 -113 -25 455 -35 -209
4934 -209 -250 29 109 -73 -48 -77 12 -207 26 -146 356 67 240 144 -133 112 -16 3 142 -109 -70 -49 81
4957 81 -120 242 -291 -24 -8 219 195 -31 -63 -118 59 29 -29 513 -180 -81 279 6 -80 155 73 -238 22
4980 22 -30 265 158 232 -41 -234 144 -47 53 -217 -224 -409 346 57 -5 17 106 -64 332 -208 -189 65 41
5003 41 135 -63 -179 -174 168 204 137 -299 87 205 168 40 280 85 165 -354 -103 225 -58 -60 -431 -186 -185 -9
5027 -9 -175 -166 -61 -190 -211 110 123 298 197 154 -69 133 214 -80 -328 171 85 -108 -112 -162 234 -231 -173 -283
5051 -283 264 -7 -140 -185 80 -234 201 280 151 -151 -27 266 -135 62 -1 -171 38 72 46 144 -238 39
5073 39 -21 54 -222 23 52 13 46 -233 472 221 102 15 -470 -111 -387 81 -75 -15 -181 -102 63 12 276
5096 276 -541 227 -72 -189 -52 -371 1 -3 61 531 -393 6 150 -41 328 -178 32 38 11 97 38 10 -33
5119 -33 358 105 33 36 159 125 -4 168 67 98 206 -108 109 -104 36 -186 -102 102 561 -148 -17 172
5141 172 -73 283 -270 84 188 365 -39 131 289 -30 -226 -133 -55 -152 -78 154 -142 87 28 -265 107 111
5163 111 138 413 -62 -114 75 138 53 222 209 244 -8 25 -48 -126 -249 -236 323 249 376 348 71 151 356 55
5187 55 -165 -154 195 -350 352 -162 -57 -730 205 77 -275 162 55 -114 430 -90 -180 55 -68 132 85
5208 85 157 -223 214 260 -96 -78 171 25 112 258 64 168 320 112 213 155 -45 2 -270 -241 -437 -302 -32
5231 -32 -112 121 87 -97 52 89 133 54 11 -47 -179 46 -81 68 -23 196 -459 109 -220 -410 286 -186 12
5254 12 -120 -189 35 -77 51 244 -96 250 138 -165 394 84 76 147 -205 519 -168 325 119 356 83 -88
5276 -88 137 315 -92 101 86 19 -90 -166 -73 3 84 254 143 249 -260 -46 -30 -148 -64 30 35 -269 -68 -84
5300 -84 -44 -52 -67 31 399 272 2 -277 228 -86 364 124 -50 152 -96 -117 -163 58 -292 -434 -201 308 -229
5323 -229 -172 -134 277 -17 -178 115 366 73 443 -95 -32 -120 -66 231 148 167 -284 149 140 251 -209 258 168
5346 168 -185 156 145 158 -114 188 -115 -180 76 -96 -16 -271 116 -20 -82 162 216 31 -83 116 13 -320
5368 -320 7 -43 -104 262 -50 -9 316 -49 46 -46 -112 -37 -271 -315 -250 9 -150 -103 254 -62 112 327 -124
5391 -124 -84 -43 -232 -24 -88 -45 46 42 -225 158 213 -146 136 -136 34 -212 183 -96 -141 -95 -31 113 220 6
5415 6 -222 -35 108 6 364 110 244 -45 -311 96 -8 -98 -73 66 224 -28 541 170 171 229 -64 -91 324
5438 324 -280 245 435 181 110 1 -174 89 207 68 -47 110 284 -197 -277 106 245 -320 44 219 58
5459 58 -273 -36 -323 -31 -140 126 238 466 -197 223 -280 13 275 -101 -37 51 317 67 51 -11 367 190
5481 190 -133 358 -25 -204 77 -58 41 -7 345 72 -54 -297 -33 114 170 135 232 -55 -251 -182 217 -292
5503 -292 301 21 -233 60 -73 -97 -315 27 -141 106 -274 -15 80 -42 57 -18 148 20 106 -50 165 -202
5525 -202 307 -40 -29 -178 158 -39 299 -75 96 -307 520 301 -404 32 87 71 3 -289 46 19 70 439
5547 439 71 34 215 -40 -98 -11 -114 -94 -125 -209 -310 -8 297 -149 -4 -83 -66 -158 77 -197 225 1 -286
5570 -286 165 436 20 -289 -244 -138 68 27 -46 57 317 264 195 108 132 374 54 348 -31 -116 203 296 -124
5593 -124 -452 523 -299 -55 -195 -98 8 48 20 -54 196 118 10 -240 -51 313 99 240 54 166 8 8
5615 8 185 183 63 47 -233 329 -61 9 -55 -625 161 -22 -399 119 -243 -44 147 -134 51 139 -14 139 -109
5638 -109 -58 77 -190 133 192 -46 130 58 -19 -254 166 167 73 81 -467 313 450 -67 169 -296 -92 347 -156
5661 -156 144 -186 -180 -86 -44 -117 153 -156 78 -254 116 56 172 424 161 -38 81 -102 123 14 -30 176
5683 176 -211 224 240 65 155 3 375 -45 126 12 -76 184 -77 148 -83 -45 61 337 102 206 186 103
5705 103 -109 -137 203 83 -383 -156 109 44 -223 101 -27 190 603 -84 184 216 -44 -227 127 164 -54
5726 -54 25 468 249 202 126 53 -55 -36 -57 -340 -245 141 115 94 237 -105 380 -260 -88 120 165 -82 -181 370
5750 370 22 -118 116 -224 285 166 307 202 8 -217 -138 64 111 -106 209 247 9 283 18 67 -72
5771 -72 -108 -187 -148 -7 -170 -311 401 24 -177 120 19 64 -140 -236 182 -247 154 163 -186 0 218 146 44
5794 44 167 -156 268 -17 88 342 390 -160 -165 -367 -76 90 228 31 -300 82 200 -280 -23 -9 -56 -97
5816 -97 -98 -69 103 131 50 -66 78 -80 -103 75 452 372 483 -1 212 -23 -402 171 90 300 -111 187 4
5839 4 234 328 23 212 -30 31 -273 -111 111 -64 107 -392 91 -87 -277 84 225 -337 -211 -187 -283 -103
5861 -103 174 -163 3 1 -115 -130 37 -27 182 3 12 125 286 36 -50 129 -360 -459 -132 -176 -198 -72 -100 -29
5885 -29 -9 -279 17 -151 90 -27 139 -288 2 -91 161 118 -166 298 78 22 -85 105 -185 -200 -172 387
5907 387 -233 7 -7 318 -483 -18 -87 159 168 -448 0 58 242 74 -43 130 72 -86 -37 -305 251 -97
5929 -97 169 420 -75 -116 -65 150 -87 -78 -29 -126 -131 -59 199 195 275 -315 -103 19 -253 -44 -183 -223 384 179 -28
5954 -28 31 70 114 -102 -386 -62 -237 -49 52 282 126 -88 -188 307 -57 122 -5 224 -316 111 -325
5975 -325 -17 3 -160 322 -177 -47 -194 -127 -78 -400 85 241 -197 -39 122 179 277 -103 -113 408 210 -283
5997 -283 264 250 25 -89 -57 361 310 -28 190 -132 -162 85 72 -17 222 20 -78 -7 308 301 393 12 216 -39
6021 -39 12 -142 -28 -224 15 -12 332 -214 55 93 33 72 233 103 -128 -201 -102 31 259 -421 -50 121 85
6044 85 507 126 223 -176 -105 67 -33 -96 15 277 -122 -136 248 -32 136 -160 -366 192 -318 69 -43 275
6066 275 -37 -233 90 91 299 -60 333 -279 324 53 41 -194 227 20 51 -221 44 -153 -301 -271 165 36
6088 36 215 -93 46 -121 -14 -327 16 11 -33 302 -4 256 106 64 -3 75 -437 279 -274 -127 85 -482
6110 -482 16 301 135 5 129 106 -107 -27 -617 -59 -223 -339 -26 94 -97 -5 -40 111 -239 63 -177
6131 -177 172 41 -197 86 209 16 -54 -58 -24 148 -278 -84 157 274 327 44 255 -39 12 184 -1 210
6153 210 -203 151 31 -170 -99 298 -179 -8 136 211 269 52 -165 78 126 -79 -83 154 94 -436 -11 -122
6175 -122 -217 113 286 -130 132 -20 -94 347 -138 173 39 445 -25 -87 39 55 39 116 21 261 -78 -300
6197 -300 -74 -212 131 98 -236 -174 123 215 68 45 -74 52 108 -49 18 -80 -33 136 158 -172 496 129 445
6220 445 -47 -333 176 -249 -239 -105 -227 -141 -16 -116 134 -135 -122 86 96 164 199 -273 -428 228 -57 61
6242 61 -132 324 -201 -111 330 -283 100 -295 138 -1 -80 -86 -67 -265 -211 77 138 335 -22 -241 133 78 104
6265 104 -280 8 -24 258 17 139 -183 -266 12 314 98 11 331 363 435 16 -13 -60 91 -244 176 298
6287 298 -94 328 134 344 -31 -287 -83 293 127 -40 271 -277 -316 -47 -49 -214 64 260 -23 181 -110
6308 -110 120 -180 208 319 -71 18 -470 28 -175 -318 198 -172 0 -37 291 273 143 -24 235 -19 -110
6329 -110 -35 19 118 -132 -83 -119 218 -204 18 43 -190 3 27 164 -30 135 147 -113 257 77 -211 -69 -35
6352 -35 -158 59 58 17 144 321 -143 -115 -53 -472 120 73 9 -159 -412 174 177 329 -193 -315 196 143 171 -174
6376 -174 237 -27 106 -69 67 -235 361 -202 -36 70 -50 -268 -273 30 -201 523 254 -122 296 -5 278
6397 278 -256 196 -110 137 174 282 -93 -132 223 102 -125 -42 58 -110 284 15 254 -392 -243 328 80
6418 80 -178 109 16 -41 379 2 -222 91 -181 81 -96 -4 -22 -11 43 79 130 -201 -125 162 45 362 -11
6441 -11 432 -138 -107 110 33 114 -186 160 37 86 -315 214 -146 162 -8 -91 -204 287 -220 191 -207 18
6463 18 -253 -300 -346 59 113 -348 -4 272 35 202 -102 -22 149 -28 5 19 -9 98 -13 50 181 -128 -152
6486 -152 124 -322 207 124 392 -130 23 0 -120 159 335 141 -241 -276 -1 -72 87 -17 243 -152 159
6507 159 86 -133 281 256 206 9 140 -59 149 124 187 -213 18 251 135 -248 -153 -293 146 -273 -40 219
6529 219 -38 -86 355 23 117 -62 181 -244 220 115 178 84 -79 -230 -126 189 82 -83 -37 100 127 -280
6551 -280 -236 23 9 -176 144 100 -61 131 -152 -82 66 352 -328 -161 -26 37 214 117 -39 -67 300 202 290
6574 290 -154 61 -110 41 -306 -156 -194 -2 325 139 555 216 48 129 216 44 -176 -204 -157 147 -257 335
6596 335 60 -170 -39 133 -106 -308 71 336 -293 -325 191 -124 -131 103 -107 278 231 299 29 385 105 -30
6618 -30 0 -64 -27 137 -7 200 312 -69 -5 144 -132 102 195 64 367 260 222 -10 236 -48 190 -128
6640 -128 35 120 -219 -118 -315 250 -372 155 41 -60 -145 -9 -176 -74 -236 -27 60 89 -66 98 77 -133
6662 -133 202 -99 -45 -13 114 -223 -250 71 -36 -27 216 -190 56 160 111 268 -215 -43 164 -64 133 297
6684 297 254 -46 -226 -188 -90 156 127 327 -85 408 313 -72 -82 182 76 11 -21 -70 -42 199 79 -40 336
6707 336 -75 103 65 -136 306 151 -162 -194 63 152 227 -31 -57 -32 -100 142 190 -120 -27 113 -92 -2 -402
6730 -402 -261 446 -86 -244 -111 469 149 29 130 34 123 -84 245 84 130 107 160 -120 -110 272 105 -346
6752 -346 375 461 -68 -207 -267 -152 492 296 -260 -7 -234 -18 -13 -152 200 220 21 225 406 114 162 63
6774 63 -15 181 -44 1 169 -136 -27 62 -50 501 -129 -155 42 -74 -18 246 -102 -61 -128 -14 154 25 -129
6797 -129 -56 143 400 -173 -111 -244 26 -110 -102 20 47 -144 -166 -367 -32 -81 229 245 168 -143 32 -337 66
6820 66 108 -269 40 -87 35 80 -163 -25 50 -98 -114 -53 -5 49 -204 -34 233 -87 237 -96 276 -345 234
6843 234 -198 -52 65 -176 -166 -29 -164 -118 439 -131 137 49 -243 3 -10 123 -105 268 -355 246 37
6864 37 34 308 349 -321 -180 34 364 118 85 -45 -71 110 -168 154 -175 -148 -26 101 -92 -36 -185 -41 40
6887 40 172 115 81 388 340 -43 92 -150 -250 -138 -285 393 327 59 -19 -102 281 132 84 -394 -157 247 120
6910 120 -279 -155 -6 57 116 -118 -134 -246 -27 -200 -269 -356 130 -103 -44 -94 284 22 189 1 -57 76 398
6933 398 -307 70 -87 47 -40 -189 134 -198 -143 25 401 16 247 166 -301 -125 72 -176 -99 -439 -253
6954 -253 241 -103 -121 10 -29 32 -24 -151 318 -193 -141 26 228 -71 -35 210 -42 -13 -367 -242 81 -187
6976 -187 -197 138 -216 -293 -218 -186 -15 173 38 82 -72 342 230 -5 -6 23 -209 69 -32 -16 205 15 22 -126
7000 -126 214 159 -114 64 -174 43 19 260 -119 -132 -135 -127 -159 -298 38 -128 -284 136 359 -118 -165 -104 87
7023 87 327 161 -339 -137 61 54 534 -114 103 -63 428 -302 -325 -59 -154 21 -407 162 -384 -224 106 250
7045 250 -86 139 123 -227 -179 -76 279 272 -229 64 -92 183 -17 -141 105 -45 19 -136 -206 285 -126 134
7067 134 119 -146 -362 183 374 20 324 -63 20 -119 -315 -300 -97 -185 78 508 -156 -248 55 -82 54 -224
7089 -224 -236 -9 69 28 -389 -44 37 -47 318 99 30 -70 119 60 -18 178 -144 148 4 -136 -43 -24 -93 -78
7113 -78 415 183 -105 -114 45 -193 -77 84 46 -12 -338 -149 273 -180 200 -160 -361 -11 -9 -355 4 -71 -38
7136 -38 152 6 251 223 -146 165 -70 -115 -106 194 65 -294 140 -313 161 40 -138 134 -60 168 -22 217
7158 217 -75 -67 -173 -126 -50 -148 14 -203 -23 -3 21 30 210 -60 198 254 -262 -217 50 -156 188 56 -676 -108
7182 -108 258 -108 355 -203 -184 120 -70 178 240 -44 374 -285 -129 -43 53 -97 -40 -99 30 129 211 265 -229
7205 -229 143 50 -121 137 -31 -91 400 -244 -314 -373 41 -2 106 -35 223 252 12 215 -160 169 24 12
7227 12 14 145 -111 -176 -81 122 25 98 102 214 243 -109 130 -132 -115 152 38 -73 475 86 22 82 256 -233
7251 -233 211 -146 87 182 -148 162 -23 252 51 -1 176 415 -171 -122 97 -204 -16 -183 -229 -82 25
7272 25 174 75 -189 341 17 0 296 -25 -4 -252 -160 139 -126 159 -52 -206 320 -237 -78 454 250 -200
7294 -200 100 104 0 -212 -158 -114 170 -186 196 62 -299 -115 -102 43 -22 -155 170 -146 10 -202 87 38
7316 38 120 -196 -17 7 -109 102 -152 218 -104 -98 -167 -12 284 -112 -135 106 -15 -46 -520 0 -37 -45 82 -181
7340 -181 -253 -120 -96 -132 97 36 217 -180 100 55 -494 -467 5 272 -8 -10 -108 -97 -188 120 69 108 106 251 15
7365 15 -18 -159 -249 -161 317 12 192 186 140 -73 198 167 11 98 126 194 123 -439 68 -119 178 70 -23 107
7389 107 275 107 -203 126 74 147 -106 -41 373 22 -360 -66 266 91 -392 -31 31 -50 23 51 -57 -4 -193
7412 -193 -233 -590 -144 441 -282 -172 -210 -163 187 322 55 -265 -98 -533 -32 -68 83 -96 -122 -415 120 -51
7434 -51 -228 128 298 314 32 -72 -280 -67 -121 -85 -229 158 19 -170 170 -135 182 -106 -412 142 46 76
7456 76 262 182 -168 174 -80 -48 -247 -157 86 -134 259 -236 -443 101 58 82 -125 107 20 85 -10 173 481
7479 481 -451 203 122 -1 -124 -42 -43 -317 23 256 454 151 -326 248 175 -344 448 256 11 -138 149 100
7501 100 129 -182 -252 -273 87 124 -2 212 69 -114 -204 139 15 380 -132 187 8 19 307 -91 23 -98
7523 -98 -287 344 37 -117 -260 50 -98 97 -16 283 -183 -17 144 107 -89 -35 19 -506 -69 -34 -319 182
7545 182 254 94 -145 -183 290 54 -98 35 -88 -98 0 -77 334 147 -147 61 292 71 -100 -77 124 -38
7567 -38 -28 -162 -45 166 -70 177 75 -67 406 -151 -43 -138 96 -143 -72 -42 -64 -178 285 -430 -407 -160
7589 -160 -215 -26 -164 -20 -65 36 25 -50 93 191 -125 -186 191 -190 165 312 -62 317 92 314 -230 42
7611 42 132 -58 -19 -135 -313 -241 -252 52 230 158 -105 135 -187 -56 46 139 -86 -323 -227 146 62 49 95 -69
7635 -69 -92 33 -32 -52 -337 278 143 -247 45 -1 83 253 191 93 56 220 413 160 99 198 46 19 167 -384
7659 -384 369 -438 155 274 155 80 -35 -17 63 40 -174 250 -301 -261 -114 -246 -128 41 -59 -255 3 -339
7681 -339 301 133 -74 -22 19 105 220 -77 -62 161 -136 -45 217 100 -228 36 -17 -107 29 14 128 188 3
7704 3 -36 112 113 -200 -34 279 173 265 -42 -152 97 -272 -385 106 -118 -221 210 209 27 29 -116 40 284
7727 284 -197 -97 -48 286 108 422 31 130 -37 211 -214 1 135 97 128 -98 -28 83 488 8 181 -33
7749 -33 115 350 -479 -339 -318 -38 -55 -99 297 192 171 -233 45 227 -249 -32 326 -95 -4 -4 -103 117 177
7772 177 -109 182 -178 -215 137 -196 -17 225 -64 323 127 -15 -64 -285 -312 133 318 251 -225 420 340 2
7794 2 -31 -136 -134 266 485 -301 -240 -121 -214 -51 -283 306 -136 -291 -164 -36 34 100 110 152 -11 164 246 -412
7818 -412 -24 193 -245 252 100 75 -2 173 -69 -161 -133 25 116 -543 -256 311 203 138 -299 -152 -377 -365
7840 -365 355 294 240 -390 -49 196 370 174 300 -149 24 149 -368 -268 34 110 -18 68 -258 -296 77 -14
7862 -14 121 -156 -84 268 -263 -183 -106 -266 -225 92 -16 126 259 -188 22 -306 11 -213 -183 94 -4 -189
7884 -189 387 -80 321 88 87 -170 61 109 40 -35 -389 194 116 399 8 -165 419 73 58 291 157 436
7906 436 12 2 173 -357 -127 268 -236 178 -213 304 -177 59 81 33 67 192 388 -213 277 216 -35 71
7928 71 21 -41 191 -81 188 181 -13 235 68 -47 224 -80 -260 117 -310 169 282 200 169 80 -156 -97 14
7951 14 237 228 -321 7 -400 -5 149 -13 -13 14 242 -39 -194 158 -66 -497 -33 -98 -47 66 -106 110 -1
7974 -1 99 -138 -357 143 -228 -185 286 -126 170 -130 -305 39 -151 0 -52 -54 -116 244 -231 -1 -10 46 -340
7997 -340 22 -275 -269 59 59 -72 -329 63 -75 56 -236 451 -112 20 179 -57 -134 -13 -73 166 502 -108
8019 -108 -123 185 -187 54 -219 -83 363 282 -164 158 258 -212 -149 -74 -108 -131 -295 -105 138 146 -207 -251 -24
8042 -24 -160 -126 -116 124 -169 -13 -198 -214 -74 -323 0 -359 85 203 -54 64 -260 121 -293 297 38
8063 38 138 -130 54 -213 -8 -41 254 -157 -228 265 12 178 -182 -387 375 -132 10 77 -101 171 57
8084 57 229 177 41 -47 -323 102 -339 28 237 136 159 199 128 107 101 -386 42 -27 224 67 21 111 162 -242
8108 -242 45 -102 -11 -170 -201 58 285 -87 -236 41 217 211 246 16 101 -135 -166 -65 -190 123 119 227 -49
8131 -49 -27 40 484 -42 381 26 140 -14 265 -334 -20 472 284 -229 -255 77 302 174 -52 88 -99
8152 -99 -351 71 561 193 -286 -11 156 -353 -104 -379 -302 -76 -57 144 -153 -7 -250 121 -155 -102 271
8173 271 79 -196 20 -205 28 53 104 244 -142 -209 145 98 -75 -402 -46 13 -39 107
8191A07
##END NTUPLES=NMR FID
##END=
