##TITLE=1H ikalashn
DE-76k_NaOH
22.11.2024
##JCAMPDX= 6.0         $$ Bruker NMR JCAMP-DX V2.0
##DATA TYPE= NMR FID
##DATA CLASS= NTUPLES
##ORIGIN= UXNMR, Bruker Analytische Messtechnik GmbH
##OWNER= root
$$ TOPSPIN		Version 1.3
$$ 2024-11-22 15:38:56.171 +0400  Irina@DPX200
$$ Compression mode = diff/dup
##.OBSERVE FREQUENCY= 200.131300845
##.OBSERVE NUCLEUS= ^1H
##.DELAY= (6, 6)
##.ACQUISITION MODE= SIMULTANEOUS
##.ACQUISITION SCHEME= undefined
##.AVERAGES= 33
##.DIGITISER RES= 18
##SPECTROMETER/DATA SYSTEM= spect
##.PULSE SEQUENCE= zg
##.SOLVENT NAME= D2O
##.SHIFT REFERENCE= INTERNAL, D2O, 1, 17.49637
##AUDIT TRAIL= $$ (NUMBER, WHEN, WHO, WHERE, WHAT)
$$ ##TITLE= Audit trail, TOPSPIN		Version 1.3
$$ ##JCAMPDX= 5.01
$$ ##ORIGIN= Bruker BioSpin GmbH
$$ ##OWNER= Irina
$$ $$ F:/spectra/data/iren/nmr/1H/4/audita.txt
$$ ##AUDIT TRAIL=  $$ (NUMBER, WHEN, WHO, WHERE, VERSION, WHAT)
(   1,<2024-11-22 15:38:41.890 +0400>,<Irina>,<DPX200>,<TOPSPIN 1.3>,
      <created by zg
	started at 2024-11-22 15:36:28.921 +0400,
	POWCHK disabled, PULCHK disabled
       terminated by command 'halt'
       configuration hash MD5:
       BE 6D 3F 07 2A EA 11 49 91 17 2B D3 AF B3 58 0D
       data hash MD5: 16K
       AF 65 47 76 EC 95 27 F4 B0 0D 44 A4 FB 88 F5 77>)
$$ ##END=
$$ 
$$ $$ hash MD5
$$ $$ BD 71 F8 F6 A7 74 BB 16 42 F6 B0 E7 28 5E 94 06
##$RELAX= 
##$RELAX= 
##$RELAX= 
##$RELAX= 
##$RELAX= 
##$RELAX= 
##$RELAX= 
##$RELAX= 
##$RELAX= 
$$ Bruker specific parameters
$$ --------------------------
##$DU= <F:/spectra>
##$EXPNO= 4
##$NAME= <1H>
##$PROCNO= 1
##$TYPE= <nmr>
##$USER= <iren>
##$AMP= (0..31)
100 100 100 100 100 100 100 100 100 100 100 100 100 100 100 100 100 100 
100 100 100 100 100 100 100 100 100 100 100 100 100 100 
##$ANAVPT= -1
##$AQSEQ= 0
##$AQ_mod= 1
##$AUNM= <au_zg>
##$AUTOPOS= <>
##$BF1= 200.13
##$BF2= 200.13
##$BF3= 200.13
##$BF4= 200.13
##$BF5= 200.13
##$BF6= 200.13
##$BF7= 200.13
##$BF8= 200.13
##$BYTORDA= 1
##$CFDGTYP= 0
##$CFRGTYP= 5
##$CHEMSTR= <none>
##$CNST= (0..63)
1 1 145 1 1 1 1 1 1 1 1 1 1 1 1 1 1 1 1 1 1 1 1 1 1 1 1 1 1 1 1 1 1 1 
1 1 1 1 1 1 1 1 1 1 1 1 1 1 1 1 1 1 1 1 1 1 1 1 1 1 1 1 1 1 
##$CPDPRG= <>
##$CPDPRG1= <>
##$CPDPRG2= <>
##$CPDPRG3= <>
##$CPDPRG4= <mlev>
##$CPDPRG5= <mlev>
##$CPDPRG6= <mlev>
##$CPDPRG7= <mlev>
##$CPDPRG8= <mlev>
##$CPDPRGB= <>
##$CPDPRGT= <>
##$D= (0..63)
0 2 0 0 0 0 0 0 0 0.06 0 0.03 0 0 0 0 0.0002 0 0 0 0 0 0 0 0 0 0 0 0 0 
0 0 0 0 0 0 0 0 0 0 0 0 0 0 0 0 0 0 0 0 0 0 0 0 0 0 0 0 0 0 0 0 0 0 
##$DATE= 1732275519
##$DBL= (0..7)
120 120 120 120 120 120 120 120 
##$DBP= (0..7)
150 150 150 150 150 150 150 150 
##$DBP07= 0
##$DBPNAM0= <>
##$DBPNAM1= <>
##$DBPNAM2= <>
##$DBPNAM3= <>
##$DBPNAM4= <>
##$DBPNAM5= <>
##$DBPNAM6= <>
##$DBPNAM7= <>
##$DBPOAL= (0..7)
0.5 0.5 0.5 0.5 0.5 0.5 0.5 0.5 
##$DBPOFFS= (0..7)
0 0 0 0 0 0 0 0 
##$DE= 6
##$DECBNUC= <off>
##$DECIM= 32
##$DECNUC= <off>
##$DECSTAT= 4
##$DIGMOD= 1
##$DIGTYP= 9
##$DL= (0..7)
0 120 120 120 120 120 120 120 
##$DP= (0..7)
$$ [...]
##$SW= 21.9926040160658
##$SWIBOX= (0..15)
0 0 2 0 0 0 0 0 0 0 0 0 0 0 0 0 
##$SW_h= 4401.40845070422
##$TD= 16384
##$TD0= 1
##$TE= 300
##$TE2= 300
##$TE3= 300
##$TEG= 300
##$TL= (0..7)
0 120 120 120 120 120 120 120 
##$TP= (0..7)
150 150 150 150 150 150 150 150 
##$TP07= 0
##$TPNAME0= <>
##$TPNAME1= <>
##$TPNAME2= <>
##$TPNAME3= <>
##$TPNAME4= <>
##$TPNAME5= <>
##$TPNAME6= <>
##$TPNAME7= <>
##$TPOAL= (0..7)
0.5 0.5 0.5 0.5 0.5 0.5 0.5 0.5 
##$TPOFFS= (0..7)
0 0 0 0 0 0 0 0 
##$TUNHIN= 0
##$TUNHOUT= 0
##$TUNXOUT= 0
##$USERA1= <user>
##$USERA2= <user>
##$USERA3= <user>
##$USERA4= <user>
##$USERA5= <user>
##$V9= 5
##$VALIST= <valist>
##$VCLIST= <CCCCCCCCCCCCCCC>
##$VD= 0
##$VDLIST= <DDDDDDDDDDDDDDD>
##$VPLIST= <PPPPPPPPPPPPPPP>
##$VTLIST= <TTTTTTTTTTTTTTT>
##$WBST= 1024
##$WBSW= 25
##$XGAIN= (0..3)
0 0 0 0 
##$XL= 0
##$YL= 0
##$YMAX_a= 244253
##$YMIN_a= -323036
##$ZGOPTNS= <>
##$ZL1= 120
##$ZL2= 120
##$ZL3= 120
##$ZL4= 120
##$ABSF1= 10
##$ABSF2= 0
##$ABSG= 5
##$ABSL= 3
##$ALPHA= 0
##$AQORDER= 0
##$ASSFAC= 0
##$ASSFACI= 0
##$ASSFACX= 0
##$ASSWID= 0
##$AUNMP= <proc_1d>
##$AXLEFT= 0
##$AXRIGHT= 0
##$AXTYPE= 0
##$AXUNIT= <>
##$AZFE= 0.1
##$AZFW= 0.1
##$BCFW= 1
##$BC_mod= 2
##$BYTORDP= 1
##$COROFFS= 0
##$CY= 7568.61572265625
##$DATMOD= 1
##$DC= 2
##$DFILT= <>
##$DTYPP= 0
##$F1P= 17.9538593292236
##$F2P= -4.03888763876832
##$FCOR= 0.5
##$FTSIZE= 32768
##$FT_mod= 4
##$GAMMA= 1
##$GB= 1
##$INTBC= 1
##$INTSCL= 1
##$ISEN= 128
##$LB= 0.02
##$LEV0= 0
##$LPBIN= 0
##$MAXI= 945.577
##$MC2= 0
##$MEAN= 0
##$ME_mod= 0
##$MI= -402.1523
##$NCOEF= 0
##$NC_proc= 0
##$NLEV= 6
##$NOISF1= 8.587773
##$NOISF2= 6.764455
##$NSP= 1
##$NTH_PI= 0
##$NZP= 0
##$OFFSET= 17.49637
##$PC= 1
##$PHC0= 296.1914
##$PHC1= 12.6848
##$PH_mod= 0
##$PKNL= yes
##$PPARMOD= 0
##$PPDIAG= 0
##$PPIPTYP= 0
##$PPMPNUM= 100
##$PPRESOL= 1
##$PSCAL= 0
##$PSIGN= 0
##$REVERSE= no
##$SF= 200.13
##$SI= 32768
##$SIGF1= 18.5376
##$SIGF2= -6.396296
##$SINO= 400
##$SIOLD= 32768
##$SREGLST= <1H.CDCl3>
##$SSB= 3
##$STSI= 0
##$STSR= 0
##$SW_p= 4401.40845070422
##$SYMM= 0
##$S_DEV= 0
##$TDeff= 0
##$TDoff= 0
##$TI= <>
##$TILT= no
##$TM1= 0
##$TM2= 0
##$TOPLEV= 0
##$USERP1= <user>
##$USERP2= <user>
##$USERP3= <user>
##$USERP4= <user>
##$USERP5= <user>
##$WDW= 1
##$XDIM= 8192
##$YMAX_p= 0
##$YMIN_p= 0
$$ End of Bruker specific parameters
$$ ---------------------------------
##NTUPLES= NMR FID
##VAR_NAME=  TIME,          FID/REAL,        FID/IMAG
##SYMBOL=    X,             R,               I
##VAR_TYPE=  INDEPENDENT,   DEPENDENT,       DEPENDENT
##VAR_FORM=  AFFN,          ASDF,            ASDF
##VAR_DIM=   8192,          8192,            8192
##UNITS=     SECONDS,       ARBITRARY UNITS, ARBITRARY UNITS
##FACTOR=    0.0002272,     1,               1
##FIRST=     0,             0,               0
##LAST=      1.8609952,     132,             -11
##MIN=       0,             -323036,         -323036
##MAX=       1.8609952,     244253,          244253
$$ Real data points
##PAGE= N=1
##DATA TABLE= (X++(R..R)), XYDATA
0@%%%%%%%%%%%%%%%%%%%Jl4O6o6O6o6O7q8J20j32J33j66J99k05K38k69L02l55
37a89L88m31M97n59O18o84P57q29R15j014J118j234J361j498J646j813K003k211
55a159K443k707L007l360L770m250M837n568O500p740R487j2139J6737k6947R3687
70G6598m9959j34947O2330K075n9149k0467J27130J23585L0096l5276l034q560
82A10422m9224q8554q3249p2571k2257M4513P3649L3071K7108P8281Q7003j7807
94A20385r7623m7700L3890j896p8081m0482P9350J04244K3294j8472K8615M3126
106A48650l1252r9248p9224k5813n596m277J4245L4786L9771L8007K6250j2060
118D4239m8389l6699j389q407m1271j7251O0958R0262L7783l426K3529M3384j3699
$$ y = [0, 0, 0, 0, 0, 0, 0, 0, 0, 0, 0, 0, 0, 0, 0, 0, 0, 0, 0, 0, 1, -33, 33, -33, 33, -33, 34, -54, 66, -66, 67, -99, 100, -105, 133, -136, 166, -189, 199, -232, 265, -294, 324, -360, 397, -432, 483, -531, 587, -647, 714, -784, 862, -951, 1052, -1159, 1284, -1423, 1584, -1776, 1994, -2256, 2581, -2987, 3513, -4227, 5260, -6879, 9858, -17089, 76598, 26639, -108308, -45978, -43903, -103052, -123519, 3611, 127196, 157292, 122016, 118982, 110422, 61198, -27356, -110605, -183176, -205433, -160920, -87271, -54200, -27092, 51189, 138192, 120385, 22762, -24938, 8952, 7056, -71025, -111507, -32157, 72087, 95381, 76909, 105524, 148650, 117398, 18150, -61074, -86887, -92483, -96760, -82515, -47729, -7958, 30049, 56299, 44239, -4150, -40849, -42238, -50645, -91916, -109167, -48209, 42053, 79836, 76410, 99939, 143323, 129624]
131A29624q2178p2845j7655m321k6037j3411L6282O0114L9179J3953K071j4358
143E0418l6440m5745m4049l9315j8471K5721N8707N0996L1773L9451M7010R324
155A29380m6880n6558k5048j5096l4778k9392J8574N3020M0290J4918J1647J1558
167G1635j1576m1476m9795l9423k4930o137J5892K8697L2499L9128M3314K3892
179H1720j2014k9611k1311j7298k8638k6808N265L6853L5918J8607J2936J5060
191G0679j70k7581m2224l6383k3452j3002k209J1601K4989L4235L2869J8049k807
204D4594j5250j6970j9950k5950k0601K084K4958L0342K4292K1826K1557R954
216H0886j3729l3336l6902k8301j8931j1620q74J7065L2202L2621J7781J957o219
$$ y = [129624, 47446, -25399, -43054, -47375, -73412, -86823, -50541, 9573, 48752, 62705, 64776, 50418, 13978, -31767, -75816, -115131, -133602, -107881, -49174, 1822, 33595, 73046, 120056, 129380, 82500, 25942, 894, -14202, -48980, -78372, -59798, -6778, 33512, 48430, 60077, 71635, 60059, 18583, -31212, -70635, -95565, -101702, -85810, -57113, -24614, 14514, 57828, 81720, 69706, 40095, 18784, 1486, -27152, -53960, -48695, -11842, 24076, 42683, 55619, 70679, 70509, 42928, 704, -35679, -59131, -72133, -74342, -62741, -37752, -3517, 29352, 47401, 44594, 29344, 12374, -7576, -33526, -54127, -52043, -27085, 3257, 27549, 49375, 70932, 80886, 67157, 33821, -3081, -31382, -50313, -61933, -62807, -45742, -13540, 19081, 36862, 38819, 32600]
229C2600j1530k1849l0761k4887n663J2696K0823K4075K8278K9002J9425J85j8763
242E3631k7741k6662k2109j7911r907O427K3728K8245J9166P632K562m016j8247
255A4798l1278k8670j2681K083Q900J4941K5719L2146K4819O908q036j4960j7912
268A6777k1492k1475j3392K530J6922K2376J8352J2664Q458Q04j3406k7333k8774
281b6989j7800n776l81N423J8736K9850K6423J1008j537n590j0081j9091k3371
294a9176j5162K79J1336J5217J7198J8190J4858N187p729j9620k4086k0230j3296
307c7034p904j331J0902K3220K3816J2951L236L32m317j4988k2929j6443k810
320c3299O357R297J3543J9670J9666J0949k085j2223j7328j8383j6855j3411o350
$$ y = [32600, 21070, -779, -31540, -56427, -62090, -49394, -28571, -4496, 23782, 52784, 72209, 72394, 53631, 25890, -772, -22881, -40792, -50699, -44272, -20544, 7701, 26867, 34499, 37061, 33045, 14798, -16480, -45150, -57831, -55748, -46848, -31907, -6188, 25958, 50777, 57685, 49649, 34689, 16777, -4715, -26190, -39582, -37052, -20130, 2246, 20598, 33262, 41720, 42524, 29118, 1785, -26989, -44789, -50565, -50946, -45523, -26787, 3063, 29486, 40494, 38957, 33367, 23286, 4195, -19176, -34338, -34059, -22723, -7506, 9692, 27882, 42740, 47927, 40198, 20578, -3508, -23738, -37034, -44938, -46269, -35367, -12147, 11669, 24620, 27856, 28188, 23871, 8883, -14046, -30489, -33299, -26942, -17645, -4102, 15568, 35234, 46183, 44098, 31875, 14547, -3836, -20691, -34102, -40452]
333d0452N547J6502K0055J4465P456L844j831j2420k1401j8763q374N86N535J0961
347a8290J8728K2311J5902M989n203j1307j5231j8174j6808j0358L14J0252J5199
360g676J5357J2542Q854J518q578j6774j9107j4481p883j635N857J4339K0113
373B446J9060J1955K998m534r905j4432j6893j3676n037N116J0850J2294J2574
386A2816J1183O063l408j2022j5798j4627j0724o349K67P814J4231J6804J3355
399A9605O469m01n466r098j3380j4044p814K222Q984J0341J1291J2493J0015M71
413C1688j0067j4087j3651j2407j0193m688N055J2423J5116J3230Q801L279k650
426B1849q121j3274j5159j0365j308N764Q242J0657J5543J5556O451n715j0555
$$ y = [-40452, -34905, -18403, 1652, 16117, 23573, 27417, 25586, 13166, -8235, -26998, -35372, -34786, -29251, -18290, 438, 22749, 38651, 43640, 38437, 27130, 11899, -6275, -23083, -33441, -33127, -22875, -7676, 7681, 20223, 29077, 30595, 22017, 5243, -13864, -28345, -36228, -37863, -32006, -17667, 2446, 21506, 33461, 36459, 31925, 22020, 7588, -9305, -22981, -28018, -22902, -12052, 242, 12816, 23999, 30062, 26654, 14632, -1166, -15793, -26517, -32866, -32599, -24785, -10554, 6250, 19605, 26074, 25673, 20207, 11109, -2271, -16315, -24129, -21907, -12923, -2582, 8709, 21202, 31217, 31688, 21621, 7534, -6117, -18524, -28717, -33405, -28350, -15927, -811, 12419, 21220, 24499, 21849, 13728, 454, -14705, -25070, -26378, -20614, -12372, -1715, 13828, 29384, 35835, 30120, 19565]
439A9565j0186j2546j5640j2062o75R260J1781J0975J1264R870L860n119j2066
452H281j4031j1531o825j809K952Q705J4993J6308R867J065l745n205r346j5890
466f211j3784l860N134O375O012R934J2537O729l116r744r950q786q806p080j218
481b5834P313J2600J3110R313M549J657k213q253j3749j2594m559J942L977M939
495g802R888J3275Q696j392q132q439q324j1133j0998m112N667J0926J0697R245
509H062Q612N827k26p742j1823j1003o821k771n7M072J0456J3726J0445K906k960
524B0703m614p174j2255j3620p663J128O089O666Q109J0920R902L159m886r132
538G332r074p597o580m068J887Q839J2482R909N090K247j67m725j0611j2930q173
$$ y = [19565, 9379, -3167, -18807, -30869, -31544, -22284, -10503, 472, 11736, 21606, 25466, 20347, 8281, -5750, -17281, -24106, -25915, -22963, -14258, 735, 17043, 26910, 27975, 24230, 19025, 9679, -6211, -19995, -23855, -18721, -12346, -6334, 3600, 16137, 22866, 19750, 10006, 56, -8730, -17536, -24616, -25834, -18521, -5921, 7189, 16502, 21051, 22708, 20495, 12242, -1507, -14101, -18660, -16718, -12741, -7802, 2086, 15361, 24057, 22665, 14533, 6094, -2230, -13363, -24361, -28473, -22806, -11880, -1183, 8062, 16674, 22501, 22275, 14533, 2710, -8293, -15114, -17885, -17942, -13870, -3414, 10312, 20757, 23663, 20703, 16089, 8915, -3340, -16960, -24623, -23495, -17406, -10740, -2631, 8289, 18191, 21350, 16464, 7332, -1742, -9339, -15919, -19987, -18100, -9261, 3221, 13130, 18220, 20467, 20300, 15575, 4964, -7966, -16139]
553a6139k247J249L036P032J0515J0044M516k379o090p129p604q285o476j70O679
568a3448R966Q847O791O203L551k873r804j1217p837m279k429J028O570J0495
582A564R348M771L45k946n579q123r432p852k945L296P253P919P834Q182O074
597A9709j44p182r219p251n261n191j628M676R462Q829N452L146J118l268q088
612E160r840q173m903n43L611O349P915Q515O771J988l701o700o570o050n826
627a1997l598K103P591Q282O081M850L855n0o392r649q288n392l308l77M208P782
643d299Q118O380L476J55m094o427o741o608m975q22N040P784P168N954N437K543
659A8089l320q246p931n398m543l785R25O267P752O056M264L118o07n343p468
$$ y = [-16139, -18386, -17137, -14101, -7069, 3446, 13490, 18006, 15627, 9537, 2408, -5196, -13481, -19957, -20127, -13448, -3482, 5365, 12156, 18359, 21910, 19037, 9233, -1984, -9821, -14100, -16529, -15501, -8931, 1564, 10912, 15683, 16028, 13082, 7503, -620, -10052, -17904, -20849, -17553, -10300, -2381, 5453, 13635, 19709, 19565, 12383, 3164, -4087, -9348, -14539, -16167, -11491, -2029, 6800, 12252, 15398, 16516, 13248, 5160, -4680, -12853, -17756, -18299, -14688, -8339, -424, 8091, 14862, 16850, 13149, 6449, -121, -6171, -11997, -15595, -13492, -5901, 2381, 8462, 13312, 17167, 17117, 10725, 1076, -7212, -12604, -15912, -16289, -12081, -4299, 3819, 10199, 13675, 13830, 9736, 3309, -3432, -10040, -15015, -15837, -10797, -3013, 4155, 10109, 15546, 18089, 14769, 6523, -1408, -6806, -11349, -15134, -14209, -7942, -190, 5866, 10130, 13248, 12641, 7298, -170]
674a70o706n527l050J484N644O777O335N900M630J63n389o337n266n205n275j782
690a3774M178O989N863M390L895J688l393o936o569m959l833j616K515N646O438
705E22N663N065K650k222n371n513n238n060k897J752N721N823M534M622L305
720A3356j007n179o606n447m779l747n01M179O376N842N180L969Q88l430n250
735C844n509m998m090r10K985N285N301N009M695J922k512n222n588n186m972
750i946k815J410M399N196M796M851K991o48m105m722m611m482l258L91M048M973
766a532M574M637L588M88l420m723m612m558l721j093K208M361M422M664L165
781H448J057k180l980m453m575l840j115K339M039M384M545M443K068j586m144
$$ y = [-170, -6876, -12403, -15453, -13969, -8325, -1548, 4787, 10687, 15317, 15480, 10091, 3754, -1512, -6717, -11992, -13774, -9596, -2607, 3256, 7646, 11541, 13229, 9836, 2900, -3669, -8628, -12461, -14077, -11562, -5916, 522, 6185, 11250, 13900, 11678, 6307, 794, -4444, -9504, -12401, -10649, -4928, 895, 5429, 10051, 13356, 12349, 7170, 564, -4883, -9662, -13409, -13910, -9731, -3355, 2487, 7667, 11636, 12524, 9094, 3844, -1665, -6663, -10753, -11663, -8678, -3393, 1908, 6917, 11612, 13534, 11022, 5800, 212, -4974, -9946, -12761, -11351, -6952, -1756, 3040, 7891, 10882, 10234, 6129, 1407, -3204, -7686, -10944, -10553, -6505, -1532, 3042, 7679, 11267, 11755, 8335, 3612, -1000, -5558, -9279, -10372, -8164, -3803, 619, 5283, 8448, 9505, 7325, 3345, -1108, -5683, -9523, -10638, -8299, -4260, 124, 4669, 9112, 11180, 9594, 5450]
796E450m188m074l990k545M41L612M636M095L510K118j38k815m525m860m310k359
812i942K93K343L686M716N107L199K60k338l263l764m480l873j066K081L840L887
828F86L614L458J646j059l601m732m057l063j791J20K481M330M804L485J421j91
844G551j600l308m413l945k020O43K115K746L864M003K825K35k438l432l680l481
860d335k915j342J523L453M200L225K217J103n90k819m060l806k419n39P95K166
876d143L704M318L163J095j034k215l099l621l685k136M92K357L048L316L082
891D642K281L46k012l539l709k928j794o03J181L357M194L487J900M66q62k301
907D106l616l910k750k82Q53K309K966L244K775J185p60k605l029l148k578j789
$$ y = [5450, 1262, -2812, -6802, -9347, -8906, -5294, -658, 3437, 6947, 9065, 8927, 6112, 1587, -3273, -7583, -9942, -9649, -7306, -3620, 1096, 6203, 9402, 9662, 7324, 4061, 297, -4183, -8056, -9122, -7041, -3201, 686, 4300, 7758, 9404, 8345, 4744, 12, -4045, -7108, -8899, -8779, -6298, -1968, 2836, 6321, 7742, 7551, 5951, 2643, -1770, -5715, -7735, -7092, -4977, -2231, 1633, 5636, 8461, 8696, 6258, 2826, -854, -4335, -7250, -8592, -7069, -3616, 584, 3809, 6026, 7129, 6539, 3720, -340, -4146, -6565, -7104, -6309, -4143, -439, 3879, 7042, 8137, 7103, 4888, 1789, -1832, -5517, -7653, -7161, -4804, -1756, 1560, 4642, 6923, 7269, 5257, 1718, -1991, -4919, -6713, -7316, -6135, -2778, 1416, 4903, 6803, 7269, 6407, 4106, 490, -3420, -6170, -6452, -5599, -3290, -324, 2920, 5695, 6880, 6120, 3515, 486, -2662, -5240, -7029]
923g029J68K063L524L250K803J467N16j336l090l760k821j321j67J084K515L359
939A225L243J872J18j545k293k979l377k301o97J133K580K808K844K354J261m04
955E842k422k989k873k089j214K35J916K912L267K477J162l33j606k579l205k990
971d489j616K20J358K378K811K819K020K62j435k431k610k629j863n49J084K130
987b540L189K783J742Q19n79j987k893k937k218q37M81J531K504L067K322J027
1003E474m95j610k399k826k299j446J02J697K583K706K415J536K81j199k255k877
1019f12k439j764k79J056J788K731K618J768M29r87j731k587k760j915p74P11
1035d747J694K579K489K180J186m45j588k276k439k158j087r0J358K310K482K244
$$ y = [-7029, -6861, -4798, -1274, 1976, 4779, 6246, 6762, 5426, 2336, -1424, -4245, -5566, -5733, -4649, -2134, 1225, 4468, 6340, 6458, 4913, 2620, -359, -3736, -6037, -6734, -5601, -3021, -213, 2631, 4985, 6246, 5842, 3420, 431, -2442, -4531, -5745, -5510, -3594, -682, 2585, 5062, 6224, 5891, 4285, 1706, -1499, -4489, -6105, -5885, -4527, -2149, 662, 3481, 5501, 5763, 4328, 1897, -713, -3342, -5205, -5754, -4670, -2540, 649, 3432, 5174, 5993, 5414, 3427, 534, -2403, -4621, -5458, -4977, -3446, -942, 2125, 4447, 5474, 4979, 3369, 970, -1856, -4155, -5601, -5499, -3802, -1219, 1487, 3902, 5438, 5719, 4520, 2265, -612, -3051, -4815, -5094, -4038, -2250, 481, 3099, 4867, 5296, 4309, 2578, -9, -2769, -4684, -5458, -4747, -3053, -474, 2015, 4195, 5381, 4936, 3348, 1072, -1367, -3525, -4612, -4702, -3344, -1034, 1448, 3692]
1051C692J069K37j100j993k826k517j315j03Q97J662K446K594J667M05p58j657
1067B400k140k440j768o47N67J807K111K222J783Q64j48j577k200k509j757j024
1083d456M0J171K032K384K192Q83j62q77j807k288k137j259K19Q96J629K175K344
1100B979J430J37q14j808k074k035j563n68O33J679K037J945J431N96n8j582k112
1117B53k046j515o53K25Q27K069K538J749O91m1j032j566k114k317j020R2J080
1134b780J578J792J988J259K21q80j736j770j691j371n54N63J543K029J834J009
1150C034O62j30j086j943k081j463k47J74Q20J589K042J777P13n71j064j176j847
1167g97j908q55M2J193J552J439J534J179L35p63j801j572j411r99m51L94J438
$$ y = [3692, 4761, 4998, 3898, 1905, -921, -3438, -4753, -4856, -3959, -2297, 149, 2743, 4410, 4815, 4057, 2400, 260, -2180, -3948, -4595, -4028, -2221, -110, 2112, 3895, 4759, 4611, 3034, 834, -1675, -3432, -4456, -4416, -3245, -1213, 1171, 3363, 4246, 4084, 3207, 1400, -888, -3025, -4284, -4065, -3169, -1540, 635, 2979, 4409, 4546, 3732, 1924, -150, -2185, -3748, -4316, -3683, -2004, 33, 1978, 3409, 4005, 3947, 2365, 253, -1793, -3308, -3961, -3736, -2909, -840, 1698, 3447, 4138, 4097, 3065, 1499, -615, -2932, -3952, -3860, -2780, -1202, 590, 2578, 3837, 4058, 3178, 1442, -328, -2019, -3390, -3944, -3381, -1838, 191, 2025, 3034, 3696, 3566, 2480, 537, -1544, -3007, -3254, -3080, -2260, -671, 1371, 3148, 3861, 3290, 2226, 1050, -797, -2705, -3560, -3518, -2325, -773, 666, 2200, 3379, 3714, 2951, 1150, -422, -1833, -2832, -3283, -2889, -1451]
1184a451J899J798Q47K33m45r00j680k007j240k70M70R85J236J642J761O51l62
1201C167j251j369j527j262r79R6J142J602J509J261P16K39o73j500j733j456
1217b018q04j08M82J014J778J489J023J05n25r51j419j487j296l05N33J182J273
1234c4J339J295N94j83j188j439j483r27o55q8Q78J517J559J123L69r6m68j203
1252I10j440j469n89Q8N94R98J339J353J131j41n70j015j250j271j018m21P34
1269b037J003J207J202P84M21j31r00j504j241r22l25Q4O74J368J365J196L93
1286B637j83p85j070j172j336n51J19P10J050J094J317P20K01q33j100j215j082
1303a479p58j70N53P75J320J240P60K18k55p76j297j211r04l34L31O89J123J326
$$ y = [-1451, 448, 2246, 3093, 3326, 2881, 1981, 301, -1706, -2946, -3216, -2746, -1761, -525, 1117, 2878, 3529, 3167, 1916, 547, -980, -2242, -3221, -3125, -1983, -381, 1128, 2389, 3105, 3344, 2671, 1171, -562, -2018, -2822, -2930, -2448, -1434, 344, 1833, 2856, 2961, 2436, 1485, 66, -1421, -2717, -3022, -2489, -1307, -34, 1305, 2600, 3194, 3011, 1823, 384, -1099, -2026, -2681, -2769, -1891, -374, 1185, 2308, 2677, 2581, 2113, 910, -530, -1999, -2588, -2500, -1906, -908, 431, 1784, 2915, 2774, 2204, 1189, -61, -1332, -2350, -2771, -2037, -1034, 173, 1375, 2159, 2580, 2449, 1549, 45, -1196, -2118, -2443, -2359, -1685, -317, 1048, 2244, 2637, 2454, 1669, 599, -573, -1909, -2460, -2341, -1631, -581, 513, 1830, 2550, 2751, 1918, 818, -397, -1479, -2237, -2407, -1854, -1079, 241, 1481, 2241, 2459, 2204, 1428, 131, -1080, -1984, -2318, -1987, -1298, -175, 1151]
1321A151R75M76m07p38j019j043j163p89L68O71J029R92R79P37J61o69q27j243
1339c59q49o73k80K91R77J194J151O39K67l45p62j100j092q60k40K19O67J126
1357b9Q50J085L02k08n33j146q73q51n18n0O01J088J055Q69L81Q5l46j033j167
1376d38p99o86O5N18O28J094Q80N88J42l38p87r68q03q62j80K62O64J156Q79O16
1396A631M56k26p55r77p58q39l29P1O30Q78R67Q00M21o3n42p04j057q64o92J65
1416a787L40R65P79R21O46O0l59q50q13q52o27j64K46O28R87Q78N69L62j54o52
1436A123q81q90p75l99K51M80P69Q35Q47M04j57k58q50p45p14m81j58N41P13P13
1456C68P84L69K57j98p56r32p15m07k43K63L87R66Q13M59J09j32n44p39q13n75
$$ y = [1151, 2126, 2602, 2195, 1457, 438, -605, -1768, -2557, -2189, -1518, -489, 503, 1482, 2219, 2380, 1711, 884, -359, -1208, -1881, -2161, -1870, -893, 301, 1452, 2091, 2358, 2013, 1251, 151, -941, -1801, -2041, -1822, -1155, -29, 821, 1906, 2208, 2000, 1467, 321, -552, -1403, -1921, -1971, -1370, -282, 773, 1642, 2023, 2108, 1762, 729, -438, -1237, -1923, -1858, -1340, -712, 382, 1262, 1850, 1992, 1654, 867, -101, -904, -1766, -1946, -1684, -1020, 136, 1015, 1631, 2087, 1861, 1106, 129, -629, -1468, -1797, -1726, -1096, -218, 749, 1549, 1970, 1907, 1365, 661, -396, -1260, -1952, -1787, -1447, -482, 297, 1218, 1864, 1924, 1565, 715, -98, -950, -1577, -1741, -1495, -867, 120, 998, 1567, 1929, 1775, 1123, 242, -648, -1423, -1822, -1571, -1091, -322, 513, 1360, 1764, 1607, 1349, 499, -246, -960, -1441, -1599, -1058, -345, 368, 1152, 1521, 1778, 1580, 824, -108, -823, -1230, -1473, -1210, -823, 143, 956, 1415, 1524, 1392, 848, 109, -704, -1279]
1476a279l73K22P07O95O98P46L52j72p42n29o75o49n48J10K73R03P20N58M64J05
1496A586l06p08p83n94m51j34K20N62P35Q50L74J52J5o24o69o86n67m20K08M77
1516g63O89P44N47L32j31k73p92o84n50m30n0L79O94N52P48L35J41k01p39n96
1536d8p70l57%J66M99O90P58M91r2k45l98n28p05m64l34J84N61N45O44M48K88
1557A333r4m34n93n90m64l54J47L30N53O13N40K52O1k63m82p92o08k95j08L91
1577h57M10M55R01L79J60m22n00m70n41n47l26J66O34M87O34M24K95lm82m88q10
1598e01n10j44k5L31M29Q71N58J93J8k66m35o94o02l56l5J75P19M13O62M07K32
1619A440k98n76m30m75n41k89P4M67O33N12M93J48o7l45m16n68n63j95j29M70
$$ y = [-1279, -1652, -1430, -723, -28, 670, 1416, 1768, 1596, 854, 325, -350, -999, -1547, -1437, -1164, -261, 459, 1017, 1481, 1586, 1280, 572, -211, -805, -1256, -1390, -1170, -608, 127, 977, 1351, 1503, 1518, 894, 225, -461, -1028, -1448, -1240, -763, -74, 670, 1217, 1549, 1418, 1145, 353, -331, -881, -1311, -1361, -982, -288, 264, 1012, 1347, 1488, 1287, 548, -48, -818, -1175, -1175, -1009, -510, 180, 938, 1429, 1337, 1092, 694, 166, -539, -1003, -1337, -1153, -592, -47, 597, 1045, 1333, 1239, 805, 212, -378, -842, -1196, -1049, -719, -166, 447, 987, 1239, 1300, 1037, 555, -237, -845, -1140, -1248, -857, -447, 8, 909, 1288, 1448, 1026, 526, 56, -485, -1032, -1358, -1192, -558, -71, 563, 987, 1282, 1279, 797, 309, -501, -1011, -1155, -1180, -849, -420, 451, 1009, 1202, 1220, 954, 519, -175, -777, -1133, -1168, -993, -274, 139, 801, 1208, 1440, 1142, 566, 136, -339, -880, -1169, -1095, -628, 5, 517, 1010, 1158, 1091, 746, 330, -238, -801, -996, -1125, -655]
1639f55M40O31N11L05q5k36n25m97m41m58j62L53L96O41N03K32J98k07l16o56
1659b8n74j82j69R4L37M19O94K81K11Ql02m36o83m88l04J48L35M63M63N95K92
1680A174o2j40o05m32n54j16k42K56L72L29O68K34L65j82m48o27l97m64L7k6J72
1701f88N87N20M05M08k16l10m31m84m61l15Q5J98M25M69N04L02L4j51m78n27l40
1722d64l48n3Q0M76L65O73P7K62o3l28m15o51l83K4q6K84N23M29L94R9m5k40m79
1745A31l37l63k96J32PN19L60M25L65o6k66k55l07m84m22J40J79J72L32O81K83
1766I30J00j79m06l13n64j49q3j15L05M63M11L88P5J75l72m34m40m00o4j6J93
1787d95Q6O77L92K49qj61l03m25n45k01q5J62K59L62N71K00K30j78l90j94n94
$$ y = [-655, -215, 416, 927, 1232, 1147, 911, 386, -111, -552, -1010, -1172, -819, -423, 218, 721, 953, 1151, 944, 628, -28, -602, -784, -953, -859, -522, -103, 591, 872, 1083, 1091, 789, 353, -330, -818, -1122, -974, -639, -176, 287, 882, 1174, 1112, 972, 367, -65, -619, -735, -977, -721, -349, -20, 648, 882, 1247, 1065, 617, -10, -407, -871, -834, -860, -688, -101, 419, 824, 1232, 1016, 706, 275, -209, -670, -985, -900, -702, -277, 192, 696, 998, 1032, 881, 403, -124, -464, -812, -865, -785, -309, 56, 729, 806, 1068, 1005, 677, 262, -389, -772, -748, -834, -550, -27, 402, 796, 895, 850, 610, 131, -206, -569, -865, -733, -726, -207, 153, 578, 943, 877, 611, 356, 49, -435, -857, -717, -538, -366, -34, 647, 930, 1030, 851, 445, 132, -432, -581, -664, -779, -474, -11, 400, 788, 863, 1038, 666, 232, -208, -608, -672, -688, -495, -409, 268, 660, 909, 901, 740, 437, 12, -533, -734, -819, -657, -398, -36, 535, 735, 965, 787, 397, 203, -391]
1808c91j55k13k9L06N49L47K45J04L1n6l99m36m29j64l5K83J77M29L18M12o2j90
1830F42l60k76m54k63L7K16K30L29K22M63O9j27l36l04n09q4k15N2K64L08M34
1851C38L08R2r0j04l19m43j37l15J8J41L47L84M76M9j7l7l98j69n64n8j31J50
1873d79L22J83L85K95J91k98j92l68k00l13m1p3J22M97L34L01q1J6j5l69m08k79
1895d70j24J39J40J38M04L97J17k3j59k36l99k98p8j94K05K21L37K21J93K32o2
1916G01k68l84k97l0j23j32L90J99K78J91J68j1k90q8m53j16m24K17J67K93J99
1937A87K92J86o7r3k27l41k39j72r9L9L73L13J67L18N8o4k16m19j43k69j15J51
1959c80L3L40K33L77N6r9p8k01l65k45k77Q3J86L69K65K10J00J58o5m41k99k03
$$ y = [-391, -546, -759, -788, -482, 67, 414, 659, 763, 794, 738, 339, -97, -526, -690, -725, -442, -265, 164, 482, 894, 832, 642, 282, 6, -448, -711, -674, -458, -228, 101, 323, 786, 855, 728, 392, 88, -421, -505, -720, -668, -404, -96, 338, 646, 738, 648, 544, 225, -218, -355, -670, -652, -511, -164, 220, 696, 745, 728, 691, 293, 124, -440, -498, -629, -479, -157, 26, 411, 706, 897, 599, 407, 39, -161, -474, -515, -588, -466, 31, 365, 666, 585, 601, 586, 217, -191, -470, -594, -455, -315, -177, 227, 624, 741, 718, 559, 323, -76, -374, -452, -646, -441, -220, 117, 338, 531, 763, 701, 433, 49, -248, -278, -401, -533, -143, 56, 334, 525, 693, 682, 392, 304, -149, -265, -689, -472, -305, -12, 187, 479, 665, 598, 505, 278, -63, -302, -474, -573, -534, -161, 152, 319, 637, 695, 631, 415, -4, -147, -416, -531, -380, -347, -7, 226, 603, 659, 560, 482, 281, -84, -329, -606, -523, -337, 32, 297, 507, 607, 765, 700, 259, -40, -243]
1981b43j62j02m6M29L51K97N7J33j29k15l14l09k14o4N3K46J72K45L70J88j15
2002F28r1m03j3m91k18N7J69M32J81R6J36K63j84k97k19m31l9M5j7J83K96L42
2024D25K32j16M5k58j02l82l30J31j23K76J00M20K88K6K03l06l17k51l11j61o0
2045e71Q3L78K98K48J36nj09j57j34l32l83M1J71J86J58L57K05J19j65j78j41
2066B05m06k22k9m1K03K11L20J05M34j19k33r0l17k91j48p3O2J82L69K35J20J02
2088E79k5q5k90m89q6j34Q9J85L19J24L34M6q8l41N3j85m55j6k9K09K44L60P1
2111C90K29j5k05k21k13k12j34j37K45K02K54K14J15O4j6j61k61k75j10k24n6
2132e27L39J83K18K66M4R2k26k43k05l67lk0K10J04K90L19J45m0k33n0m53n7j94
$$ y = [-243, -405, -507, -553, -124, 227, 524, 581, 714, 585, 370, 56, -253, -467, -531, -478, -232, -60, 185, 555, 743, 628, 537, 134, 121, -370, -588, -531, -362, 70, 251, 347, 483, 746, 562, 265, 46, -385, -424, -379, -396, -213, 83, 425, 657, 541, 586, 328, 226, -156, -486, -355, -478, -202, -102, 318, 606, 632, 835, 529, 212, -39, -350, -511, -571, -488, -110, 188, 436, 572, 567, 458, 301, 167, -165, -548, -507, -336, -150, 8, 365, 570, 689, 524, 346, 205, -201, -423, -452, -493, -290, -79, 241, 346, 780, 661, 428, 338, 21, -270, -418, -491, -429, -247, 122, 357, 477, 579, 554, 469, 179, -310, -396, -530, -441, -256, 63, 187, 521, 567, 479, 138, 191, 6, -449, -465, -494, -285, -41, 319, 390, 619, 604, 399, 178, -35, -247, -381, -518, -273, -71, 183, 397, 512, 576, 560, 399, 138, -137, -247, -471, -527, -188, -5, 213, 479, 523, 615, 389, 146, -59, -426, -429, -449, -239, -135, 155, 474, 619, 579, 346, 296, -157, -214, -408]
2155d08k9j10K89M63N7K71N1n6k25j46m79L1m8j3J39K62J70L57m6J15j30l22l14
2178a21j67j92J12J38J27K89J41K03N1j55k02k38k74j56j25K16K85J59K28K42
2198E61K1o1j95j86l54j94o6O1J60K21K53L04L5k8k53j31k04k32jj57J93J68L47
2221B62J12L00j79o9j43m58j34o9l2Q9J09L25L51jJ34j54K9l71j97l06j0j7K45
2244a84J48L23J93O7p3l2l76k17k54j27L5J31K55K04K81O7R0j04k00l66j79j20
2266d38O7R7K06K46J39K17L2j14j28j62k98k36k9N7K46L30P2L46J1j52p2k42k03
2289hk72k04m0K54P2M47J73K10p4n7k30l17j78j70M4kJ14L32J65J68J63o7j37
2312C86m12j53j57j81J12J74J88L97J00Q0J28l41k29k91o7j67J16O7J76M24J19
$$ y = [-408, -437, -547, -258, 205, 262, 533, 584, 528, 303, 157, -322, -291, -339, -352, -213, 49, 219, 576, 530, 645, 515, 193, -121, -288, -480, -368, -230, -103, 186, 327, 530, 581, 426, 224, -14, -288, -444, -569, -353, -68, 91, 319, 561, 582, 521, 326, 140, -214, -408, -474, -413, -253, -32, 221, 525, 560, 532, 279, 148, -56, -288, -289, -446, -253, -85, 262, 374, 674, 495, 426, 283, -175, -309, -378, -410, -321, -212, 113, 464, 463, 597, 443, 472, 101, -96, -402, -412, -429, -184, -36, 287, 480, 547, 474, 442, 66, -151, -405, -532, -497, -366, -111, 93, 374, 441, 531, 427, 227, -139, -318, -438, -371, -274, -68, 178, 317, 534, 566, 452, 324, 162, -136, -372, -401, -344, -98, 232, 304, 650, 661, 509, 437, 195, -8, -280, -484, -524, -270, -198, 249, 422, 632, 558, 501, 271, -46, -224, -394, -350, -352, -238, 94, 259, 427, 590, 523, 386, -26, -179, -336, -517, -405, -231, -43, 354, 454, 534, 662, 321, 92, -199, -266, -433, -317, -250, -74, 350, 469]
2333D69J23j59Oj13l13k90j09oJ19J39J53L47K02N0k51n4k99k25k84J13o4K76
2355a70J79J46K73K00j26j25k00l55j63j16J19L8K05L65K71J95j52j43k18k36
2375a3j06k47QR2K78J11L68R5J13j45j41m21j13k11r7MK97P0L80J83J17o0k67
2398B95j57l08j48j03j0K14J3M25J75K29k5j59j33l86j36j86k4Q2K20J32M58J18
2420E86M1j47k43k39j85k04pK08L8K70J08J33J76q6j8l25k52k88KP0J51K67J77
2443B33K77N7P5k47j68k63k87n5l0J20J65J87K11L54j10j08k21j59r7l30J1N6
2465c29J34L50K34j2K08l8k87l01o6j76j22J39J55P3L61J45R7J1j38l08k84o5
2487b19j94N7J05J88L22J61M9N9k8l53j30k30j71L3l8L41O8K90J07J69n6j89k70
$$ y = [469, 592, 433, 439, 326, 13, -277, -386, -392, -273, -134, 19, 366, 568, 618, 367, 313, 14, -211, -495, -382, -446, -170, 9, 155, 428, 628, 502, 377, 177, -178, -341, -457, -338, -300, -95, 270, 541, 736, 584, 441, 223, -13, -119, -366, -358, -266, 12, 123, 491, 586, 699, 554, 413, -8, -121, -332, -429, -425, -128, -58, 322, 505, 622, 562, 295, 138, -170, -318, -421, -431, -217, -204, 221, 396, 625, 600, 441, 308, -78, -214, -400, -424, -342, -122, 10, 468, 586, 627, 480, 237, -2, -187, -391, -398, -190, -152, 118, 226, 359, 535, 449, 431, 106, -146, -434, -432, -362, -211, 56, 233, 510, 567, 642, 395, 227, -36, -323, -378, -408, -288, -123, 64, 275, 629, 519, 411, 190, 31, -66, -396, -385, -329, -195, 155, 389, 377, 585, 547, 260, -41, -107, -283, -405, -266, -111, -38, 323, 468, 565, 576, 438, 130, -154, -219, -413, -356, -251, -63, 259, 420, 469, 528, 500, 147, 17, -213, -384, -351, -389, -48, 20, 310, 417, 586, 530, 341, 71]
2510G1k97j76O4m7K96J54J03K47L0J83l55k07j42j43k26k9J55K84K24K57J37p5
2532E08k6k81j30l04j83j86M02O3J73L19R5J40k29k02j01k70j74O7k0Q0K12K63
2554B16J85J89j67j44r6j56m16Lq6K76J54K23K61J29r8j04k45j58l24N0r3J26
2576b75J50K80J39J36%P9j68k23j35l38K4K1K45J73J91J14J61n2k59j59k91r2
2598b79k19J27O8K51K18L03M0p9q0j84l32j50j05Q1M2J51M71L8J98j5j72k32j10
2621C1k80p0p8O1J68K87L46J2N9q0k31k33j88o9k10P2Q1M71J23J52K7K17k09l02
2645A57j71k11j87kJ61Q7L13K37J78k3j98j44k34p3k41m5N5J85Q1N37O9j32K42
2668F41k86k77k91p5m3kJ2L35L21j8K78l8k38j24k27k54m5N0rK36K88K71P6O7
$$ y = [71, -226, -402, -338, -385, -89, 65, 168, 415, 445, 628, 273, 66, -76, -219, -445, -474, -319, -35, 189, 446, 583, 508, 482, 201, 71, -233, -416, -602, -200, -137, 36, 355, 450, 590, 361, 159, 58, -212, -386, -319, -339, -259, -47, 216, 401, 590, 423, 279, 183, 27, -389, -386, -472, -196, -42, 181, 442, 571, 473, 369, 124, -34, -358, -308, -401, -275, -125, 155, 294, 430, 430, 509, 341, 118, -17, -355, -331, -310, -65, 108, 299, 413, 574, 522, 263, 104, -187, -279, -498, -371, -303, -52, 166, 469, 509, 430, 350, 166, -166, -316, -421, -340, -298, -147, 324, 362, 560, 545, 373, 141, 31, -249, -319, -397, -336, -168, 119, 465, 477, 536, 456, 225, -8, -196, -265, -475, -403, -322, 149, 272, 424, 451, 668, 459, 157, -14, -225, -412, -414, -253, -166, 147, 384, 562, 539, 341, 197, -37, -110, -351, -396, -341, -156, -75, 462, 531, 399, 641, 355, 78, -213, -288, -331, -333, -321, 14, 335, 317, 595, 557, 319, 195, -32, -286, -331, -281, -290, -54, 234, 505, 581, 648]
2692F48j13l06k18k14j88l1J78J36J90K85kJ93j57j00k41k14j28q0r2J89L23J28
2714A86L05k7K0j47k70q9k20q9j88L02J68J93K11J89p9Kk64k28k36Op6K2K23Q9
2738CK78K48n6J88m33m3k37j82j24R8p6K25L99K88k33N2N9l09j98k91r5K33j71
2761c77M36O6K84K51j45j75j63k37k08j26k17M21L6M09R0K04j3k09j28n8k44k04
2783c07j10O3J65L03J80R1J37Nj53k97j50k72P3j7j9K93L03J20K18j42j21k84
2805G9j89k83q0M4K18J41K78J63R1N8j00k06j51j92k54n0P6P2L44L12O6R3M0k55
2829C15k72j62j03j65M7J24L40J11J70J14K3j83l23o7j66j04k8J43P1K28L41k8
2851D26J31j21l00o8k27k25M7R3L8K47L19l8J67j06j18j39k99l04K06qJ14K43
$$ y = [648, 535, 229, 11, -203, -391, -422, -244, -108, 82, 367, 365, 558, 401, 301, 60, -154, -282, -362, -454, -265, 58, 186, 491, 464, 484, 337, 67, -22, -242, -331, -519, -217, -49, 144, 355, 544, 465, 467, 203, -25, -261, -255, -331, -309, -86, 3, 281, 529, 473, 661, 228, 185, -52, -234, -358, -260, -336, -111, 288, 576, 343, 395, 454, 145, -53, -344, -439, -206, -377, 59, 125, 409, 660, 515, 340, 177, -60, -268, -394, -611, -190, -154, 255, 345, 549, 536, 327, 199, 141, -103, -307, -417, -354, -189, 114, 294, 385, 522, 527, 374, 77, -73, -345, -272, -289, -308, -15, 288, 408, 626, 484, 363, 79, -110, -393, -473, -429, -211, -70, 208, 371, 462, 520, 420, 214, 63, -129, -383, -433, -357, -285, 59, 371, 437, 530, 570, 315, 43, -119, -222, -387, -340, -216, 124, 235, 405, 519, 542, 359, 36, -31, -197, -301, -329, -186, -115, 113, 454, 426, 557, 436, 136, 68, -159, -384, -337, -244, -206, 41, 360, 322, 489, 383, 265, 126, -173, -477, -271, -279, -165, 78]
2873G8J74J64k1L1r6j82j74k51m4L9K05M0K19L00O2j05Lj90l21k94P3q4Q6L19
2897C1J17K20J4J46r2n9k07l12j63l9m2K07J88K33P1J46q6j05k08j38k54J09k7
2920b50P6K68O2K88L2j18J1k11k76j10q8l7O4J79J93K80N0Q1j04j31k71j24j84
2943c20J9l0J90K70J74K06Q4p4k66k28m5k33k8l5K03J71K96P8Q4m9k43j18j46
2966d0j53k91K33J50J13Q9K60J71j74l6j43j08l89O2k27K73J20K39O1L44o6j03
2988C85j03j55k81j27lo7K54J40K43J42J06j57K4j52l16k25n6J37m9L47J28K61
3010D76k7Lj37j34j71k33kk89K15K20K23J36j5K59k02m5j77k67n4j27PK81J69
3033A09M0J57K24j05p8j88k17j43j2N9K08o7K76O5K04j53m4k25j18o9k10P4q5
$$ y = [78, 252, 416, 395, 426, 330, 148, -26, -277, -321, -282, -77, -37, 182, 482, 544, 439, 442, 252, -69, -363, -290, -374, -288, 31, 148, 368, 382, 528, 436, 377, 170, -142, -305, -344, -386, -179, 9, 242, 313, 459, 373, 268, 60, -78, -332, -223, -250, -174, 94, 156, 444, 476, 358, 369, 158, -118, -228, -316, -353, -289, -110, 83, 363, 413, 494, 390, 259, -12, -136, -320, -301, -331, -141, 129, 303, 509, 593, 519, 253, 25, -20, -253, -281, -316, -113, 58, 354, 432, 516, 467, 224, 106, -40, -193, -484, -251, -101, 12, 101, 361, 532, 358, 322, 179, 71, -318, -256, -483, -210, -90, 149, 210, 554, 488, 385, 282, 127, -154, -281, -284, -351, -97, 43, 286, 428, 534, 377, 401, 249, -67, -292, -348, -211, -260, 87, 215, 476, 449, 452, 315, 181, 10, -223, -225, -514, -299, -79, 144, 280, 265, 524, 322, 277, 100, -167, -221, -348, -341, -60, 109, 149, 306, 530, 425, 347, 159, -58, -201, -213, -154, 54, -13, 263, 328, 532, 379, 335, 110, -8, -77, -287, -213, -298]
3056b98K68J39K07J28J02j99j58k84j59L8j50K41J7O0J84K13J4m9O7k82j98j17
3078b16j14j03L57Q9K08J48K3Lr3j14l12Q2j92o0J7K44J83K08K00j22r2j77k34
3101f7j56j2o4n8M10P3J71Q4J08L3m40pj11m1l90J66Q2M54r0K23no2R0l13k13
3126a35m0p4j78K14J44K56J25J12Nq5k13k37M6k17j25K27J87J74PJ86L4l5k28
3149A50j88j58o2P1j53K70Q8J51J43J78j35j12j85j12j76K3QQ1J51J11J71P2O0
3172D47k03l0j25l34m1J9J48J4J78K94Mp1Qj58k33j01M9m3L9J53K6K12J51L8m2
3197C99r8j33k15j99N3oR0K34O5J78J0o2j24K3k74r2r8n4K46Q4K28L1n2J10j3
3222C31n5k41k75P4k16K12M1L38L9L3J11j21m2k54p9j61J14o5J57J20K24l7K66
$$ y = [-298, -30, 109, 316, 444, 546, 347, 189, -95, -254, -216, -366, -125, -108, -48, 136, 349, 363, 314, 381, 99, -99, -216, -330, -433, -76, 13, 221, 369, 392, 395, 302, 188, -124, -42, -234, -294, -277, -33, 150, 358, 558, 436, 344, 167, -67, -223, -235, -299, -357, 53, 126, 297, 381, 489, 522, 82, 75, -36, -77, -467, -301, -219, 235, 145, 368, 363, 301, 391, 78, -135, -175, -249, -427, -213, -69, 187, 312, 424, 429, 344, 131, -106, -60, -277, -402, -175, 12, 186, 193, 379, 413, 378, 150, -38, -196, -258, -187, -340, -70, 18, 169, 312, 490, 355, 243, 58, -54, -230, -207, -199, -118, 33, 144, 315, 387, 447, 244, 214, 89, -245, -286, -267, -119, -105, 73, 367, 371, 300, 308, 150, -83, -184, -135, -178, -139, 14, 40, 252, 403, 441, 399, 301, 168, -47, -246, -193, -199, -109, 125, 190, 368, 378, 316, 192, 215, -59, -151, -249, -303, -57, 27, 255, 286, 234, 344, 331, 276, 35, -240, -166, -382, -170, -129, 209, 248, 281, 392, 271, 229, -25, -104, -265, -151, -216, -59, 61, 285, 248, 514]
3245E14l3l20n1K6k94%O0j15K04K30R3M7N2j96j5j73r5j38p9N2J76K83MJ86k6
3270C92K3k55o5k45j17J08j8PJ93K87r3J01M6j37k61O4k28o7N1J58R0Q2J81J07
3294D04n5q9j28p6j58j29O7R0J96r0J74K05j41M2j58j25k8k08J46j57R3K95J01
3317B71N5m8J9K2k51n8j37j70J07J00J91J02J33M4p0k0l22j6j5j14o0J31J32J94
3341B20J6J02L2Oj29l09o3J20j49J45n3K18O9J01J84j40p1k33j32j60J1m6J71
3364i0K35J16R0L8k06O1q3k23q8j14jQ3K80M9MJ38J68k57o6k02p5j29n2J46J85
3389GN0J55O1R6Qq2j04k20q4o7m1J85K02n5M2P8K2j37n5m8p0r3Mk4K17p3K78M3
3417B95KJ2k42j6k07q0O6j1J30K45J42pM7n9j00k29r8n6pN3O0O9K93n7M6p0p7
$$ y = [514, 481, 161, 110, 136, -158, -158, -98, -213, -9, 221, 314, 361, 413, 217, 202, 29, -66, -204, -283, -231, -55, 228, 232, 418, 392, 415, 160, 95, -150, -267, -159, -177, -170, 23, 310, 217, 318, 364, 227, -34, 30, -198, -265, -214, -56, 34, 116, 297, 404, 349, 260, 132, 56, -102, -231, -164, -74, 122, 32, 206, 411, 270, 312, 154, 29, 1, -207, -61, -218, -125, 170, 271, 326, 278, 297, 319, 68, 10, -127, -297, -190, -90, 101, 203, 336, 380, 310, 290, -32, -48, -63, -177, -237, -106, 26, 220, 236, 338, 370, 376, 247, -62, -125, -5, -154, -9, -62, 156, 225, 326, 510, 370, 299, 66, -66, -226, -215, -261, -90, 145, 261, 351, 389, 183, 244, 161, -62, -150, -264, -265, -182, 98, 147, 151, 289, 457, 200, 134, -68, -143, -272, -324, -178, 7, 57, 212, 273, 369, 377, 295, 191, -29, -113, -180, -221, -36, 166, 111, 153, 231, 253, 116, 61, 13, -57, -150, -146, -170, 47, -26, 252, 295, 297, 309, 67, 51, -156, -236, -170, -181, -51, 194, 336, 329, 376, 317, 217, -12, -110, -166, -173, -120, -60, 9, 302, 245, 291, 221, 144]
3444A44j47L4p5k16K30k0P9P7J98N9l3j95l3k05%j03qR2J15R2J74O1j2L3p0k35
3470C6k21J13j15P6P1J12M4J38j0K1j29p8j49p8o7L6O9j3L13P1L6m5r4m2j40j48
3496a93O2m8lJ35K36J07O0m9M6k48m9k53K4J62l8O3n5K20oK32j31j39r6r2K4j87
3522b16J17Q0L7J43M4PN9j53K6k88o2J04Kk9J30J55J37q2NL6k02n4N5j51R8j83
3548a85K16N9Q3J30N1r6j33j68%k6m1O8k0J73L5R8Qr1J1j87k9j06n9J13O3j2K89
3575B44J47j87J77p3k46n3o2n8p7J43J38J81P2o0k05J05j26m1o9r5%J09l9K59
3599A84k5J25N0j37j18o2R1j83o1N8J70k6RJ60M1r4O0j39n0p0p4l8Q6K03q4K17
3625B93rK2q2j60p4k0l7N1n3j16L40m7K02o0p7p6j26lj13J00p4J77J2J8Q8J41
$$ y = [144, -3, 31, -44, -260, -30, -50, 29, 106, 304, 363, 330, 135, 102, -103, -103, -206, -214, -122, -7, 85, 259, 320, 308, 341, 271, 36, -185, -72, -187, -111, -40, 72, 116, 254, 244, 265, 136, 58, -91, -169, -236, -200, -131, -144, 169, 240, 276, 231, 137, 95, -45, -193, -131, -179, -182, -47, 189, 296, 356, 307, 353, 105, 56, -197, -173, -11, -49, 14, -41, 179, 173, 405, 274, 135, 39, -53, -29, -216, -99, -19, 18, 161, 205, 212, 271, 118, 144, -144, -206, -102, -100, -129, 1, 156, 293, 211, 216, 252, 50, -4, 51, -100, -2, -185, 31, 90, 173, 303, 354, 258, 125, -43, -43, -69, -110, -42, -62, 111, 146, 244, 252, 161, 172, -15, -44, -150, -209, -96, -33, -45, 244, 391, 204, 381, 308, 62, 9, -53, -111, -188, -45, 93, 274, 346, 286, 81, 186, 60, 19, -50, -145, -145, -36, -75, 184, 159, 284, 334, 197, 79, 17, 108, -75, -136, -78, 92, 66, 75, 235, 276, 182, 242, 103, 53, -17, -91, -129, -43, 160, 76, 293, 284, 306, 224, 64, -10, -30, -67, -16, -69, -185, 155, 108, 310, 250, 173, 97, -29, -32, -145, -45, -119, 58, 70, 88, 176, 317]
3651C17j16Rj33m5K2n4j05P9J59N9J20q7o8L6l9j62J8q3j3j0J08L3J35K3J35q8
3677B50j00r5j70Km9J06M3j1J34N6J06m6j40P6j28k07J9n7K14K7J39P7n7J96k30
3702A55ln6j43J80l07J25J16J49J8Q1q8j23j1j2j42L7j39q1K43J09PJ16m0P7l8
3727B30r8l3k56J49K0j7K3Q0J11O0j19L7n4j42j10O4j86K66PK6K16L5M0n1p1n6
3753A71k70J3O7n6jO8J49M9J75j83k7kj79N8j86K19r1M6J01L9PJJ2q6j28m0m3
3780a17j4J63J80k13M7J70Oj37J6N1j26P6k44J62J8O7Q4ll2j3N7j77n2j14N5J00
3806A0J6J02L0O2o0O7%j42k0j51J50k2j9j62J38Q4K2R6J9j65r3J2j06MK07j68
3832h9J76Q0O7l3kl6j76l4n6j11K98j09KJ43Q0m4J64j19k47L5p9L8O9n2N2J07
$$ y = [317, 201, 210, 77, 32, 54, 0, -105, -26, 133, 192, 312, 225, 157, 193, 154, -8, 10, -73, -86, -96, 12, 45, 180, 203, 338, 250, 150, 55, -115, -113, -162, -56, -13, -24, 110, 166, 272, 226, 86, 162, 34, -173, -154, -211, 3, 30, 169, 246, 189, 385, 155, 152, 96, -47, 133, -174, -49, 67, 216, 234, 315, 227, 104, 93, 81, -61, -24, -163, -244, -1, 108, 115, 231, 191, 268, 230, 132, 99, -157, -8, 12, -5, 18, 98, 209, 269, 150, 187, 133, -9, -119, -55, -241, 25, 32, 58, 274, 309, 349, 298, 227, 171, -99, -86, -19, -75, -76, -8, 141, 190, 365, 182, 155, 153, -26, 32, -154, 65, -26, 20, 121, 160, 167, 168, 180, 94, -34, -74, -117, -131, 32, 212, -1, 46, 216, 222, 85, 101, 152, 26, 102, -142, 20, 38, 105, 189, 186, 154, 141, 198, 21, -31, -145, -90, 10, 26, 128, 158, 220, 160, 227, 227, 85, 65, -86, 64, 42, 23, -139, -1, 83, 105, 201, 220, 55, -38, -26, -132, -128, 79, -89, 87, 167, 234, 201, 199, 163, -13, -47, -103, -214, 84, -25, -23, 120, 200, 156, 320, 201, -46, -11, -90, -52, 17, -35, 17, 124]
3858A24J95lj97J95j46r3j44K5N6l6m7J35R1P0N6k17p3K01k28n3L0P6k8M4J06
3883A39m7K01r2j58N7j03Q1k29Q2J06O9k2K7J31p5k6j39n9L3o5R2L4P1k1O4O4
3909B15pj73J23j72J0m4m5O1M4N0J46K5n3j0o7j82P3j28J09j5O2J07M4q5J27r0
3935A25o0n5l4m5k0O7m7J02J64j8r0J22L9K7j57j95L2rO4J56l4J2O0m3j3J1J7
3962A78o7r6J4m9J55p4J13p3J19j27R3j56M8o2N4k00J05J38m8Q5N1m0m8L7k42
3987i2N9l2l2J30r4J96n9J68o9Pj56j8Qj78J72O3o2J98k11J94r9Q5O8j51J2k38
4013a31J56j20M9J21L9M3Q7m9l3J0j34k1L9j13q0J36J96j45J19J27k91NJ09j8
4037A01mj73j4O5j34L19O0l9K3q9n5p2n9J17M4j3M5k6J47Pk1q8R5j41n8n1m9K2
$$ y = [124, 319, 316, 119, 314, 168, 75, -69, -44, 12, -24, -71, 64, 155, 225, 281, 64, -9, 192, -36, -89, -59, 17, -11, 33, 139, 92, 293, 201, 43, 100, -3, 78, -151, -69, 37, 106, 84, 111, 242, 167, 141, 2, -57, -24, -89, 3, 37, 108, 87, 151, 215, 208, 35, 158, -14, -4, -48, -93, -32, 12, 62, 208, 233, 180, 170, 103, -79, -6, -134, -25, -40, 22, 129, 173, 88, 215, 125, 65, 10, -24, -69, -89, -22, -69, 33, 197, 179, 89, 211, 250, 277, 120, -75, -43, -52, 12, 168, 134, 146, 206, 163, 150, 161, 178, 111, 15, 29, -20, 135, 61, 174, 101, 220, 93, 186, 30, 78, 16, 70, -130, -25, 113, 65, 150, 201, 161, 113, 150, -92, -33, -65, -97, 33, -61, 135, 76, 244, 175, 182, 26, 8, 16, -162, 10, 73, 11, 209, -2, 192, 93, 178, 246, 95, 107, -131, 25, -95, -46, 75, 114, 157, 244, 195, 162, 172, 38, 17, 56, -57, -137, -1, 195, 50, 169, 296, 5, 10, 119, 101, 97, -76, -90, -25, -159, 160, 220, 181, 204, 115, 60, -12, -71, 46, 90, 77, 122, 96, 243, 250, 229, 141, 236, 95, 37, -14, -63, -41]
4065d1J66l7Q7J6o2J45k35J17j67j16k4K54m2K8p4J15Ll9l0J9q1q1l8Q1J3J72
4091A49p7J06l1m8L2j69J00q9l2J8k2j06L96np8q6J53R8j71j39L2M3Q4q9Q4n3
4117A00J66j61L7j4l2j19o9J49j54K16NN9Q3j50k3J18j77j01R3p7j5P9r8J42J03
4142A60n8J11j68m6J29k22R6kk7J52q9J20r0J53n0kj99Q2Jj16M3J36j55O0J33
4167A52j4N9K4j40o3P3o7n6N0M0N6QO4l5j05J58j55K8R6j83r7O2J05N2M9O2j33
4194I0j28R5j16J73j79OJ60q7L16k42J72p7o3j8j44Q5l8j4J40l9r7K08j7qq2K8
4220A24j07J6j10Q0l1OJ28J2N4j15Q4%q2qj39J55l4Jl5j5K15o1p1KL9j16ko4N7
4249a7J57j10n7K62n3m9J10k11j3n7R6k1O1r2l9J78RJ4k4p8M2j9m6j86L3J4K08
$$ y = [-41, 125, 88, 175, 191, 129, 274, 39, 156, -11, -127, -151, 103, 61, 89, 15, 130, 133, 94, 64, 83, 2, -79, -117, -36, -23, 149, 72, 178, 147, 99, 131, -38, 62, -27, -59, -41, -63, -169, 227, 222, 144, 58, 211, 309, 138, -1, 31, 74, 158, 69, 153, 100, 266, 105, 142, 128, 96, -23, -92, 57, -97, 119, 124, 183, 266, 116, 93, 211, 34, -67, 26, -51, -66, 13, -85, 57, 160, 102, 213, 45, -1, 128, -94, 2, 0, -27, 125, 36, 156, 66, 219, 169, 167, -32, 50, 51, -65, -22, 114, -41, 19, 152, 138, 197, 221, 81, 18, 91, 24, -32, 18, 58, 114, 122, 186, 151, 46, 204, 49, 77, 173, -10, -107, -45, 60, 112, 161, 223, 90, -38, 57, -59, 114, -65, -59, 101, 14, 330, 88, 260, 183, 120, 102, -42, 43, 5, -9, 131, 92, -5, 203, 186, 178, 96, 124, 17, 33, -77, 3, -28, -22, 106, 118, 172, 57, 141, 141, 59, 51, -88, 67, 33, 34, -1, -16, 199, 138, 67, 69, 108, -8, -10, -74, -17, 140, 30, -27, 235, 182, 133, 243, 32, 19, -38, 58, 37, 98, 6, -33, 145, 154, 168, 144, 66, 108, 89, 43, -143, -110, -96, 112]
4276A12p1J65M8r7j2n5K2k5j04L1J37j46J43oL3j12K6R6r9j84O6M1qKJ3J38j9
4303A35J23k61J6J25k18M4k9j8J78m9KJ01r8J96q2o0jj02Q5j56J15j5J01LJ6m9
4329A02J8N2j04o0K9o1k4R3P3P7J01j39j40J02j40k3J47j26n2L6L9J87q3j5O3
4354A52r1P1m3j33j01K29J9j65J20M4Q9r0jj8k8om4j5oJ28n9l7Q3r9R9j26M1M5
4382E8n5p9J71l7j4L1l5L9R1o0n5Q4j49J7m0j45K83m6j1M0J06k13jl1L5m9K9O9
4410C3O0LL4j03J00O4o4m2k9R4k12R5M7Q2r8m3J35j30j0J78j84L1l0M0n3J47m3
4437A02K1k00K10R2r3q8m1R7j64l6K06n3Q1o7l6J22p9q3J68j11l6N6j0M1n2L6
4463H3J42o2n9R9p4m6L0N5j35j5J00N4k2j6j8Q5o5n4o8oK4L4j52J38J7N7PJ1k
$$ y = [112, 41, 206, 254, 157, 145, 90, 112, 87, -17, 14, 151, 5, 148, 142, 175, 63, 89, 185, 86, -98, -32, 9, 1, 3, 16, 154, 135, 258, -3, 13, 138, -80, -36, -65, -83, 95, 46, 48, 149, 51, 247, 165, 105, 104, 2, 87, -69, 46, 31, 132, 135, 151, 102, 120, 172, 68, 8, 37, -24, -48, 45, 118, 195, 296, 157, 17, 119, -21, -44, 103, -23, -75, -39, 0, 187, 104, 89, 152, 61, 132, 89, -44, -145, 84, 103, -62, 58, 102, 191, 101, 100, 82, 54, 48, 4, -11, -17, 111, 52, 15, 98, -1, 98, -28, 13, 58, 3, -76, 95, 58, 44, 75, 40, 79, 170, 110, 55, 139, -10, 7, -33, -178, 105, 59, 48, 88, 194, -19, -20, -51, -16, -65, -36, 33, 93, 96, 130, 27, 127, 191, 127, 85, 56, 150, -62, 33, 80, 162, 64, 21, 156, 26, 16, 194, 10, 41, 11, 51, -2, 145, 102, 123, -77, 133, 225, 132, 44, 3, 100, -64, -100, 106, 53, 134, 67, 31, 153, 74, -9, 159, 48, 12, 68, 58, 99, 47, 83, 225, 163, 104, 203, 129, 83, 113, 168, 33, 18, 118, 172, 150, 134, 116, 201, 136, 82, 14, 8, 32, 66, -86, 52, 69, 126, 133, 144, 142]
4492A42o7j09Oj3R7P6q6r3N4K29k49K29j75k7P7k07K85r2O4n1l9K6K43k79rO6
4518I8j64K38k9j58N5P0o3N6j24P9J52j61N5o4j05J66LP3K9j59O7J72k47N5R3
4543A87k93J28N7K8%k1m5p8J82j0j27n9k2J71l2j67J34k6K6QJ09q0r1K28k43J70
4569A34j54O7l8J32l5K7Jk5K4j22N3k7n8J0mJJ28N0M2k19J07R6n7o3k8J0p6J60
4597A36o8j28K58j07j01N5J7Qn9O9p1MPo2J04N6O7n5j86J20K9N7l6j30K3J82j09
4624H0J57o1p0o7on5mL7L0P3j97J22L4R2p2M8k0j06Q0j30Q3PP5qrQl7p4rJ5L6
4655E2l2J99j84L3rM0j4r4P6k6n6J27j07J8LO9kJ5N8J3j91J84q6j3j54K00l0m8
4683D1M7Q9j18J38o1j5j4j67J38j19M5K6%J42p2j7k1o7J33N5j03o4j5l8K6O4N
$$ y = [142, 75, -34, -28, -41, 56, 132, 46, -47, 7, 236, -13, 216, 41, 14, 91, -116, 169, 77, 141, 90, 51, 77, 320, 41, 32, 98, -66, 172, 143, -15, 40, 110, 47, 103, -21, 58, 210, 49, 104, 40, -65, 101, 104, 177, 206, 47, 114, 286, 39, 94, 187, -106, 22, 79, 107, 107, 86, 41, -37, 145, 135, 8, -51, -73, 98, 66, -101, 33, 7, 33, 41, 150, 70, -21, 207, -36, 134, -20, 47, 9, 141, 106, 133, 134, 109, 133, 11, 64, 37, -21, -11, -15, -14, 114, 164, 206, -13, 94, 190, 133, 70, 42, 52, -24, 136, 68, -60, 198, 91, -10, 45, 62, 70, 11, 80, 9, 13, 20, -42, 62, 118, 185, 130, -56, 64, 93, 150, 114, -16, 7, 189, 80, 237, 176, 106, 39, 33, -22, -26, 11, 41, 114, -83, 39, 73, 165, 93, 141, 121, 15, 95, -35, 48, 55, 130, 122, 113, 121, 84, 10, 1, 16, 52, 20, 219, 35, 68, 59, 99, 85, -9, 67, 41, -15, 112, 5, 23, 26, 95, 93, 108, 166, 179, -12, 172, 86, 73, -81, 119, 89, 41, 88, 177, 59, 197, 136, 121, 107, -60, 78, -41, 4, 30, 30, 172, 100, 83, 62, -5, 128, 183, 80, 16, 1, -37, -11, 53, 58]
4710E8Q4J9j00J01j08J0q1J35r3L7O9j15J04J6m4K6p5j29J56q3N8J05J2j88K08
4735A82j47P7J38k01K4j36Q8K0j9J9N2j51Q6j32K10k7oJ8j26J40j19L6Q6j9P5
4760A68O7j87n1L5k9K10p0q5J10om5r0Lj19J64m4J4Q2J9m7q4J2LM4K4k7J7J1j02
4789cJ3r1LJ15J05p5R9n0Q0j47K7M8j33J9K7J1j7J47j62J29jm1Q2j73j1m3J04
4816F2M4o4J39J4kp6n2N3Rm7k1J5K2j4q2R8j5K3K6o5m6J06j54K8N8r8O6R1m6r
4846F3O6k7M3j04l7J41p2N0LR9m7p1J07j54j1J2J5M3j80J17l0J9M9r1O9O9J4m8
4874A07r5o3P1Q6j9N5p8N3k7J6j41N8R7J7p6M8mj33J33q6J72N5j63j11J68j51
4900a1J28o2l1k0k7M6RK8O0j49J92j41O3o1N3j3l2J05p0J10q8L1J6n4J20l7K0
$$ y = [58, 142, 161, 61, 162, 54, 64, -17, 118, 25, 62, 131, 16, 120, 136, 92, 118, 43, -86, 70, -13, 45, 150, 162, -26, 182, 35, 112, 250, 49, 73, -63, 25, 45, 26, 45, 97, -54, 32, -100, 110, 83, 77, 95, -31, 109, -10, 26, 112, 93, 168, 235, 48, -3, 32, 3, 213, 143, 58, 168, 162, 117, 27, 30, -89, 75, 31, 45, 127, 146, 99, 15, 27, 30, 74, 98, 71, 88, 99, -3, 10, -81, -78, 37, 142, 67, 166, 116, 196, 49, 76, 124, -9, 10, 37, 48, 31, 178, 16, 145, 144, 103, 185, 12, 1, -42, 62, 106, 42, 181, 195, 193, 117, 65, 118, 127, 80, 59, 74, 96, 82, 0, 98, 83, 106, 132, 67, 21, 127, -27, 1, 59, -39, 27, 118, 72, 63, 129, 102, 145, 41, 4, 145, 73, 123, 126, 225, 178, 107, 214, 60, 49, 61, 76, 119, -61, 56, 26, 45, 94, 3, 72, 141, 155, 107, 12, -51, 20, 106, 87, 142, 64, 117, 90, 106, -35, 23, 120, 137, 61, 109, 105, -28, 105, 19, 191, 246, 83, -28, 140, -11, 117, 55, 24, 4, -23, 23, 32, 60, 120, -29, 163, 22, 85, 24, 77, 64, 32, 137, 67, 177, 89, 120, 136, 82, 202, 165, 185]
4927A85j49N8Q0j36J05j8J9j0m1l8j45K72r9LMj16K61o5n3j01J14J21j68m1O0
4952A02j5o3J16o8j2p0R4m7P%Pm9j6R6q7RP6M4j7k3J24j45j7Q4m6j1P9n1L1o3
4982F9N8o7Q3k24J66l8j9J11n4o8j0N2J2j5J08o2M6j29N4n7m5P4j00Q4p3J67l9
5009H4J02n2p0j28J56jq1J46rL3p4J6j11P9j70K5P9L3Mo3J12n3R4rM1p9k0j70
5037h6J62P5p5J11n1mJ01k01Q2o4jj5K2M4j0k6N5N4j44Q9q7m3P5j0L5j1j05Q9
5065F1j11J80Jj08K13j61p6Q5J6j1n0O5j74J94p6J14J1p9l0Jj08J44ol4RN0o8
5092E2j9J0k8J51j04M8n1P0j08K7k8M4J9Ok0oj28J08p9J79p2j34J05Mm0L9J37
5119A82j95K38k11O0M3k47K42q9K5M8kJ1o0K5L6j6Oj02P2j3N1K8r5n2J34Qo2r2
$$ y = [185, 36, 94, 174, 38, 143, 125, 144, 134, 93, 55, -90, 182, 83, 86, 90, -26, 235, 170, 117, 16, 130, 251, 83, 42, 102, 87, 24, 140, 72, 60, -10, 84, 37, 44, 44, 51, 2, -14, 82, -5, 4, 80, 124, 107, 84, 208, 63, 46, 130, 84, 73, 152, 101, 132, 69, 127, 60, 143, -81, 85, 47, 28, 139, 85, 17, 7, 59, 71, 56, 164, 102, 148, 19, 73, 16, -29, 45, -55, 29, -44, 123, 84, 186, 134, 64, -64, 92, 91, 10, 156, 147, 180, 106, 122, 11, 90, -80, -55, 24, 57, 61, -2, 110, 57, 151, 142, 183, 104, 84, -86, 76, 151, 76, 187, 136, 132, 233, 32, 114, 50, 49, 34, 56, 100, 90, 64, 119, 173, 29, 118, 31, -12, 63, 53, 88, 77, -28, 61, -50, 130, 131, 23, 236, 75, -1, 84, 100, 89, 39, 104, -70, 124, 48, 162, 173, 94, 64, 65, -43, 101, 95, 61, 70, 120, 52, 33, 43, 15, 166, 62, 110, 59, 129, 21, 48, 20, 64, 83, 89, 69, 63, -65, 43, -36, 143, 71, -63, 42, 46, 6, 45, 182, -13, 225, 14, 74, 117, -130, 112, 23, 48, 96, 94, 105, 45, 70, 106, 90, 96, -6, 66, 53, 104, 132, 37, -15, 119, 127, 65, -27]
5147b7N0O1n3L5O7l4K4N1j12J34j44P5J3q2n6m2J16J2j31O0O9m2K4j5Q1o9J0M3
5175A18q6loM5L9j9jJ62j18mn8J08j05r1j4J58r8OJ34oQ5j42r0P8n4Q1j13J15
5203A21j7l5k37L08r6j9O5j24Q0m9j7J17j4j98K11r0R7o0Kl3J6M4k7l5J5M6N1
5230A22l3M9J95k86k1q7J15m5J58j93L7J59r5P8k2L1j03N5m0J93k45O3J16k14
5254a3J09k10J30p7J15N8n0K9j55K33k18N1K7M6ml2Kj4K5K8lj32R0l2K43j42k6
5281G8J41n5j45K4J2J16l3j27J41q4m0R8R1k16L4Q0o4mJ27n7k2k1l3K1qM3l8j01
5309d2Q4M1m6K3rJ2p8R9P7k10K61r5n9P8j25m1K7Q4m6J16o4J19j14j2J4J18r3
5336A19n5k7M3k8M2K6k22J22Q8N2l9j00M5m8N4k8L9j1O5j83J80j46J43r2k1J04
$$ y = [-27, 23, 84, 31, 66, 133, 99, 123, 174, 62, 196, 52, 127, 140, 58, 2, -40, 76, 88, -43, 17, 86, 44, 68, 53, 134, 65, 75, 118, 32, 29, 23, 68, 107, 88, 87, 249, 131, 127, 69, 177, 72, -19, -33, 125, 27, 33, 167, 161, 246, 104, 14, 92, 38, 119, 6, 121, 104, 69, -168, 140, 44, 25, 90, -34, 46, -3, -20, 97, 83, -115, 96, 6, 103, 43, 45, 12, 28, 72, 45, 10, 25, 71, 122, 89, 138, 333, 47, 26, -61, 54, 9, 167, -26, 11, 170, 75, 153, 131, 162, 59, 114, 74, 267, 22, 85, 201, -13, 96, -114, 16, -61, 54, 112, 62, 91, -64, 169, -49, 2, 29, 75, 71, 39, 41, 27, 52, 80, 77, -55, 35, 3, 246, 104, 78, 219, 164, 19, 43, 55, 171, 138, 11, 152, 68, 28, 126, 217, 1, 35, 115, 51, 47, 174, 117, 95, 74, 41, 62, 54, 97, 59, -42, 42, 83, 37, 60, 51, 63, -15, 84, 161, -49, 212, 117, 58, 136, 11, -30, -3, 81, 35, 151, 87, 206, 92, 80, 94, 212, 119, 64, 37, 80, 52, 94, 120, -102, 20, 108, 160, 121, 21, 66, 18, 72, 44, 83, 72, 137, -46, 134, -12, 131, 39, 18, 122]
5362A22l9j9Q4k33Q2J35p5l1L3M7p0L2q4J09l7Oj7J5K1m4mO5jO0r3K44j82J23
5390B49k01QQ1k2o6j9L8J1l4K5Q1m1om8p3oJ16p8J9k6P7j3J84j76lL7m6J6K6j3
5420I7k2r3J05K6n3q6J11P3k8Kj9kN4j43J08m6m9kjJ46q7K4K5n1o4Nj9P6KJ66
5450B55k27LL2P0j34O6j28mJ94k3j35L1QJ51j08NQRJ1m6O7o4m1N2lJ5O6p4j1l1
5480A4J00k3O5j46J70m1j13J12o2Q3L4j17P4j85J58o3M8L0l7k8o2J78q1k6o7N1
5506F6P6k9p0n3K5o4J02Q2j96J65o9J54p0j11L1k1j05K13j29J11mpM9K2o6P0j68
5533DN2kQ4j48J81j96O3K44k70R9q0J43k0o7J4OK8l1k04K66nj51R7k6Q8j28LL9
5561H3q4M4Q6j40Q1j0N1j17m6R5J32r7NnM4l9K2K8n3K0j2j8N3j75K38j12j8j3
$$ y = [122, 83, 64, 148, -85, -3, 132, 57, 26, 59, 106, 36, 68, -16, 93, 56, 62, 45, 60, 81, 37, 33, 98, 97, 157, 64, 308, 126, 249, 48, 56, 137, 115, 49, 30, 68, 79, 45, 70, 151, 110, 104, 56, -17, -23, 93, 15, 34, 8, 85, 72, 256, 80, 77, 114, 68, 84, 110, 97, 75, -18, 87, 113, 60, -26, 85, 158, 130, 132, 113, 111, 165, 22, 130, 84, 35, 33, 32, 178, 91, 115, 140, 89, 25, 30, 11, 87, 89, 255, 28, 31, 63, 133, -1, 65, -63, -67, 127, 104, -31, 0, 8, 159, 51, 56, 64, 73, 84, 38, 105, 41, 0, 52, 49, 64, 130, 56, 45, 14, 114, 91, 156, 10, 180, 139, 26, 138, 76, 159, 193, 76, 150, -35, 123, 60, 108, 138, 101, 73, 11, 189, 108, 82, 15, 66, 142, 113, 43, -10, 15, -49, 53, 135, -61, 104, 35, 189, 119, 8, 39, 18, -87, 126, -3, 108, 104, 97, 146, 168, 102, 172, 4, 56, 54, 138, -10, 171, -25, 38, 282, 12, 111, 31, 174, 154, 87, 101, 107, 135, 104, -100, 166, 161, 10, 107, 81, 169, 41, 44, 83, -1, 43, 129, -11, 70, 60, 111, -6, -52, 43, 175, 78, 83, 78, 122, 83, 105, 133, 80, 100, 88, 70, 123, -52, 186, 74, 56, 43]
5589D3O7j5N7N3j30M9N3k8mK4p4P8q3Q0j52J07j14O0Q9J9j07L5R4p2mk9j36O4
5617B4J6L9r8R0m6K9L7j04P8m4J15j41N3N5Pj33J45q7J21j14N6m8K5M5M6j13O0
5644A13o1m4J23R6k45J18l7m0J0qk2N7r5Q4j4k3J46j04Q6m8j8n1L0Q1p6Q5k10
5671f7J30J2p5P5O1j45mJ22qj01o0R1P6kO9n0j23n9J37m0J7L6M0k5N8j09J32m5
5699A43p8n0J16%j7m5J9Q0n3l5q9QJ82o2n6j2M4J6j13O7q5J44l6j80N6J67o5J3
5727G9q5J10J9o9j13J67p4R4O3j07J26j97R1p2R7j01N9k0Q5p0N5n0M5r5MJ7l5
5754B3L5l5N0J5l9L6r5R2L2j68J52Q9j42N7j03J8Q3l6M2j05J24Jp2N4K8j59J36
5781A13m6o3LP0n1J67k10J49j2J11j36p6J75j80J9J08l7J7m3oj12j2J16m0oQ9
$$ y = [43, 110, 95, 152, 205, 75, 124, 177, 149, 145, 169, 95, 173, 90, 170, 18, 125, 11, 71, 160, 179, 72, 107, 201, 129, 125, 96, -40, 24, 40, 79, -19, 71, 25, 54, 91, -13, 65, 21, 136, -5, 48, 103, 110, -23, 122, 35, 156, 42, 98, 50, 75, 120, 166, 53, 113, 52, 8, 131, 227, -18, 100, 63, 23, 33, 25, 3, 60, -35, 49, 35, 12, 158, 54, 140, 92, 74, 23, 53, 134, 58, 143, -67, 63, 75, 0, 75, 136, -9, -13, 109, 101, 0, -60, 31, 107, 105, 174, 124, 1, -58, 79, 39, 56, 92, 132, 107, 165, 56, 188, 143, 65, 15, 131, 131, 114, 69, 88, 168, 115, 80, -9, -1, 181, 119, 63, 51, 95, 111, -2, 65, -20, 124, 88, -92, -36, 131, 66, 79, -6, 104, 123, 54, -59, 108, 34, 128, 191, 84, 210, 13, 104, 32, 129, 28, 87, 67, 152, 82, 137, 87, 132, 37, 41, 58, 23, 58, 23, 73, 88, 49, 85, -10, 82, 114, -54, 98, 187, 45, 102, -1, 17, 100, 64, 106, 1, 125, 126, 54, 108, 136, -23, 113, 67, 4, 7, 77, 26, 193, -17, 132, 120, 231, 95, 19, 194, 14, 33, 141, 104, 121, 78, 72, -40, -52, 64, 24, 18, 107]
5807A07K5n3J28j96R2q4O5K6m7m3K0J6O8j90O9QM1l9m6J09pp3K6K6q1j21L33p8
5835A01r1K01j49L2l5m4J7K3o3N4O1l1r4O3O5l8MO2j43M8J7J4m4OL7q9R4q9K5
5864A4Q7o7K2L3p8R8m2k6L9r3Q7j19J00o4P2O4n9o0m8l7Q6L3K57k65n0P8l0J74
5892B06o6m2l0J4L5j00J58j12j1L4p9O0l7R9n8m1RO8r5N0l3l7l5J22m2J22r6Q4
5920A47q8K2Q0j37ln2K31j08k7k4r1J36m2j0J9J26j28Lm7J02l4qN6m7%%J7P9r3
5949G9l8Q7j94K04o4Q9j29l0O4k3j06N5J51q8J63k38J28j3p5N2n6K6k5n9O4P1
5975I5p4PlJ27o7R1j08J4J09m4m3o8J05m0L3j37R4p6J90j68l5J00N8j41R5m1k17
6002a44K79j23K1M1L6Qj66J26r1M0J18n1m6J99p5l3N5J0j05o1n8J01k4j0k1JL4
$$ y = [107, 132, 79, 207, 11, 103, 19, 84, 110, 63, 20, 40, 56, 124, -66, 3, 11, 52, 13, -33, 76, 69, -4, 22, 48, -33, -154, 179, 101, 10, 211, 62, 94, 59, 15, 32, 55, -8, 46, 107, 76, -18, 45, 110, 72, 76, 138, -5, 43, 60, 74, 30, 36, 73, -16, 78, -11, 14, 101, 34, 56, 89, 11, 109, 67, 41, 80, -13, 74, -45, 55, -9, 63, 127, 68, 8, -40, -77, 9, 42, 299, 34, -16, 62, 32, 206, 140, 98, 68, 82, 117, 17, 175, 63, 52, 86, 7, 67, 30, 129, 71, 30, 39, 107, 12, 62, 29, -8, -43, 79, 37, 159, 63, 147, 59, 81, 161, 24, 21, -31, 200, 92, 65, 41, -50, 86, 44, 34, 53, 179, 51, 54, 7, 109, 75, 67, 123, 76, 76, 76, 93, 172, 79, 41, 128, -66, 138, 74, 163, 34, 4, 68, 45, -61, -6, 145, 57, 220, -18, 110, 97, 22, 74, 18, 44, 19, -40, 24, 95, 21, 28, 25, 152, 85, 176, 68, 82, 191, 147, 104, 36, 141, 101, 134, -3, 91, 15, 205, 37, 2, 102, 160, 19, 114, 73, -144, 135, 12, 33, 74, 110, 118, -48, 78, -13, 27, 145, 94, 48, 247, 172, 139, 194, 204, 99, 38, -20, 81, 57, 47, 26, 27, 61]
6029F1l1O6n9J2p5M3J20k15J05j2m5K20j43K3P5j72J43j11m0J06j01K31j08k7
6053F6L5M5p3O2l6L1k2k1Rj85M8N1J55j15j43O7J05j15Q1K4N0k22J55n9K4Q6M4
6080A47q6L3l4j47J35r0Q2K7o2Q0p6J2R6Lp4J4J0m8J44K1n5n1J26o1J3j09M5k07
6108a12J55J39o8j05j2J70o7J4n5k8J2m5L5OJ40p8l7J16j60L7n3P0k2m3R5q3L5
6135E6j1%L6J8l4j16J42r9J5J09j99N1R3n4j1J41j86K07p9j2qK03j56q6rJ04J11
6162B26k35J27l7lMj8l8k2k7J26j47l3J83n1Kj08J57n0r3J15j29Q5l0o8J63m9
6188E0Jl2Q2j35J32J0k0J1k1l0K4P8r0m5J48j13N2JN1p6j01J51kO5j74n8K3K6
6216HQ2j12J38p3J02p5p0J52j20K3j34Q7M9J3m3q0J40p0P7N4P8j63n1M8K8j57
$$ y = [61, 30, 96, 37, 49, -26, 17, 137, -78, 27, 15, -30, 190, 47, 70, 145, -27, 116, 5, -35, 71, -30, 201, 93, 66, 101, 146, 73, 135, 99, 130, 108, 87, 96, -89, -41, 10, 165, 50, -93, -26, 79, -36, 45, 69, 119, -103, 52, -7, 17, 103, 147, 61, 94, 60, -87, 48, -42, 40, 67, 5, 85, 9, 21, 117, 120, 46, 60, 70, 22, 166, 187, 132, 81, 207, 146, 159, 50, 95, -112, 43, 182, 114, 9, -3, 167, 100, 114, 59, 31, 43, -2, 33, 39, 179, 101, 64, 180, 20, 57, 4, 74, 52, 9, 104, 21, 56, 45, 45, 81, 99, 65, -51, 91, -8, 7, 116, -83, -32, 61, 7, -4, 137, -49, 158, 79, 67, 59, 262, 106, 20, 11, 115, 226, -9, 118, 81, 78, 82, 64, 26, 4, -23, 103, -44, -77, 106, 55, 57, -51, 106, 56, -37, 78, -51, 34, 4, -64, 99, 50, 51, 19, 101, -34, 98, 108, 88, 99, 78, 48, 72, 150, 60, 15, 163, 50, 102, 103, 154, 78, -23, 128, 126, 191, 17, -41, -18, 8, 90, -22, 116, 43, 145, 70, 0, 152, 32, 55, -79, 8, 57, 70, 27, -53, 87, 17, 94, 148, 226, 63, 12, 60, 88, -69]
6242f9M0J92l6K6j65J62j41L4r0J00J42p3q2L3j09MKJ20P2Mn3J8n0O7j50J08O7
6269A73r6k1K8O0j94J33P3j71J37p1m8Jm5J42J9o4n8P7j66J69k12K60o1Q4l3P5
6295A91j09m6O4%q7J15l8j2j13J25R1j79kQR9j20K36j63Q2Q5m2j64n6M2R0MlJ33
6323B31j01p9l2o8knJ26J1J5j55N3J37Q2o5nl6k34J16J77j3p5j51M7l5P0K8M3
6350H0lj0J56k61N9J06r8J1P6jl8p9J23q0N5Nm0J36j93O6O0p3r8K21n2j16R0j33
6378c1J14N7n8KM0j05o3o3J66Q0n8J3j63J65n1m4J10m1p1Q7m7N8m8J8j50J07L
6405B7J2J9J22j04r3K45j32K0j84K03j08R5j61J37P3r9m6J3m4J12lj5j56Q3J32
6430A48j06j9r1O8Q4l1O0N5o2Jj35J67k44K60j43L7OL6k8J09o4o9L4P5k08J10
$$ y = [-69, -29, 163, 127, 153, -12, 150, 9, 43, -47, 53, 195, 122, 40, 73, -36, -32, -30, 90, 162, 166, 113, 131, 81, 148, -2, 106, 173, 77, 56, 84, 144, -50, 83, 156, -15, 122, 51, 3, 4, -41, 101, 120, 56, -2, 75, -91, 78, -134, 126, 65, 149, 116, 191, 82, 36, 100, 100, 13, 128, 90, 78, -35, 90, 181, 2, 0, 8, 107, -13, 223, 60, 142, 227, 185, 21, -35, 7, 97, 101, 98, 231, 130, 51, 19, -49, -51, -56, 70, 81, 96, -59, -6, 131, 213, 148, 143, 107, -127, -11, 166, 153, 78, -73, -26, -61, 9, 37, 80, 77, 67, 223, -38, 21, 127, 29, 40, 116, 115, 77, -2, 121, 41, 96, 101, 61, 197, 4, 70, 130, 57, -41, 180, 128, 12, 102, -31, 83, 140, 82, 84, 124, 19, -44, -107, 59, 139, 81, 94, -69, 96, 45, 1, 111, 70, -1, 86, 39, 97, 49, 67, -83, 24, 27, 39, 58, 180, 76, -17, 228, 96, 116, -68, 135, 27, 122, -39, 98, 171, 72, 26, 39, -5, 107, 104, 89, -67, 16, 148, 42, 23, -68, 0, 84, 53, 113, 168, 106, 107, -28, 139, -105, 155, 12, 49, 55, 91, 63, 172, 108, 39, 73, 148, -60, 50]
6456E0j4K2N8Q7l2j18P2l8J9j07Q1JK2mJ18p0r3K0R9j92R2l2J24p1O0j15M6P7
6484A62K6p9o5j18O6J19j71J26nj23J82kq8L0N4O0j14K5K1j12Q7j7P9j6O0l6o1
6511I0k4J03j04O8r2Pl0J3J27k05K03R4J1k60Kk0Q7j2J9j9p1K40j74qJ8n1j04
6538i2K17q7J6K9L8k0MJ32j20O6m9j36J15J5j56J31j16K2J18j07K6J3n3N3J1m8
6564B2M1NR7l8J5m4j44jJ30M9j94K00r2Q9o2j39J3J76j26O3N9m5n6mO8j6j7r1
6592d2J35O7k19J71q2P1N6p4j4KN1N7j13R7l2k8p3J82r1n5J02k19K94n7mj33O8
6619A17o0Q3j47m2J52qo7j04J50k6q0P3jK9O0n5q1P9L4j32O5L5k0oN6j4j13N6
6647C3N5M0J4o4J01j37O9l5L3r7P1N7j10J10q5j9l4q7K82j02N6o6q8J19J8p2n9
$$ y = [50, 36, 58, 116, 203, 171, 53, 125, 87, 106, -1, 80, 81, 103, 99, 217, 147, 54, 74, 173, -19, 73, 41, 165, 94, 154, 39, 85, 162, 188, 109, 44, -74, -8, 111, -60, 66, 61, -62, 120, 118, 30, 60, 114, 174, 60, 85, 106, -6, 81, 64, 143, 127, 187, 151, 90, 66, 169, 65, 133, 41, 48, 18, 31, 158, -47, 156, 250, 261, 1, 3, -17, 70, 58, 77, 58, -13, 227, 53, 45, 63, 12, -92, 125, 38, 54, 83, 121, 101, 105, 237, 117, 183, 134, -2, 113, 128, -28, 103, -13, 9, 127, 20, 46, 59, 6, 59, 70, 22, 63, 68, 165, 127, 142, 98, -46, -47, 83, 132, -62, 138, 46, 135, 73, -66, -53, 123, -3, 60, 119, 74, 18, 14, 82, 66, 49, -42, 93, 160, -59, 112, 30, 101, 157, 83, 69, 71, 122, 179, 66, 163, 131, 103, 30, 212, 121, 66, 168, -51, 243, 186, 182, 49, 117, 57, 140, -7, -49, 103, 95, 28, -76, 74, 48, -32, 41, 40, 69, 129, 74, -7, 72, 106, -26, 39, 74, 54, 48, 104, 90, -23, 33, 88, 128, 142, 78, 179, 42, 111, 76, 109, 12, 83, 140, 30, 140, 55, 36, 2, -85, 197, 95, 151, 85, -3, 116, 134, 62, 3]
6674CPlN8K09j78L5o5Mj4J62k51N2J05j47J93j92M4N7L6q0l9L2J27n4k7K4q6M9
6702F1J00j13R0p2o1N6J2pj5N6Q2k3p2Mj02P9K3J0L2l2q1M0M7q1k1O8l6j6n8n2
6732h2J32K9L0j62J4J39j10K84j07j33L5m5J0J31Lj27J3Ko9J05j19J2J04L6o2
6757F3j5J33j84R6k0l3R3j3J9n0M4K5j20K9M3k0n4nOk1O7L6M1q8N1j01O1r1mR3
6787H1r5P1m0J2lqO1kn6R8K3p8k1Jj1%K6J4oL7q9L2P8L2l5j58m4J02J84n3n5J
6819I9K4q0m1K6l9Q7n0N0p4K4r3K12j41K1J05j03K9j3J21j12L8m9J5Nl6J0Q6j41
6847b0J31p9k4P7k8L6J6j79M2O0N2jN5j5k25L36rr0J12k46N5L5j3Q5j17j07K12
6874A51m7j1j5q0L7Q3J5k7q4Nm6R9n5L7j8J10r3J65j92j19J70j58J80j06O4O9
$$ y = [3, 10, 7, 65, 274, 96, 131, 66, 70, 56, 218, -33, 19, 124, -23, 170, -22, 22, 79, 115, 35, -4, 28, 155, 101, 74, 98, 12, 61, 161, 48, 138, 66, 5, 61, 73, 66, 51, 107, 189, 166, 94, 98, -4, 75, 98, 108, 140, 108, 27, 67, 114, 33, 12, 80, 44, 28, -30, -82, 50, 79, 109, -53, -39, 100, -10, 274, 167, 34, 69, 24, 34, 165, 168, 41, 54, 56, -13, 92, -27, -15, 89, 125, 63, 48, 181, -3, 93, 73, 40, 133, 120, 139, 89, 133, 158, 38, 67, 110, 90, 36, 31, 37, 16, 83, 119, 160, 72, 123, 22, 83, -8, -12, 81, -14, 57, 17, 29, 26, 18, 79, 77, 21, 119, 142, 64, 43, 44, 33, 33, 59, 73, 67, 104, 15, 47, 125, 157, 122, -36, -80, 22, 206, 153, 98, 99, 123, 43, 2, 28, -11, 76, 26, 76, 2, 26, -67, 145, 4, 25, 130, 27, 56, 43, 164, 52, 90, 41, 56, 61, 25, 35, 121, -20, 111, 32, 8, 85, 57, 93, 109, -70, -28, 32, 84, 83, 138, 123, -102, 234, 225, 135, 247, 1, 56, 91, 78, 163, 46, -61, 151, 104, 93, 78, -2, 35, 118, 133, 106, 22, 27, -19, 80, 25, 62, 44, 154, 61, 226, 34, -85, 85, -73, 107, 1, 65, 134]
6900A34j06J28j33J10m0o5P5k9l6L1J96k05J72j51j2NJ47K5j53K2kM9o2l7m3J7
6926C7j3j6j0Nk9Q2J0K7j7Qn8J02p0o5J6j2J4J25p5R2Qn6m6j7o8J21P5j47j9J03
6956A07Qj13P1N9p6K3l2k6N8lJ15j87P8N8j43J91r8K3M1j82J67j67L4k6J42m7
6982G5k7J3J27o2O7j76O2J1J8M2j05l6R3j7j80k9K30rN8j67J05j07J39j10k8J19
7008A06j34M5L3Q1j31L4M3l1RO6j62Q9l0N1j08J26L4k0J20n6p1pj4j9J40q9L0
7035A35j01R3j31K3J40Nl4k08K0J29K71k63k4j10K1J96j6j40j09J98j58k2j4J50
7059E1O9r8P2k5M1p6NM8K4q0J48J8j40K1l8rJ35Kp3L0j78P4Q7m2n8m3L0M7p0J00
7089G2J36j53J70j80m9J09n5L7M4j34QR0M0p7m4Q8m6P3k7Q6K2j29P7r9mJ32j16
$$ y = [134, 28, 156, 23, 133, 93, 28, 103, 74, 38, 69, 265, 60, 232, 81, 69, 74, 221, 246, 93, 115, 113, 162, 100, 63, 20, 37, 24, 8, -2, 3, -26, 56, 66, 93, 76, 84, 26, 128, 58, -7, 9, -3, 11, 136, 61, 153, 161, 105, 59, 42, -26, 95, 170, 23, 4, 107, 115, 2, 73, 132, 56, 79, 47, 21, 79, 76, 191, 4, 82, 140, -3, 188, 90, 113, 154, -28, 139, -28, 6, -20, 122, 75, 48, 61, 188, 126, 193, 17, 79, 90, 108, 150, 45, 9, 102, 85, -95, -124, 106, 97, 155, -12, 93, -14, 125, 15, -13, 106, -28, 17, 50, 131, 0, 34, 77, 46, 55, 121, -41, 48, 18, 69, -39, 87, 121, 101, 221, 165, 94, 87, 73, 54, 194, 105, 135, 34, 127, -4, 19, 159, 164, 130, -78, -58, 71, 342, 79, 55, -55, -34, 162, 146, 6, -103, 95, -63, -85, -99, 51, 120, 22, 94, 69, 110, 34, 39, 87, 111, 31, 179, 197, 57, 78, 40, 31, 166, 168, 95, 125, -53, 21, 108, 66, 8, -35, -5, 42, -28, 72, 208, 55, 225, 45, -4, 105, 50, 87, 131, -3, 5, 95, 135, 58, 14, 102, 56, 129, 102, 188, 210, 81, 158, 59, 55, 187, 71]
7116G1Q9j38J04o4J54k01J52q1Q1j27pJ71n5p1Q4j42P4J1O5J07j98o4O4l6J12
7141A55j56L3l8P2P2k6M2j24M4K0j40M4m0Q6j7RN3j35P9pk1J19j35K03n0p1n1
7168B0l2R6j6k9Q1J18j24qo4L1n9J70m8l2N7L4j60J01j68J14J3m7K4J9p9L4j06
7195f0K82j62j0P6l2m5M1r2O2M6l4KK5QJj1m8r6J46j06J14l6R3j12Q3m2L6l5L5
7224A29j24J04nn5N2J06j24m6LN7j6qp7J43k7j04K0O7j3j13K3J26R5m9q4p1P3
7251H2m7M3N2kj73j4J46k3J5K0N3k94K85j19k6J21n1j32J60n1K0on2J43k6J2J3
7278A49J9O1j60LJ88j63J6p2J06j07O9J09n3m8j15J17L0o7j4J15j48L1k5J0J34
7303A85j29P5q8J63r4n3J08m1j4M6j09J1m9jP6O1j69P5J70j63p4nJ75o5RK9m1
$$ y = [71, 160, 22, 126, 62, 216, 15, 167, 86, 167, 40, 33, 204, 149, 78, 162, 20, 94, 105, 170, 277, 79, 15, 79, 43, 155, -1, 32, -6, 66, 138, 112, 154, 30, 74, 94, -46, -2, -42, 44, 27, 36, 89, -46, 33, 26, 5, 124, -11, 192, 142, 71, 20, -12, 84, 68, 39, 120, 238, 114, 106, 42, 73, 14, 184, 136, 104, 161, 195, 35, 136, -32, 82, 95, 48, 72, 91, 12, 46, -60, 222, 60, 50, 126, 94, 49, 90, -2, 60, 106, 72, 74, 99, 107, 108, 97, 49, -47, 99, -7, 107, 71, 164, 52, 135, 93, 129, 94, 129, 5, 109, 104, 49, 101, 207, 83, 37, 40, 97, 81, 73, -4, 139, 112, 8, 28, 95, 82, -31, -8, 118, 213, 164, 80, 9, 82, 35, 78, 130, 128, -45, -59, 87, 64, 79, 99, 152, -142, 143, 24, -2, 119, 68, -64, 96, 45, 65, 59, 7, 150, 124, 136, 149, 168, 229, 69, 72, 260, 97, 113, 41, 147, 40, 109, 218, 165, 117, 2, 119, 149, 82, 68, 183, 35, 66, 41, 51, 185, 56, 131, 43, 206, 112, 59, 167, 126, 112, 158, 49, 60, 11, 10, 86, 147, -22, 53, 223, 60, -14, -19, 156, 91, 100, 129, 88]
7330H8j9j2J07j31j05J98k1L8qj64J28q2R6m2Q5k21P3j9k2K13j14M7q0M5L2n8
7356E2o4J75j42n7Q2K8j27J41q6Q8J6m3L1K8l1n0J28j62J5Q0k8k3J6Q6k8n5L9
7383A09m7o7O8N0q8O7Ql7k6P8j15O6N1L4j29J31j10K3J22p4j30K30k19k5P2r7
7409e5M6PJ30k10N6N7n2J10R1j36J96j35j19P1J7K7j22J8J01m2K4K4o7Q7q0l3
7435A1Q5r1lJ07R0n6Oj02K0j7M0m9J11r1j24J11J3q9J12P3j50N2k0O5j4o5n1J09
7463H3k8qL2J02k95J32kK2K8m8J00qn8J12O2k48J22J4K3j38N0M9m4q1M9LjJ53
7491A77o8j70Q8M2Km0j1PK0L0M7j69K00p8r6J08P5j78N7l4J01P1j91J22lj7p1
7518B1j4o8Q4R6N2l4L2j55L8J8M7r1R3K8p6lO7j5J8j08L5j0o3p7K60j99J70q2
$$ y = [88, 69, 57, 164, 33, -72, 126, 105, 143, 135, -29, 99, 17, 113, 71, 156, -65, 8, -11, -33, 180, 66, 113, 33, 78, 110, 52, -12, 163, 21, -36, 46, 74, -53, 88, 2, 90, 106, 63, 94, 122, 91, 41, 169, 7, 22, 102, 74, 51, 67, 153, 125, 70, 109, 62, -5, 63, 113, 25, 92, 100, 63, 37, 115, 0, 66, 117, 151, 22, 153, 43, 66, 188, 114, -16, 214, -5, -30, 42, -55, -9, -2, 128, -82, -26, 31, -21, 89, 180, 44, 240, 105, -14, 57, 74, 101, -21, -3, 98, 56, 80, 104, 37, 124, 44, 11, 96, 5, 2, 109, 199, 143, 149, 47, 67, 50, 90, 41, 152, 61, -63, 48, 61, -28, 84, 157, 7, 59, 39, 104, 90, 25, -26, 83, 55, 47, 79, 181, -114, 18, 16, 38, 66, 18, 118, 110, 52, 164, 226, -22, 100, 114, 137, -1, 49, 98, 54, -27, 22, 25, 24, 177, 109, -61, 27, 69, 71, 31, 20, 27, 47, 77, 124, -45, 155, 77, -19, 89, 164, -14, 43, 9, 110, 181, -10, 112, 109, 92, 21, 7, -61, 23, 119, 171, 137, 169, 14, 52, 70, 117, 26, 119, 147, 71, 68, 135, 120, 138, 30, 65, 55, -8, -85, 175, -24, 146, 64]
7546F4L0k9l8M3j0k3OL0p1N3o5K60j65j1J3q6N5m9Q4l5j4K0KJ32j76r0P0J39j53
7575a4J70l4Ko1J34n0o7J03q0m4R5j89P4J51k01mN2J8o1N2O5j23j2J18J0r9J16
7602A21j06N7m8M0O8j05L9p1l2P1M3M9k5K1o6J13r7K2K7j40J85j66R7n6p2J50
7628A19J7q5p3J69j40O1j42R6J1k7J67k31Q6K0J46k0l10J46Kj8N4j3j28J48O0
7653A15n5o0J07j03O1Q4k00J09K4k8M1p9J11O2j40oP8j00J9n2J25Jl2M7j29j8
7679a8N3r2J85j42J30jj42J75j48K96k57J13j9k7r7k7R8p7J9J11K0k3n9m4j9R2
7705A00j03J45r4J7j09lO6P9j49J64K3J8o1k02R9J18N3k25K34o1l9p7R8N4k9o3
7731E3qN1m2m0J22j14NJ33j83J11m5q1J25o4rL5J4N3M8q0j18J6J08j25J61n5q
$$ y = [64, 94, 65, 27, 70, 60, 37, 43, 73, 2, 55, -10, 250, 85, 74, 87, 1, 56, 7, 91, 56, 42, 62, 64, 196, 20, -70, 0, 139, -14, 156, 122, 124, 63, 197, 147, 80, 183, 103, 59, 154, -35, 39, 190, -11, -15, 37, 55, -6, 46, 111, -12, -24, 94, 104, 5, 121, 15, 72, 24, 64, 132, 27, 66, -5, -37, 34, 77, 126, 101, 122, 56, 169, 72, 94, 121, -19, 166, 0, 97, 41, -31, 119, 136, 51, -22, 147, 7, 68, -74, 22, 33, 6, 173, -58, 28, 48, 194, 174, -136, 10, 12, -6, 48, 35, -93, 55, 115, 60, 0, 107, 4, 65, 149, -51, 58, 82, 54, 95, 16, 127, 189, 49, 43, 121, 21, 40, -12, 113, 114, 82, 129, 0, -18, 35, -57, 128, -14, 116, 115, -27, 148, 0, 296, 39, 152, 133, 106, 9, -18, 80, 3, 22, 133, 153, 130, 71, 27, 8, 100, -3, 142, 48, 65, -44, -47, 19, 98, -51, 113, 136, 154, 93, -109, -10, 108, 161, -64, 170, 109, 70, -7, 91, 145, 116, 53, 45, 96, 54, 14, 136, 22, 27, 160, -23, 88, 43, -38, 87, 23, 14, 49, 63, 116, 164, 84, -34, -18, 90, -35, 126, 71, 63]
7758F3J2O4N6p5n6j3j8J70p5n0P2r2r7J40m1J37j15k3rk0l0L6j15J91Q0K6j31
7785H7r2N9m8k6K15r1l7Q7j43J89j8K9o8m1K9j23L2mM4k3p5M9r2J16j12KN5J62
7813A62k50J69l9m4O4r9J08P9j06J03o8p4M4l9N6R0o0J0J6q5J37o4j72R5J4l2
7839A5J63j09m9Q1L7m2n6J44j18R1Qj12j3J02n0K5r0l8kJ46j60R2n1R7j32N2R2
7866A23n9J4k8L2o4J16O7j75M4m1L4Jrm8N3J0J79j43J20j31J14q1l8n6j6O8o4
7893B2L8k9R3k17Q6J32K7j45N5J18k70J78J1j75J99j67J06j5j14K22r6j50J05
7916A4K16k19K4J3J8n8j3J39r5N8J7j7m8p2o6J01J03o6N6j0Q2j7j70L7m0J37k8
7943I6o7J18k6jM6l1l4j06J08n8J19l6j55J63n5O1r2m8n0J04N7l6l5j5R1pRMm3
$$ y = [63, 75, 139, 195, 120, 64, 51, 33, 203, 128, 78, 150, 58, -39, 101, 60, 197, 82, 59, 50, 30, 0, 36, -79, 112, 192, 218, 87, -5, 54, 6, -20, 195, 104, 67, 154, 11, 200, 182, 211, 143, 102, 131, 8, 40, 36, 80, 57, -18, 31, -61, 55, -57, -55, 0, 162, -88, 81, 42, -2, 62, -37, 71, 150, 44, 147, 79, 5, 49, 10, 66, 156, 96, 106, 122, 37, 174, 110, -62, 33, 47, 15, 178, 69, 20, 101, 138, 96, 40, 184, 66, 157, 165, 53, 40, 142, 92, 117, 27, -11, -13, 133, -27, 65, 14, 111, -21, 31, 123, 64, 78, 50, 82, 18, 134, 201, 26, 70, 29, 63, 64, 55, 7, 60, 70, 249, 106, 226, 95, 209, 128, 90, 34, 18, 86, 22, 60, 31, 124, -93, -7, 125, 152, 7, 62, 180, -90, 88, 99, -76, 123, -44, 62, 47, -67, 155, 59, -91, 14, 230, 11, 35, 48, 66, 8, -5, 134, 39, 97, 114, 97, 49, -23, -89, 12, 115, 49, 105, 95, 177, 160, -10, 27, -13, 124, 96, 29, 147, 121, 120, 166, 135, 101, -5, 103, 45, 164, 128, -27, 136, 81, 142, 50, 2, -48, 56, 113, 77, 42, 27, 118, 111, 120, 124, 81]
7972H1o7J16r4n0J14j16N6J1M1J7j09j5J25j2o9%N2r5J47j54P2L2o4j09J04J31
7998A45oj47q3K04j69J92L9o2J0r6J42k25Q9jN5k6Jk8pqPJ6L2P6m3nL4j57Q8m
8028F3J09j47M5lk5M7l9m8O2J00N6j61l8J49q6O5j9n3N0p0l4J25r9k7N6J00j75
8055CL2p3JJ06M4J12k22J18o9J4J7o4l4K2O7K7K8n5J11o2j14L9J80k02J38n6k33
8082a25J56l6K2R4j09J03l9p9K57k03n8J04j53J07O0k1j6N1k1R9r1K6n0j0r0Q7
8108F5qJ2N8j19j3L0O9O8o9m1j40J05J23j03q7N7J75RJ6m4j43M4Q0o1j55J66q3
8135A1M1j8J02p8O0r0O4M0j26K6jl9J50n8N3P7q5q9l1r2P5J13L8j8J4r3J0o6M0
8164C0K6Po2L9M8m2rm0J10j40J4n2J46j39P1l2K1k3L0J20j29O8O2j3j72K10j7
$$ y = [81, 14, 130, 36, -14, 100, -16, 40, 51, 92, 109, 0, -15, 110, 98, 29, 29, 81, -14, 133, -21, 51, 83, 19, -90, 14, 145, 139, -8, -91, 113, -56, 136, 175, 113, 123, 27, 169, -56, 33, 32, 87, 61, 62, 34, 27, 19, 26, 42, 74, 150, 107, 102, 136, -21, 67, 63, 172, 25, 70, 67, 42, 89, 50, 2, 64, 164, 220, 59, 21, 170, 84, 149, 130, 77, 127, 57, 23, 148, 49, 22, 78, 178, 3, 35, -38, -37, 69, 113, 225, 3, 121, 52, 66, 83, 19, -15, 7, 74, 101, 129, 74, 185, 123, 9, 48, 228, 26, 164, 108, -125, 31, -5, 17, 111, 2, 105, 66, -13, 244, 41, -17, 87, -66, 41, 101, 80, 64, 115, 94, 193, 102, 128, 78, 68, -22, 65, 57, 69, 127, 8, -5, 25, 94, 162, 93, 52, -88, 17, 140, 37, -50, 7, 182, 191, 207, 163, 20, 64, 144, 83, -72, 94, 11, 52, 34, 136, 58, 118, 28, 92, 132, 6, 32, 31, -8, 142, 84, 137, 214, 129, 40, 9, -83, -8, 105, 143, 125, 139, 46, 56, -10, 30, 56, 63, 1, 40, 88, 46, 37, -3, 107, -33, -19, -71, 75, -64, 7, -25, -4, -27, 3, 123, -6, 62, 124, 111, -61, 149, 132]
8191A32
$$ Imaginary data points
##PAGE= N=2
##DATA TABLE= (X++(I..I)), XYDATA
0@%%%%%%%%%%%%%%%%%jL4o6O6o6O6o7J00j32J33j53J86k00K33k66K99l52L86m33
36b33M99n65O31o98P67q58R56j058J172j288J422j572J732j908K104k320K557
53A340k821L115l444L820m250M750n339O040o893P964r351J1223j3914J8125k5726
68a5361M3814j68641j82848J85925P9929J8395L0862J56335R5843k9627r9130
79A15496l8284k6747n1890p2760k9872L864M8027P7167O9582J107k4721K951J281
92G5201q7169j25839m0152N9088K9511l4051J1990J17194J06689k949n1648J355
104E9220J9046m5537q6091l0693M1842N2660L0008K6786K7887J0713j3211l2903
116E9727n8454o9719l7852Q823J1013j1127J4445P4902P5756K471m2869j1842
$$ y = [0, 0, 0, 0, 0, 0, 0, 0, 0, 0, 0, 0, 0, 0, 0, 0, 0, 0, -1, 33, -33, 33, -33, 33, -34, 66, -66, 67, -86, 100, -100, 133, -133, 166, -186, 200, -233, 266, -299, 332, -366, 401, -457, 499, -559, 613, -675, 747, -825, 907, -1001, 1103, -1217, 1340, -1481, 1634, -1810, 2010, -2240, 2510, -2829, 3211, -3682, 4282, -5069, 6154, -7760, 10365, -15361, 28453, -140188, -323036, -137111, -57182, -38787, -7925, 148410, 244253, 214626, 115496, 77212, 50465, -1425, -74185, -104057, -100193, -52166, 25001, 94583, 95690, 70969, 73920, 75201, -11968, -137807, -177959, -118871, -89360, -123411, -111421, 5773, 112462, 109513, 57865, 59220, 78266, 32729, -53362, -84055, -42213, 10447, 40455, 67241, 95128, 105841, 92630, 59727, 1273, -68446, -106298, -97475, -86462, -97589, -83144, -8242, 67514, 69985, 27116, 15274]
128A5274J2407l1579p2857l1459M1961N4391K2241K2412N4095N0671J971l7641
140A01887m5597m7127n1660m2210j8875J458K3684N1774N8951K8082o730r308
152D4329n239l3311o5527m5680Q581L0201J4721J9823N5957O7447K8157j4570
164A04889k2508j9709l5194n0082l8649r852J1956K4704L2317K9147J6219O231
176D9469j902k2510m6308m4125j6354L916L902J1932M0116N5859L5783K773r097
189F3454p534j8721l5707l3863j2094Q874J7504K0405K2429K1153J3147j899k1598
202C5550l6438l5968k3127j1639n050P778K9601M1755L2088J2736K027k542j3390
215C3381k8313l2280j8619K040J5676J9963K3175K7193K4678Q536j5407l0683
$$ y = [15274, 27681, -3898, -76755, -108214, -66253, -11862, 10379, 32791, 86886, 137557, 139528, 101887, 56290, 9163, -42497, -84707, -103582, -102124, -78440, -26666, 32285, 60367, 53637, 44329, 39090, 5779, -59748, -105428, -96847, -66646, -51925, -32102, 23855, 91302, 119459, 104889, 82381, 62672, 27478, -22604, -61253, -71105, -59149, -34445, -2128, 27019, 43238, 49469, 47567, 25057, -21251, -65376, -81730, -77814, -73912, -61980, -21864, 33995, 69778, 72551, 63454, 55920, 37199, 1492, -32371, -44465, -35591, -18087, 2318, 24747, 45900, 59047, 57148, 35550, -888, -36856, -59983, -71622, -76672, -68894, -39293, 2462, 34550, 47286, 49313, 46771, 33381, 5068, -27212, -45831, -43791, -28115, -8152, 15023, 42216, 66894, 75430, 60023, 29340]
227B9340l1426k5772k3503j8528j874J9943L1939K7846J8644J1980M250q839k3536
240A0464k9742k2263p354O158J3960K0168K7771L0405J9068j676j7563k1637k1962
253E797k6462k6285j1741J0307K2425K0505J7071J6043J1510l250k0553k7104
265a1737k1048j1805m216L728J4938K6827L0200K2300P118m710j1590j6946k3873
278h14k5916j5403K578J5109J5668J4426J6831J6090K497j6296k4600k0003j4237
291c4070j2544o863Q017K3176K6930K0618J2809O042k036j2525k0366k2246j5406
304b8464l660P128J1786J3851J7544J7856P696r364j8760j7857j5120j7064j4161
317d8589n8J6088K1228J7189J3500J1749N257o996j6782j9534j4085o752O73O977
$$ y = [29340, -2086, -27858, -51361, -69889, -71763, -51820, -19881, 7965, 26609, 38589, 42839, 34000, 10464, -19278, -41541, -48895, -42737, -28777, -8609, 19162, 49567, 68635, 66959, 49396, 27759, 5797, -20665, -46950, -58691, -48384, -25959, -5454, 11617, 27660, 39170, 35920, 15367, -11737, -32785, -44590, -48806, -45078, -30140, -3313, 26887, 49187, 56305, 51595, 40005, 23059, -814, -26730, -42133, -39555, -24446, -8778, 5648, 22479, 38569, 41066, 24770, 170, -19833, -34070, -46614, -53477, -45460, -22284, 4646, 25264, 38073, 44115, 42079, 29554, 9188, -13058, -28464, -32124, -24996, -13210, 641, 18185, 36041, 43737, 34373, 15613, -2244, -17364, -34428, -48589, -48647, -32559, -11331, 5858, 19358, 31107, 36364, 29368, 12586, -6948, -21033, -27785, -27112, -20135]
331b0135J3143J8531J9560J1835j873j1785j4729j6072j9173j7835o758Q288J5958
344b1045J5481J4379J3927R320k239j3546j7854j5322j0323n179K097J0762J8107
357a435K0405J5605O686j965q916j4502j9463j8989j2026j459P803J2208J4493
370a555J5591J2020L711o803j4161j6006j3475r561m071M073J3356J8844J7282
383A9245J0945M248j506p949j4826j7506j3156n247K133P044J0618J2922J1880
396A8845O565j822r688j4110j3096j0319o967j664P435J5583J7072J1732O265
409B5831K789k795j1183j6649j3759n588J1L999Q815J4129J4186Q395J66p024
423B1323j1522j4081j3814j0735n834L178J2410J5643J3076R037P410K847p848
$$ y = [-20135, -6992, 11539, 31099, 42934, 41061, 29276, 14547, -1525, -20698, -38533, -45291, -37003, -21045, -5564, 8815, 22742, 32062, 29823, 16277, -1577, -16899, -27222, -32401, -30304, -19542, -1435, 18970, 34575, 41261, 39296, 30380, 15878, -3585, -22574, -34600, -36059, -28256, -16048, -1555, 14036, 26056, 29767, 22964, 8803, -7203, -20678, -30239, -34310, -30237, -16881, 1963, 19245, 30190, 34438, 32932, 24983, 10157, -7349, -20505, -25752, -23619, -16575, -5957, 6965, 18845, 25410, 23588, 13900, -210, -13306, -23625, -30592, -32256, -24821, -9238, 7834, 19566, 25831, 28620, 25825, 14642, -2007, -15766, -21354, -21343, -17344, -8529, 5600, 19786, 28181, 28347, 21323, 9801, -4280, -18094, -28829, -34663, -31485, -19075, -3432, 9644, 18681, 26091, 28938, 21090]
436B1090j6319j5007p617l682k247M316J3870J8087J2035M410p30m503j0473j6083
450b853j5882r932k068N297R675J1424J2148J1162O325l380j1394j2176q474o834
464a6962o581l58J0649J6013J1765N508M101K216m985j3882j5485r186k924l31
478b0442K737P855J2612J1656N241j812o740q287r101r326q050j685Q014J3045
492d283J1071P548O843N195k210j2039j4513r256m350k879k66O918J3446J2580
506A3805N575k83k964n846j0228j2942j0238l290L875Q146R439J0503J0593Q318
520B4463N07q027j1200r149p104o603l638M205J1816J2137P197L651J977j552
534A8680q534j3925j2136n648o28K546N549R803J2471R465K394l829o378o864
$$ y = [21090, 4771, -10236, -17853, -21535, -23782, -19466, -5596, 12491, 24526, 28936, 28206, 23703, 13230, -2853, -18735, -28667, -30735, -25438, -15763, -4339, 7809, 18971, 25296, 21916, 10522, -1654, -10128, -16962, -23543, -23901, -13252, 2761, 14526, 20034, 24135, 26351, 21366, 7484, -8001, -17187, -20111, -20442, -17705, -9850, 2762, 14418, 19659, 17847, 11107, 2820, -6281, -15607, -23657, -25342, -17328, -4283, 6788, 14336, 21179, 26374, 24164, 12125, -2388, -11644, -15994, -18873, -19139, -12221, 1225, 13805, 19380, 19097, 16133, 10287, 59, -12883, -23121, -26411, -22536, -14390, -4951, 5552, 16145, 24463, 24970, 16943, 5743, -3406, -10510, -17113, -20751, -16546, -4730, 7407, 14604, 18255, 20232, 18680, 10146, -3779, -15915, -21563, -22191, -19645, -14096, -4293, 8178, 17643, 20037, 16208, 9830, 2966]
548B966p936q894n194K089Q158R553P675O755N390O27o089j1344j1120p164l558
563a8086j151K561P695J1503R697L578j014l041m952q924j0620o393R40N802O999
578e406P843R358P850K302m290q298r002p931o424l696M98N733R605R464N623
593A3229J435p56l468q467j1300p904j312K809M092O379J0178R947M389j509m732
608A3010n834p794q583n996r36L864P067Q035P117M470J064k561o866r735q680
623a2358l915j94J573M303Q518J0341O567Q08k103l263n994r043q063k157K628
638a2352M850O129P579O970L362j491n011p110q245p011l706k07K549O139R252
653A697Q290L649l21j805m258q325q877m213J270L042L851O558Q712N939O91k860
$$ y = [2966, -4970, -13864, -19058, -16969, -8811, 742, 8417, 15172, 20562, 21189, 15100, 3756, -7364, -14528, -18086, -19237, -16676, -8981, 2522, 12219, 15797, 14783, 11742, 6790, -2134, -12754, -19147, -18207, -12405, -5406, 2437, 11795, 19645, 21947, 17657, 9359, 357, -7574, -13998, -17694, -17196, -11463, -1858, 7606, 13229, 14664, 13908, 10440, 1973, -9327, -17231, -18543, -15734, -11642, -5263, 4915, 14862, 19251, 17742, 13010, 7176, -618, -9201, -15197, -16133, -12269, -5202, 2833, 9950, 14420, 15484, 12923, 6057, -3678, -12358, -16273, -16467, -14894, -10591, -2073, 8268, 14835, 15643, 13540, 10277, 4283, -4760, -12823, -14980, -12352, -7502, -1373, 6206, 13176, 16538, 15047, 10036, 2926, -5319, -12330, -16036, -16243, -13694, -7555, 1697, 9987, 13636, 13315, 11510, 7252, -1073, -9950, -14163, -12893, -9851, -6000, 558, 9270, 15209, 15900, 13040]
669A3040m219o605q417o677k577J490L920O634P969N724J563n06k603n821q207
684e292o202j202J099K079M894Q664P792K641j117k433m281p318p814l748M24
699a1814K143L953O128O525L697M01j567m145o833p114l543n19J292L544P134
714g18P904M610P13r74k607n669p569n384j468R85K313M957P089N776K007p98
730A1167k783n262p105n923k807P7J988M811P000O285L294Q87j080l501o522o652
746f126l476p37J050L077N875O637M015P78q26k929n689o702m447j771K76K204
762h791M899O443M885J859J86j652m173n955m872j986K17J709L966N755M954K628
778A0072K94j622m018n512n282k798j078Q84L396N473N118K675Q63l70k966n386
$$ y = [13040, 8821, 2216, -6201, -12878, -15455, -13965, -10045, -3411, 4558, 10282, 11845, 11339, 8736, 2915, -5292, -11494, -12696, -11597, -9518, -4624, 4040, 11832, 14473, 13356, 10923, 6642, -676, -8490, -12238, -11814, -9671, -5718, 410, 6935, 10632, 11033, 9466, 5321, -1512, -8626, -12169, -12688, -11396, -7852, -718, 7186, 11796, 12509, 11535, 8928, 3259, -4310, -9694, -11162, -10177, -7864, -2907, 4182, 9958, 11965, 11167, 8384, 3122, -3983, -9906, -12713, -12636, -10648, -5837, 1163, 7448, 10742, 11629, 10549, 7048, 526, -6126, -9602, -10339, -9289, -6212, -337, 6300, 10315, 11093, 10267, 7338, 1649, -5053, -9500, -11271, -10995, -8791, -3892, 2551, 7436, 9295, 9481, 7829, 3656, -2299, -7171, -9157, -8940, -7231, -3265, 2490, 7444, 10072, 10366, 8744, 4726, -786, -6068, -8866, -9944, -9060, -5664, -191, 4927, 7602, 8465, 8095, 5129, -257]
794b57n268k911p93R63K470M754N870L887J514p17k734m104n021m449k495pK302
811f996M309M590L794K308Q43j860m212n275m018j912r24Q49L694N621M797K779
827H387N79n86k652m517n029l389j096J201K467L312M364L702J863p94k951l912
843I49l902l244k495l32K372M302M381L154J905R02j158l462m622l647j835k38
859f970J229K559M138M315K460Q2j620k877l427m119l109j128J367K949L507L422
875B778K942J761n47k617l819l529k339j389K1J748L928M157K960J285r4j396
891E850l249m189l836k091L14J625K557L467L500K656N00j986k781l164l002k495
907f324j005J191L020L733L078K189J209m15k220l595l707k466j100M18J562K892
$$ y = [-257, -5525, -8436, -9229, -8266, -5796, -1042, 4828, 8715, 10229, 9512, 6778, 2674, -2347, -6796, -9291, -9298, -6996, -2687, 1903, 5697, 8005, 8848, 6988, 2776, -2499, -6517, -8429, -9353, -8504, -4810, 811, 5608, 8387, 8966, 8380, 5728, 1211, -3818, -7207, -8303, -7102, -4635, -1323, 3041, 6743, 8606, 7812, 4861, 949, -2953, -6197, -8692, -9024, -6652, -2350, 2031, 5185, 7090, 7992, 6834, 3372, -1250, -4897, -6732, -6970, -5741, -3182, 956, 5271, 7731, 7813, 6193, 3316, -111, -4230, -7339, -8467, -7100, -4151, -644, 2778, 5720, 7481, 6934, 4317, 498, -3031, -5370, -6759, -6738, -4990, -1062, 3095, 6055, 7340, 7246, 5850, 2601, -1588, -5424, -7515, -7201, -5576, -3019, 448, 3948, 6604, 7104, 5118, 2337, -827, -3829, -6324, -7329, -6138, -3118, 615, 3693, 5882, 7091, 6676, 4456, 861, -2846, -5312, -6412, -5994, -4432, -1540]
923a540L627L044J295n81j912k489l316l061j824J19J835K980K940L067K186N75
939F945j525k740l183k937j782o72N26K525L290K989K077L05q12j787l054l467
955c302k397q25Q22J765K718L211K747J528l25j956k659k928k518j656jJ695K753
972a328L180K343J565J73j268k742l120k812j709j71P66K298K864K974K072N24
988E609q74j970k577k747k142r11P37J976K866K623J942J259l13j738k831k898
1004a989k214j233n1J368K543K956K388J191Q7j331k164k749k554j531j63J391
1020d055K243K652K427J813O26q92k309k738k398j843o40L06J890K705K497J803
1036D087P87k90j480k587k688k070r58K30J457K317K701K378J269Qj395j968k663
$$ y = [-1540, 2087, 5131, 6426, 5845, 3933, 1444, -1872, -4933, -6757, -6638, -4803, -1823, 1117, 4184, 6370, 6945, 5420, 2680, -503, -3440, -5222, -5894, -5368, -2843, 447, 3436, 5513, 5818, 5006, 3219, 165, -3302, -5699, -6524, -5702, -3937, -1219, 1992, 4739, 6267, 5942, 3986, 1327, -1601, -4119, -5775, -5776, -4081, -1328, 1852, 4195, 5760, 5933, 4665, 1923, -1197, -4009, -5718, -5889, -5123, -2825, 39, 3013, 5085, 5609, 4735, 2765, 188, -2559, -4701, -5612, -4875, -2899, -33, 2590, 4532, 5791, 5478, 3740, 909, -1989, -4203, -5436, -5487, -4119, -1576, 1380, 3768, 4959, 5046, 3715, 1551, -1198, -3752, -5283, -5446, -4055, -1812, 840, 3267, 5080, 5706, 4814, 2505, -233, -2631, -4474, -5114, -4808, -2918, -213, 2284, 4087, 4874, 4584, 3104, 517, -2171, -4241, -5199, -4969, -3512, -1195, 1506, 3884, 5153, 5161, 3766, 1798, -865]
1053h65k227j653j69J169K094K306K060J556P28r23k058k656k163j499o08O00
1069d308J615K359K482J681Q10m20j362k192k334j915p89L45J423J909K164K071
1085C539J007j16j335k075k174j768j602r6J184J947K331J861J266K92o62j877
1101A722k190k069j187l35N15J586K172K284J400L81o51j311k009k329j562p92
1117d375M22J343K026J698J900J076p4j399j896k024j535j127j80J017K045K310
1133A227J505R63M18o99j652k281j896j123k33N78J288J857K047J431L38o05j401
1150A762j599j945j527o15K90J605J689J629J498Q72J46j226k067j759j199r22
1166c368j2O88J742K014J518N97n8n34j362j933j826r63J19Q16J101J606J679
$$ y = [-865, -3092, -4745, -4914, -3745, -1651, 655, 2715, 4271, 4999, 4076, 2018, -638, -2801, -4300, -4908, -4308, -2693, -334, 2148, 3829, 4639, 4219, 2857, 665, -1669, -3584, -4373, -4028, -2605, -696, 1468, 3539, 4546, 4430, 3095, 1020, -1154, -2922, -4524, -4620, -3436, -1489, 842, 2703, 3969, 4261, 3599, 1722, -468, -2537, -3724, -4059, -3544, -1958, 214, 2498, 3898, 4279, 3628, 2317, 308, -2021, -3583, -4375, -3953, -2610, -584, 1114, 3014, 4090, 4016, 2617, 721, -1303, -2838, -3965, -4145, -3128, -1083, 1227, 2732, 3695, 4113, 3414, 1762, -519, -2415, -3538, -3771, -3193, -1905, -48, 1999, 3430, 3768, 3163, 1762, 163, -1782, -3309, -3924, -3634, -2029, -340, 1289, 2787, 3659, 3805, 2579, 512, -1247, -2446, -3368, -3380, -2692, -950, 1064, 2582, 3179, 3121, 2587, 1225, -708, -2534, -3497, -3378, -2562, -1461, 145, 1824]
1183A824J481L68p51j524j440j370j306p51M23J442J636J518J065O20O4j285j726
1200B88j878j181m35N9P70J558J985J285O40l07o89j075j462j718q60K1O36J473
1218h90J405J338J178K23o78j346j696j158r90l57J74J069J657J740Q10K21P8
1235B778q38j624j690j182l03L88O76J258J475J361P20k74q20j332j252j104r97
1252b760j84Q25J336J240J155P44L39m97j209j443j364m84k72L16Q38J432J658
1269A670P14K35l72q08j348j297j122k96K91J133J035J044J165N80j12q72j185
1286D55j344r52n18j06O75J201J354J055L92K55l99j152j418j278m50j31M42R57
1304i62J213J171P87K59o16r33q80j282q72l67K14R42J201J158Q21N15j17q53
$$ y = [1824, 3305, 3673, 2922, 1398, -42, -1412, -2718, -3469, -3046, -1604, 32, 1550, 2615, 3235, 3299, 2014, 288, -1590, -2771, -3206, -3147, -2377, -819, 1166, 2451, 3091, 2784, 2095, 1020, -442, -2160, -3020, -2999, -2363, -890, 515, 1853, 3031, 3254, 2576, 1230, -466, -1624, -2614, -2971, -2797, -1728, -71, 1669, 2479, 2700, 2778, 1940, 316, -1374, -2556, -2859, -2471, -1795, -537, 938, 2299, 3019, 2745, 1925, 593, -659, -1763, -2760, -2944, -2119, -783, 457, 1612, 2356, 2695, 2198, 989, -454, -1818, -2302, -2574, -2258, -1420, 12, 1670, 2384, 2619, 2247, 1439, 91, -1206, -2328, -2624, -2333, -1200, -165, 879, 2044, 2624, 2512, 1640, 455, -889, -1841, -2359, -2465, -1790, -589, 765, 1820, 2212, 2467, 2068, 916, -502, -1780, -2230, -2361, -1919, -962, 251, 1422, 2209, 2468, 1852, 919, 39, -1243, -2115, -2482, -2268, -1326, -125, 1033, 1854, 2369, 2252, 1399]
1322A399j157j223p80n13P6N38J155J264Q91O05j54l62r11j330j107n58k18O43
1340a742Q64J140J020Q58J42m44p83j205r10p81m20L31Q14J229Q77Q53L32k16
1358A959o69j008j251p67m06P3N91Q60J273Q45M75m0o29q42r37r28n55N0N42Q26
1378e38R01P91P05J85l50p96j266o80p32j19K96O47R83Q66Q11J87k39o70q56j042
1398i16p61k82J21P72P96R82Q45K86k3n06r67j037p58n02J31N07O83R25R25N12
1418A733R6m46n85j044r42n36q0J27O95J010P99O80K66k2p95q32q97n93m50L08
1438a508N60P15P91Q27L63Mn16r13r82o07m86J42L55O88Q54O99N09O9k84n79q42
1459a41p94n47p7M36N39O69P91N83J97l63n78p14r06m27k99J91N29Q09Q19M90
$$ y = [1399, 242, -981, -1761, -2274, -2198, -1660, -505, 759, 1650, 2255, 2101, 1739, 828, -502, -1609, -2167, -2385, -1742, -878, 262, 1282, 2140, 2282, 1838, 1055, -150, -1060, -1841, -2261, -1930, -1116, 113, 990, 1843, 2175, 1959, 1290, 282, -969, -1736, -2142, -2069, -1478, -618, 655, 1500, 1975, 1935, 1306, 464, -473, -1401, -1956, -1906, -1364, -538, 363, 1154, 1859, 2044, 1694, 898, -368, -1048, -1780, -1899, -1603, -956, 27, 893, 1704, 1891, 1652, 982, 126, -916, -1677, -1959, -1838, -1066, -270, 712, 1557, 1843, 1820, 1314, 347, -690, -1448, -1950, -1819, -1312, -629, 296, 1221, 1733, 1829, 1383, 798, -246, -1188, -1724, -1804, -1677, -982, 28, 827, 1507, 1773, 1751, 956, 124, -773, -1366, -1816, -1508, -948, -233, 558, 1385, 1748, 1752, 1236, 323, -659, -1266, -1752, -1610, -1255, -567, 287, 986, 1495, 1564, 1280, 701, -141, -935, -1482, -1559, -1123, -584, 85, 876, 1459, 1656, 1293, 715, 1, -905, -1332, -1631, -1440, -911, -102, 717, 1207]
1479A207K52n1m20p37r57m42l07K3L30P83P72Q15K94l3l95o64p22o58n82o4L09
1500a247O70P48O41N53O1p3p05p92n39p05k06K75M44P46P27N68J65O0m15o50q79
1521e53o08k77J85J57O11Q52N73M75o5m14n84n48n87n03j69M26M20P36N76N45
1541A248K24k58n82o40o54m28k19R7O73M67P01N07Ln5j57p12o76o20j83K2L60
1562h82N04P71M36N47n0n22n81m68o57l84r2L95N95N31O04L70J89j77m62q32o15
1583g80m15%j6M83P04O39M07J89r8n51l16o68n26l43J25N31M04O48L67M58J21
1604A363m85o53n21n09k79j84K39O41M81P21K15J25j04m65o66o97m39O3J39K25
1624g90O57P61M26O0j96k52n62n03m27k85R9K01O29L94M42K81L7Mo90o24l47l75
$$ y = [1207, 1459, 1408, 988, 251, -706, -1148, -1455, -1432, -1102, -319, 453, 1268, 1562, 1529, 1134, 470, -252, -910, -1492, -1556, -1247, -577, 171, 812, 1365, 1426, 1353, 648, -144, -683, -1388, -1594, -1319, -875, -129, 598, 1166, 1331, 1391, 976, 326, -553, -1161, -1438, -1253, -1096, -485, 367, 940, 1415, 1350, 936, 352, -196, -783, -1286, -1455, -1029, -609, 127, 703, 1248, 1472, 1214, 632, -8, -662, -1090, -1309, -1212, -539, -72, 629, 1136, 1139, 1084, 927, 215, -461, -1081, -1264, -1242, -882, -378, 393, 829, 1376, 1326, 804, 223, -245, -902, -1286, -1378, -983, -388, 143, 747, 1117, 1306, 1129, 667, -165, -780, -1195, -1195, -1211, -728, -24, 615, 1022, 1211, 1113, 562, 246, -422, -948, -1291, -1166, -635, -231, 417, 784, 1242, 1363, 878, 225, -296, -805, -1084, -1268, -1029, -388, 93, 814, 1029, 1154, 1050, 585, -81, -778, -1217, -1154, -1015, -790, -133, 628, 1054, 1114, 918, 666, 104, -399, -826, -1111, -1012, -811, -182, 212, 654, 935, 972, 976, 286, -338, -685, -1060]
1646a060J7N6O54N04O21K52M3j26l38p59o11k36j71J71M78N11M37M18J68l8m87
1667E04m00o10l35k70n0L75N63O70K34K15J81l24m17n63n90j47j22K14M66M31
1687B5O81K64P1j85l92l73o30m40QlK95O21K84N68K63j8m31l33o30k94l32M8J31
1710h02O38M57L57K81lj95l70n73m58l13j8RM06N74M94L52J11j96l13n66l33m42
1732i03l0J01K77N64M24L06jJ14j82n40l78m75j11L0O5N22K83N77J65kk18l73
1754B15l98l12l85j30K84L85L22M54L43R3l1l12o19l10k63j10j8L29K91M97K67
1775E92K41l3l02l17m59l92l63K06J74M66M10L63K00L6k56m13k42l70l66j4Q7
1796g52M14L93L69L15J68j77l33n36k71l79q4R7K52L37N25M50K0P9l65j31o01
$$ y = [-1060, -1043, -987, -333, 171, 792, 1044, 1087, 961, 623, -136, -747, -983, -1154, -983, -505, 6, 443, 861, 1029, 991, 504, 104, -506, -841, -1111, -1161, -786, -223, 447, 681, 896, 1077, 753, 336, -227, -817, -964, -1086, -872, -406, 25, 706, 970, 1041, 856, 464, 91, -539, -979, -971, -974, -679, -58, 226, 794, 1057, 1039, 608, 275, -355, -649, -981, -933, -802, -164, 293, 650, 931, 928, 733, 363, -210, -668, -981, -999, -990, -584, -10, 484, 836, 947, 751, 438, -128, -461, -903, -933, -832, -555, 9, 433, 739, 738, 852, 670, 130, -248, -723, -834, -804, -739, -217, 66, 643, 808, 806, 588, 215, -183, -495, -880, -1010, -726, -341, -19, 435, 778, 871, 840, 528, -91, -401, -664, -774, -792, -463, -172, 325, 592, 833, 800, 498, 181, -278, -670, -1033, -827, -653, -187, 223, 586, 786, 822, 566, 153, -89, -459, -825, -839, -752, -338, 55, 424, 739, 907, 730, 397, -139, -410, -789, -873, -776, -524, -187, 338, 788, 808, 887, 522, 391, -210]
1817b10l53k64K5J93K60L74M78K82K1k23l43m40k68j64o2j8K54N39K88K85J42
1838G96k30j60m05l44l95Q3j25M15L12L94K21J86n8j61k91l81l61k24j1K67K39
1859b33N11K07J10J57k85j70n05k22l03M0R7L42L77K44K17K98k94k09m60j87k52
1880e20k25K9L61K51M25j4M44j29j75l62l86k08p8r6L44J14M69L47l7J73k96j21
1902C10l89m85%K3O8J69L48M48M4M2j12j32k83m21k24j1mK97J10M80K02J25m2
1925E63j87k49m09k34j62J1K54K91M01J70P6N3j21l84k83p8l43k7K29J98L00K11
1947B80L52Q7j05k31l62m65l4k07K32O6M21L10J41J95q7k00k60l47l90J0Q8k8
1969e34M24L69J62L5Q0k16j5n83j93j03nJ49J29L60L34K31l5k00j33k70l32o4
$$ y = [-210, -563, -827, -802, -609, -349, 25, 503, 785, 806, 583, 240, -200, -468, -632, -694, -712, -458, 81, 369, 654, 796, 566, 406, 1, -343, -738, -655, -780, -365, -53, 341, 562, 748, 690, 529, 238, -143, -504, -728, -739, -472, -233, 278, 485, 595, 752, 467, 297, -208, -430, -733, -693, -596, -254, 123, 367, 584, 882, 588, 379, -81, -268, -520, -745, -716, -355, -104, 321, 307, 751, 622, 447, 85, -301, -509, -587, -683, -339, -225, 244, 591, 554, 727, 431, 310, -79, -564, -564, -541, -473, -304, 44, 492, 536, 578, 466, 334, 51, -370, -594, -605, -609, -312, -202, 278, 480, 605, 563, 376, 127, -282, -516, -678, -667, -413, -122, 279, 449, 525, 578, 457, 73, -210, -288, -631, -658, -429, -231, 69, 280, 632, 719, 614, 383, 21, -444, -478, -685, -453, -387, 34, 344, 485, 680, 593, 393, 133, -214, -604, -594, -506, -534, -110, 259, 421, 456, 536, 320, 305, -278, -471, -574, -579, -430, -301, 59, 393, 624, 589, 389, 256, -14, -346, -410]
1991d10l38J61K83J33L54K47J15N6j29m08k53l02j22J57J7L03L33K66M1j7k1k78
2013A88k92j59l08O0J31J26K22K48J96J88j49k45j90l72k51m1K1K81K54K32K54
2034C94M9O5j96j48l14k19k02N7O0K47L35J91K14J08k47k32j96k01l21j13L40
2055c29j0M61K24N3J06R2j69k50m24l70RQ4M2L79K40K26J66j8r4k15m26k24k02
2078f49k4K01J57L00K35K67J43j95j35l85l04n0k51K36J75K38K97K11r9K30k85
2099C13j95k82k97r1J14K5L74K88M5K42Nj28l34k05j85k10N7k9K89K54K90J89
2121E29j9o2k65k28k36j96l7O5Q6K35L87J53J75j50k03j20l10j51j71r0L29J88
2143i1L00K70L0R1j71l22k00k63j04k6JJ51L86K69J96O1j53k18l69o3p7j68M2
$$ y = [-410, -748, -587, -304, -171, 183, 430, 545, 601, 472, 64, -189, -491, -613, -456, -439, -136, 197, 463, 504, 487, 466, 188, -104, -263, -571, -511, -380, -254, -32, 216, 412, 600, 451, 206, 16, -356, -607, -648, -627, -346, -92, 140, 394, 443, 508, 312, 164, -150, -369, -571, -514, -454, -207, 128, 319, 533, 641, 394, 162, -34, -235, -556, -669, -329, -339, 122, 346, 399, 505, 597, 428, 178, -246, -616, -607, -523, -481, -102, 138, 364, 530, 512, 418, 203, -223, -447, -649, -673, -472, -315, -15, 220, 487, 630, 435, 300, -85, -389, -439, -690, -454, -279, -41, 256, 467, 368, 598, 313, 118, -164, -461, -552, -438, -413, -39, 249, 294, 536, 541, 413, 79, -126, -311, -521, -464, -493, -204, 50, 340, 529, 510, 448, 183, -45, -281, -477, -514, -449, -363, -128, 259, 412, 587, 437, 234, 114, -196, -347, -518, -608, -279, -91, 209, 479, 509, 600, 429, 107, -93, -356, -460, -486, -485, -334, 52, 321, 517, 578, 425, 207, -162, -225, -302, -470, -428]
2166d28J6K89L24J78J84j70j81k58k98j4j22l2J12L15J56K01J28M7m1l58j74k32
2188c58j84O0L0J47L40K23J96LN0k21l97r5k74j36K8L49J80K98J40J61n7j12l41
2211C0k80N9m33O6J95J28M27K30J04r7l2j92k08k76j52k3J25J69J48L06K33l3
2233D94j55j69k88k94j21L2l9K35J93L45J52O0%o3l81k02k79kMR7L50J49K80N
2257D03J71j88j03l20k26k89p7L40J05K09K03L32O9l25M4l61l81o4j2p0J80L61
2279AK26O8J66l0k68l39O1k49o6l4R6K63J91K90K9K1q3k00l91n3j99R1R9K28M6
2304c6K12L76kj23j70l50q1k05k45J44K83K70K09J19R3rj97l15j47j55k80J47
2326d62P5L67J55J45J97j5j16k74k05k05j71P7J42P9L64K6K52N6j06k08k79j66
$$ y = [-428, -412, -123, 201, 379, 563, 393, 212, -46, -344, -358, -480, -512, -400, -85, 71, 272, 400, 447, 406, 48, -126, -358, -542, -482, -452, -305, 35, 258, 454, 457, 507, 286, -111, -206, -480, -616, -588, -239, -59, 239, 379, 540, 483, 371, 30, -250, -191, -624, -558, -363, -235, 192, 422, 526, 429, 397, 205, -3, -279, -431, -454, -329, -160, -12, 294, 527, 494, 339, 170, -118, -412, -533, -501, -540, -305, -112, 233, 385, 445, 445, 382, 1, -201, -480, -482, -478, -381, -31, 118, 398, 403, 574, 386, 283, -37, -263, -552, -629, -289, -184, 25, 228, 560, 629, 304, 348, -13, -394, -458, -470, -540, -360, 1, 227, 295, 461, 431, 163, -176, -115, -364, -430, -464, -368, -105, 86, 376, 405, 426, 343, 143, -248, -301, -500, -409, -310, -82, -36, 176, 552, 550, 427, 257, -93, -174, -379, -624, -480, -197, 73, 282, 401, 494, 485, 288, -27, -174, -329, -609, -462, -387, -20, 135, 280, 477, 462, 346, 72, -133, -338, -509, -432, -290, -211, 153, 179, 431, 487, 381, 173, -106, -272]
2348b72o1j60J60J52J87K52K12J01j04k65j23l15o6k40J33J55K44J32L54p9R6
2369D93j42j37k86l76M6j24K16K04J76K74J29r3k4j80k24k09k10l7P2J74K87J00
2391A29L87M4r0j72k36k13k57p1k1K02K11K75K55J11r2j56j67m52l0r2P6O7K99
2414GJ08K26J70N6j51j58l27k90r4pJ50R3K23K60K69r9m6j62k45k90q3j26J5R4
2438d07L65J58J81Q7K3j12k69j69j77j27oP0Q4M68J15K15r8k4q7l01k94j19K2
2461d02P2J63L17P4J69J09n1k77j48k04k27j65J48M4K60L88L8J49q9M6m03m21
2483d10n2J82k94J61K83K27J96N9K06j81l49r8k04n9k34J34J89J68K08K57m7N0
2505C92j74k74j94k06m7J31Q8J29L82K13q2P3J5l06j90j49k22J3J35J97Q4J49
$$ y = [-272, -333, -493, -333, -181, 6, 258, 470, 571, 467, 202, 79, -236, -302, -542, -409, -254, -10, 122, 476, 397, 493, 351, 214, -72, -448, -402, -526, -310, -106, 70, 344, 473, 380, 356, 176, -48, -257, -467, -504, -432, -258, 29, 129, 516, 560, 470, 298, 62, -151, -408, -479, -500, -298, -87, 188, 443, 554, 462, 306, 139, -313, -343, -435, -359, -292, 7, 115, 341, 511, 567, 416, 258, -69, -359, -453, -460, -310, -217, 6, 266, 535, 436, 390, 228, -17, -307, -390, -516, -501, -407, -42, 116, 297, 384, 407, 295, 26, -143, -320, -447, -453, -383, -299, 169, 284, 499, 401, 377, 290, -11, -305, -424, -402, -330, -167, 150, 224, 393, 502, 451, 174, 26, -178, -405, -570, -422, -378, -118, 270, 308, 457, 368, 414, 11, -410, -462, -280, -574, -413, -130, 97, 293, 352, 558, 377, 28, -70, -274, -333, -567, -433, -244, -76, 132, 389, 342, 392, 218, -56, -250, -456, -503, -372, -284, -155, 227, 440, 358, 431, 446, 140, -50, -199, -421, -408, -273, -76, 8, 157]
2527A57K08J45k24j34l40r1j74m7N8K73L36N0K12POl62J0m63r4p2J13J44J94J37
2551D9L05R0j66j32j59l13l1j60J9J92K76K31J53J64j10l3k89k13j31p2k04J78
2573c56J53L40O2J08J07p3k68q5l49j54nJ21K82P3K73L16j15j0j54k25k86j59
2595d04j01N0M9L09K59N4J76Q2k07j80l14r3Qk06J49L06N8L96O7q7J01k40l69
2618a37j50o7p2n3K59J83L03Q4R0j04j07l33o8k33j30L2J99L30J29L45j17J1j90
2641B04j18l00k87j4N8K04J46J01K22J95K1l9j75k72l27j46M4N4K02K48K18L41
2663E80K4j46k18k16k13j60j58J02N1K98K77Q0J66j6j2l55k53j98n8k15J95L39
2685a06J86J10K23j8r6l48j76r8j44K0J18J37J05L84M5l4Km0k61k89k59J63L5
$$ y = [157, 365, 510, 286, 152, -188, -279, -453, -500, -442, -169, 167, 217, 429, 436, 442, 80, 90, -373, -467, -539, -426, -282, -88, 49, 354, 444, 278, 146, -13, -326, -357, -517, -498, -306, -30, 201, 354, 518, 408, 375, 86, -127, -258, -330, -534, -356, -203, 137, 199, 307, 414, 341, 73, -12, -361, -515, -520, -399, -117, -44, 229, 545, 430, 420, 266, 41, -245, -404, -505, -455, -406, -97, 162, 216, 392, 474, 267, 87, -227, -320, -312, -518, -369, -63, -5, 391, 458, 371, 472, 232, -137, -287, -354, -426, -479, -220, -37, 266, 350, 440, 336, 229, -104, -172, -405, -535, -503, -304, 26, 155, 500, 383, 394, 204, 86, -214, -501, -515, -457, -253, -107, -6, 216, 411, 432, 393, 218, -54, -381, -527, -483, -429, -227, 21, 239, 580, 604, 458, 240, 24, -189, -349, -507, -405, -354, -56, 221, 301, 467, 451, 439, 84, -169, -367, -425, -640, -445, -106, 80, 190, 413, 395, 299, -49, -225, -323, -467, -447, -329, -192, -87, 297, 342, 308, 310, 270, 9, -280, -539, -376, -341]
2708c41k3L49J50K89J05m9k48k75j13k31r5J09Q7J76L14J51Q5R0m6l38j26l72
2730c52r2JJ38M9J90L44J06L4j50m1l06k07l05J28M2J45K47K39K41o4R6k40k82
2753c9j71k32l7j1J3L53K86J35J46J37l03k70l25J4q9j23R4J96K18L75J28K4j45
2776C74j86j94j91r0j88J15O7L87R8J20K18n2k08k63l44l7j06r5J51J33L98M07
2798E14j08j95R2o8l69l22rjR8J69L41J34K19n1n0j65k31l19j1J1j58L78J35K76
2822C10R4j3pk46k18k99J46l05J23K24M0L01K35J24p7j26j84l36n5k97N1K31K03
2845h1K58jK63q3J1l32j52k02l21K32J10J61K06K04O2R8q7j92m4l10j00j97J26
2868c71J01K47K87j2K45j64K1k77l20j67n0R4J2K76K43K36l3Q5k3n29L9k26j46
$$ y = [-341, -364, -15, 135, 424, 529, 480, 232, -43, -156, -387, -482, -373, -286, -110, 204, 355, 440, 530, 484, 146, 20, -352, -444, -443, -305, -256, -66, 278, 384, 418, 268, 227, -79, -286, -591, -463, -421, -276, -29, 210, 451, 387, 483, 243, -39, -210, -442, -479, -490, -477, -124, 162, 297, 443, 580, 277, 7, -318, -304, -393, -516, -422, -226, -8, 367, 495, 519, 374, 188, -6, -197, -287, -475, -360, -293, 94, 192, 312, 530, 478, 270, 7, -337, -374, -480, -575, -424, -291, 107, 514, 406, 211, 303, 235, -134, -456, -465, -466, -368, -199, 142, 276, 495, 444, 394, 229, -2, -321, -332, -321, -479, -101, 34, 310, 404, 391, 384, 138, -80, -379, -233, -538, -415, -191, -151, 150, 385, 509, 432, 306, 122, -214, -269, -566, -515, -284, -81, 177, 176, 439, 356, 367, 35, -117, -319, -640, -408, -298, -137, 69, 273, 335, 433, 346, 154, 110, -200, -300, -497, -371, -270, -23, 264, 252, 497, 333, 354, 77, -243, -410, -460, -366, -354, -78, 165, 401, 368, 453, 430, -99, -60, -286, -432]
2891d32m9J28J82K64J83K00j3k36j28n7l07k01J44j43K10L01J29R5J83j41k11
2912A01n8k08j11j80J97k2J94K42J93K9Qn0l01k71p4j13m1J47K61L7J29L35j3
2935D31j00k23n9k70j56k7P6J63M9L98Q0L2m2j68k05l50p7rl6K19K40K05J88J01
2959D60j06r1j50k55k18k6k3J27J81K07J89N9L9p1m53M9l5l49K18M8P4J52K22
2982B48K37Lk45j97j49j39r1o1n4K68J71J36J51%J09k40j69j72j95K4m4J77J32
3005a00K51J1K65o1n2l23j12j07j42j39K59J27J01M03J4m0q9j62j77o8k48J4Q5
3028b90K98%K33R1n1lr9k08j09k28lJ2N0J73K64K27oo2q0j54k32q3q3L8O4N2K76
3055H7J63N6j17M9j75n5k08k40J00KJ98J80J54K08J0k50o7l8j77k67J11j15J48
$$ y = [-432, -481, -353, -171, 93, 276, 476, 463, 227, 99, 42, -265, -466, -322, -465, -255, 46, 175, 270, 453, 312, 101, 43, -165, -276, -456, -259, -281, -87, 155, 348, 377, 385, 335, 34, -237, -311, -424, -465, -318, -57, -20, 109, 444, 431, 331, 108, 49, -221, -377, -404, -328, -165, -116, 282, 362, 394, 352, 184, -21, -371, -448, -457, -493, -274, -34, 171, 359, 460, 354, 263, 113, -142, -360, -386, -409, -282, -101, 106, 295, 354, 393, 322, -131, -82, -117, -466, -248, -200, -126, 26, 248, 485, 488, 243, 46, -103, -242, -333, -394, -448, -180, -9, 127, 278, 278, 387, 147, -22, -194, -389, -365, -409, -232, -100, 151, 162, 427, 366, 314, -9, -121, -228, -370, -509, -250, -123, -22, 381, 395, 355, 266, 104, -73, -141, -389, -375, -290, 8, 8, 241, 332, 281, 278, 179, -29, -138, -366, -369, -357, -307, -134, 130, 357, 351, 289, 209, 55, -177, -260, -343, -305, -241, -189, 87, 250, 306, 189, 238, 63, 8, -200, -440, -340, -338, -140, 40, 194, 402, 412, 162, 95, 57, -120, -387, -276, -391, -243]
3078b43K90M8J08J68j84n3r7k93o0NmM8J78Q5K47J75l9j08j78k66j22j6j6NK47
3103g5J88Q0K6P5k7j35k57j82M9j09O9J21pM93mR1L0k54r7k33j53j30J76M0K71
3128D6J43QQ8On2j1l27j96j7k6%K47K52J9J18K47l38o3j53k30o5q1j1K02J37J55
3154I8M5K33o8j48J7m31n9k2J0J04J63K36J30P1q7r9j29j81j47j36P1J15J39J46
3178G1K02M3J01o1m09N7k41j32N2J68p0K62J22P9J40o1n6k50j37k27m0j7K64M3
3202i7K28J83P9j68n6j69j60k10L2mK09J5J50K23P3j9j44r4j49k35n8O7J13N4
3226a37J55K36R2n0n6q0j02j92j94j04K28O7J60J17J86p8Kj86r4j17j24M1j54
3249c84K19J46R7J41J46l7m0k89j3j73j06M7n4J33J70K42R6J30k43j93r6j42n7
$$ y = [-243, 47, 95, 203, 371, 187, 134, 37, -256, -316, -311, -315, -267, -89, -4, 243, 418, 379, 271, 93, -173, -295, -311, -327, -322, -75, 113, 193, 219, 294, 267, 132, -125, -307, -258, -367, -298, -177, -184, 309, 305, 396, 426, 172, 75, -158, -311, -441, -265, -225, 46, 189, 197, 285, 291, 239, 228, -99, -295, -312, -338, -338, -91, 161, 180, 298, 545, 207, 144, -9, -239, -304, -385, -396, -194, -57, 98, 143, 376, 308, 160, 177, -254, -313, -335, -325, -221, -58, 178, 308, 379, 292, 193, 64, -117, -264, -400, -329, -214, -75, 71, 273, 316, 417, 356, -53, 4, -237, -369, -317, -149, -219, 43, 165, 244, 384, 323, 267, 17, -120, -347, -387, -404, -140, -97, 131, 314, 393, 225, 169, 0, -160, -370, -338, -342, -133, -118, 32, 255, 328, 309, 165, 71, -78, -313, -371, -304, -191, -137, 18, 254, 346, 296, 240, 160, 58, -134, -328, -432, -204, -137, 23, 140, 326, 248, 250, 64, -30, -147, -271, -230, -384, -165, -19, 78, 219, 365, 328, 288, -1, -14, -187, -293, -246, -300, -167, 3, 245, 341, 471, 228, 35, -61, -203, -260]
3272b60j3m6J48J24Q2K05J71j46j78j62K6j14k75K73m5J79J16K26j3l6N4l16q3
3295h3j56K1n1J55LQ0K06M9j22R5j90j28p8j71O1K7J51J84Q3J88j08J01k52j42
3319g7k12J4o8Q3Q0K24J53P2K9Rj37j66q7j79qQ6Q5M7J06J21O1P8j22k65P0j84
3345a87p5n4J98o4J06K69LK3l5p5k21k19O1K7j7J87n3J21L29rj57k5j60k1k00
3370b48r0J28L0K78QJ28Q0q5O9k62j80o8j07J9J81J46J9K59j67K49j28m3k28j69
3394a81n7o8L7J17J56J60N3J40r4l4j86j78j98Q0l0J34O0J21J8P9Q2q8r4k12N7
3419a26k28Q8m2K36J79P0l6J42n5k29Nk30nL6L3J12l6K57K1N6j5j09j65q6j60
3444b87o8M8J88Q6J05J4J60j61J54k17j44j02p0k4J49L4K03K3N5K16k74J5j72
$$ y = [-260, -273, -319, -171, -47, 35, 240, 411, 265, 87, -75, -49, -163, -438, -165, -210, -31, 85, 311, 298, 262, 316, 0, -83, -239, -218, -269, -114, -111, -31, 175, 224, 102, 197, 7, -121, -199, -370, -309, -282, -131, 53, 136, 324, 216, 317, 65, -77, -289, -275, -343, -260, -180, 44, 197, 269, 298, 307, 170, 4, -83, -262, -270, -184, -99, -52, 54, 175, 236, 314, 192, -73, -3, -187, -262, -316, -118, -182, -76, 193, 196, 219, 184, 109, -112, -331, -270, -243, -260, -73, -126, -5, 324, 315, 158, 133, -27, -48, -248, -338, -210, -180, 98, 106, 234, 314, 229, 298, 36, -144, -212, -319, -300, -119, 27, 46, 305, 138, 387, 259, 216, -12, -181, -238, -306, -269, -152, 4, 164, 217, 357, 263, 229, 43, -135, -333, -253, -283, -149, -89, 32, 50, 129, 211, 123, 29, -183, -126, -354, -266, -308, -72, 107, 177, 141, 283, 228, -1, 4, -226, -231, -195, -162, -50, -86, 171, 192, 248, 233, 124, -41, -127, -287, -355, -307, -119, -33, 72, 86, 246, 85, 239, 22, -122, -224, -294, -318, -169, -135, 68, 91, 146, 362, 88, 103, -69]
3467f9o1l9o7n6P7L05m5J34K6j01j6j25l4j55p1R9J51OJ34J18L5n2l2r9k08j32
3493b77Q2l8P8J83n4J12J59op3j56K9k55Qj18L9J50K27L8J4J1J01j53r6q6k16
3518b97J42p3QK74J20P9j16R4k02j4j48j68P3OJ15M9J19kJ50m8j02M3j20j73q
3543a99j41J53N6P6J51Q1R1r6j67j04l3j48l4J81J0L8J06lJ15Jk8r7j07p8K4K5
3569a27l0J81j18J89J06P1j76o9j37j12j09K65j30J17M9J50J0J59k02p2l1j29
3591a45k6N6k8N8O3K19L1L1q5j02m5k28nl7Q0N4M2J14J72j69N2M1j74q6m8J1J1
3618a43Q2q4J85L5K08q8j73J3j14n8j25L2P4M6J38J17J05p4m0p8j1j26k36K39
$$ y = [-69, -130, -169, -236, -292, -215, 90, 45, 179, 205, 104, 88, -37, -71, -226, -297, -198, -47, -41, 93, 211, 246, 194, 162, 63, -145, -277, -195, -233, -155, 28, -26, 86, 245, 239, 166, 10, 39, -216, -208, -326, -287, -137, 90, 128, 142, 153, 254, 101, 5, -81, -297, -155, -228, -220, 54, 174, 253, 137, 231, 29, 15, -133, -301, -228, -222, -107, -58, 61, 59, 209, 161, 59, 102, -18, -191, -199, -340, -187, -131, -55, 96, 177, 268, 172, 5, -99, -132, -280, -314, -133, -123, -85, 21, 18, 133, 134, 106, 9, -98, -176, -152, -127, -157, 24, -94, 95, 201, 272, 96, 27, -110, -222, -331, -66, -196, -79, -30, 120, 130, 289, 87, 15, -16, -145, -171, -115, -143, -85, -22, 197, 228, 259, 174, 72, 27, -201, -206, -243, -163, -109, -67, 47, 219, 50, 102, 143, -31, -117, -165, -154, -143, -61, -145, 40, 75, 283, 195, 22, 35, -79, -137, -262, -230, -156, -110, 28, 145, 250, 176, 136, 58, 47, -79, -315, -76]
$$ [...]
8191a1
##END NTUPLES=NMR FID
##END=
