##TITLE=1H ikalashn
DE-76k2_TFA2
19.12.2024
##JCAMPDX= 6.0         $$ Bruker NMR JCAMP-DX V2.0
##DATA TYPE= NMR FID
##DATA CLASS= NTUPLES
##ORIGIN= UXNMR, Bruker Analytische Messtechnik GmbH
##OWNER= root
$$ TOPSPIN		Version 1.3
$$ 2024-12-19 14:57:35.421 +0400  Irina@DPX200
$$ Compression mode = diff/dup
##.OBSERVE FREQUENCY= 200.131300845
##.OBSERVE NUCLEUS= ^1H
##.DELAY= (6, 6)
##.ACQUISITION MODE= SIMULTANEOUS
##.ACQUISITION SCHEME= undefined
##.AVERAGES= 48
##.DIGITISER RES= 18
##SPECTROMETER/DATA SYSTEM= spect
##.PULSE SEQUENCE= zg
##.SOLVENT NAME= CDCl3
##.SHIFT REFERENCE= INTERNAL, CDCl3, 1, 17.49637
##AUDIT TRAIL= $$ (NUMBER, WHEN, WHO, WHERE, WHAT)
$$ ##TITLE= Audit trail, TOPSPIN		Version 1.3
$$ ##JCAMPDX= 5.01
$$ ##ORIGIN= Bruker BioSpin GmbH
$$ ##OWNER= Irina
$$ $$ F:/spectra/data/iren/nmr/1H/4/audita.txt
$$ ##AUDIT TRAIL=  $$ (NUMBER, WHEN, WHO, WHERE, VERSION, WHAT)
(   1,<2024-12-19 14:57:17.546 +0400>,<Irina>,<DPX200>,<TOPSPIN 1.3>,
      <created by zg
	started at 2024-12-19 14:54:04.609 +0400,
	POWCHK disabled, PULCHK disabled
       terminated by command 'halt'
       configuration hash MD5:
       BE 6D 3F 07 2A EA 11 49 91 17 2B D3 AF B3 58 0D
       data hash MD5: 16K
       DF 0D EE 57 EB 27 51 8F D3 76 69 07 7F B5 46 C6>)
$$ ##END=
$$ 
$$ $$ hash MD5
$$ $$ CD 7A 76 B9 30 9F 69 BB A2 AA B6 B7 FE F1 E4 55
##$RELAX= 
##$RELAX= 
##$RELAX= 
##$RELAX= 
##$RELAX= 
##$RELAX= 
##$RELAX= 
##$RELAX= 
##$RELAX= 
$$ Bruker specific parameters
$$ --------------------------
##$DU= <F:/spectra>
##$EXPNO= 4
##$NAME= <1H>
##$PROCNO= 1
##$TYPE= <nmr>
##$USER= <iren>
##$AMP= (0..31)
100 100 100 100 100 100 100 100 100 100 100 100 100 100 100 100 100 100 
100 100 100 100 100 100 100 100 100 100 100 100 100 100 
##$ANAVPT= -1
##$AQSEQ= 0
##$AQ_mod= 1
##$AUNM= <au_zg>
##$AUTOPOS= <>
##$BF1= 200.13
##$BF2= 200.13
##$BF3= 200.13
##$BF4= 200.13
##$BF5= 200.13
##$BF6= 200.13
##$BF7= 200.13
##$BF8= 200.13
##$BYTORDA= 1
##$CFDGTYP= 0
##$CFRGTYP= 5
##$CHEMSTR= <none>
##$CNST= (0..63)
1 1 145 1 1 1 1 1 1 1 1 1 1 1 1 1 1 1 1 1 1 1 1 1 1 1 1 1 1 1 1 1 1 1 
1 1 1 1 1 1 1 1 1 1 1 1 1 1 1 1 1 1 1 1 1 1 1 1 1 1 1 1 1 1 
##$CPDPRG= <>
##$CPDPRG1= <>
##$CPDPRG2= <>
##$CPDPRG3= <>
##$CPDPRG4= <mlev>
##$CPDPRG5= <mlev>
##$CPDPRG6= <mlev>
##$CPDPRG7= <mlev>
##$CPDPRG8= <mlev>
##$CPDPRGB= <>
##$CPDPRGT= <>
##$D= (0..63)
0 2 0 0 0 0 0 0 0 0.06 0 0.03 0 0 0 0 0.0002 0 0 0 0 0 0 0 0 0 0 0 0 0 
0 0 0 0 0 0 0 0 0 0 0 0 0 0 0 0 0 0 0 0 0 0 0 0 0 0 0 0 0 0 0 0 0 0 
##$DATE= 1734605834
##$DBL= (0..7)
120 120 120 120 120 120 120 120 
##$DBP= (0..7)
150 150 150 150 150 150 150 150 
##$DBP07= 0
##$DBPNAM0= <>
##$DBPNAM1= <>
##$DBPNAM2= <>
##$DBPNAM3= <>
##$DBPNAM4= <>
##$DBPNAM5= <>
##$DBPNAM6= <>
##$DBPNAM7= <>
##$DBPOAL= (0..7)
0.5 0.5 0.5 0.5 0.5 0.5 0.5 0.5 
##$DBPOFFS= (0..7)
0 0 0 0 0 0 0 0 
##$DE= 6
##$DECBNUC= <off>
##$DECIM= 32
##$DECNUC= <off>
##$DECSTAT= 4
##$DIGMOD= 1
##$DIGTYP= 9
##$DL= (0..7)
0 120 120 120 120 120 120 120 
##$DP= (0..7)
$$ [...]
##$SW= 21.9926040160658
##$SWIBOX= (0..15)
0 0 2 0 0 0 0 0 0 0 0 0 0 0 0 0 
##$SW_h= 4401.40845070422
##$TD= 16384
##$TD0= 1
##$TE= 300
##$TE2= 300
##$TE3= 300
##$TEG= 300
##$TL= (0..7)
0 120 120 120 120 120 120 120 
##$TP= (0..7)
150 150 150 150 150 150 150 150 
##$TP07= 0
##$TPNAME0= <>
##$TPNAME1= <>
##$TPNAME2= <>
##$TPNAME3= <>
##$TPNAME4= <>
##$TPNAME5= <>
##$TPNAME6= <>
##$TPNAME7= <>
##$TPOAL= (0..7)
0.5 0.5 0.5 0.5 0.5 0.5 0.5 0.5 
##$TPOFFS= (0..7)
0 0 0 0 0 0 0 0 
##$TUNHIN= 0
##$TUNHOUT= 0
##$TUNXOUT= 0
##$USERA1= <user>
##$USERA2= <user>
##$USERA3= <user>
##$USERA4= <user>
##$USERA5= <user>
##$V9= 5
##$VALIST= <valist>
##$VCLIST= <CCCCCCCCCCCCCCC>
##$VD= 0
##$VDLIST= <DDDDDDDDDDDDDDD>
##$VPLIST= <PPPPPPPPPPPPPPP>
##$VTLIST= <TTTTTTTTTTTTTTT>
##$WBST= 1024
##$WBSW= 25
##$XGAIN= (0..3)
0 0 0 0 
##$XL= 0
##$YL= 0
##$YMAX_a= 632123
##$YMIN_a= -694755
##$ZGOPTNS= <>
##$ZL1= 120
##$ZL2= 120
##$ZL3= 120
##$ZL4= 120
##$ABSF1= 10
##$ABSF2= 0
##$ABSG= 5
##$ABSL= 3
##$ALPHA= 0
##$AQORDER= 0
##$ASSFAC= 0
##$ASSFACI= 0
##$ASSFACX= 0
##$ASSWID= 0
##$AUNMP= <proc_1d>
##$AXLEFT= 0
##$AXRIGHT= 0
##$AXTYPE= 0
##$AXUNIT= <>
##$AZFE= 0.1
##$AZFW= 0.1
##$BCFW= 1
##$BC_mod= 2
##$BYTORDP= 1
##$COROFFS= 0
##$CY= 7568.61572265625
##$DATMOD= 1
##$DC= 2
##$DFILT= <>
##$DTYPP= 0
##$F1P= 17.9538593292236
##$F2P= -4.03888763876832
##$FCOR= 0.5
##$FTSIZE= 32768
##$FT_mod= 4
##$GAMMA= 1
##$GB= 1
##$INTBC= 1
##$INTSCL= 1
##$ISEN= 128
##$LB= 0.05
##$LEV0= 0
##$LPBIN= 0
##$MAXI= 945.577
##$MC2= 0
##$MEAN= 0
##$ME_mod= 0
##$MI= -402.1523
##$NCOEF= 0
##$NC_proc= 0
##$NLEV= 6
##$NOISF1= 8.587773
##$NOISF2= 6.764455
##$NSP= 1
##$NTH_PI= 0
##$NZP= 0
##$OFFSET= 17.49637
##$PC= 1
##$PHC0= 90.40456
##$PHC1= 24.82712
##$PH_mod= 0
##$PKNL= yes
##$PPARMOD= 0
##$PPDIAG= 0
##$PPIPTYP= 0
##$PPMPNUM= 100
##$PPRESOL= 1
##$PSCAL= 0
##$PSIGN= 0
##$REVERSE= no
##$SF= 200.13
##$SI= 32768
##$SIGF1= 18.5376
##$SIGF2= -6.396296
##$SINO= 400
##$SIOLD= 32768
##$SREGLST= <1H.CDCl3>
##$SSB= 3
##$STSI= 0
##$STSR= 0
##$SW_p= 4401.40845070422
##$SYMM= 0
##$S_DEV= 0
##$TDeff= 0
##$TDoff= 0
##$TI= <>
##$TILT= no
##$TM1= 0
##$TM2= 0
##$TOPLEV= 0
##$USERP1= <user>
##$USERP2= <user>
##$USERP3= <user>
##$USERP4= <user>
##$USERP5= <user>
##$WDW= 1
##$XDIM= 8192
##$YMAX_p= 0
##$YMIN_p= 0
$$ End of Bruker specific parameters
$$ ---------------------------------
##NTUPLES= NMR FID
##VAR_NAME=  TIME,          FID/REAL,        FID/IMAG
##SYMBOL=    X,             R,               I
##VAR_TYPE=  INDEPENDENT,   DEPENDENT,       DEPENDENT
##VAR_FORM=  AFFN,          ASDF,            ASDF
##VAR_DIM=   8192,          8192,            8192
##UNITS=     SECONDS,       ARBITRARY UNITS, ARBITRARY UNITS
##FACTOR=    0.0002272,     1,               1
##FIRST=     0,             0,               0
##LAST=      1.8609952,     -14,             -191
##MIN=       0,             -694755,         -694755
##MAX=       1.8609952,     632123,          632123
$$ Real data points
##PAGE= N=1
##DATA TABLE= (X++(R..R)), XYDATA
$$ [...]
2282C09l22O4K19k46K35l09L81m33M5N54k71R2m51L08K67q12k60M41K28l9j56
2303a56L6M49j51k57lr3J50q9L91R6k03J77n0k15q5n7M75k55m07J54K3q5p2J79
2327d8j15J45K94l97j50N11l19m0NK43KK4P6j50K06k02j57L8K62k76K5j32J49
2350fq2J21k42J37k44L00j21L1l81M18j6m54L90M91n90N60p01J076p56k42M51
2371A40L88p42J46O26k86N0k80n94Q75k74j42j36j9M17o76Q37n38J82O2O8j5k63
2393a74N21k56l40M05J32Q1j58j76P9N0m58M80J84n89K33n1L9n06Q8N23j11k35
2415b39L27q7K32l99j91O06j282J663k14l17N8m0l6J4r7m0K6j62l6k1J84n77M54
2438a74j7K43j61n2j37L82n23O00j32K49k27m88O54k17M28K83o34l87N52l67J
$$ plain form
2282 309 -13 51 270 24 259 -50 331 -102 -57 497 226 318 -133 175 442 -370 -630 -189 39 0 -156
2303 -156 -120 329 178 -79 -82 -175 -25 -114 277 373 170 347 297 82 -3 -60 415 160 -247 -93 -70 -155 -227 -48
2327 -48 -163 -18 276 -121 -271 240 -79 -119 -114 129 131 155 231 81 287 85 -72 -34 228 -48 -23 -155 -6
2350 -6 -88 33 -209 -72 -316 -16 -137 -106 -487 -69 -85 -539 -149 342 -248 312 -389 687 -69 -311 140
2371 140 528 -214 -68 558 272 322 42 -552 323 49 -93 -229 -248 169 -507 330 -208 -26 36 104 89 -174
2393 -174 347 91 -249 156 288 369 211 35 114 164 -294 186 370 -219 14 -37 2 -504 -416 107 -4 -239
2415 -239 88 1 233 -166 -357 249 -1033 630 416 99 157 117 81 95 -2 -42 -16 -178 -214 -235 -51 -628 -174
2438 -174 -191 52 -109 -161 -298 84 -439 161 29 278 51 -437 217 0 428 711 77 -310 242 -125 -124
2459a24J66l28M23n13L66l06M27o59j24J52L04L15j307J250K0O78m88l48Q7L09
2479C00J60m31K06m89K47M39k14J50r51M25P32p28R38j314J180k1o79n29j27K025
2499A319j102m46R81q99N94n70L63m09K24l6k56L64m08K54K20q9k42J2P9k57k1
2520c25M50j71J08o97l0N21L09J90k91m71K22o28J260L8q47M58O86l92q27R46
2540E09r03Q2Q4K45l13K97j90L19o94M41l32J83q0M25k30K53J03j09P4q5kk6J40
2563A91L0k64L01k38j25J1MQ4n4k01J17K7l4P6J64m5k43K3L39P7k94J60j92J31
2587D5K56j31k41J79K9j30l0J21m53M43m1J21j65k48J31L0K66q3k46R3J04j67
2609a17K25K0j62J16m29Q93L1p57P68k72k02J6J7q42j3J277q87K89k17K67j97
$$ plain form
2459 -124 42 -286 137 -376 -10 -316 111 -548 -672 -520 -216 99 -1208 42 62 740 252 -96 -9 300
2479 300 460 29 235 -254 -7 432 218 368 -583 -158 574 -154 784 -530 650 629 -50 -579 -706 1319
2499 1319 217 -229 752 -147 447 -123 240 -169 55 19 -237 127 -281 -27 193 104 -138 -126 -47 -304 -325
2520 -325 125 -46 62 -635 -665 -144 165 355 64 -407 -185 -813 447 485 -362 96 782 390 -437 509
2540 509 -394 -312 -228 17 -296 1 -189 130 -564 -123 -455 -272 -352 73 -157 96 199 90 164 79 77 51 191
2563 191 221 -43 258 20 -105 -94 -90 -6 -60 -261 -144 -117 -151 -75 89 44 -199 -176 163 240 -54 106 -86 45
2587 45 301 170 -71 108 137 7 -23 98 -355 88 47 168 3 -245 -114 -84 182 99 -147 -54 50 -117
2609 -117 108 128 -34 82 -347 546 577 -180 588 316 114 130 147 -695 -708 569 -318 -29 -246 21 -176
2630a76%N4J43L7k19J75j60L18m3N4J93k12k41O16k69J8r0l10N12j12p8l79J01
2653f8K55Q2n63M14m24L93l76K14k5J18k02J48M5m8J80J92p38N15k06J06K9Q4
2675A25k31M11j96J87l23J35k04K08n94Q56j197M31M53m78Q8j30J053m35J36m77
2695a82K20r9K80m23K06J29P3o65M83J62q9J0m17L74p5j19O2n25M43R2m72P92
2717B60m41M56P9j38k70L50k61j58k7L73j6K99p35K34m5R7J29j54m98M40N2j57
2739a31l22M12p18J65O61k21k5N48J24n52M63m92R76m85j621J682n9k26q79J165
2759D65k42o19L82k6J75k70j07M14k52J97k39k07O1L17kk10J98k50Q58j34o41
2780a32j73N49j11J3K47m27K03k56k75N07j12O4l1q75O40O1N14j265O34o8L42
$$ plain form
2630 -176 -176 -122 21 58 -161 14 -146 172 129 183 376 164 -77 539 270 288 198 -112 400 288 210 -169 -68
2653 -68 187 269 -294 120 -304 89 -287 -73 -98 20 -182 -34 11 -37 143 335 -403 112 -94 12 41 125
2675 125 -106 305 109 296 -27 108 -96 112 -482 374 -823 -392 61 -417 -329 -459 594 159 295 -182
2695 -182 38 -61 219 -204 2 131 204 -461 22 184 95 105 -312 62 -13 -132 -70 -595 -152 -60 -532 260
2717 260 -181 275 354 216 -54 296 35 -123 -150 223 207 506 -229 5 -40 57 186 32 -466 -26 26 -131
2739 -131 -453 -41 -759 -594 67 -154 -179 369 493 -59 404 -88 888 403 -1218 464 405 179 -700 465
2759 465 223 -396 -14 -40 135 -135 -242 172 -80 117 -122 -329 -268 49 47 -163 35 -215 643 509 -132
2780 -132 -305 244 133 146 393 -34 169 -87 -362 145 33 97 66 -809 -169 -108 406 -859 -225 -293 49
2801D9K67m71L96r7J11k03J89k92L47p8j19J59k57M5k45j19j8P6K60J49m41L68
2823G6k83L19m72N50l17m7N74l69J0J60k13N49o29N7j41P6L18m45L06k19J90k81
2845b31R9L55n11K6nJ15r2K27K65k72p3N6J20O59q01O09p50m54P64K12K32o30
2867h0L36m27J07N9O20R1o54m53K61R43j835J633m68K65p68l50Q10p31O11L39
2887C09l13M70m91J93l10J84K58L83p75M12j49m75Q6n86J088j66m24L92l71J96
2907h9j07K95P2j80R4j07k95M12R0J3J49m64M39l49j14L89k35N1l78L09p8J62
2929G9k39J35j71K16j05L2J0j60J03j35M19r2k38k5K20p5L00J07j72k74L63l19
2951b1K22L28q96J97J25r3O24l95j49J10L33l00m13L77Q8j18k73K90l7N4o1M13
$$ plain form
2801 49 316 -155 241 144 255 52 241 -51 296 218 99 258 1 46 -199 -318 -336 -260 0 149 -292 76
2823 76 -207 112 -360 190 -127 -174 400 31 41 201 -12 537 -92 -35 -176 -100 218 -227 79 -140 50 -231
2845 -231 -132 223 -288 -262 -267 -152 -244 -17 248 -24 -97 -41 79 738 -63 546 -204 -658 106 318 550 -80
2867 -80 256 -171 -64 -5 615 706 52 -401 -140 803 -1032 601 133 398 -370 -720 90 -641 -30 309
2887 309 -4 466 -25 168 -142 42 300 683 -92 320 171 -304 -218 -804 284 118 -306 86 -285 -89
2907 -89 -196 99 171 -9 85 -22 -317 95 185 198 347 -117 322 -27 -141 248 13 64 -314 -5 -83 79
2929 79 -160 -25 -196 20 -85 -53 -43 -203 -100 -235 184 92 -146 -171 49 -26 274 381 209 -65 298 -21
2951 -21 201 529 -367 -170 -45 -138 486 91 -58 52 385 85 -328 49 137 19 -254 36 -1 53 -8 405
2973D05n77L12J61L24r35N44Ln05P46l48j0Q8L8m25k98Q5M39n74J44M13R0K31
2995C51Np08L89q57J335k89j23K30p12k3L17M83k94p9N49q06m82N12m95J073j204
3016h28R49M41n93l44L59l63J027m25L38N4k22k07l39q7N95q50N36R73o04m06
3036Dk11J42L3R26o50p74J84P0j32m18k11J322N53p81L60k16l43j37J99J13J96
3057B29K14n41J78j56j34M0j02M50m62K02K8K46j43j28m6q6J26L8N7L99l28k83
3079b02J32k9K23l62n5O23j94k81l32N10J92m45K27j43N26j55l01j08P36r78J8
3100c98J92L61P0L5p47J12L52J87n63O55l12l97K70n60L48O07M8k46q71R83k69
3121a43o21K49O91p68N69M40j37r97P64j5j4j58j18O51o31Qk5O57r00N72N6O85
$$ plain form
2973 405 -172 140 301 625 -310 234 237 -268 478 130 120 208 246 -179 -477 -392 47 -527 -383 30 120 351
2995 351 356 -352 37 -820 515 226 103 333 -379 -402 -85 398 104 25 574 -232 -714 -202 -697 376 -828
3016 -828 121 562 -31 -375 -16 -379 648 223 561 615 393 186 -153 -240 355 -495 41 1014 410 4
3036 4 -207 -65 -32 894 244 -530 -346 -276 -408 -826 -1037 285 838 57 417 201 -142 -279 -80 33 229
3057 229 443 -98 80 -76 -210 -170 -272 178 -284 -82 -54 192 49 -79 -125 -211 -85 -47 10 409 81 -202
3079 -202 -70 -99 124 -238 -293 330 136 -145 -477 33 225 -220 7 -136 390 235 -66 -174 562 -416 -398
3100 -398 -206 155 225 260 -487 -375 -23 164 -399 256 -56 -453 -183 -743 -395 212 260 14 -857 126 -143
3121 -143 -764 -515 176 -592 -23 417 280 -717 47 32 18 -140 -258 393 -238 -230 -255 402 -498 74 130 815
3143H15o18j9m48K59n10O50j22J00j69O1q1K30l17K99r5P5k29k4K40J80j96K1
3165A02k00P5J27j83l03J68R9r9K54l03O13j246P50P6o4R19j078J62m39P81j17
3186I4K34J27l07p1k44K97k4J66o9n12N21k41P9jo9n8L24k22j41r2L30j78l8M0
3210e5j72J46M21k37l72K83l22K73J85q9R8j10o7J0J9n8J01q9J14k10J77m32M39
3233E3J4r2j46R5MJ18J33k44o3L38p6j69R2j03l4L08k47m8K5m24K95R1R9J20j99
3258f0J02k77Q9O9j3r6jL66k57J56r5J96k91J60J14Qj8j79M1M4k57L34k79J42
3282bJ10N8k16r4J10j28J09J7n21j27R04l98K55J99k57RN2k43L76p3J36m80N84
3305C80n4j65l95J99K70n49R6L13O5k8J71M4j90k99J74J18j43j17L64l88O1M52
$$ plain form
3143 815 197 178 -270 -11 -521 129 7 107 -62 -1 -82 148 -169 130 35 110 -119 -143 97 277 81 102
3165 102 -98 -23 104 -79 -382 -214 -115 -214 40 -263 350 -896 -146 -70 -134 785 -293 -131 -570 211 94
3186 94 328 455 148 77 -167 130 106 272 203 -309 212 -29 50 49 -20 -78 246 24 -117 -209 121 -57 -95 -55
3210 -55 -227 -81 340 103 -269 14 -308 -35 150 61 159 49 -18 -8 11 -47 54 -35 79 -131 46 -386 53
3233 53 67 -25 -171 -76 -72 46 179 -65 -128 210 134 -35 57 -46 -80 228 -19 -67 -42 -466 -171 -80 19 139 -60
3258 -60 42 -235 -146 -77 -90 -186 -187 179 -78 78 -17 179 -112 48 162 170 152 -27 14 58 -199 135 -144 -2
3282 -2 108 166 -50 -144 -34 -162 -53 -36 -557 -684 220 -178 77 276 19 28 80 -163 213 140 276 -204 380
3305 380 326 161 -234 -35 235 -314 -218 95 160 132 303 347 157 -142 32 150 7 -110 254 -134 -73 379
3327C79m07m9k49M51k66p6j65k83M77J38K75k38k14O23j222P80N38o32L32o68
3347d76P95o15M87l49J48M52l10k65L03j62P8J68j07K36k11j17j35n06P28r3l0
3368A9O0j30k16j67L92k81K78R1l11L80j33k35L95o1J34O9l00nL45l24q0L28m6
3391B02J69j34j24O9j79l92K79K46m57L47J03k40J13oj06J20m7R0J07k49L54p7
3413A88N0q7n42J06P04K43k10K5o47N06K14l99l42j64M68l96N53n54l58O44k6
3434b4L36m4o4r2rk96L61N9J42n55J45k85J67l64J13N08j58J9k43O66n16J03k14
3457b45K13K0J0K05l16P70j81m90L94N32q60j47K01K88k01K70k73q16M62J89r0
3478f5K47pm65M53m44K28j84m79R40o75Q82r3n20j36K63m89J118n62K14P03j000
$$ plain form
3327 379 -28 -77 -326 125 -141 -217 -382 -665 -188 -50 225 -13 -227 396 -826 -46 492 -140 192 -476
3347 -476 319 -296 191 -158 -10 442 132 -133 170 8 86 254 147 383 172 55 -80 -586 142 49 19
3368 19 79 -51 -267 -434 -42 -323 -45 46 -265 115 -18 -253 142 81 215 284 -16 -21 324 0 -80 248 202
3391 202 371 237 113 182 3 -389 -110 136 -321 26 129 -111 2 -4 -110 10 -37 53 160 -89 265 188
3413 188 238 151 -391 -285 419 662 452 477 -170 336 550 151 -191 -355 113 -283 270 -284 -642 2 -24
3434 -24 312 268 204 112 103 -193 168 227 369 -186 -41 -326 -159 -523 -410 98 -60 -41 -284 382 -134 -31 -245
3457 -245 -32 -12 -2 203 -113 657 476 -14 380 912 52 -95 106 394 193 463 190 -626 -164 25 -65
3478 -65 182 175 -290 163 -281 -53 -237 -716 224 -451 431 338 -182 -318 -55 -544 574 12 226 929 -71
3499g1N52n4j79n24p6L94M87o39K99o18j60K46K11P7k85M48k95J45K1R2Kj31J29
3522G1k02O4O5N9n9p8J1J97j51L2k3p7K44l06K28Q0j88Qj32J52j0k9n1K82l92
3547b05j96P11j78P3j80O3k45P08j40k85K37o18K51J94J08k90p5j93L81m37M00
3568H4L63J64j197R31p98L7K28n47Q70M52j11L00J70j125K76k12M59O0m88k20
3588c04P82j074J91R0K74m2k5j34K79k30J51L66k46O7P6k87P7m29O77k98K90r9
3610A52K48k56m5r78M10J048p12M76j70m83L92Q5n10p4K89O5k32P11k66O6j22
3631I4j52K12J48K4r2l49p6L2K76q5K24l23K54l08jP9k21K65J26j00j17J67m2
3654C5j69K4R2m4M5K16j60P0j12K37j10j22j29L15l24L47k09p1K58o0k5j8j54
$$ plain form
3499 -71 481 427 248 -276 -352 42 529 -110 189 -429 -589 -343 -132 -55 -340 108 -187 -42 -21 71 73 -58 71
3522 71 -131 -67 -2 57 -2 -80 -69 128 -23 9 -14 -91 153 -153 75 155 -33 -25 -157 -5 -15 -44 -95 187 -205
3547 -205 -401 310 132 205 25 88 -157 551 411 126 363 -255 -4 190 298 8 -67 -260 121 -316 84
3568 84 447 611 -586 345 -453 -416 -188 -735 135 587 476 776 946 -179 97 -115 344 404 -84 -304
3588 -304 478 -596 -405 -315 -41 -83 -108 -242 37 -193 -42 324 78 145 221 -66 11 -418 259 -39 251 152
3610 152 400 144 99 -879 -469 579 -133 343 173 -310 82 167 -343 -417 -128 -63 -295 416 150 216 94
3631 94 -58 154 302 326 234 -115 -191 -159 117 32 256 -67 187 -121 -122 -43 -264 1 127 27 -90 77 35
3654 35 -134 -110 -18 -62 -17 199 39 109 -3 234 124 2 -127 188 -136 211 2 -69 189 129 104 86 -68
3677f8J80o2J60n7j08o3rLq7P7J53j30j5O2K96j73J41m91L08j38K6j28K02j45
3701f6k31M5K01P0j58P8J20k58J91M6p8QJ18J62j73k24L68k61j77m2K98K80l70
3724e3K47j60l2J92k24Q2j29K17m01L63r7N13l37L63p41P85n98L82l32j40R17
3745H17j108P31m32m3l04L19J23o1r6m6N5q6m5K33L25n29K9j18J9L04l54J20M15
3768B68J64q57j76R90k58j6j66K27j58N14l84j28n33K66L64o23l4L80N86l19k9
3789G8k34j17J72j73K00J30pj14J35k6K08K15n44N64n30P1L14q14N96L5j31k1
3811Gl97N81n13K52L96j35k82L51q9k9k29j83K13j89N48m52P7L28K29r15J50L68
3833H7R6K2Kl1n94P25l64K80k90L37k64l7P6l51N65m61mk08L10j53J06k82K98
$$ plain form
3677 -68 112 50 210 153 45 -18 -27 -24 -111 -34 119 -11 -26 36 332 159 300 -191 117 -21 5 -123 79 -66
3701 -66 -297 -252 -51 19 -139 -61 59 -199 -8 38 -40 -32 86 248 75 -149 219 -42 -219 -261 37 317 -53
3724 -53 194 34 2 194 -30 52 -77 140 -261 102 5 518 181 544 -197 588 -10 372 40 -100 817
3745 817 -291 440 8 -35 -339 -20 103 42 -54 -100 -45 -131 -176 57 382 -147 -118 -236 -217 87 -267 -147 268
3768 268 432 -425 -601 389 131 115 -51 176 18 532 148 20 -513 -247 117 -506 -540 -160 426 107 78
3789 78 -156 -273 -101 -274 -74 56 49 -65 70 44 252 467 -77 487 -43 28 342 -472 124 159 28 7
3811 7 -390 191 -322 -70 326 191 -91 260 171 142 -87 -270 -57 -246 302 -150 -73 255 484 -431 -281 87
3833 87 183 205 207 176 -418 307 -57 223 -67 270 6 -31 45 -306 259 -202 -206 -414 -104 -257 -151 -433 -135
3856a35%J96Rj51L42N6j54K50r2l81K35m68l0L56j0J80K6n3k23J70l69N39l67
3879g4Q0p6J21RJ90m89K85k19K27k90J05R6J15k08l9J3J54R1n0J89j47j50l36
3902d03L31K77k79J9O0j19j01N12K24o50O21n10J52k45J83K53n50K99k27R1M71
3923D09m57k47l32M29jL65p2N96q97M80l43L46j45j28L80j90l1M31j55n59L38
3944B17M14q49M62j416O26Q16r8l36K56m4J2L7j9k18K45m5p4k90N26r6l8l6j5
3967C7J7l52N77k14PK2o7k90J26J75J13j63q6q7J25rJ43J76k86O1J73k49J70k8
3991I1j5k02J70K73m66k98K75r1J01M60l17J77k12k45J98J60N3l19J70K5k25J82
4013e5l01L53p0rj23J28pR3J18M6j62J06j63m9J39r1oj9J21k09J29p8R7k51K93
$$ plain form
3856 -135 -135 61 70 -81 261 317 163 413 321 -60 175 -293 -323 33 23 203 229 176 -47 123 -246 293 -74
3879 -74 6 -70 51 60 250 -239 46 -173 54 -236 -131 -35 80 -128 -167 -154 0 91 41 230 83 -67 -403
3902 -403 -72 205 -74 -55 5 -114 -215 297 521 -129 492 -18 134 -111 72 325 -225 74 -153 -62 409
3923 409 -48 -295 -627 -198 -199 166 94 690 -207 273 -70 276 131 3 383 193 162 593 438 -121 217
3944 217 631 -218 244 -1172 -546 270 172 -164 92 48 60 97 78 -140 105 60 -14 -304 222 126 88 52 37
3967 37 54 -298 279 65 72 94 27 -263 -137 38 151 -12 -98 -185 -60 -69 74 250 -36 25 198 -51 119 91
3991 91 76 -126 44 317 -149 -447 -172 -263 -162 298 -19 158 -54 -299 -101 59 112 -207 -37 -12 -237 -55
4013 -55 -356 -3 -73 -82 -205 -77 -84 9 127 173 11 117 -46 -95 44 -47 -53 -72 49 -160 -31 -109 -12 -263 30
4038C0p0J07n1m12M25J96m7k92M46n2l41m2O7K7Q1j64J18m8r3J55j35o8n3J17
4062i9K14j04k14Q7l6Q0k04J32K29R4j09k23L53pj61KjO8l6N3k23R8j14q2K30
4087B7j24L3L09l06L8K22k0k69J63R6r0l90O3l3M26Ol5n5j76Q3M7P4j13k82K72
4112c4%m8j68K91k60j30L84K77j82k09k7n3L44j86K19j8q3l99O25j49l5n90j54
4135e85O50M98M3o01n95L18QN33j98j28P0R3k24J19m8qk84K80Q2J99j77K66n14
4158b03m5P90o4J45q24j25O29m77K24m4k3l13J21O74n28K79m20K26o9J24O1k89
4180a51N30n71O0K84m32N85j56k28K59j66J71j89R7m3j45K19j55M5K81m13q4N15
4202C13n91L65r1M09n49N04l27j19KK56l48j13J50K07l47j48K41o73K11N36Q49
$$ plain form
4038 30 -40 67 16 -396 29 225 178 -114 332 280 -61 -103 -36 -9 72 -92 26 -22 -115 40 -95 -163 -216 -99
4062 -99 115 11 -203 -116 -152 -72 -276 -144 85 179 70 -153 200 193 32 34 33 101 65 118 -105 -7 -121 -203 27
4087 27 -97 -64 245 -61 -23 199 179 -90 73 169 79 -311 -248 -281 145 151 116 61 -115 -32 15 89 -24 -306 -34
4112 -34 -34 -82 -250 41 -219 -349 35 312 130 -79 -106 -159 185 -1 218 200 117 -282 343 194 159 -431 -585
4135 -585 65 563 606 5 -590 -272 -264 269 71 -57 13 106 -118 1 -47 -55 -339 -59 23 222 45 311 -203
4158 -203 -248 542 478 623 -201 -326 303 -174 50 6 -17 -330 -209 465 -63 216 -204 22 -47 77 138 -151
4180 -151 379 -192 -132 152 -280 305 149 -79 180 14 185 -4 93 50 -95 124 -31 14 295 -118 -202 313
4202 313 -278 87 -4 405 -144 360 33 -86 -84 172 -176 -289 -139 68 -279 -427 -186 -859 -648 -112 737
4223G37k58o23k8N97j042N39p00R60K06n64J45L24j14K23j59o26K06J13N2l16
4243c28M43p82J083M78j067no19L75m8O18J77q44O64j81l46L42j08M9k97M37l17
4264b76N08j06J86j56k90O1k70M37m39J64K79j09J53m91M80l17k75l34J037q88
4284f46O04L92m11l1N27J22j243L72R05q64N10m8o41N93j62j303R12O51n13J36
4304a38L49o90J402n10k79J8q6k57L14k21j94k32N2P30n11M43m02M30l8j53K3
4325E0n59N69P3n5j190J245Q5nk45j77j0M26l8n77L18L93o7J44m46k66J147j730
4347i15O01mL07j15k58L59M36p09L71j87K82l9k13Q8K76n23K48k95O97J86r7O87
4369A183j031m19m80J039p17P6L43k2R56j304j1N67L24k77L50p5l25q00J456j342
$$ plain form
4223 737 479 -144 -172 425 -617 -78 -778 182 388 -176 -31 293 179 402 243 -383 -177 -64 -12 -328
4243 -328 115 -667 416 894 -173 -178 -797 -422 -470 148 325 -519 145 -36 -382 -40 -148 -99 -396 41 -276
4264 -276 232 126 312 156 -134 -73 -343 94 -345 -181 98 -11 142 -349 131 -186 -461 -795 242 -646
4284 -646 -42 350 -61 -92 435 557 -686 -314 591 -273 237 189 -452 141 -21 -1324 -412 239 -274 -138
4304 -138 211 -479 923 413 134 152 66 -191 123 -98 -292 -524 -472 258 -253 190 -212 218 180 27 50
4325 50 -509 60 133 78 -1112 133 218 213 -32 -209 -219 207 169 -408 -90 303 236 380 -66 -332 815 -915
4347 -915 -314 -318 -11 -126 -384 -25 411 -298 73 -114 168 129 -84 4 280 -243 5 -290 407 593 496 1183
4369 1183 152 -267 -747 292 -425 -349 -6 -28 928 -376 -387 180 504 227 577 502 177 -623 833 -509
4389e09J213l90n18K68q38O76j81m25J621j042M41l27J58k50K51o09M67n08K41
4408b61P47k46k87L38l7m20l43O12J63l7p80K33L15J13m38M17O4j02K31J44m67
4429d1j74K93l11n5M87k4n45M76L58q26M34R17j324K46K17Q8p71J043J69l73M68
4450G52p20J28k72O43p73mR43j65p65M23o21o09J370q47P16l57j34J223j524l03
4470h96J436r41J42P0k03K94M53j21j99P9j53J12K9L25q91P40J94j44k09N4l0
4491A41j62R5p6J98j51K37j68J34j5m70j41P9N20j92n63O16j46N08p34j92J43
4512c39n1K54qK90R2m38P05m59M82m74l12q1M26j68j04K98P65l36r18M14J77j93
4534B2Q5R53j039j08N65k50j12k56J114r49L12k53J11j11l24K64Q2o25J250j205
$$ plain form
4389 -509 704 314 -204 64 -774 -98 -279 -704 917 -125 316 -11 147 -103 148 -461 6 -502 -261
4408 -261 486 240 -47 291 254 -166 -509 103 266 229 -551 -318 -3 110 -328 89 153 51 282 426 -41
4429 -41 -215 78 -233 -288 199 175 -370 106 464 -362 72 989 -335 -89 128 216 -555 488 657 284 752
4450 752 32 160 -112 531 -242 -246 697 532 -233 190 -431 -1040 330 -517 199 -158 -292 931 -593 -896
4470 -896 540 -401 -259 -189 -392 -98 355 234 35 114 -39 73 102 427 -464 276 470 326 117 171 141
4491 141 -21 74 -2 196 45 282 114 248 233 -237 -378 -299 221 29 -534 82 -64 444 -290 -482 -339
4512 -339 -390 -136 -144 146 238 -200 505 46 528 54 -258 -339 87 -81 -185 113 878 542 -376 38 215 22
4534 22 107 1060 21 -87 478 228 116 -140 974 25 337 84 195 84 -240 24 106 -519 731 -474
4554d74O7L81L86k54M89j106O67k9l55k02M72j43n03M59Q0j35K93k55N4K60M1
4575A93n3j90J81r4P4m27K70Jj28P1J01j72J5p4J33L48p0o99N57J54L91L5q75
4598b58M17K14R52j346j28O04J29N13j173K02p33Q10m96l15K13M47O2J45m94J25
4618a10J76J4p73O21j5K18l7m14L22J46k9r8l83J11k41M45Q9J29j52k25P17n8
4640D53k13K30q61M30M65n09Q9L5l49M6N84j56M8R7l47O7l34m50J347p94Q60p92
4662e4L52m5n01M27J24j41m86N1n90m08L65J084n26j0O30q82R15r45J010k33p0
4683F7N03q32Q74q68O66o10j07l02L81K17o01M2k4M87J84J24l71O24J08q51J216
4704I27r38N02p05n95Q27O41j061l42P16k21K00j35R2O2k17L64n33m75Q59j83
$$ plain form
4554 -474 -407 -26 360 106 595 -511 156 127 -228 -430 42 -101 -604 -145 -65 -200 93 -162 -108 152 193
4575 193 140 -50 131 37 111 -316 -46 -45 -173 -102 -1 -173 -158 -232 -99 249 179 -520 37 191 582 617 -258
4598 -258 159 373 1325 -21 -149 455 584 1097 -76 126 -607 203 -293 -608 -395 52 114 259 -235 -110
4618 -110 66 80 -693 -72 -87 131 94 -320 2 148 119 21 -362 -251 -492 -47 42 171 19 -206 511 453
4640 453 240 470 -391 39 504 -5 84 119 -230 -184 400 244 292 389 42 109 -225 -675 672 -122 738 -54
4662 -54 298 253 -248 179 303 162 -324 -273 -863 -1271 -906 178 -348 -358 272 -610 305 -640 370 137 67
4683 67 570 -262 612 -256 410 -200 -307 -609 -228 -11 -612 -570 -594 -107 77 201 -170 454 562 -289 927
4704 927 -11 491 -214 -809 18 659 -402 -744 -28 -249 -49 -184 -92 -30 -247 117 -416 -891 -32 -215
4724b15r2N16k4J41q09O66k72k52P91k35j76j7L73j25r05O44R4K2P94j104K65
4745H0K8m86O2K94j79lQ0m29K21R57j277Q27k51N4n9L76o68L82J85L3mk0o1n2
4769I0j3k22K28k41K19k81J15J73m2P1l70M31k00j88K37r9Q6n1j29L37k05L91
4791C37o42K43K1M43p90k5M99Q95j088r03Q86K08N17r93O72l21kj06M40j24K30
4812C97j062n3R05k92P88p68q07L33J197n00p27N16l47O33j03j215J273Q81j855
4831h06K59Q53O09n3j203R92j198o2J011K39N9r90J233q47r5j40p2k66K52k73
4851d98Q58l03J82K14m18L50q45M70N06L84p83j147R53J18R25j427L42o81P38
4870f2L34n68N56j62Q0l07K74r6q7j91K7o50M05L13k34L25L08r3j19M53q49O15
$$ plain form
4724 -215 -307 209 185 326 -483 183 -89 -341 450 215 39 22 395 270 -635 9 103 125 919 -185 80
4745 80 108 -378 -316 -22 -201 -204 -124 -553 -332 625 -652 175 -76 -22 -81 295 -373 9 194 227 223 203 142 90
4769 90 77 -145 83 -158 61 -220 -105 68 26 97 -273 158 -42 -230 7 -92 -6 -57 -186 151 -54 337
4791 337 -305 -62 -41 402 -388 -413 86 981 -107 -1010 -124 84 601 -392 280 -41 -43 -149 291 167 397
4812 397 -665 -718 187 -105 683 -85 -892 -559 638 138 -589 -73 -420 213 110 -1105 168 1049 -806
4831 -806 -547 306 915 862 -341 651 -547 -609 402 641 700 -290 943 96 1 -139 -211 -477 -225 -498
4851 -498 360 57 239 453 35 385 -460 10 516 900 117 -1030 -77 41 966 -461 -119 -800 -62
4870 -62 272 -296 260 98 178 -129 145 49 -38 -229 -202 -852 -447 -134 -368 -43 265 172 53 506 -343 272
4892B72n75M64n8k88J14K71m68K81N52o34L61o28L36K55j31j0jl01l08N02j90
4913a84L13j38J95l49L80j71J43K5k48N17p33L51P9k90O6K06l58qM19n54J62J15
4935f2J36o6k05J67j68J99k54J92m90M66j27RO64o44J29N5J03j00K02j65k27j5
4957b01M61k34O2l4L1j32l2M70l40k57L19N5k43OO7Q4j62J77L8j07j6j34N2J58
4981H8r7k31L23p1M23l75k13L9K49k04J35j51J29J66j46q0J09j37J10k55Jm7J85
5004e0J35r8Q8J21k14O7L9N1O3j44K5J66k46j82L07j26N2k32K66J4j3P5l42L59
5028A81l20L53j94K07k1j69r1J99k70J39j1j41M7n7K74p7j1Q4j53k82L3L42J3
5051G5r6K0n4p1K88n9j03J4J1L15l74j31N0n60N78ML26k95J06j10J27l03L29J7
$$ plain form
4892 272 -303 161 103 -185 -71 200 -268 13 565 -69 292 -336 0 255 124 114 113 -188 -496 6 -184
4913 -184 129 -9 186 -163 217 46 189 214 -34 483 -250 101 180 -110 -44 162 -196 -204 215 -339 -177 -62
4935 -62 74 8 -197 -30 -198 1 -253 -61 -551 -85 -212 -203 461 -183 -54 1 104 4 206 41 -186 -201
4957 -201 260 26 88 54 85 -47 -79 391 51 -206 113 168 -75 -69 -2 82 -80 97 135 28 12 -122 -70 88
4981 88 -9 -240 83 12 435 60 -153 -114 135 -69 66 -85 44 210 64 -16 93 -44 66 -189 -188 -235 -50
5004 -50 85 -13 75 196 -18 49 88 139 202 58 83 249 3 -179 128 2 54 -178 88 102 89 164 -178 181
5028 181 -139 214 20 227 206 37 -54 145 -125 14 3 -138 -91 -148 126 49 38 122 -31 -313 -280 62 75
5051 75 -21 -1 -55 -126 162 103 0 14 25 340 -34 -165 -115 -675 -97 -93 233 -62 44 -66 61 -242 87 104
5075A04J49M0p89M47j05M08K64l22k03O2K5p27O74Q7J70o0l90J88j87J78l02j95
5097d84Q17o47K98M31n07O04K69q44J24O83j097r5R3K08K05m09P24n16M97n88
5117b34j83P00l64j5K51L33k71n54M64k59L68n14O53o39m1N21k49L48r5j78j00
5138e8M67n16P5O6n8q5L53l50M35m07K85q60K73J03K35L51m60K29j69M60m06K29
5160A92m24K07J07R3n57M37L6L8J11m12q2N13k87q7J53Q2l17k6OK37J51l33K67
5183A05k30J34N9k34K77j58J00k56K90M5k6k54J99p8j48L46p2l9p8OK3L0J6k52
5207a95K45k76M38l93K41k16K41r2p6oJ89Q4N4m98L29K61k06k34J54p6J36l27
5229b23R3j51L64J05m9J09J7l45M4K17Q2k56P3m25N88k05r8J76m33M96p25O07
$$ plain form
5075 104 253 293 -496 -49 -154 254 518 196 -7 55 80 -647 27 114 284 224 -166 22 -165 13 -289 -484
5097 -484 333 -314 -16 415 -92 512 781 -63 61 744 -353 -448 -355 -147 58 -351 373 -143 354 -234
5117 -234 -417 283 -81 -96 155 488 217 -337 127 -132 236 -278 375 -264 -305 216 -33 315 220 42 -58
5138 -58 409 -107 -32 34 -24 -109 244 -106 329 -78 207 -653 -380 -277 -42 309 -151 78 -91 369 -37 192
5160 192 -232 -25 82 175 -382 55 91 129 240 -172 -254 259 -28 -115 38 120 -197 -223 -217 20 171 -162 105
5183 105 -125 9 68 -166 111 -47 53 -203 87 132 106 -148 51 -27 -175 171 99 60 -18 -12 11 41 57 -195
5207 -195 50 -226 212 -181 60 -156 85 -7 -83 -89 100 184 238 -260 69 330 124 -110 44 -32 104 -223
5229 -223 -130 -281 83 188 139 248 265 -80 -36 181 263 7 80 -345 243 38 -60 116 -317 179 -546 61
5251F1Q16n19j090J006P26n24q8o60K62M9o4J13k28J170j252O5n05O33k89N72
5271B54K48p19N12n33L10j40K57l43O9J55n7PL2m9L6o1k0J65l2k92L19k61P25
5294E82n26j17M9j31J96K1o8M08m72j53M3J90j216J599R9n33j69N90j34n06K29
5315a9J71K36j93l85K69M3j63J88k07k34L21M5j97N17r8l06k97M64k21N62n97
5336a01N35m4n95M55l63j63M99o48K36O74j014J70K35j43L27j28J36k76J15m57
5356e50J22R92p1Lp69K49J51N95j344R13m93PN47k99K23k14j84Q7M3J37L64l70
5378A39J12k63q5l89N89m17J86O20p1j048J224j53p0o60M65J36O01j039%j126
5398a249N79J020O10m01r56K97j40O37o14n70m27J037L63l43N10J1P5J1q93M59
$$ plain form
5251 61 877 358 -732 274 1000 476 388 -272 -10 39 -25 88 -140 1030 -222 -157 -662 -29 -318 254
5271 254 502 -217 295 -238 72 -68 189 -154 -85 70 13 20 52 3 39 -22 -42 123 91 -201 118 -143 582
5294 582 56 -61 -12 -143 53 74 6 414 -58 -211 -168 22 -1194 405 504 -29 -198 392 258 -248 -19
5315 -19 152 388 195 -190 79 122 -41 147 -60 -294 27 72 -125 392 294 -12 -309 155 -66 496 -101
5336 -101 434 390 -205 250 -113 -276 223 -425 -189 485 -529 -359 -124 -267 60 -68 68 -208 -93 -550
5356 -550 -428 564 493 496 -273 -24 127 722 -622 291 -202 -195 352 53 276 62 -122 -35 8 145 509 139
5378 139 251 -12 -97 -486 103 -314 -128 492 421 -627 597 444 374 -286 179 315 916 -123 -123 -1249
5398 -1249 -670 350 960 559 -397 -100 -240 397 -217 -787 -1214 -177 186 -157 353 364 439 450 -443 16
5418A6k33M02m13J25O61M0k16m86j80L29l63N68m97L74k77k6o53J197n3J37k53
5439A99K98n96o94J227Po77K90J87n56M00o78O4P24m27k10K75N57r9k4l21p39
5460g93R38J30J81n43L7j46M04m19j04L40P2K34k95q3J3R44o61k3r6j53j90O5
5482a48J93k03l69L99M85rl01l2o9m97O52o3K20n39M80L23k41m29Q2J71OJ94n5
5505B50k42J40p5R7k43j87j45N67o85Q23j356O10N53q75J263O7l25m90q0K73p44
5526h04P27j90N52M21m58o5o62R40r1J3l21m81M82J04j7k08m43M94j12q0P02p67
5548b64M07l97K22K73k93L63p36J128k00j085O37j76l28O77L15o40L41l62N61
5567D43j18k99J92l06M66j25n78L46L0N60k40M39M1j200N45R55r85j1J57j256
$$ plain form
5418 16 -217 185 -228 -103 558 598 382 -104 -284 45 -318 250 -247 127 -150 -176 -829 368 315 452 199
5439 199 497 -99 -793 434 441 -236 54 241 -315 85 -593 -529 195 -232 -442 -167 390 291 267 -54 -793
5460 -793 145 275 456 -87 -50 -196 208 -211 -315 25 97 331 36 -47 -34 910 249 226 130 -23 -213 -148
5482 -148 45 -158 -527 -128 357 348 47 15 -54 -551 101 38 258 -281 199 522 281 -148 -66 105 111 305 250
5505 250 8 148 73 170 -73 -260 -405 162 -523 300 -1056 -446 107 -768 495 562 237 -253 -333 -60 -804
5526 -804 -77 -267 285 706 248 183 -479 461 370 383 62 -419 63 167 150 -58 -501 -7 -119 -199 503 -264
5548 -264 143 -254 -32 241 -52 311 -425 703 503 -582 55 -121 -449 228 543 -97 244 -118 443
5567 443 325 26 218 -88 378 253 -325 21 51 611 371 810 851 -349 196 1151 166 155 312 -944
5587i44P91j65M05p82J54M75P67p93n0J103j491L36N49J35M51j422K40j8O56L86
5607G83j456J661N45j865J14p57J115k56J85j7m79N57m28M56O84j305Q30j360
5625i93L82l1L15K85L83L50o17M9N53m20n00Mk81R92m09J41K96p1l08k34p6o72
5647h62Q51m03k44P77l81M4L42J60q46Q97m42L29j100P14J39J75L61k78l71k46
5667c84K21l98J18N05m23P02m65K37n56J122j065K90O95L03l31L50q90j7M20l89
5687D5q46J964j613Q95o87k31M57l57O30j257J741j246r8P26J14r0Jj132J061
5706G7l31n0J71J57r0K16P3l92J76J0j92L32K70o36P06r02P30K48m79j78l76M04
5728e6K99q31L86J36K49l5m31mR4L13j01K07j7J0j59l67M42np1j49N10k69k63
$$ plain form
5587 -944 -153 -318 87 -695 -541 -66 701 -92 -142 961 -530 -194 355 490 941 -481 -241 -259 397 783
5607 783 -673 988 1533 -332 -218 -975 140 -116 69 52 -427 130 -298 158 842 -463 367 -993
5625 -993 -611 -642 -327 -42 341 691 74 123 676 256 -244 -240 -521 471 62 203 499 428 120 -114 -190 -862
5647 -862 -11 -414 -658 119 -262 -218 124 284 -562 335 -107 222 -878 -164 -25 150 511 233 -138 -384
5667 -384 -163 -561 -443 62 -361 341 -124 113 -443 679 -386 -96 599 902 571 921 31 14 434 45
5687 45 -801 1163 -450 445 -242 -473 -16 -373 257 -1000 741 -505 -603 123 237 147 148 -984 77
5706 77 -254 -304 -133 24 -66 150 223 -169 7 17 -175 157 427 -209 497 -405 325 573 94 -84 -460 -56
5728 -56 243 -588 -202 -66 183 148 -283 -287 -193 120 19 226 209 219 60 -307 135 130 59 -90 420 151 -112
5751a12K77O24m72k43K25m08L49o00M71o05L50k40J76L06m36K28l25M45J05p3
5771D2j5j09J84n02k9O81N1n0l21J66K92K0q49J54O01p48K87M85p87K9M04l34
5793c48K61n85M05K33K16k12N06j33j084P29J96q90J79M75j56k96M98K05m36L34
5813I7q89N42N59p00k01P46M75q25L40k13N04m54k09P98j361J285p04L00R1K18
5833C99j68k55m84J93Q47r47L45j98J07Q47m69p57P32L13l40L73n43n15M47R74
5853I01j729R81k28J86j30l05L24K65n3m28J29p55P79p00R67n8j50l00j192J849
5873C53L82r12k01R50m18q21J359m95R4P63j136o0N70l34K53n1M77j076Q47n43
5893Al15M68m96O78j78l47M36n2j160P17P07P2j201J298j723J296J7K53n3R22
$$ plain form
5751 -112 165 789 317 74 299 -109 240 -360 111 -494 -144 -384 -208 98 -338 -110 -435 10 115 42
5771 42 27 -82 102 -400 -429 252 303 253 -68 98 390 410 -439 -285 316 -432 -145 340 -447 -418 -14 -348
5793 -348 -87 -672 -267 -34 182 -30 476 343 -741 -12 184 -706 -527 -52 -208 -504 -6 199 -237 97
5813 97 -792 -250 309 -391 -592 154 629 -196 144 -69 435 -19 -228 570 -791 494 -210 90 181 399
5833 399 231 -24 -508 -315 532 -415 -70 -268 -161 686 217 -540 192 505 165 538 -5 -520 -73 901
5853 901 -828 153 -75 111 -19 -324 0 265 212 -216 -87 -842 -63 -763 204 146 -4 -304 -1496 353
5873 353 735 -177 -378 572 154 -667 692 197 291 1054 -82 -142 428 94 347 296 773 -303 544 1
5893 1 -314 154 -342 336 158 -189 247 195 -965 -248 459 531 -670 628 -1095 201 218 471 418 1340
5913A340o28j198K09K75k31K25K19j028N90P9N30j103J268j006O03P82j453J742
5931A215j051K40o27L47k87J095m2q14n81M17J36L7J018n00p30m19M82j90R0M36
5951B72l6n33J74J69J65j61j14mn85J669j048k0K6n87j03R83q97j178J502j65
5971d71O34m63J20o60J039o2L9n07L26o14k18K058p70p3O2n98M10p61N59K99o12
5992b63N33j084R72l79P94r63L58Jk60N40n12M86O3k60m42L87n06P76m0R1l33
6013d1J68l55M40k28P31j285M30j45N21M91j674J018J82k19Q21r71j8Lj96N40
6033B13r0K22r8L52n09K14k92oj4L33m48M21m34n21P20N12o17K99n30J21L45J2
6055B05J37m06R64n45k06k3p17N2J84N14M65q82M29k23J48L85k67m0m41N40j9
$$ plain form
5913 1340 712 -486 -277 -2 -233 -8 211 -817 -227 -148 382 -721 547 -459 144 926 -527 1215
5931 1215 164 404 -223 124 -163 932 890 76 -505 -88 48 85 1103 603 -127 -546 -64 -254 -164 272
5951 272 236 -297 -123 46 211 50 -64 -68 -653 1016 -32 -52 -26 -613 -716 267 -630 -1808 -306 -471
5971 -471 163 -300 -180 -840 199 137 176 -331 -5 -619 -837 1221 451 378 440 -158 252 -509 50 349 -263
5992 -263 270 -814 158 -221 573 -390 -32 -31 -291 249 -263 223 286 26 -416 -29 -535 241 201 292 -41
6013 -41 127 -228 212 -16 715 -570 -140 -285 236 727 -947 71 253 34 855 -116 -134 -131 -327 213
6033 213 123 345 247 599 90 304 12 6 -8 325 -123 298 -136 -657 63 575 -42 257 -273 -152 193 205
6055 205 342 -64 900 355 149 126 -591 -539 -355 159 624 -258 171 -52 96 481 214 174 -267 273 254
6076B54r40M25n4J041j017P7j0j62M49k89M00M12q4o31p71J380m09n60N00L51
6096C62o93K21K57k92j10K55k53J67M7K68J76q62J225o1j408O11K11K60p43N57
6116A95q60M39k75M56N78m59j06j24L69N05j159J046j287J090j64p8n47J87P97
6135F03m34k63J1J87L12j2n37L89o8j84k53L39K97m24p2K87k52L10L29L64j479
6156e50J240p0p56j05P87o74p0m27J226L02j310n5N01J07J98p25J83M41m71L39
6176A11n30n55O06R35r27o20J254j96m07K72l8o74M74O91Q6n62K11J15k78m38
6196d70O30k76n78L17J001m10m10R46o94J72o07L67K5L06K49r45O99k7l17k25
6216b47J57k91N75l88J42rj24M98K28o9j054N84J34j68J58m66K42J61K46j18J88
$$ plain form
6076 254 -686 -261 -315 726 -291 -214 -224 -386 63 -226 174 586 502 -129 -900 480 71 -489 11 362
6096 362 -331 -110 147 -145 -255 0 -253 -86 -39 229 405 -457 768 707 -701 -90 121 381 -362 195
6116 195 -665 -226 -501 -45 533 74 -32 -156 213 718 -441 605 -682 408 244 166 -381 -194 603
6135 603 169 -94 -83 104 416 404 -133 256 188 4 -249 90 387 -37 -109 178 -74 236 565 929 -550
6156 -550 690 620 -136 -241 546 -128 -198 -625 601 903 -407 -462 39 146 344 -381 -198 243 -228 111
6176 111 -419 -974 -368 567 -360 -980 274 78 -329 -57 -95 -769 -295 396 482 -80 131 246 -32 -470
6196 -470 160 -116 -694 -377 624 214 -196 750 56 228 -379 -12 13 319 568 -377 322 295 -22 -247
6216 -247 -90 -381 194 -194 -52 -61 -185 313 541 472 -582 2 136 -32 126 -340 -98 63 309 191 379
6237C79m40L14l69N44j13n76M74N0p53O47j79k26R17p02L70m5m86N34n63N60l72
6258c5J85j24o6j51Q3J56K22J4q47O82k21M00k59j06K10n38L54K24J25o64L64
6279Hl00M54k04R8L4K67n52K49l3L36o47K23K59l13J068o64n94L07J87k08k75
6300c00L75l1j22J90M1n61O64J2j76M4J88Pp1o45P9R02m52m08O12j13l65P0k91
6323c51k44M08l2N11K55r34O91j17L7k72k33M00L52j297J258l26Q6O3L1M4p67
6344d37j44J399o82L62m77R40q00q54J016k59M71o7O5o16N0j33K63o46M10L71
6364B32k2j83P4j19K33l85M94J63k73m31K90M63j60k73m27k09J09P84l25J0k46
6385b01N61n53O58l66K9K00j22j06k09r9M69n53N31l44j3K56Lk73R3LP2j91n8
$$ plain form
6237 379 -61 253 -116 428 315 -261 213 263 -490 157 -22 -248 669 -33 337 292 -194 340 -223 337 -35
6258 -35 150 26 -40 -191 -108 48 270 284 -563 119 -102 298 39 -67 143 -395 -41 183 308 -356 8
6279 8 -292 162 -42 56 90 357 -195 54 21 357 -290 -67 192 -121 947 283 -311 -4 183 -25 -300
6300 -300 75 44 -78 112 153 -408 256 268 92 136 324 331 260 -385 -306 596 144 -264 348 235 -130 -60 -351
6323 -351 -595 -187 -219 292 547 -387 304 187 224 -48 -281 119 471 -826 432 106 192 255 286 330 -437
6344 -437 -581 818 136 498 21 961 161 -693 323 64 535 468 533 -83 -33 -166 97 -549 -139 232
6364 232 210 27 101 -18 215 -170 324 487 214 -217 73 536 376 103 -324 -533 -424 360 35 45 -201
6385 -201 360 -193 465 99 128 328 206 100 -109 -208 261 -292 239 -105 -118 138 141 -132 -39 -36 36 -155 -213
6408b13L71L68o64M57m22k06M39l86O25k81j60j7J56M22l20m3O9m40K71N65k95
6429B96k31K58l86L26r3k79N4M66j42m39m4N56l73K83m29j1K7N98k21k57N0N45
6451E54o73l49M71K47Q9r47Q6K93r1L48j20N56J35r47m01P59m24M98l14j58J6
6472c72L34J83J9M8m4k2L10r03L98Q0O53m01l95j35Q75l93J22m13l40J06M50q3
6494G7J55k45l05N39L6j18k40l42N30O3m59Q9N25P9l31J14l46K97o37R81L62l07
6516E17n81l33P83q5k51K70k32K55l02n35O20J38p90M13K55lp52Q02l72k22N06
6537A01k10l5k9J8j06O30o01oL04l68K01R7J24K59l77l21N13o89J005l6q07N24
6559A91m69M52o49L38J08K84k42j91N1K86k09j97O07nm82L67k86L08k27m7M5k42
$$ plain form
6408 -213 158 526 -138 319 -103 -309 130 -256 369 88 -72 -89 67 489 169 126 195 -245 26 591 296
6429 296 65 323 -63 263 170 -109 -55 411 269 -170 -214 342 -31 252 -177 -188 -161 437 216 -41 9 554
6451 554 -119 -468 3 250 339 -608 -522 -229 -320 28 -92 464 599 -348 -749 10 -414 84 -230 -388 -372
6472 -372 -38 145 164 212 168 146 456 -447 -49 31 684 283 -112 -247 628 235 357 -56 -396 -290 160 77
6494 77 232 -13 -318 221 257 139 -101 -443 87 150 -309 -220 305 384 53 167 -179 118 -519 462 824 517
6516 517 -64 -397 386 301 50 320 88 343 41 -494 126 264 -526 -113 142 139 -613 189 -183 -405 101
6537 101 -109 -144 -173 -155 -261 369 -232 -238 66 -302 -101 -4 120 379 2 -319 194 -495 510 474 -333 191
6559 191 -278 174 -475 -137 -29 255 13 -178 -127 159 -50 -247 360 355 -127 240 -46 262 35 -12 33 -209
6581b09k56R1j61Q84J42q56M10k25k01P93o95L14l94o57P96J69r5L03N0l16M18
6602C05l61K91M45j08n10m40Q07J24P9p64l29N76M27k90N5m6n98K35j72L04K72
6623C02k30N83o09l46K15N30p49l86K43R58m58L34l91k56L6M51k75j03r93K205
6643A061k081Q75K57jp26J155n59N6J19r1N36n70l38J8N80k17J0n38J89J11J44
6664a0L4j69q8K51p4J44N4j24l51L18n7J5R0K10j58j02J73j46q6p6L21m69N10
6687B10o32M53J03l28QK29j98N7K15J00L8l0pj91k4l71N1M51j09L11k87o48M34
6710a65M28L17o47k04J15L36K11n2j011O49J02k86M76m21r1K62n20M30l35P74
6730C68M9m06j61j0R39q62k08M16J30l29M52n54j29k70R6N56Lo5j9l68J71l09
$$ plain form
6581 -209 -465 -374 -535 349 491 -365 45 -180 -381 412 -283 31 -363 -1020 -224 -55 -150 153 203 -113 305
6602 305 -56 235 680 572 62 -378 429 553 632 -132 -461 115 542 252 307 261 -337 -102 -274 30 302
6623 302 72 655 46 -300 -85 445 -304 -690 -447 511 53 387 -4 -260 -224 227 -48 -151 -1144 1061
6643 1061 -1020 -145 112 111 -615 540 -19 37 156 65 601 31 -307 -289 291 74 84 -454 -265 -154 -10
6664 -10 24 -145 -233 18 -56 88 142 18 -333 -15 -72 -57 33 243 85 -17 156 10 -76 -152 169 -300 210
6687 210 -422 31 134 -194 -186 43 -155 -98 117 217 255 225 218 27 3 -368 -317 134 25 336 49 -599 -165
6710 -165 263 580 -67 -271 -156 180 391 339 -672 -23 79 -207 269 -152 -243 19 -501 -71 -406 368
6730 368 417 11 -150 -160 779 -83 -291 125 255 -74 378 -176 -305 -575 -479 77 80 15 -4 -372 -201 -510
6752e10Q41m51M85M7o94N69o51L25Q7k54K9p1K19n71L77M60l80N77j42o10J67
6773a51M24k27L15n28J37k23o63J476m46j114J362N89r11R17m28r20M15K10o10
6792c76M5K41N36N6n06M72j405j76N45J266p96M58J80j339O92N90m25n37k16J192
6812D97j216Q79k73L74m42m12J220o16j36o03L04M40j389M84J165j81J40n53j70
6831d88J44P55k74o84P45k4k97J14Q56n39r58Q95q22R9M05J87M63m87N67m28o21
6852c92R8L25p7J07m6k76k0M01K98m33K95M99o94J27k2J14j08j029P87O39n28
6873F5k37Q9p7O5M39p12J83n6J64R09j572J437j656J441p06k96K22Q17j198ro81
6894a369N08M95Q00j54O0k27r1M28l92L3m95L63j11O36o74M67J57j390J302m20
$$ plain form
6752 -510 331 -120 365 412 -282 287 -364 -39 48 -206 -177 -248 -29 -600 -223 237 -143 434 292 -318 -151
6773 -151 273 46 361 -167 -30 -253 -916 560 114 -1000 362 951 40 957 529 -391 24 234 -376
6792 -376 -331 -90 446 502 -4 468 -937 -1113 -568 698 -98 360 540 -799 -107 483 58 -479 -695 497
6812 497 -719 160 -113 261 -181 -593 627 11 -125 -728 -424 16 -1373 -889 276 95 235 -318 -488
6831 -488 -344 411 137 -547 198 174 -123 -9 847 308 -650 245 -577 -478 -73 114 577 90 657 229 -392
6852 -392 -294 31 -46 61 15 -261 -281 120 418 -15 280 779 85 212 190 304 196 -833 -46 593 65
6873 65 -172 -83 -160 -95 344 -368 -185 -241 -77 832 -740 697 -959 482 -224 -520 -298 519 -679 -688 -1369
6894 -1369 -861 -366 434 280 340 113 22 450 58 91 -404 -41 -152 484 -190 277 434 -956 346 -74
6914g4m28J93p5m69Q91K83K22m25k18k17L79K49p63Q76k03n94O5j183J920o57
6934b28O75n56P1Q54p06m10J91n13P34L69n78N19k97J40o61P21p01M00Q48r75
6954a03J92k8q1j28L86r9K79q3O4l0l2m93%j3J85M8l93M09K93j56n87P00o14K8
6978b56K12j01n76O67K12n19p66J384J22N93j228N98k98K8l1k38O65p52O84k87
6998A13N49n80r8J92J38k60j19l00M13m10P90k63K8K48o84O75o13K53K6l20K50
7019B8n81n58J283J57n85J12L89N49q24o8J65O95r20M3j15m4M49m85M41j34K34
7040B31J0j80K27k54M32o29K97Pj78N92j31m89L10L98r63N1L47J6o14M30l91j01
7062e82J239n24n33O87j165O71J4P24P5r88J146j55j9q78O48j87n54L44K17K40
$$ plain form
6914 -74 -502 -309 -384 -853 38 321 543 118 -100 -317 62 311 -452 424 221 -373 -308 -1491 429 -228
6934 -228 447 -109 -38 816 110 -300 -109 -622 112 481 -97 422 125 265 -396 325 -376 24 872 -103
6954 -103 89 61 -20 -148 238 139 418 335 399 369 337 -156 -156 -169 16 64 -329 80 373 217 -370 330 -284 -256
6978 -256 -44 -145 -721 -54 158 -361 -1127 257 379 972 -256 342 44 72 41 -197 468 -284 400 113
6998 113 662 82 -16 176 314 54 -65 -365 48 -362 428 165 193 441 -243 432 -181 72 98 -222 28
7019 28 -553 -1111 172 329 -256 -144 245 794 -30 -98 67 762 -158 -115 -230 -274 175 -310 131 -3 231
7040 231 241 61 288 34 466 -163 134 141 -37 555 424 -65 245 643 -320 -269 78 94 -520 -90 -481 -582
7062 -582 657 133 -400 287 -878 -207 -193 531 606 -382 764 609 590 -288 360 173 -381 -37 180 420
7082D20M60j469L53j97j14K7J021K7m52l01P10l25j64J74k58k36N74j39m48P26
7102C89k30o4j42j97Q20j264N58M14p96P23l58P20n88Q08o87n87Q13k66k19O54
7122E01n60P63o91P50n47r3n82P62M7q95M76q25J001K19o20M05o73J144p78qM45
7143B41l67j72J42L96m71K53L70p23j35N64l64n61L97J85j49J65M4J184q12l82
7163a95L46r60R44Q0J00n97n67J148j119O68L33j28K3p36J015q88K73L90k52K12
7183I0N0j13P39n48K02o22P25p37O61l87l50L76N3n88O30K97l89N39q25O12j17
7204B98K4k76o26K11%o4J99R7L77K67l74k01P15p30N19n95q69P26J190o66K37
7225D59l08m37K26J60j63P54j082l2K99Q7j75M2q4L3J15l7J97j68M3K71l03nK73
$$ plain form
7082 420 880 -589 -236 -433 -547 -520 501 528 76 -225 485 160 -4 170 -88 -324 250 111 -337 389
7102 389 159 95 -47 -244 576 -688 -130 284 -512 211 -147 573 -15 793 106 -481 332 66 -153 501
7122 501 -59 704 13 763 216 123 -459 303 350 -545 -69 -894 107 326 -294 111 -562 582 -196 -204 241
7143 241 -126 -298 -156 240 -231 22 392 -331 -466 98 -266 -827 -430 -245 -394 -229 -185 999 187 -195
7163 -195 151 -809 135 215 315 -282 -849 299 -820 -152 181 53 76 -660 355 -533 -260 130 -122 90
7183 90 140 27 766 218 420 -202 523 -214 447 60 -290 86 139 -449 181 478 89 628 -197 415 298
7204 298 322 46 -580 -369 -369 -433 -234 -137 240 507 133 -68 647 -83 436 -159 -1028 -302 888 222 459
7225 459 151 -286 -60 100 -63 691 -391 -423 -124 -37 -212 -170 -254 -221 -106 -143 54 -114 -71 200 -103 -108 165
7248A65k08L63j06k44m72N85JJ43k9J30n74K08M28l58j63N9J12q05L07o7J92K29
7270a04J03k72N39r98M60M38n47J74L05m0r2K16L69n93q6M69o41N54j87l40L75
7291A02l38J86J11M84j6n17M14q15O06R8N58m03r85k55Q80k42J057j136N33o00
7311b78K70J1k38N07j09O09q57M7j47Q86j008jK60J07o3J9j2qL66l75K10m00j69
7334c73O39m40K15k99J65M10l55N30k6r88J95P46l98o95M27L68q9N42j255Q74
7354A93K37r12P67J4N75j641P87j063J279p29P82o42J83K18l80J57M1j97L02m88
7374e17n2L61l98K0N41J44JK75j37j10l47k19L26p4Q0J38L38K08m19o06K70M6
7396a31l51N94k68Q5k31l87K89R4M80k76L62n06N67n8j27k45J92n8k37Oqj94J081
$$ plain form
7248 165 -43 320 214 -30 -502 83 84 227 198 328 -246 -38 390 32 -131 -72 40 -765 -458 -525 -333 -104
7270 -104 -1 -273 266 -732 -272 166 -381 -207 98 58 -34 182 551 -42 -128 341 -300 254 67 -273 102
7291 102 -236 -50 61 545 529 12 426 -389 217 315 873 470 -515 -770 110 -132 925 -211 322 -278
7311 -278 -8 3 -235 272 163 772 -85 -38 -185 701 -307 -308 -48 59 -4 15 3 -5 361 -14 196 -204 -373
7334 -373 266 -174 41 -258 -93 317 -38 492 466 -522 -327 419 21 -674 -247 121 32 574 -681 193
7354 193 430 -482 285 299 874 -767 20 -1043 236 -493 289 -353 -170 48 -332 -175 -134 -331 -29 -517
7374 -517 -569 -208 -606 -586 -45 99 100 375 238 128 -219 -438 -112 -186 -106 32 370 578 159 -447 -177 -131
7396 -131 -482 112 -156 -71 -302 -689 -400 -306 174 -102 260 -246 321 263 136 -109 83 25 -212 -206 -214 -408 673
7419F73j143N75n7l30n6J74J95L1r5k93P82j163O68J88j86l01k70P35J8j04k58
7440b17J22l36J43P3J89J01k59J95o52n7Q67j08J04l12O65n98K1j40k56Q24j76
7461A93n24K68M40o10M46k96K58l11R3o19R36r11Q92n07j69Q64o20K51k81M39
7481B32k18k28K26qJ36l53M29K16l43J41o57Q24l81l49M75n27M44L54m09m15Q9
7502c22j38l4K62m8O68l57l07K87J87l06j28K72L91n12r5N7N73j43m95J53k40
7523b75l24R26m68M51O4n47K36j57o5K46m8j56K13l4J92l26J42j5j90J85o3l42
7545c55K75j47m35O33J56P9j91l56Q60m63J44p90L05j38M65k83K24J75n58p37
7565a137O77O85j78k67M56M6n8m41M78l0q63R77p4l39O28m61l26p2m00J356j174
$$ plain form
7419 673 -470 105 48 -282 -338 -164 31 62 -33 -326 456 -707 -39 149 -37 -338 -608 127 145 41 -217
7440 -217 -95 -431 -288 -215 -26 75 -184 11 -641 -698 169 61 165 -147 518 -80 -59 -199 -455 369 193
7461 193 -331 -63 377 -233 213 -83 175 -136 -43 -662 274 -637 255 -252 -421 443 -177 74 -207 232
7481 232 14 -214 12 4 140 -213 216 432 89 230 -427 397 16 -333 142 -385 59 413 4 -411 -322
7502 -322 -460 -494 -232 -280 388 31 -276 11 198 -108 -236 36 427 -85 -180 -123 450 307 -188 -35 -275
7523 -275 -599 327 -141 310 374 -173 63 -94 -159 87 39 -117 96 62 254 -72 70 55 -135 50 -13 -355
7545 -355 -80 -227 -662 -29 127 206 15 -341 519 56 200 -590 -285 -423 42 -241 -17 158 -400 -1137
7565 -1137 -460 225 47 -220 236 282 224 -217 261 231 -632 345 271 -68 560 99 -227 -299 -699 657 -517
7586e17O44P72j8q49q2M83o38n86N97L5J28O64l11p88O16p3J60l00J45n24N85
7607A43L61n89n02L90k27N70M08o88N58L1m01K34L62p72l88J14N07j41M49j0l2
7628C77l69j1k14k72K58J10K07K63l41K71q63K70K93k11N12q15J68K03K69j1l12
7649b18J35j89L08R6l17P27m79l19j74J97J3K2l2N53l69K47r6K06n95M37l9j04
7671A0rj21K54l73K89L24J77o24K7J08k61M82k60R4j43K12l39l6j20K0K01K1q6
7694a53j59M44p66M34j0L52m04l7L42j19M41J2o41O49q09J86K57J94j63r56P45
7715a61M00Q7m81m45R46q49L45j31R1M45o80K16k08O29nK17k13j39n8J60m25P08
7737D49o50J4R9J58N34m82k3L9o6J54q4o49O38M03r99O39qj3k6q84Q81K07j08
$$ plain form
7586 -517 127 899 881 32 -50 433 -205 -791 -194 -159 -31 633 322 -466 150 77 237 -63 82 -442 143
7607 143 504 -85 -587 -197 -424 146 554 -134 424 455 54 288 650 -122 -510 -396 111 -30 419 409 377
7628 377 8 -3 -217 -489 -231 -121 86 349 8 279 -584 -314 -21 -232 280 -535 -367 -164 105 94 -218
7649 -218 -83 -272 36 132 -185 542 63 -256 -430 -233 -220 -198 -230 323 -46 201 105 311 -284 153 114 10
7671 10 1 -120 134 -239 50 374 551 -73 -46 62 -199 283 23 117 -26 186 -153 -189 -309 -289 -88 -67 -153
7694 -153 -312 132 -634 -200 -210 142 -262 -299 43 -76 365 377 -264 385 -424 -238 19 213 50 -906 -161
7715 -161 239 326 -155 -600 346 -503 -158 -289 -198 247 -433 -217 -425 204 199 416 203 64 6 166 -259 449
7737 449 -201 -187 -88 70 604 122 99 138 72 226 142 -507 131 534 -465 174 166 153 127 -757 124 331 223
7760B23j514J383j137K65J073m58N29p91J31K21J066o8j298K37O27j178R85j60
7778A36N96q58L30Q5k86k88k84N06m78N74K79J95q31R2JQ32m48O1k20n32N82j7
7800B7j66k85M12J90l11o8L22l93K97j86J80n3k70M59j46r1j36J73j90K36K48
7821B49J34O0j67k30n35P37l21j30N5P2J16K52l59j6j97L30m20l01Q91R1j23k05
7843a7J23J29j25l76mK08k4L54k70k93N35m08J51n9j4K06NN0j30j98M9L5P8J14
7867A19l17K40m6j57j3j01L70l3J00p69P75lr1l45Q12j454J343K51k9p61k00K30
7889g9k98J43M7k0M59o70J93O72j226O62m53O48r2j19L37j96J04r8L18k80P0J37
7911B59p4J70o90M66q8m60M27K54k14j51o6j6m6K68K8m09K20J94k21J3K76l50
$$ plain form
7760 223 -1291 92 -1045 -780 293 -165 364 -427 -296 -75 991 923 -375 -138 489 -689 296 136
7778 136 732 -126 204 289 3 -285 -569 -63 -541 33 312 507 -324 -232 -231 601 153 214 -6 -538 44 27
7800 27 -139 -424 -12 178 -133 -201 121 -272 25 -161 19 -34 -304 155 9 -82 -218 -45 -235 1 249
7821 249 383 443 276 46 -489 248 -73 -203 -148 -76 40 292 -67 -83 -280 50 -370 -671 220 311 188 -17
7843 -17 106 235 110 -266 -270 -62 -86 268 -2 -295 240 -168 -17 -76 -90 116 121 171 41 -157 -108 -73 5 119
7867 119 -198 42 -4 -161 -174 -275 95 62 162 -607 168 165 74 -271 541 -913 430 681 652 -109 -309 -79
7889 -79 -377 -234 -187 -207 252 -418 -225 447 -779 -117 -570 78 -14 -133 204 8 112 14 332 52 122 259
7911 259 185 355 -335 131 43 -417 10 264 50 -101 -167 -183 -229 39 67 -342 -122 72 -149 -136 140 -210
7933b10K92q4J80q8N7j23j39K18l9K69j83r2J27l61L46K5k04o6J3K16j09J17j09
7956E3rl50L46j51l22O72m13N76m82n1r3n9L04N8k43k46N32k24n67R37l19J89
7978A38k65Q1j44K40K0J49o1j04j8Lk2o9j66j00J94P2K71j56m20M89L3l67K8K34
8002F0lJ11R2m20L2J00l07L12L54j48l35K70j16J10L07m66k31K04J64J29n85M9
8024c17LO84n65M08N8JM47p62P0J65o7j45j85K65j48k25L57r9L17m59L26l38J32
8047g7j17K50n05N19j38K74o4m2j27l91M24l24M35n51R55m51m85K39m3L33k35
8068a21J3j62K61M9k77j80J96L22j41k96N17l90K16J20K10n23M23L1k83l66M62
8089H1j83J76L58k08k24j88R5N43j54j85m82o3K94P80k97n60j05L61n28P38J85
$$ plain form
7933 -210 82 -2 178 90 147 24 -115 103 64 333 150 58 185 -176 170 195 -9 -75 -62 154 45 162 53
7956 53 44 -306 40 -111 -433 239 -174 402 -80 -131 -224 -283 21 79 -164 -410 122 -102 -669 268 -51 138
7978 138 -127 -46 -190 50 70 219 158 54 36 39 17 -52 -218 -318 -124 -52 219 63 -357 132 165 -202 -174 60
8002 60 57 168 260 -160 -128 -28 -335 -23 331 183 -152 118 2 112 419 -47 -278 -74 90 219 -366 -317
8024 -317 -314 370 -195 213 271 272 719 -43 27 192 125 -20 -205 60 -88 -313 44 -55 262 -197 129 -209 -77
8047 -77 -194 56 -449 70 -68 206 142 100 -27 -418 6 -318 117 -434 521 70 -415 -176 -219 114 -121
8068 -121 -108 -270 -9 40 -237 -417 -221 101 -40 -336 181 -209 7 127 337 -186 237 268 -15 -381 81
8089 81 -102 74 432 224 0 -188 -93 450 296 111 -371 -434 -140 640 343 -217 -322 39 -489 249 434
8110D34p43j95J73J98J05k03P24q78O3j81P34L57r55j16K83k57R5J58m3P30n51
8131f8J73m31K82q77J071k35k31P97p20N30k6n08j53L96J9k87k87M23j78O37m3
8152B84l57j20N55m60j86J41M35p02Q0K63K76m87K77M6K44k06j03l63P72j029
8172f40K28P73o40L10o68J68K20M11q57L94j21Q17K53p37k30m77J109o50L23
$$ plain form
8110 434 -309 -504 -331 -133 -28 -231 493 -385 -322 -503 231 588 -367 -483 -200 -457 -362 -204 -247 483 -68
8131 -68 105 -326 -44 -921 150 -85 -316 481 -239 291 265 -243 -396 0 19 -268 -555 -132 -310 327 284
8152 284 -73 -193 362 -98 -284 -143 292 -410 -330 -67 209 -278 -1 45 289 83 -20 -383 389 -640
8172 -640 -412 361 -279 31 -637 -469 -249 162 -695 -301 -422 395 648 -89 -319 -796 313 -337 -14
8191a4
$$ Imaginary data points
##PAGE= N=2
##DATA TABLE= (X++(I..I)), XYDATA
0@%%%%%%%%%%%%%M8r6R6r6R6j43J91j92K40k88L36m31M85n35O26p45Q87j006J150
32F23j297J442j640J878k111K352k638K953l291L651m068M515m993N521o095O722
48C524p410Q167q995R907j0922J2046j3296J4713j6319J8148k0262K2745k5709
61a3663K9308l3794L9564m7311N8334p5354J05395j74052O20419M4937j140027
72e86244L14111Q07264R6992r28869l98009N22995N61907l45676n63808M1185
82d78152N61325J64811l43467k70034K73009L86355j310l46395j23187K56716
92G9671K58547j48067l13932k6677K98329J52532k10366k65620O0708K45743L5960
103A66828k56244j83553J35178K37794l8024k67912r0590K53137K26463j41139
$$ plain form
0 0 0 0 0 0 0 0 0 0 0 0 0 0 0 48 -48 48 -48 48 -95 96 -96 144 -144 192 -239 246 -289 337 -408 479 -527 623
32 623 -674 768 -872 1006 -1105 1247 -1391 1562 -1729 1922 -2146 2369 -2624 2897 -3198 3524
48 3524 -3886 4281 -4714 5193 -5729 6317 -6979 7734 -8585 9563 -10699 12046 -13663
61 -13663 15645 -18149 21415 -25896 32438 -42916 62479 -111573 508846 553783 -586244
72 -586244 -272133 535131 632123 -296746 -694755 -171760 390147 44471 -519337 -478152
82 -478152 83173 247984 -95483 -365517 -92508 293847 292537 -53858 -177045 79671
92 79671 338218 190151 -123781 -150458 147871 300403 90037 -175583 -114875 130868 166828
103 166828 -89416 -272969 -137791 100003 61979 -205933 -296523 -43386 183077 41938
113D1938k70327P7719L63355J18030k84421k05233K13156K86460j05635l36760
123a01718o9344K43780J24761j98944k27661M3977J93913M1296j50792j10009
133b10741Q9242J68914L5004j16234o6593J10944J45621k8995j45140k4450J39838
144I7410P5576j17816j31942N0485J28386k1871j55281n7150J11340Q6944q4808
155a8727j28065K8175J41835L6931j18417p5682J05307J39484k9427j31687m920
166e5193J44836P0352j06624j06786N4349J08169k3808j20748m3265O4928M3194
177B9404m8936o5173j339M6096L1365q547k7770k123M4146N3421l942m8103n044
190f545O1348L8237n0492o2573K2505O0192j5755p7349k7003N2106L0237n0645
$$ plain form
113 41938 -228389 -150670 212685 330715 46294 -158939 54217 340677 235042 -101718
123 -101718 -171062 72718 197479 -1465 -229126 -185149 8764 50060 -100732 -210741
133 -210741 -121499 47415 82419 -33815 -100408 10536 156157 127162 -17978 -42428 97410
144 97410 172986 55170 -76772 -26287 102099 80228 -75053 -132203 -20863 66081 -18727
155 -18727 -146792 -118617 23218 60149 -58268 -133950 -28643 110841 81414 -50273 -55193
166 -55193 89643 159995 53371 -53415 934 109103 85295 -35453 -78718 -13790 29404
177 29404 -19532 -84705 -86044 -39948 -8583 -17130 -44900 -47023 -2877 50544 46602 -1501 -6545
190 -6545 54803 93040 42548 -20025 2480 62672 46917 -30432 -57435 -5329 24908 -25737
202b5737n3893K6781O0045l839n4514p204O1352M2955l4572m1623L1094O4438
214F5283N56n8663j9285M7447L0422m0611n1307O363L2608m711l7395j8872J3676
227c4489J2753J064m023l795J887J9860K6588J589k2110J239L7942J9280l1767
240B6018l1593K1669L3876j9150m8224p826L5227N594m2653k6103K7127K8282
252B244j9475l0268J3513L7147O241k4027k397L1837K1569j4900j5577J3312K2744
265D1963o505k3539m662J0260j006j8458j3819N66j161q087k493L335l774l600
279c0980J1608J8850m73j2424R569L0970Q225k4049p613K5725J6767k2166l0019
292f010Q957K2165j1667l3472o209K1983M062k4495j1054J8602J4321j0912j1371
$$ plain form
202 -25737 -79630 -52849 7196 3357 -51157 -58361 2991 45946 11374 -30249 845 65283
214 65283 65839 7176 -12109 35338 65760 25149 -26158 -19795 12813 8102 -29293 -48165 -34489
227 -34489 -21736 -20672 -24695 -28490 -26603 -6743 19845 21434 -676 563 38505 57785 26018
240 26018 -5575 16094 49970 30820 -17404 -25230 9997 15591 -27062 -53165 -26038 2244
252 2244 -17231 -47499 -33986 3161 9402 -14625 -17022 14815 36384 21484 5907 19219 41963
265 41963 35458 11919 7257 17517 16511 -1947 -15766 -15200 -16361 -24448 -26941 -23606 -27380 -30980
279 -30980 -19372 -522 -995 -13419 -3850 27120 35345 11296 3683 29408 46175 24009 -6010
292 -6010 2947 25112 13445 -20027 -26236 -4253 -191 -24686 -35740 -17138 -2817 -13729 -25100
305b5100J3863J9289k122j1635P751J6710K844j0490p62R558K032j1252n964N120
319I842j840j0851p202N171n21j2419o857J0479R044r152r556J2533J8276j583
333E364j3753O186K2117M698j7144o997J6957R408j5822j6888O922J1742r510
346C280j8725L82J3377N5j5282j914J3837N295q871k960J1433R472p602n782Q409
361D404R777o631q356M316Q868l738j2265J300R967k856j1968p05R993K188j3174
376h880m559J2030P559j0448r641J0225J2823m563j1938L520J4813j99j2129l397
390d784J2392K864j0653p117Q229P094r316q511N689R657m297j0517L353J0801
404D884P16q670r24R420K654r638k480O991L786q153o495O728O541p352p879O013
$$ plain form
305 -25100 -11237 8052 5930 -5705 2046 18756 21600 11110 10348 19906 21938 10686 4722 9842
319 9842 8002 -2849 -10051 -4880 -5401 -17820 -24677 -14198 -5154 -14306 -23862 -11329 6947 5364
333 5364 -8389 -2203 19914 24612 7468 471 17428 26836 11014 -5874 1048 12790 3280
346 3280 -15445 -15063 -1686 -1631 -16913 -18827 -4990 305 -8566 -11526 -93 9379 1777 -4005 4404
361 4404 14181 7550 -806 3510 12378 8640 -3625 -2325 7642 4786 -7182 -7887 2106 4294 -8880
376 -8880 -13439 -1409 6150 -4298 -13939 -3714 9109 4546 -7392 -3872 10941 10742 -1387 -4784
390 -4784 7608 10472 -181 -7298 931 8025 -1291 -9802 -4113 5544 1247 -9270 -5917 4884
404 4884 5600 -3070 -3994 5426 8080 -1558 -4038 2953 6739 -1414 -7909 -1181 5360 -1992 -9871 -3858
420c858Q610l794q829K425J2362k17r796j220J0813M039r468o143Q219O612q163
435A592q121M836P417l912j0331J895Q624n21r239o72Q813L261q006j990P744
450A390O255o379m961N826Q109l879p328K096P291j792r377n91P702p86r636l391
466i451P494L547p979n419P502P389m684o839N133J0142j074p803J593R264R88
481I803q327k015P012K393q591m937N505M139o950p043L926O482l399p268K319
496f951P782k70o928N07Q411K633o463j010O251M833m888m470M556M933l765p225
512b064J784N835k495p882r21O457J3p014l465O852M469o057l369N806O584k957
528A576n500L793P539j642o337N42O966L32p222j900N971J929p490m332M989M608
$$ plain form
420 -3858 4752 958 -7871 -5446 6916 6699 -3097 -4317 6496 10535 1067 -5076 3143 9755 1592
435 1592 -6529 -1693 5724 1812 -8519 -6624 2000 1479 -7760 -8432 381 3642 -4364 -6354 1390
450 1390 7645 1266 -3695 2131 10240 6361 -967 1129 8420 6628 -2749 -3340 4362 3576 -6060 -9451
466 -9451 -1957 1590 -6389 -11808 -4306 3083 -1601 -8440 -3307 6835 5761 -2042 -449 8815 9803
481 9803 1476 -539 6473 8866 275 -4662 843 4982 -1968 -9011 -5085 1397 -2002 -9270 -6951
496 -6951 831 561 -6367 -5860 2551 5184 -1279 -2289 3962 8795 3907 -563 3993 8926 5161 -2064
512 -2064 -280 5555 3060 -4822 -5743 714 727 -6287 -9752 -2900 1569 -4488 -7857 -2051 4533 1576
528 1576 -3924 -131 7408 5766 -571 -29 6937 7269 47 -1853 4118 6047 -1443 -5775 -786 3822
544C822o156n429M201N356k853o468K623O276j64n056J71O967J967n689j674N356
560C250L910m678m358L318N024l680m961O83M834j700o370m77O147N12o442k041
576g029N866L573m632l462M918M628k533n082K775O220j586n111P61N721J45n681
592e09j113N373J374n674l504M703K918n265m234L310M104k701n431J688O141
607A180Q1n710J079O197O9k884j990N219K917m434l282M317K886l471m638J000
623a464M767j588m771n52M709O58n546j421M448K202l757k881L944M064k627l796
639c611K855M894q55m421J067N460O0n322j219M817J183n284l370L672K685m054
655a443m252K767L977k213m653K054M970l30m177J033M713J149m654o17N041J722
$$ plain form
544 3822 -2334 -7763 -3562 1794 -1059 -7527 -4904 1372 1208 -3848 -3677 3290 5257 -432 -2106 3250
560 3250 7160 2482 -1876 1442 6466 2786 -2175 -1492 3342 1642 -4728 -5205 942 1454 -4988 -7029
576 -7029 -1163 2410 -2222 -5684 -766 3862 1329 -3753 -978 5242 3656 -1455 -694 5027 5172 -509
592 -509 -1622 3751 5125 -549 -4053 650 3568 -1697 -5931 -2621 1483 -1218 -6649 -4961 1180
607 1180 1261 -4449 -3370 2827 2896 12 -1978 3241 6158 1724 -1558 2759 5645 2174 -2464 -1464
623 -1464 3303 1715 -3056 -3608 1101 1759 -3787 -5208 -760 1442 -2315 -5196 -1252 2812 185 -3611
639 -3611 -756 4138 3283 -1138 -71 5389 5449 127 -1092 3725 4908 -376 -3746 -74 2611 -1443
655 -1443 -5695 -2928 1049 -1164 -5817 -3763 1207 877 -3300 -2267 2446 3595 -1059 -1676 3365 5087
671E087l986k450L314L047l223l832J611L573k066l754o67L877L7m621l94L413
687a034Q65k540j760L860K449k840j250J973M561q74l928Q53L921j0l853q12K992
704B573R38l975k704L501J266k844l589K973K780j837l765K115M835j527l826
719c086l55O204J37l785j309M990K151m290j514L155K271l315k377J519K733k396
735G33l195k81L225p47l400n3L084O32k406j077K728K617j525j650J924L183j041
752B751k784O22K805J08l748n86L264Q16l932j886K739J596k284m006K717K709
768I01k114l016J393L885j204k559P37L903O7l046k3L709J360k804j643L311J252
785D109k786k641J608K653k067l266K13K252M47l989PL393O19k672k96K547J123
$$ plain form
671 5087 1101 -1349 1965 5012 1789 -2043 -432 3141 1075 -2679 -3346 531 568 -4053 -4447 -1034
687 -1034 -169 -2709 -4469 -609 1840 -1000 -2250 -277 4284 3410 -518 335 4256 4246 393 -419 2573
704 2573 3511 -464 -3168 333 1599 -1245 -4834 -1861 919 -918 -4683 -2568 2267 740 -3086
719 -3086 -3441 2763 2900 -885 -2194 2796 4947 657 -857 2298 4569 1254 -1123 396 3129 733
735 733 -2462 -2743 482 -265 -3665 -3718 -634 -2 -2408 -3485 -757 1860 335 -1315 609 3792 2751
752 2751 -33 589 3394 3502 -246 -832 2432 3248 -684 -2570 169 1765 -519 -4525 -1808 901
768 901 -1213 -4229 -2836 1049 -155 -2714 -1977 1926 1993 -1053 -1076 2633 3993 1189 -454 2857 4109
785 4109 1323 -1318 290 2943 876 -2390 -2177 75 522 -3467 -3460 -67 552 -2120 -2416 131 1254
802A254j192j068J754K746j970j760J03K789J54k623k18K551N09l199j738J764
818a44J568k512k276J951K217k241l294K721K939n98k313K53K974J316l068J4
834d93L140R24k380j721K386J205k057k324J804J406j809k341J079J609k99k842
850b713O96J505M84j784n14K059J229j072j093J877J230l39j456N07K281o94j985
867B18l30J652J121l039j616K066J179k472k339J527K349j194k260J270K933p37
883C28k464Q67L204j73k389J00K419J214k501j052K048J403k391k052J839J816
899B216j758k343J067J164o26k077J03K148m42j101p47J906J635j367j033J467
915B12K060q28j384P22J668N27k227n22J790q30r95j932J622J366k728j902J571
$$ plain form
802 1254 62 -1006 748 3494 1524 -236 -133 2656 2810 187 -31 2520 3029 -170 -1908 -144
818 -144 1424 -1088 -3364 -1413 804 -1437 -4731 -2010 929 331 -1982 -1729 1245 2561 -507 -493
834 -493 2647 3571 1191 -530 1856 3061 1004 -1320 484 1890 81 -2260 -1181 428 129 -2713
850 -2713 -2017 -512 -28 -1812 -2326 -267 962 -110 -1203 674 1904 1565 109 616 2897 2203 218
867 218 -112 1540 2661 -378 -1994 72 1251 -1221 -3560 -2033 316 -878 -3138 -1868 1065 328
883 328 -2136 -1269 1935 1762 -627 -527 1892 3106 605 -447 1601 3004 613 -1439 400 2216
899 2216 458 -1885 -818 346 -280 -2357 -2254 -106 -548 -1649 -2396 -490 1145 -222 -1255 212
915 212 2272 1444 60 782 2450 2977 750 228 2018 1188 193 -1739 -117 1249 -1479 -3381 -1810
932a810J458q11j785J462J859o23j904J556J913K16k759J027K635j30p99j194
948C11J238O21j552j168P65J577j612k003M91J133k83k023J74K854j125q25j13
965a540Q72J608q09j222J253K638j157j490J022J225j155o94p3K13P78j660l32
982e23O69K68k447p20K118J073j733j282J676J158r15L6m12J945R17j821J73J230
1000A410Q91j655o27J924O82j697k095J536J367j857j076n82K224p19j637L65
1016a546Q03Q36j473L61J247Q29r22l53J172R64m79j347O00J694j283m64r24J116
1034H31l2j823O1J594o64j024JJ22J704j474m44P30K65N96q96K7J098L42r18J93
1054B89J269k71j048o13L95K219j344o08o7J547j226k212J457P20j272j040M29
$$ plain form
932 -1810 -352 -1163 -2948 -1486 373 -250 -2154 -598 1315 1531 -1228 -201 2434 2304 1505 311
948 311 1549 2170 618 -550 215 1792 180 -1823 -1332 -199 -482 -2505 -2331 523 -602 -1427 -1540
965 -1540 -668 940 131 -1091 162 2800 1643 153 1175 2400 1245 551 478 691 1469 -191 -523
982 -523 146 414 -2033 -2753 -635 438 -1295 -2577 -901 257 -658 -622 -1034 911 1828 7 180 1410
1000 1410 2301 646 19 1943 2625 928 -1167 369 1736 -121 -1197 -1779 445 -274 -1911 -1546
1016 -1546 -743 93 -1380 -1019 228 1057 135 -218 954 1918 1439 92 692 2386 1103 639 -285 831
1034 831 799 -1024 -963 631 -33 -1057 -1056 -934 770 -704 -1148 -418 -153 443 -453 -426 672 1014 96 289
1054 289 1558 1287 239 -374 21 2240 896 288 221 1768 542 -1670 -213 507 -765 -1805 -1376
1071a376Q27P47j141m55Q99J734j153k145L026L55j189O73n08J659M7j968r4J809
1089A747l1k071L08l27J756k143o76O22N74q28j147J440J006j01j562N31Q09Q27
1107G34m96L26R1L07n71j507K679J54j478m66O21N57j096j317N85J146j127m65
1125a323L73N69O60j798M81O76J226k76j445J365J430q27r71P84J76j95J09q60
1143A54J145l76p71p66P64k76L7q15j24Q79k29j021k46K112m53l37K33Q17m2n45
1163A40p7J667n11q65l78J467M58q21j364K76J236j273j654O62R89j187k40j37
1181a612Q52k43k18J49J311j62l57L9J052P83o96m18R62N8k06j768O53N39K0j104
1201c66q2Q45n87q66k11J189o73j26n59J105K36l44n99N98J684o12r53N04O75
$$ plain form
1071 -1376 -549 198 -943 -1398 -499 1235 82 -2063 963 1318 129 802 294 1953 2000 32 -62 1747
1089 1747 1716 -355 -47 -374 1382 -761 -1437 -815 -241 -1069 -2216 -776 230 129 -1433 -902 -93 734
1107 734 238 564 655 962 391 -1116 1563 1717 239 -227 394 951 -145 -1462 -877 269 -858 -1323
1125 -1323 -950 -381 279 -1519 -1038 -362 864 588 -857 508 1938 1111 140 924 1100 905 1014 154
1143 154 1299 923 152 -614 150 -126 -89 -904 -1028 -149 -378 -1399 -1645 467 14 -323 -90 727 685 140
1163 140 63 1730 1219 354 -24 1443 1901 1080 -284 -8 1228 -45 -1699 -1037 -48 -1235 -1475 -1612
1181 -1612 -760 -1003 -1221 -1072 239 77 -280 -241 811 1594 898 480 1442 1500 1294 -474 179 718 738 -366
1201 -366 -448 397 -190 -1056 -1267 -78 -751 -877 -1436 -331 -95 -439 -1038 -440 1244 632 -321 183 858
1220H58J53j079K4Q09j13l29K13m6j08m20j062m02J288k88j117P18O72j42n88
1239i59K45J012J51l7q70R89N1m81K40K07O21l25p64J90L78j90o89k13M49P9r78
1260h94k01L71J48l58l26J126J58n70L90j59R54k23m4j86J057L72p03m74L08M1
1280G87n71p60K84P62q01q57N53R69r82n99M62O08L17j139N87L82K83p73k07J386
1300F91j77l83j34J150J66j321J96J219r6j431l20J21K85j68q71K6N78K48n43
1319g64O89j99m02N47r66Q48K22l3K11k86J342M37j225m37L88P43L5j84R9j112
1339d7Q49j449J069o42l66k26o8P39p6j057N6J416m26j97M56L9J034n13J60L25
1359A076k58j11o50K28R07r58m28j7K52o9j049k00M88O22q07j32J71R25o73K54
$$ plain form
1220 858 1011 -68 -44 765 652 323 536 490 382 -38 -1100 -1502 -214 -502 -1619 -901 -229 -371 -959
1239 -959 -714 298 449 412 -458 531 582 101 341 548 1169 844 80 270 648 458 -231 -444 5 84 -894
1260 -894 -1095 -724 -576 -934 -1260 -134 24 -546 -156 -315 639 416 372 186 1243 1615 912 438 746 787
1280 787 216 -544 -260 502 -299 -1156 -603 366 -616 -1215 -753 -145 172 -967 -380 2 285 -488 -695 691
1300 691 514 131 -3 1147 1313 -8 188 1407 1311 -120 -440 -319 -34 -202 -1073 -1047 -469 -221 -764
1319 -764 -75 -274 -676 -129 -1095 -247 -25 -58 153 -133 1209 1646 421 -16 372 1115 1150 966 1065 -47
1339 -47 802 -647 422 -220 -586 -812 -880 -141 -217 -1274 -1218 198 -228 -425 31 70 1104 591 751 1076
1359 1076 818 707 57 285 1192 234 -194 -211 41 -28 -1077 -1277 -789 -167 -974 -1106 -935 -10 -683 -429
1379d29k09J131k58k44l02J014M85r70j23M50L46l62p32J41M36m19l72J24N16
1398B23j645J409j414K046o97j210J199n18P12l32m94O55O28k96j91M39J153j317
1416C50m46M18L20j67p84LM8K7n96j11P42J38n20l26N78N45o35k10J014L9k26
1437B01J09j54P99j92m44L19pO13m13o82J87o0j079J32N40k49j13o57M33L34K14
1458a69p41L87O28K39p18M17M21N15n16o10P91M05p20l65K64M83m02n97q1N95
1478B26l29j62n36P36o41M87n90O60L08l52q45P32R58m03K3J84K70m02K71j17
1498D78K66k41M39j162J253j132r82M56N86L37j075M82n20P54k35n51J65j58J096
1517B56l52q28J014N02j40P1J74N83o76j430J831q4j26j040K35P40j095j70J87
$$ plain form
1379 -429 -638 493 235 -9 -311 703 1188 218 95 545 891 529 -203 -62 374 -45 -417 -293 223
1398 223 -1422 -13 -1427 619 -78 -1288 -89 -607 105 -227 -721 -66 562 266 75 514 1667 350
1416 350 -96 322 642 475 -309 -306 -258 -231 -827 -938 -196 -58 -578 -904 -326 219 -416 -626 388 427 201
1437 201 310 156 955 763 319 638 631 1244 831 149 336 276 -803 -671 -131 -380 -493 -1150 -717 -383 -169
1458 -169 -910 -523 105 344 -374 43 464 979 463 -147 644 1049 329 -36 228 711 309 -288 -369 226
1478 226 -103 -265 -801 -65 -706 -219 -809 -149 159 -193 -1038 -306 652 249 272 456 726 324 595 478
1498 478 744 503 942 -220 1033 -99 -1081 -625 -39 298 -777 -295 -815 -61 -296 -847 -682 -840 256
1517 256 -96 -924 90 592 452 523 697 1280 604 -826 1005 921 795 -245 -10 730 -365 -535 -348
1536c48L37m46n23L88M51L40n30l6L67M15l5l69K34L61m5o49O1L61J85o79n1K59
1558D8J51o52J02j77L02J56j444J501L34m17p1l72R89j81j80o70J065K52j974
1577a238R38J363p38k59K34M43j5l53p81N09k3j51m26P9L93j16n88K95K88j36
1597b82l28K20M75p9k76m64R16L46n55L5oK94K85n12n7K51r4l38l71N37k7l35
1619c65j26k90P63l92p3N3L66L60j93o10J180Kn00J68J07M93l61m67J13J41j49
1640B20p03N8N27m13k95l8O05j90k63l32N17L08p80L3Q77j9L10N9l85O03k03K20
1662G16Q1q01K99m78L47q5L15o59j32R1J85l61PJ51J28%n66O36N14n66l90R44
1684C76m71Q48j57p72N72L64j283R22j326Q17l56K66K48K05n85m66L33J73J67
$$ plain form
1536 -348 -11 -457 -980 -592 -141 199 -331 -367 0 415 380 11 245 606 561 -88 -27 334 519 -160 -211 48
1558 48 199 -453 -351 -528 -226 -70 -1514 -13 321 -96 -167 -539 450 269 89 -581 484 736 -1238
1577 -1238 -300 1063 325 66 300 743 728 375 -406 103 80 -71 -497 -418 -25 -141 -729 -434 -146 -282
1597 -282 -610 -390 85 6 -270 -734 182 528 -27 8 2 296 581 69 12 263 169 -169 -540 -3 -30 -365
1619 -365 -491 -781 -18 -410 -483 -430 -64 296 103 -507 673 675 175 343 450 943 582 115 228 369 220
1640 220 -483 -425 102 -311 -606 -644 -39 -229 -492 -824 -307 1 -779 -746 131 112 422 481 96 699 496 716
1662 716 797 -4 295 -183 164 79 394 -265 -397 -306 -121 -482 -475 -324 -196 -196 -762 -126 388 -178 -568 376
1684 376 -95 753 596 -176 396 760 -523 399 -927 -110 -466 -200 48 253 -332 -798 -465 -292 -125
1703a25M4o45Q6P28p41M69l6R56o75j97M20M39J6n27J27J49r4k29j15L14k93l0
1725D1o64K93K99m87l27L52K75L06l54j59N40j46k5R5k8M45k74N8K81J33j44k52
1747B58J94p3k09n52J03P43m88m06l05O85m36j85L03K78j63N27m10q4M71Q9q4
1768B56m28O46j86j00K98O17n78m09k7J64q78j76L46J11j2j35o50O11O76K0n70
1789d04r9M61k62k85N80M47j029J390q97L40N87j85j136P08J65K58j785J001n20
1808f65k41K91M33k08K37k67M83j12j56M45l46N05Q4j083O82M85L37r26J70J02
1828B50M74j4k61l49O7K68o69q4P99n07j87k02p7j08n8O42m76J74O5l15J293n32
1850A93O48o79r8M2K40l03N79n96N5L67k8L25m08n36l8l28M03O5K49n14r7L76
$$ plain form
1703 -125 -81 -726 -640 88 -653 -184 -220 736 61 -136 284 723 739 212 339 488 394 165 50 364 71 41
1725 41 -623 -330 -31 -518 -845 -493 -218 88 -266 -425 115 -31 -56 39 11 456 182 240 521 654 510 258
1747 258 452 379 170 -382 -279 464 -24 -430 -735 -50 -486 -671 -368 -90 -253 274 -136 -220 251 340 256
1768 256 -172 474 288 188 486 1103 525 116 89 253 -625 -801 -455 -344 -356 -491 -1141 -530 146 166 -404
1789 -404 -503 -42 -304 -589 -9 438 -591 799 -98 242 829 644 -492 216 381 639 -1146 -145 -665
1808 -665 -906 -615 -182 -390 -153 -420 63 -49 -205 240 -106 399 483 -600 82 567 904 -22 148 250
1828 250 724 710 449 100 167 435 -234 -318 481 -26 -213 -415 -492 -600 -658 -16 -492 -318 -253 -568 725 193
1850 193 841 162 64 106 346 43 622 26 81 448 420 745 337 -199 -237 -565 -162 -97 152 -362 -459 -83
1872h3j23J5n7J84K94m39N42k9j00L59l11J86l53j68L47j665K143p63m88k05M15
1893b99k82J368j345m8J086r82L90Q46j502j47J857k48q25P91n87K39k78K74q38
1912e30N32L39k03k3n30J151j195M19q10J152J51p71p95P86Q57j242L09O09J71
1931C77p65O17k81P01K68o59K2J030j108o57M57L84R8j039K0M57o6K43m96L88
1951ik14O3m73L07n6J61M72p09L19J041m27l53L80l43N87p24L03o24L88jq3j78
1973a73K63m80N48m69J62m05J36O21k31k1k23N75L42j034Q84l10n4M02k60J51
1993D24Qm5q69R27j45j26k22k13J62o8k74m1M40M9J8p25J39O85k32k57M07K68
2015C10j39j30n1M18K68r5m92j6J95m65M96L36L79j343l8O3K5K67k74j39L87r3
$$ plain form
1872 -83 -206 -191 -248 -64 230 -209 333 304 204 563 252 438 85 -83 264 -1401 742 -21 -509 -714 -299
1893 -299 -581 787 -558 -606 480 -502 -112 734 -768 -915 942 694 -131 660 73 312 34 308 -530
1912 -530 2 341 138 115 -415 736 -459 -40 -850 302 453 -318 -1113 -327 530 -712 -403 206 377
1931 377 -388 229 -52 649 917 258 280 1310 202 -455 2 386 484 -555 -535 -78 -144 99 -397 -9
1951 -9 -223 -160 -633 -326 -382 -221 251 -458 -139 902 475 122 502 159 746 22 325 -299 89 88 5 -173
1973 -173 90 -390 158 -311 -149 -554 -418 203 -28 -49 -272 303 645 -389 495 185 131 533 273 424
1993 424 432 387 -482 445 300 174 -48 -261 -99 -167 -441 -482 -42 7 25 -700 -561 124 -108 -365 42 310
2015 310 171 41 -10 408 676 581 89 73 268 -197 299 635 1014 -329 -367 -304 -279 -12 -286 -425 -38 -131
2037a31N46n11N9K24l10L24j76L73J31L9m22K18l04Jlp8m0o5j25p1r0K70n10P1
2061e80N59J12q04R12L71n26k42J64L96j31R8k10jJ89j33p7K9m9KL6p6o9k1j75
2085b26L4K35o09L83j6O1L3L76k69Q5M89l63J60n46j64M86L5R6J38k60m19N10
2107B49o93P14j80k89M58k29q2m03O38k08r1l22K85K76j3P03k4J32o70J9L56P1
2129F97k48m72O97j41j092J96O13q72K41P50L75n53l2r79L81J76M82m56L57n46
2149d26L19L86k63N9K75n8Q0j10K51n00J34j72O27J35q21J41j47J40p49O55k13
2170b57QJ80M39j015Q74K91m28n96N92l5n68Q46j54J51Q8j66l41J24K80k73J99
2191B39k40pok15L0N7p9P6k40M44j59j83K82l3K38n9l7J55L7k60N3l8J15n8j18
$$ plain form
2037 -131 415 -96 -37 187 -123 201 25 398 529 568 146 364 60 61 58 -20 -60 -125 -250 -321 -411 -141 -651 -580
2061 -580 -21 91 -713 199 570 44 -198 -34 362 231 329 119 118 307 174 97 126 77 79 115 39 -30 -51 -226
2085 -226 -192 43 -566 -183 -199 -138 -105 271 2 87 576 213 373 -173 -337 149 184 280 418 158 -261 249
2107 249 -444 270 90 -199 259 30 -52 -455 183 -25 -116 -438 -153 123 110 813 789 921 251 270 626 697
2129 697 449 -23 674 533 -559 -363 250 -622 -381 369 744 191 159 -820 -439 -263 219 -237 120 -426
2149 -426 -107 279 16 75 350 292 372 262 513 13 147 -25 602 737 -84 57 -90 50 -699 -44 -257
2170 -257 -249 -69 370 -645 229 520 92 -504 88 53 -515 331 177 328 416 250 -91 33 313 40 239
2191 239 -1 -8 -14 -229 -199 -142 -221 -145 -385 59 -100 -283 -1 -34 204 145 108 263 300 40 93 55 170 112 -6
2216fj9j8P5oj99L06n60J89pK16l74L45j55J10j18J83N3K19J61m18J43p1N1J79
2240B79k47R4L6K13p0l94J71j57j2J35l53Q9K2L5k83M97K32p81M61M09o6n28L16
2263I8R70p18m29J68N17l24k98j1KL04l39k52J77J35K1m39L28k43L25j1l83K06
2285a96R4Q8l15K73M97n38k59P98n95N79l57r3l81M51P6J05m06p5J41l34Q68o51
2307b30O18k98l97M9L5l23N95n11L21K42oO4L2J00k19J2jQ6Oj59K04j55l48M15
2331A32j68j26j90L27j13N6l4r6J61K80j32q7l0M89k00k13J23J87r2j44k17K50
2353A63j75P6L5l5k93O7k91j64M16l99L20K49J50M86r43Q3R78m49L44m87o69M63
2375g5O6J78j01k15M91n02M9M02k13j54L5k00R2j02k23M15j46L01k37p5N24k74
$$ plain form
2216 -6 -25 -43 32 26 -173 133 -427 -238 -245 -29 -403 -58 -213 -103 -221 -38 15 234 395 -23 120 49 100 279
2240 279 32 126 162 375 305 -89 82 -75 -87 48 -305 -216 -194 -159 -442 55 287 -494 -33 376 310 -218 98
2263 98 1068 350 -79 89 606 282 -16 -27 -25 279 -60 -312 -135 0 21 -418 -90 -333 -8 -19 -402 -196
2285 -196 -102 -14 -329 -56 441 -97 -356 442 -153 426 69 -24 -405 46 122 227 -179 -254 -113 -447 421 -230
2307 -230 388 90 -307 -258 -223 -546 49 -462 -141 101 95 159 191 291 72 84 83 169 175 16 220 65 -283 132
2331 132 -36 -162 -352 -25 -138 -82 -116 -212 -51 229 97 10 -20 469 269 56 179 366 274 130 -87 163
2353 163 -12 64 99 64 -229 -162 -453 -617 -201 -600 -280 -31 119 605 -338 -255 723 274 618 131 -538 -75
2375 -75 -9 169 68 -147 344 -158 -109 293 80 -74 -39 -239 -147 -249 -472 -57 -203 98 -139 -214 310 36
2397C6j86J48J42M56n7n30J76j87J77O3L88m87l05O37m49R6l23L0R6n22K64K33
2419a04O26l47q19R85n2m25L41k24K31j90J86j14J3K84J45m09J73j74j05j83j06
2440b68j80O42M3j20k03m48P61l95K11R4M7J12l19J59J18n13L94J4K15L8m01J81
2462A82Q3K37j228M28P5o94N56p7q2P36m42L16k73P2l84Q95l84k99N92n4k12J157
2484A200j102K13J09J57R2n60M86J83j218J039n41M22o99j8N08p50k54M59Q08
2503E34o24J8L47l19j31R42l10j37o73M98M06o89J29K0Q1o2m87K69M88k58l85
2524c43K52l90N79l86L61K13l40j17o15L74P22l99Q99r7l39J64j67k96NK56l30
2545FK6j70J59k56L97q09M11m03j62M60J0J98m8N4J50Q2j00l0K0K03j09k45L66
$$ plain form
2397 36 -150 -2 140 596 539 9 185 -2 175 238 626 139 -166 471 22 118 -205 -175 -79 -601 -337 -104
2419 -104 522 175 -644 341 289 -136 205 -19 212 22 208 94 107 391 536 127 300 126 21 -162 -268
2440 -268 -448 194 237 117 -86 -534 227 -168 43 137 184 296 -23 136 254 -259 135 149 364 402 1 182
2462 182 265 502 -726 -298 -223 -917 -361 -438 -520 216 -226 90 -183 -111 -495 400 16 -283 309 255 43 1200
2484 1200 98 311 420 577 669 109 595 778 -440 599 58 480 -219 -237 271 -479 -733 -274 534
2503 534 -90 -72 275 -44 -175 767 457 320 -353 145 551 -138 -9 11 92 30 -457 -188 300 42 -343
2524 -343 -91 -481 98 -288 73 286 -54 -171 -786 -412 310 -89 810 713 374 538 371 75 80 336 6
2545 6 32 -138 21 -235 162 -647 -236 -639 -801 -341 -331 -133 -181 -127 23 105 5 -25 -5 198 89 -156 210
2568B10j99J62j22N8J02j93l6k24O9J65q1j43J13P7j36K70L3k93RR5m5K18jj60
2592e2q2N01l46n1O1L2N0n9m9N3J1J5ml28J29Q6k59J00k6k76L12K19l8N2l36K03
2618h2L59k88j76M56k69N88q31K67J06m5JK48o14J29J92j16m77O33p55N13J4j23
2640b70L26Jj33k3J74P3K54p5j3q2J84m24K37J73K33p21L94l17m1M17k90L6n27
2663d14K97PP7l91K08K57j78q0L33p25L72N90L32o63N58m48K8j23l29M17k49M08
2685B84o23K03L72o11N27l63K69J33M0j50n65N77M7p1J57p2J13n90K25K51r9l62
2707c08j55P01m8K0j99r4K00l62J50QpK25l86P0l0QK10k14m7J83l35O71j35Q4
2731B10M31m76q0l57Q4M68j67N6m19M23K26J16q96Q27m28l64J714j245J01m20
$$ plain form
2568 210 11 173 51 109 211 18 -18 -242 -173 -8 -89 -232 -119 -42 -178 92 125 -168 -159 -64 -109 109 108 -52
2592 -52 -134 367 21 -30 31 63 113 54 5 58 69 84 80 -248 -119 -33 -292 -192 -218 -494 -182 37 -1 51 -285 -82
2618 -82 277 -11 -187 269 0 588 -243 24 130 85 86 334 -280 -151 41 -75 -552 81 -674 -161 -147 -270
2640 -270 56 57 -76 -99 75 148 402 327 314 232 416 -8 229 402 635 -86 308 -9 -50 367 77 113 -414
2663 -414 -117 -110 -33 -424 -216 41 -137 -217 116 -609 -237 353 685 22 580 132 160 37 -292 125 -124 284
2685 284 -339 -136 236 -375 152 -211 58 191 231 81 -484 93 140 69 226 154 267 -323 -98 153 54 -308
2707 -308 -463 238 190 210 11 -83 117 -245 -95 -87 -94 131 -255 -185 -215 -207 3 -211 -258 -75 -410 261 126 210
2731 210 641 165 85 -272 -188 280 113 169 -250 173 399 515 -381 446 18 -346 1368 123 224 -196
2751a96N80N3p09J67L09k41m7Q8L0J63j14J67m00N43j044K53K76K01k80o3L64
2772A00l28P3j07P08l51l39Q10p5o89N1M6K86K67j76K61n49J11L06m77L20m51
2793b03K46l83N16o61J13M51l36M26m17Q02p38M52k03J4j70K61o1j09Q3J07J21
2814C11j71J67n47O65m16K26n9qK5l74k76O43k06M83n19m23J09L02n1M9J7L3q4
2837a04L14k59k89N18L4j48K86m34J19k75L73p22Q82m19K63k49J51k03J66J61
2857A65N54n55l70L8K8P41J41k2p07K95k07j88M13k49l72N79p79J081o13K31j09
2878I5K36j76m18n60K39M48q5J73K14o06Q90l19K49%j33o63M69j79J39L99n50
2899a38P35m49K47o53M91n18l0J94J84o24J41L67q5k53N19k18L6J39l75N71k10
$$ plain form
2751 -196 384 437 -272 -105 204 -37 -84 4 34 197 83 250 -150 393 -651 -398 -122 79 -201 -264 100
2772 100 -228 -155 -262 446 95 -244 566 491 -198 -147 -101 185 452 276 537 -12 99 405 -72 248 -203
2793 -203 43 -340 176 -485 -372 79 -257 169 -248 554 -184 268 65 79 -91 170 109 0 83 190 311
2814 311 140 307 -240 425 9 235 176 168 193 -181 -457 186 -20 463 -56 -479 -370 -68 -119 -70 -53 -20 -104
2837 -104 210 -49 -338 180 214 66 352 -82 37 -238 135 -587 295 -124 139 -110 41 -162 4 165
2857 165 719 164 -206 -168 -140 601 742 720 13 308 101 -87 326 77 -295 284 -495 586 -27 204 95
2878 95 331 155 -263 -823 -584 -136 -221 -48 166 -440 450 131 380 380 247 -416 53 -126 13 412 -138
2899 -138 597 148 395 -258 233 -285 -315 -121 63 -561 -420 -53 -138 -391 128 -90 -54 85 -290 281 71
2920G1j12L3j03K44k05J81L06Lk66m04K72k46k5M54j06k07L11l31l9J13r8J43
2942a1k86N64n3J21m52O2J16M1m4j69N46n52L24k99l57O25J59j90k35m87M86k2
2964a13J03Q4o5L7k80O6J89M29p73R2J60K00o9K68k32r4J93k95l18L31M00l76
2986f3LJ13p17K53J90R74n65J07o03L2k42R65r20N45P5l04O17K01p37q95Q64J419
3008A312j591J61M77p99N62j63n30J83l97J082p97J48j21L33M01p44P48o88O8
3027c55Q80n5n72j65P71n10p68J094r82J394k20q46M66o33J45J255n38O47j959
3046i51j33J143j78j18O00m91o7k25N59j58n0L5O3k41N46M6K81n5r48M42J72n39
3068b67m4L92m5j11j09k97M32o1J5K24l21J71O7r6O4J56l71J34J21J23L8j27k86
$$ plain form
2920 71 -41 -8 -111 133 -72 109 415 418 152 -252 20 -226 -251 203 97 -110 201 -130 -169 -56 -154 -11
2942 -11 -297 267 214 335 -117 -55 61 102 58 -111 435 -117 207 -92 -449 176 335 145 -90 -577 -91 -113
2964 -113 -10 74 9 46 -234 -168 21 450 -323 -231 -71 129 60 328 96 2 195 -100 -418 -87 313 -63
2986 -63 -60 53 -664 -411 -221 753 188 295 -308 -276 -518 447 -473 72 147 -157 460 661 -76 -971 -107 1312
3008 1312 -279 -118 359 -440 122 -41 -571 -388 -785 297 -500 -352 -473 -140 261 -483 265 -423 -355
3027 -355 525 470 -102 -267 504 -6 -774 320 -662 732 512 -334 132 -501 -356 899 361 1008 -951
3046 -951 -1084 59 -119 -237 363 -128 -195 -420 139 -19 -69 -34 29 -212 334 380 661 606 -342 100 272 -267
3068 -267 -311 81 36 -75 -184 -481 -49 -110 -95 129 -192 -21 46 -50 14 170 -201 -67 54 177 215 88 -198
3091a98K66j96RO43o94J74j5J3J84k30R5K27q61L32M88n89Q01p73j2Q97n86O73
3113F48o40J51j49Q4j4l89k14N61j02N18r10K63M27n90P00o78k56J063q63Q62
3133D72k40k25k25P77j079O06n41L58OK41L62o43M41j59R7k94N54q12M24k46N11
3154C85l32k99j00N17M66o17p6M0K06n23L28K40K59m01j84J55k29m10M01O20o02
3175a56N0K83L37l57k1m04J60j70N4L69j50L14l29Q0M0j46L2K2N09m11j21R7j09
3198b7J3j15N9j53M99n9k33N66p21K87j93J23j56N23r1j50l79K33j82J19j32J94
3220B5NL6j59K77k4j65L73k65J20r0J61k16j20N1Q2k87L20l2Pj97K28n6n3O3j3
3245G1J4j08j2k7K63l32j94Q49j46j44m75M60k80J9Rj69L83l41J91N2p4L8j65
$$ plain form
3091 -198 68 -128 -119 524 -170 4 -11 2 186 -44 51 278 -583 -251 237 -352 449 -324 -336 561 -25 648
3113 648 8 159 10 94 80 -309 -523 38 -64 454 -456 -193 234 -356 344 -334 -590 473 -390 472
3133 472 232 7 -218 559 -520 86 -455 -97 -91 150 512 -131 310 151 248 -46 508 -304 120 -126 385
3154 385 53 -246 -346 171 637 20 -56 -16 190 -333 -5 235 494 93 -91 64 -165 -575 -174 446 -156
3175 -156 -106 177 514 157 136 -268 -108 -278 -224 145 -5 309 -20 60 100 -46 -14 8 517 106 -15 82 -27
3198 -27 -14 -129 -70 -223 276 217 -16 550 -171 116 -77 46 -110 413 322 172 -207 26 -156 -37 -169 25
3220 25 30 66 -93 184 160 -5 368 103 223 133 294 78 -42 9 91 -196 124 92 99 -98 130 74 21 84 71
3245 71 85 -23 -35 -62 201 -131 -325 524 378 234 -241 219 -61 -42 -33 -202 181 -160 31 83 9 47 -118
3268a18O0O8j10K64%k04N6j2M4k65J45J69j99K23n5n0K9q3J69j23K7m15J24P32
3292D76m11k74p6J80o0k7j53R2L49k11k4J18J35J13L3K17J30m90l41N55l87K41
3314A85N34j298R12q47M78N9o2l7J17m96Q8L09k97L37o09P57q28P52m4k65M79
3335B24m88M54l2k83m84M63k23J73J2l3K34L73k24M00q64M08k89l48O79p3n44
3356d65O43j02j99L61j74M9k69L08j52M7Q5J9J31l31j23K29k50l0J27N3Q5L7j49
3379g0J4j1L7K7m4J87j84p9L14j02k60r5K32k90K39N31p27N82K52m51Q3j28k3
3402C4n6r7N7j55P9J32N0j40J23p1R9l42O72m06R17M1j025N32j19K23j089P48
3424B07P6K15j68L49n20j22Ok67J109m65p60J61J52l42QL79r9l3J36K50j95K08
$$ plain form
3268 -118 -58 10 -100 164 164 -40 16 4 48 -217 -72 97 -102 121 66 16 45 -38 131 8 35 -380 -256 476
3292 476 65 -209 -285 -105 -165 -192 -345 -253 96 -115 -139 -21 114 227 260 477 607 117 -224 331 -56 185
3314 185 719 -579 333 -514 -36 23 -39 -76 41 -455 -367 -58 -355 -18 -627 130 -698 54 10 -255 224
3335 224 -264 190 158 -125 -609 -146 -369 -196 -184 -217 17 390 166 566 -298 110 -179 -527 152 79 -465
3356 -465 178 76 -123 238 64 113 -156 152 0 47 132 151 282 -49 -172 57 -193 -223 -96 -43 42 79 -70
3379 -70 -56 -67 -30 -3 -47 140 -44 -123 191 89 -171 -266 -34 -324 -85 446 -281 301 553 102 185 57 34
3402 34 -22 -119 -62 -217 -138 -6 44 -96 27 -44 55 -287 385 -21 896 937 -88 444 325 548 -541 207
3424 207 283 498 330 679 159 37 43 -224 885 420 -340 -179 -27 -369 -361 18 -81 -114 22 272 77 285
3446B85m24O32l18o3k44P0K1O6l03J36K21j18R5l48M45k92L59r38P96l22Q9J99
3468D4RP9R13o72k17K16j27n13O96l79P1k97j98j98L70N10km1q5L72p33Q48j410
3491g44O32lJ23%K98J39J96J00l8j37m20K47j96j205J427m53J95p19k08R82p0
3512A46k61n6L19p3J92j80j38j84K71l2j38K10k10O4o1K94mk94K48Q3p1N3J23
3535C01k91r3j49M9K53k09N7O5J54L9n61M83J52m18L0J81j56k0K7o05R79m7p11
3558d90L82J84K78n47N2N11j88o0K03k38n2Q8m55M28N29l81l35K40j79n92P01
3579G9N37o68J13r6J77l8J22m30K7Q89l46n2j41l54L03P6k37K66k00j49J88l6
3601C0K55k00p00K93P62M6j21j9O4rm73J90J220j264J08L1j28N3k0k70K58J81
$$ plain form
3446 285 -139 493 175 112 -132 -62 -41 25 -278 -142 79 -39 56 -292 153 -139 220 -718 78 -244 -155 44
3468 44 53 132 1045 373 156 372 245 -268 428 49 120 -177 -375 -573 -203 307 305 264 179 551 -182 666 -744
3491 -744 -112 -115 8 8 306 445 641 741 703 566 146 393 197 -1008 419 -34 161 -558 -766 216 146
3512 146 -115 -171 148 75 267 87 -51 -235 36 4 -134 76 -134 -70 -131 163 159 -135 113 196 125 178 301
3535 301 10 -83 -232 -183 70 -139 -82 -17 137 176 -385 98 250 -168 -138 43 -113 -133 -106 -711 268 221 -490
3558 -490 -108 76 354 -193 -141 370 182 122 325 87 35 123 -332 96 625 244 -91 149 -30 -622 79
3579 79 616 -52 61 -35 142 104 226 -204 -177 712 366 314 173 -181 122 198 -39 227 27 -122 66 30
3601 30 285 85 -615 -322 440 486 365 346 410 401 -72 118 1338 74 182 213 85 138 118 -152 106 287
3623B87j82J45k21k0M17l45J99l00J54k54j12O27l86m39J58L95m8j22k67L72J71
3644B29k61K56n97K66L33j60o6J33k17r8K52j46Q4K1P2k47r8K31QL04l04J03K31
3667C29m31J36j48j16K63o2R5k9J0k88J95n9m5K43o7n5M6k9N0J74k4j47J8m7l25
3692c13M11o3k65O8K35j98K70lj32q3R5Ro9J54k11J42J02lj27k69L46p5K28m57
3716b08l4L41J53l19PL50l67j40M54k19j41k2K30j93ROmJ73j4l33p3J77j31j91
3740d89P31k72J12r1K63N85o76m25n46P89P6r8l36M85k48j70o9N82n55Q76l20
3761B04j32J47k13Km13L73J24n34M95m50J51m73M88M34m9j44j39j07l5O88j31
3782B86k50J11j91P2o5j05lK78n91K82k8N7o6j44K16p2P5N09k9n46L2L92j37R1
$$ plain form
3623 287 105 250 29 9 426 81 280 -20 134 -120 -232 395 9 -430 -272 123 75 -47 -314 58 229
3644 229 -32 224 -373 -107 226 66 0 133 -84 -182 70 -76 8 29 101 -146 -244 -13 -5 299 -5 98 329
3667 329 -102 34 -114 -230 33 -29 66 37 47 -241 -46 -105 -150 93 26 -29 17 -12 38 212 188 41 59 12 -313
3692 -313 98 35 -230 -162 73 -125 145 142 10 -73 22 31 -38 116 -95 47 149 146 19 -250 96 21 249 -208
3716 -208 -242 99 252 -67 -60 290 -77 -217 237 18 -123 -145 85 -108 -99 -93 -97 76 62 -271 -344 -167 -298 -489
3740 -489 242 -30 82 -9 254 839 163 -262 -808 -19 57 -41 -377 108 -140 -310 -379 203 -352 524 204
3761 204 72 219 6 8 -405 -32 92 -442 53 -397 -246 -719 -231 203 154 10 -129 -236 -271 417 286
3782 286 36 147 -44 28 -37 -142 -145 133 -458 -176 -204 -147 -213 -357 -141 -213 -138 371 342 -204 -172 220 83 174
3806A74m66O10L9j06j14j03j40L47k1k07j70J64P2j85m3o2O1M85k83j56J51P7
3828A24Q9L14o84J87P8j34L10P4l75PRl21K37j0n7L47k27J94l28K48k00j17L13
3851G8k55K78j67%M40n82q00O24m3K37q3J147q15j05K64k00l64L83j91j61J07
3872b08M50k75P5j36J48j86L83k1j61J40l20L53k54L32k92o1j47N3L79k58L7K
3894C3l5l9j77J00J26k34K48r5L8p2j27M32r4k6k47k9M01l86K65j44O5j85J17
3917f5L24q0l34K78L54j59m13jJ85j97N6l72L21K9k80K53j8J79j20P1L83N59j81
3940G72j41o78M48k09n2L30k46l54r30J254o48J63ML51l64J61Km7J92k21o9J06
3962a76J51N1j11N32m64n7L45k51n2Q9N9k24r1J65n0J02j12K58k81K04l5rk35
$$ plain form
3806 174 -292 318 357 251 137 34 -106 241 220 13 -157 7 79 -106 -149 -211 -150 335 52 -104 47 124
3828 124 213 527 -157 30 108 -26 284 358 -17 -10 -1 -322 -85 -95 -152 195 -32 162 -166 82 -118 -235 78
3851 78 -177 101 -66 -66 374 -208 -1008 -384 -427 -190 -273 874 59 -46 218 18 -346 37 -154 -315 -208
3872 -208 242 -33 42 -94 54 -132 251 230 69 209 -111 242 -12 320 28 -33 -180 -127 252 -6 31 33
3894 33 -2 -41 -218 -118 8 -226 22 -73 -35 -107 -234 198 104 78 -169 -198 203 -183 82 -62 3 -182 -65
3917 -65 259 179 -155 123 477 318 -95 -96 89 -108 -52 -424 -103 -74 -354 -101 -119 60 -60 11 394 953 772
3940 772 631 -47 401 192 140 470 224 -130 -1060 194 -454 -291 -287 64 -300 -139 -137 -184 8 -213 -282 -176
3962 -176 -25 26 -85 447 -17 -74 271 20 -32 57 116 -108 -199 -34 -84 18 -94 164 -117 87 52 43 -192
3985a92N11j88k6j00j14J63Q1j74J95o0p78O86q2rN6OL37l27l89N67k07J0J36
4008A02n0l24L48k5j16J50j76K93l41K89j71O7k77K91o2J66n4J27m23k0q1L35
4030D8j6J79k73J65J0j00J59k49PQ3J61J69k38k37M07n52K57J06k2K43k50j93
4052a36J90p3k8r8K52m44K69j32J31N3j46P2n0K12rj16K72l08O3J27K4j71J14
4075F8j3J98l75L34j4j07o3q9J69r1k0k98N00k04qq6K07j71K11l10K28qj36K00
4099A22J17j55j45J95k53L46k71J69n3Mj90j91J44k9K45m9J42L5n1m76P40l26
4121G0m26Q5J41K12j23l75R62j93k75K5P4M09M0k56k47L21n62N78P7k5o01j23
4143b12K44n9Q6k02J22o5L1l87M04P2o1J02N35q24l02M60J10J22p15K02Q07o46
$$ plain form
3985 -192 319 131 105 5 -109 54 135 -39 156 96 -682 4 -78 -87 -31 -25 312 -15 -404 163 -44 -34 102
4008 102 52 -272 76 51 -65 85 -91 202 -139 150 -21 46 -231 60 -2 164 110 237 -186 -206 -287 48
4030 48 32 211 -62 103 113 13 172 -77 -70 13 174 343 105 -132 275 -277 -20 86 64 307 57 -136
4052 -136 54 -19 -47 -145 107 -337 -68 -200 -69 -16 -162 -90 -140 72 63 -53 219 -89 -26 101 125 -46 68
4075 68 55 253 -122 212 198 91 28 -61 108 17 -3 -301 199 -5 -13 -99 108 -63 148 -162 66 58 -78 122
4099 122 239 84 -61 134 -119 227 -44 125 72 76 -114 -305 -161 -190 55 6 148 183 132 -344 396 70
4121 70 -356 -271 -130 82 -41 -416 546 353 78 103 177 586 626 370 123 444 -118 460 537 512 -89 -212
4143 -212 32 -27 59 -143 -21 -86 -55 -442 -38 34 -27 75 610 -214 -516 -56 54 176 -539 -337 470 -176
4165a76R09j254j73J133k55k98m0j38M71o48Q11j13j06q1j40J77p6Q0m6J75q8
4186A24K07l04K91j96k79J89k98K72L34m71K69l73J88q0L4N9R6j2j06L58m3p48
4208d89Q09l75j92K95l33J48k5J45L6L26k66k58M60k99J15L73q16n7J070k14n65
4229a12o6J90M19k52l66K92l69o2J54O33j123K77L68L14J3K38l43n22M56k4j54
4250c9L97m06l5J31M08l07l50j05M11m50L34m77N95J94k94k23J25O30l67m8q58
4271g34N10m76J266p70p23N46L80j87L37r72J559k02o45Kj46L0O21p64N14n12
4291c66l8P26q10M97o67L82N39n20J45J87O20q20L05O6j68M62p45O9j86p43J605
4312E40j322L57J1P40L31j60m95k24K92p21M29K25k07N48L27q67J039j337K83
$$ plain form
4165 -176 733 -521 -694 439 184 -114 -154 -292 179 -469 342 229 123 42 -98 79 3 83 37 212 124
4186 124 331 27 318 122 -157 32 -266 6 340 -131 138 -235 -47 -127 -93 -34 62 50 -56 302 259 -489
4208 -489 320 -55 -247 48 -285 -137 -162 -17 19 345 79 -179 281 -18 97 470 -346 -403 667 453 -112
4229 -112 -178 12 431 179 -187 105 -264 -326 -172 461 -662 -385 -17 297 310 548 205 -317 139 115 -39
4250 -39 358 -48 -83 48 456 149 -201 -306 105 -345 -11 -488 107 301 7 -216 -91 539 172 124 -734
4271 -734 -224 -700 566 -204 -927 -381 -1 -188 149 -823 736 534 -111 -109 -255 -225 396 -368 146 -366
4291 -366 -404 322 -488 9 -658 -276 263 -257 -112 75 695 -125 180 246 78 540 -205 -136 -322 -1065 540
4312 540 -782 -425 -414 326 657 497 2 -222 70 -651 -222 3 -204 344 671 -196 843 -494 -211
4331b11O98l16k84k97N50j91q9j9j36L2J01J20KR5J97n69k81O06M01r8pj23J9
4354B00l93M09k3k55l36N61m2l96k24K85L35j18m98M36M43k81p04Q13j78L57r74
4375e83R15k58m37R53r68O7l7N1O11k37K51Pl35J27k86N49j97l71k32M14L38l29
4397A3l65K49N1m21N7R24K77l82l91P28q50J220j590P38l64p09O67j90Q71p24
4417a91N38j14m22Q85q27L45R0o24J12O46r67N39J46L50j136R67j78m64K80K20
4437A95O4o02K12K53m84Q36L22m73o73L67p8n52N52j72j51J033o53J82o26O29
4457A81o69N69n43J67Q10J64l75j024N30J13K25P78j211O26N19j565K97M70o08
4476e46q9R33m53l46L31j65N59j02K00o76M68j43J54l8j13q7J39J11j57K15k17
$$ plain form
4331 -211 487 171 -113 -410 140 -51 -140 -159 -295 -263 -162 -42 -40 55 252 -317 -598 8 409 311 304 181 200
4354 200 -193 216 193 -62 -398 163 121 -275 -499 -214 121 3 -495 -59 384 103 -601 212 34 391 -583
4375 -583 332 74 -363 590 -378 -311 -348 -297 314 77 328 335 0 127 -159 390 193 -178 -410 4 342 13
4397 13 -352 -103 -52 -473 -416 508 785 403 12 740 -110 1110 -480 258 -106 -815 -148 -338 533 -191
4417 -191 347 233 -189 696 -131 214 304 -320 -208 438 -529 10 156 506 -630 337 159 -305 -25 195
4437 195 259 -343 -131 122 -362 474 796 323 -350 17 -61 -613 -61 -233 -384 649 -4 178 -448 181
4457 181 -488 81 -462 -295 515 679 304 -720 -190 -77 148 926 -285 341 860 -705 -408 62 -546
4476 -546 -635 298 -155 -501 -170 -335 224 122 322 -354 114 -29 125 87 -26 -113 26 137 -20 195 -22
4497b2K79l46J35o1k42P9L71R3j32o17O51l47k94M74K73p42O33k54L7K88l93K69
4519A32L72l86k62K39r73O03K93n12M51O3J95k1q0m35j52N63L44k60K0n32j99
4540e37K38M2l30O47M14q16K32L96m28q4M62r84M87p2P66q36K84N67n60n4L2o0
4562a94O72o74K34j84K94M36m71k18r2K82K16o59N73o3J89r11M86n3K67p2M7m35
4584c30N70o26J73Q0J78Q7J9r02J506o18m83N72l22M35j62N94j228J360j622K07
4604e12P67j812K439j071m8O33n72K04n1l57M09K55j91N1J53q45M59P72j352P53
4624H4l6L07L48j107L16O6K17L00o41kJ203j082K83qq17K46k62Q32l64k22N02
4645A63p01R47j023Q47k35j24J18k19J06K48J43j98K65L22q10K80p34J307j136
$$ plain form
4497 -22 257 -89 46 -15 -257 -178 193 286 154 -463 188 -159 -453 21 294 -448 185 -69 -32 256 -137 132
4519 132 504 118 -144 95 -878 -275 18 -494 -43 20 215 194 114 -321 -473 90 434 174 194 -338 -537
4540 -537 -299 -257 -587 60 474 -342 -110 286 -142 -226 236 -748 -261 -333 433 -403 -119 448 -112 -166 -134 -194
4562 -194 478 -196 38 -146 148 584 113 -105 -197 85 301 -358 215 152 341 -570 -84 -137 130 58 105 -330
4584 -330 240 -386 -213 -133 45 132 151 -751 755 137 -346 226 -96 339 177 771 -457 903 -719 -512
4604 -512 255 -1557 882 -189 -237 396 -176 28 -23 -380 29 284 93 144 297 -548 -89 683 -669 84
4624 84 48 355 703 -404 -88 -22 195 495 -146 -148 1055 -27 256 248 -569 -323 -585 247 -117 -339 163
4645 163 -538 409 -614 233 -2 -126 -8 -227 -121 127 270 72 337 659 -151 129 -605 702 -434
4664d34J76k46r10J017L57K81l46O40k08j086Q8l10N95l60J071K77j032J125n81
4683A14l44P22m43k67O88o21l35L58P3J38J14k37R75j762P74O14n49oK47J04k99
4704E8J86q33J163R1k3q60P03J20j202R95K16j011J452j284J114r43M65k85K52
4723C74n83n44P18l5j46r8N23n64N58L22L18r18O77l11n07K41M04n89m22j13P83
4744H8j39k25M48q11O60m4M5j84L94n18j10L75M39o41K63nk36L07k73j7L97j93
4766B0M8%j68Q9l7j32J33m2J46j3r1mJ70j66ropQ9j87M6n5J38j52K33O5N6j23
4793D1k25Q55n33R10j139j99Q42j50j14m6p86O21q8k52P13m32j46M65Q32j585
4813d16o74N42j97K16O10K13O8k65p87J58P70j91o83M40p25O04J069o21o75L34
$$ plain form
4664 -434 -258 -504 -1414 -397 -40 241 -105 535 327 -759 -671 -981 -386 -746 325 602 -430 695 114
4683 114 -230 492 49 -218 470 -151 -486 -128 -55 83 197 -40 935 -827 -53 561 12 6 253 357 58
4704 58 244 -589 574 665 642 -218 485 605 -597 398 614 -397 1055 -229 885 -58 407 122 374
4723 374 -209 -753 -35 -70 -216 -314 209 -355 203 525 843 -75 602 291 -216 25 429 -160 -582 -695 88
4744 88 -51 -276 172 -639 21 -23 22 -162 232 -286 -396 -21 418 -223 40 35 -201 106 -167 -184 213 20
4766 20 68 68 -100 -11 -48 -180 -47 -89 57 44 -47 -51 119 -47 -56 -62 -69 20 -167 -121 -176 -38 -190 43 108 164 41
4793 41 -184 671 138 1048 -91 -290 552 402 288 242 -544 77 -11 -263 450 18 -128 337 1169 -416
4813 -416 -1090 -548 -745 -529 81 294 362 97 -690 -532 238 47 -636 -196 -921 -317 752 131 -544 -210
4833b10M32j3M49j145L17q25J341p01l7N53K05r5r8p19J82J008r98M66N00l0o36
4854e4Q26n45p98J050J16l93N58k16p32N12r65K44R97K06o44rM26n69K76k07k47
4875a68j6N29k50j96J52n8m2m12Q61r52K52K34j42L87j72q6j6K71j41j98J57k59
4897b65j5o8N96o29N23o23M14L08n77P76l27k14K69N90q88J9m46R25n10m9N84
4918C93r10N73p0k04M22J16l36P9k62L62m46L99n49M10k13n7Q4k84L21J31j85
4939b26O4K81l94o1J35J06pn8K57K8k32J51J1j81M44k08O4l01K68L09n12j25M0
4962a47K56K16Kj10R4j43o5K22l59j35J61K80m08n4K19l7j30O9j5rK26J19p8k01
4986b7p9n3K30j2P3n3p9J06k23M27k20M5O7k89k85K65R3K80j19q9P3l6J26k26
$$ plain form
4833 -210 222 209 658 -487 -170 -995 346 -355 -392 161 366 271 173 -546 -364 644 -354 112 612 582 -54
4854 -54 772 227 -571 479 595 202 760 544 -188 324 -641 -397 600 806 162 153 579 10 286 79 -168
4875 -168 -184 345 95 -101 51 -7 -49 -461 400 -552 -300 -66 -208 179 7 -79 -95 176 35 -163 -6 -265
4897 -265 -280 -348 248 -381 142 -481 -67 241 -336 440 113 -101 168 758 -130 -111 -557 368 -142 -191 393
4918 393 -517 56 -14 -218 204 320 -16 63 -199 163 -283 116 -433 -23 -236 -293 -209 -493 -172 -41 -226
4939 -226 -162 119 -275 -336 -201 -95 -102 -160 97 125 -107 44 55 -126 318 110 174 -127 141 450 -62 -187 -147
4962 -147 109 325 327 217 311 168 103 325 -34 -169 -8 272 -136 -190 29 -8 -138 -69 -84 -93 133 252 174 -27
4986 -27 -106 -159 71 59 132 79 0 106 -117 310 90 135 202 -87 -372 -107 -14 266 147 58 131 95 221 -5
5010ek00J67k9k8K62r2j33r3MJ21n2m3J12J17m21K32K7M4Q1Om5k17K11o9q1J20
5036dJ65k68J04N0m7q3J5j22J69K13n6K03k06k79J99P7PJ03j51p2m6L4m2LJ30
5061I6r8j83K12j97M08k04K25L06n58o6K50o6J19k79Q9k0ok14j30K46k22r8N28
5084A38m25N96n32M49m33J87l74P03k24M11q32n7M00k7k80l07P86qJ93l73L65
5105C56p4L13o06l87R4J49M93k93M01n14L10j08p66M95m36K60J88J49k88P31j054
5126e87Q84Oj068J655p25J86o25M86q99Q25k02K21n68M58J65k72n1K77Q3j98M22
5147D73o51L69K76n01K49J41n08q62O07L76L37n13M71r3j16n33N32K76k10j24
5167dj91R36r28J00M59j58Q9r5k97j6J02J54J0k61qJ46o3J14j41J5n2o1M3K58
$$ plain form
5010 -5 -205 -38 -67 -95 167 75 -58 -151 -147 -26 -78 -121 -9 108 -313 -81 -54 -10 71 77 32 -185 26 -43 -124 -4
5036 -4 161 -107 -3 47 0 -83 -68 -190 -21 192 136 339 133 -146 53 130 137 240 89 17 -29 5 -37 -34 96
5061 96 -2 -185 27 -170 238 34 259 565 7 -59 191 125 244 -35 54 34 28 -186 -316 -70 -292 -390 138
5084 138 -287 309 -223 226 -207 -20 -394 309 85 496 -336 -393 7 -20 -300 -607 179 171 364 -9 356
5105 356 282 595 -11 -398 -304 -155 338 45 446 -68 242 134 -632 -137 -573 -313 -125 24 -264 467 -587
5126 -587 297 303 -765 890 165 351 -274 212 -687 138 -64 157 -411 47 212 -60 -111 166 249 51 473
5147 473 -178 191 467 -34 215 356 -152 -1014 -407 -31 306 -207 264 171 55 -478 54 330 120 -4
5167 -4 -195 741 -187 -87 372 214 303 208 -89 -105 -3 151 161 -100 -108 38 -25 89 -52 -37 -89 -150 -107 151
5191A51j64m0J7O2J89r7m06L48j4n1Q6M2l18L23j67j34J76N94p90K11M84p65K62
5214ak39M51l65M35l22J54q1j16L30m04J55N6L0m04K74L11k55K00k56R6p3J98
5236A74q2j41J45j66P4j98K36k02J29J39k78Q00p98K77J27l85l6J031j268J88
5256b34J03K6K4J68j06k79M65m32J13R13l53m47R52j180K81P2j24l12N56l39J07
5277b6k4L26j69j92J34j00j7J17j89J15k12J04p7K54L3J14k01J47k61M28k2l90
5299a08J1k4m5N16j96L5Qm60J04l19J20K24J79K7J43O9Km94j38M61N57n29On36
5323c87K01K06o6j94J12Q9M13j01J3j30k45p0L58o20R7j29M91L6M0M91m79J13
5345B39j18l01Q8l39J43L48l38M19l37L53j35Q02j087J94L94n69L42p98Q29M20
$$ plain form
5191 151 -13 -53 -36 26 215 118 -288 60 46 -5 81 123 -195 128 -39 -173 3 597 -193 18 502 -263 -1
5214 -1 -240 211 -154 281 -41 113 32 -84 246 -158 -3 53 83 -321 -47 264 9 209 -47 49 -24 174
5236 174 92 -49 96 -70 4 -194 42 -160 -31 108 -170 630 -168 109 236 -149 -185 846 -422 -234
5256 -234 -131 -105 -81 87 -19 -298 167 -265 -152 761 408 -39 913 -267 14 86 -38 -350 206 -133 -26
5277 -26 -50 276 107 -85 49 -51 -68 49 -140 -25 -237 -133 -210 44 77 191 -10 137 -124 304 282 -108
5299 -108 -97 -121 -166 350 154 189 197 -263 -159 -478 -358 -134 45 72 215 284 286 -208 -346 115 672 143 149 -387
5323 -387 -186 20 -46 -240 -128 -39 374 273 286 156 -89 -159 199 -421 -324 -453 38 74 114 605 126 239
5345 239 121 -180 -92 -431 -288 60 -278 141 -196 157 22 824 -263 -69 325 -244 98 -700 129 549
5365E49K74n08k01N47j210M41N29n06O65L9r44j0R56j40o40j10N22q9P52j636
5385g20R30o45M33R1p3j86j53k01J303k48n73p55RN24N73q23K78N26o30O37m85
5406a88K49k08r9J215j043J19L84L47r36k14Q54j019O97p20K72K64J18N9O1j3
5426A99k44K32J59l54l67O73R7q94M23l24j26M82m8L71m24q6O79O45o64Q5L63
5447H77q67Q11r17m0l65R01k29o5m31K58N6K06n68L75L79n16L17l84J28ql48O77
5469B47n36K44k97q5J4J61L18m14O86l40O69o64q5P1K70j09m25m1K88M76k01j86
5491F1r54M81L04O10m58o63m95J64K92O17l78N75j06J45K0j26l29N98j250P96
5511i6L81p98J247j402P15J2P39j026Q26q74M63m89N80l47N86O5q88P87m37P91
$$ plain form
5365 549 823 315 114 661 -549 -108 421 -85 580 619 -325 -335 621 481 -159 -269 253 164 916 -720
5385 -720 210 -435 -2 89 16 -170 -323 -524 779 531 -42 -797 -788 -264 309 -514 -236 290 -340 297 -188
5406 -188 61 -147 -246 969 -74 45 429 776 -160 -374 480 -539 158 -562 -290 -26 92 151 212 199
5426 199 -45 187 346 -8 -375 298 395 -499 -76 -400 -526 -44 -92 279 -145 -231 448 1093 429 514 877
5447 877 10 821 -96 -136 -501 400 171 106 -325 -67 -11 195 -373 2 381 -135 182 -202 -74 -82 -430 247
5469 247 -289 -45 -342 -427 -413 -252 66 -348 338 -2 667 3 -82 -11 259 150 -275 -316 -28 448 247 61
5491 61 -893 -412 -108 502 44 -619 -1114 -950 -658 -41 -419 156 50 195 215 89 -240 358 -892 -96
5511 -96 285 -513 734 -668 47 59 798 -228 598 -276 187 -302 278 -69 517 582 -306 481 44 835
5531H35j45r87O22n13m12J48J36K78j86k33N38k12j6L29j64l24m6l88R87j70J3
5552I0k04j14K24m2l37K12k54l1J136l49m44k76Q64k89m4q53R86j36J06j86K61
5573C20n47l7n0K37K64j36p53R70L56K58j291M88J024k027J027J2J1N76p74p22
5593g94P21m04o46J576j623J420J017j860P18p23R02R29j415k31M40r81J867j061
5611a48N30n64R37j112Q79K93j134K54j86M36J41O52m00n97N86j277L40n13O57
5630b26K19p03L01M41K99J18p2m5J99j078L18K11k39Q42o52l7k52M58j137J440
5650D05p57p84J085j176J427k40j175J873m37j01J99l00K29l41j31M74M47p0j077
5669d50P36p21R12m39J4K70m17j10j107K073L11j855R25k27k2o70J684j328k36
$$ plain form
5531 835 690 -297 325 -188 -600 -452 -316 -38 -224 -457 81 -131 -147 182 18 -306 -352 -740 247 77 90
5552 90 -114 -228 -4 -46 -383 -171 -425 -456 680 331 -113 -389 475 186 142 -711 275 139 245 59 320
5573 320 -227 -264 -314 -77 187 51 -702 268 624 882 -409 79 1103 -924 103 115 126 702 -72 -794
5593 -794 -73 -477 -1123 453 -1170 250 1267 -593 125 -598 304 1233 -182 -413 27 -954 913 -148
5611 -148 382 -182 755 -357 522 815 -319 -65 -251 185 326 978 578 -19 567 -710 -370 -883 -226
5630 -226 -7 -710 -409 32 331 449 377 332 531 -547 -229 -18 -257 585 -67 -104 -356 102 -1035 405
5650 405 -352 -1136 -51 -1227 200 -40 -1215 658 221 120 319 19 248 -93 -224 250 697 627 -450
5669 -450 286 -435 477 38 52 322 -95 -205 -1312 761 1072 -783 142 -85 -107 -777 907 -421 -657
5688f57J258o25K13r02J11J015o00J45k87Q6N10j598R64O30m27K98o03P45l3P4
5708C17m67O01M1o45K70l10k00K27m9J41J39k09j75K48K02J17o49M56n94K4J9
$$ plain form
5688 -657 601 -24 189 -713 -602 413 -187 -42 -329 -243 267 -1331 -367 263 -164 134 -469 276 243 317
5708 317 -150 451 492 -153 117 -193 -393 -166 -215 -74 65 -144 -319 -71 131 248 -401 55 -539 -515 -496
$$ [...]
8191a91
##END NTUPLES=NMR FID
##END=
