##TITLE=1H ikalashn
DE-76k2_TFA
17.12.2024
##JCAMPDX= 6.0         $$ Bruker NMR JCAMP-DX V2.0
##DATA TYPE= NMR FID
##DATA CLASS= NTUPLES
##ORIGIN= UXNMR, Bruker Analytische Messtechnik GmbH
##OWNER= root
$$ TOPSPIN		Version 1.3
$$ 2024-12-17 16:34:02.343 +0400  Irina@DPX200
$$ Compression mode = diff/dup
##.OBSERVE FREQUENCY= 200.131300845
##.OBSERVE NUCLEUS= ^1H
##.DELAY= (6, 6)
##.ACQUISITION MODE= SIMULTANEOUS
##.ACQUISITION SCHEME= undefined
##.AVERAGES= 32
##.DIGITISER RES= 18
##SPECTROMETER/DATA SYSTEM= spect
##.PULSE SEQUENCE= zg
##.SOLVENT NAME= CDCl3
##.SHIFT REFERENCE= INTERNAL, CDCl3, 1, 17.49637
##AUDIT TRAIL= $$ (NUMBER, WHEN, WHO, WHERE, WHAT)
$$ ##TITLE= Audit trail, TOPSPIN		Version 1.3
$$ ##JCAMPDX= 5.01
$$ ##ORIGIN= Bruker BioSpin GmbH
$$ ##OWNER= Irina
$$ $$ F:/spectra/data/iren/nmr/1H/4/audita.txt
$$ ##AUDIT TRAIL=  $$ (NUMBER, WHEN, WHO, WHERE, VERSION, WHAT)
(   1,<2024-12-17 16:33:42.546 +0400>,<Irina>,<DPX200>,<TOPSPIN 1.3>,
      <created by zg
	started at 2024-12-17 16:31:30.015 +0400,
	POWCHK disabled, PULCHK disabled
       configuration hash MD5:
       BE 6D 3F 07 2A EA 11 49 91 17 2B D3 AF B3 58 0D
       data hash MD5: 16K
       C6 0F CA 5B 1C 02 DC 3C B4 71 88 61 CA F4 5C B5>)
$$ ##END=
$$ 
$$ $$ hash MD5
$$ $$ 88 79 B5 89 37 E6 A3 AC CE BB 42 E6 66 13 8B 4B
##$RELAX= 
##$RELAX= 
##$RELAX= 
##$RELAX= 
##$RELAX= 
##$RELAX= 
##$RELAX= 
##$RELAX= 
##$RELAX= 
$$ Bruker specific parameters
$$ --------------------------
##$DU= <F:/spectra>
##$EXPNO= 4
##$NAME= <1H>
##$PROCNO= 1
##$TYPE= <nmr>
##$USER= <iren>
##$AMP= (0..31)
100 100 100 100 100 100 100 100 100 100 100 100 100 100 100 100 100 100 
100 100 100 100 100 100 100 100 100 100 100 100 100 100 
##$ANAVPT= -1
##$AQSEQ= 0
##$AQ_mod= 1
##$AUNM= <au_zg>
##$AUTOPOS= <>
##$BF1= 200.13
##$BF2= 200.13
##$BF3= 200.13
##$BF4= 200.13
##$BF5= 200.13
##$BF6= 200.13
##$BF7= 200.13
##$BF8= 200.13
##$BYTORDA= 1
##$CFDGTYP= 0
##$CFRGTYP= 5
##$CHEMSTR= <none>
##$CNST= (0..63)
1 1 145 1 1 1 1 1 1 1 1 1 1 1 1 1 1 1 1 1 1 1 1 1 1 1 1 1 1 1 1 1 1 1 
1 1 1 1 1 1 1 1 1 1 1 1 1 1 1 1 1 1 1 1 1 1 1 1 1 1 1 1 1 1 
##$CPDPRG= <>
##$CPDPRG1= <>
##$CPDPRG2= <>
##$CPDPRG3= <>
##$CPDPRG4= <mlev>
##$CPDPRG5= <mlev>
##$CPDPRG6= <mlev>
##$CPDPRG7= <mlev>
##$CPDPRG8= <mlev>
##$CPDPRGB= <>
##$CPDPRGT= <>
##$D= (0..63)
0 2 0 0 0 0 0 0 0 0.06 0 0.03 0 0 0 0 0.0002 0 0 0 0 0 0 0 0 0 0 0 0 0 
0 0 0 0 0 0 0 0 0 0 0 0 0 0 0 0 0 0 0 0 0 0 0 0 0 0 0 0 0 0 0 0 0 0 
##$DATE= 1734438817
##$DBL= (0..7)
120 120 120 120 120 120 120 120 
##$DBP= (0..7)
150 150 150 150 150 150 150 150 
##$DBP07= 0
##$DBPNAM0= <>
##$DBPNAM1= <>
##$DBPNAM2= <>
##$DBPNAM3= <>
##$DBPNAM4= <>
##$DBPNAM5= <>
##$DBPNAM6= <>
##$DBPNAM7= <>
##$DBPOAL= (0..7)
0.5 0.5 0.5 0.5 0.5 0.5 0.5 0.5 
##$DBPOFFS= (0..7)
0 0 0 0 0 0 0 0 
##$DE= 6
##$DECBNUC= <off>
##$DECIM= 32
##$DECNUC= <off>
##$DECSTAT= 4
##$DIGMOD= 1
##$DIGTYP= 9
##$DL= (0..7)
0 120 120 120 120 120 120 120 
##$DP= (0..7)
150 150 150 150 150 150 150 150 
##$DP07= 0
##$DPNAME0= <>
$$ [...]
##$SW= 21.9926040160658
##$SWIBOX= (0..15)
0 0 2 0 0 0 0 0 0 0 0 0 0 0 0 0 
##$SW_h= 4401.40845070422
##$TD= 16384
##$TD0= 1
##$TE= 300
##$TE2= 300
##$TE3= 300
##$TEG= 300
##$TL= (0..7)
0 120 120 120 120 120 120 120 
##$TP= (0..7)
150 150 150 150 150 150 150 150 
##$TP07= 0
##$TPNAME0= <>
##$TPNAME1= <>
##$TPNAME2= <>
##$TPNAME3= <>
##$TPNAME4= <>
##$TPNAME5= <>
##$TPNAME6= <>
##$TPNAME7= <>
##$TPOAL= (0..7)
0.5 0.5 0.5 0.5 0.5 0.5 0.5 0.5 
##$TPOFFS= (0..7)
0 0 0 0 0 0 0 0 
##$TUNHIN= 0
##$TUNHOUT= 0
##$TUNXOUT= 0
##$USERA1= <user>
##$USERA2= <user>
##$USERA3= <user>
##$USERA4= <user>
##$USERA5= <user>
##$V9= 5
##$VALIST= <valist>
##$VCLIST= <CCCCCCCCCCCCCCC>
##$VD= 0
##$VDLIST= <DDDDDDDDDDDDDDD>
##$VPLIST= <PPPPPPPPPPPPPPP>
##$VTLIST= <TTTTTTTTTTTTTTT>
##$WBST= 1024
##$WBSW= 25
##$XGAIN= (0..3)
0 0 0 0 
##$XL= 0
##$YL= 0
##$YMAX_a= 652315
##$YMIN_a= -691379
##$ZGOPTNS= <>
##$ZL1= 120
##$ZL2= 120
##$ZL3= 120
##$ZL4= 120
##$ABSF1= 10
##$ABSF2= 0
##$ABSG= 5
##$ABSL= 3
##$ALPHA= 0
##$AQORDER= 0
##$ASSFAC= 0
##$ASSFACI= 0
##$ASSFACX= 0
##$ASSWID= 0
##$AUNMP= <proc_1d>
##$AXLEFT= 0
##$AXRIGHT= 0
##$AXTYPE= 0
##$AXUNIT= <>
##$AZFE= 0.1
##$AZFW= 0.1
##$BCFW= 1
##$BC_mod= 2
##$BYTORDP= 1
##$COROFFS= 0
##$CY= 7568.61572265625
##$DATMOD= 1
##$DC= 2
##$DFILT= <>
##$DTYPP= 0
##$F1P= 17.9538593292236
##$F2P= -4.03888763876832
##$FCOR= 0.5
##$FTSIZE= 32768
##$FT_mod= 4
##$GAMMA= 1
##$GB= 1
##$INTBC= 1
##$INTSCL= 1
##$ISEN= 128
##$LB= 0.02
##$LEV0= 0
##$LPBIN= 0
##$MAXI= 945.577
##$MC2= 0
##$MEAN= 0
##$ME_mod= 0
##$MI= -402.1523
##$NCOEF= 0
##$NC_proc= 0
##$NLEV= 6
##$NOISF1= 8.587773
##$NOISF2= 6.764455
##$NSP= 1
##$NTH_PI= 0
##$NZP= 0
##$OFFSET= 17.49637
##$PC= 1
##$PHC0= 254.3507
##$PHC1= 4.527569
##$PH_mod= 0
##$PKNL= yes
##$PPARMOD= 0
##$PPDIAG= 0
##$PPIPTYP= 0
##$PPMPNUM= 100
##$PPRESOL= 1
##$PSCAL= 0
##$PSIGN= 0
##$REVERSE= no
##$SF= 200.13
##$SI= 32768
##$SIGF1= 18.5376
##$SIGF2= -6.396296
##$SINO= 400
##$SIOLD= 32768
##$SREGLST= <1H.CDCl3>
##$SSB= 3
##$STSI= 0
##$STSR= 0
##$SW_p= 4401.40845070422
##$SYMM= 0
##$S_DEV= 0
##$TDeff= 0
##$TDoff= 0
##$TI= <>
##$TILT= no
##$TM1= 0
##$TM2= 0
##$TOPLEV= 0
##$USERP1= <user>
##$USERP2= <user>
##$USERP3= <user>
##$USERP4= <user>
##$USERP5= <user>
##$WDW= 1
##$XDIM= 8192
##$YMAX_p= 0
##$YMIN_p= 0
$$ End of Bruker specific parameters
$$ ---------------------------------
##NTUPLES= NMR FID
##VAR_NAME=  TIME,          FID/REAL,        FID/IMAG
##SYMBOL=    X,             R,               I
##VAR_TYPE=  INDEPENDENT,   DEPENDENT,       DEPENDENT
##VAR_FORM=  AFFN,          ASDF,            ASDF
##VAR_DIM=   8192,          8192,            8192
##UNITS=     SECONDS,       ARBITRARY UNITS, ARBITRARY UNITS
##FACTOR=    0.0002272,     1,               1
##FIRST=     0,             0,               0
##LAST=      1.8609952,     -283,            -92
##MIN=       0,             -691379,         -691379
##MAX=       1.8609952,     652315,          652315
$$ Real data points
##PAGE= N=1
##DATA TABLE= (X++(R..R)), XYDATA
$$ [...]
2068b14J78p21L54P75l77L2K09m87M58m64M31P5j85n6J82j15Q4j53k90K49k38
2089b73K98p3l28R3J02m9p3M15r8L0j51j17K5L72Jk42N05n07J94j61j26L80l93
2112a76M8L65j75p9j60J71j66M3k07K30l64M87l3L1j15m84N21j12oL4J91K24M2
2135C10k85J11j79j29L39p62O21k0p0J76o0n00R57o06l8K67J85m12M73j88k30
2156d0l33P20n6l84M54n71N19k49k49M3N12l42K04l44L4J57k51l06N52J43l02
2177h9N4k17J91J88j88L0p4J49q6K81l67M26m4L2l22o8J69J94K39j99j46l33L37
2200A57o7k87L4m8K25j14J8J43j78L37l06K00k03q1N6K24j25L23j81j94J84l56
2222b39j63M10J96k99L92m82L94l34j7K08J16l84L05m01M90m00k74N42NK76M0
$$ y = [-214, -36, -757, -403, 372, -5, 27, 236, -251, 207, -257, 174, 249, 64, 8, 190, 75, 159, 6, -284, -35, -273, 25, -48, -376, -283, -181, -230, -303, 112, 14, 44, -107, -224, -199, 173, 174, -68, 437, -70, 124, -37, -163, 217, -176, -128, 237, 62, -17, -177, -6, -172, -129, -336, -106, -470, 17, -16, 15, -100, -584, -63, -175, -181, -147, 44, 268, 310, 25, 136, -43, -172, 167, -595, 26, 6, -64, 112, 52, -448, 509, -97, -135, 132, 317, -95, 378, 190, -40, -373, 347, 291, -93, 361, -210, 309, 60, -189, -146, 366, 24, 228, -116, -82, 75, -176, -482, 70, 213, -89, -35, -252, -61, 127, -61, -31, -105, 44, -42, 239, -128, 298, 254, 286, -36, -104, 65, 259, 498, 299, 153, -180, 157, 90, -197, -163, -211, 14, -100, -82, 61, -117, 220, -86, 114, -89, -170, -114, 110, -15, 308, 127, -67, 117, -239, -402, 8, 204, -95, 297, -185, 209, -125, -142, 66, 182, -202, 103, -298, 192, -208, -482, 60, 65, 341, 381]
2243C81o7o10J08k6K99p7j06m7N6L33l60N6K50n41P36l31l63J79M78m67K2J32
2265C5J49k50K3L9J0J43k6l0K07k51j20K85r6k16M0r3o6J61j12k12J31M65m26
2288b10O26n74K08K7k94J10J25L7J90m09J3p6J16J6J95k72R8J60nL2J37k58j69
2311a77J61N21q97J31J34kq7K24l50J92K58r3M00l95N5l48M5N12l61j09J53l23
2333c56N99k81L7J39j24J02p6k89K73l8K81k09j86P6r4l28L11p4M98j26rJ6j5
2356A27j16r5L23m03K18m05M21L0n69K62N3M42R1m12j24J50K10o3m87K96j99J08
2378a42J77j60J51j04J27M1J40j23l11L29R7l79Q6J27K30m01J75n16K36N1K40
2399G1j94M37k93k8Q7K39j91j07k41O0O23m02j54p6L10K3j6l65K07J54J8l46j00
$$ y = [381, 314, -296, -188, -214, 85, 8, -98, -145, -89, 244, -116, -60, 190, -351, 385, 54, -309, -130, 348, -119, -97, 35, 184, -66, -43, -4, 6, 149, 123, 93, 300, 49, -71, 214, 118, -98, -58, -151, -217, -56, -168, -380, -249, 216, -210, 416, -158, 50, 77, -217, -107, 18, 55, 245, -164, -151, -227, -111, -95, 100, -172, -74, 86, 81, 113, 250, -8, -177, -16, 505, -392, -261, -127, -129, -216, 8, -342, -150, 108, 15, 415, 20, 75, -273, -228, 284, -77, -186, -33, -356, 243, -38, -1, 138, 14, 116, 40, -249, 24, -14, 267, 58, -128, -52, -146, -474, -163, -237, 261, 135, 126, 142, 127, 11, -84, 239, -164, 54, -351, 70, 100, -469, -207, -154, 288, 379, -33, -157, -7, 203, 140, -347, -51, -250, -142, 35, -125, 26, -78, 49, 90, 230, 107, -204, 125, 222, -157, -71, 56, 286, -115, 60, -456, -220, -169, 71, -123, 314, 21, -7, 80, 319, 128, 21, -220, -160, 463, 61, -93, -169, 141, 164, 148, -217, -10, 144, 162, -184, -284]
2422b84k2L44k32L41N0J9k63J11p5o2rl19L23P6Q6j07J29l0j81o1O5J32J00j13
2446A8m77L41J54J0J51j54j76J13o1k38N55k61J72k01K6J02l7J92k38j25J40K8
2468C4J0J16k28J82k20Jl39M58J07k88O0q6J17J03j09o0P6Oj45K75J16j86L7L2
2492F9K37k51Q8n8K3j29m9Q3j70L20M3j90Qj11P7j87r3r8N04j10j29k60K54R9
2516c0J14P8m81N30j62j76K27j99K12m4m74L84J65K0k20j51m6O63n79M14l83M8
2538i0L00n35N49m5m2N3k84J12M6J74l34J03j26J01J34jk07J80l8kj13j8J92j07
2562Bq8J99J10n08NN40j60n0j82L02j7j1r6J12j87l33L17K41O0l61J91n2j71M35
2586B98J3j72k03PN2NlO4l5J43m0j79l2J50m52M66j53K83j14p8L0J42k10p5J36
$$ y = [-284, -306, 38, -194, 147, 197, 216, -47, 64, -11, -73, -82, -401, -78, -2, 84, -23, 106, 76, -105, -166, -101, 31, 131, 18, -459, -118, 36, 46, 197, 43, -133, -20, -81, -319, 236, -25, 147, -54, -28, 74, 37, 229, -9, -134, 6, 34, 44, 160, -68, 114, -106, -105, -444, 14, 121, -167, -107, -193, -76, 27, -82, -142, -66, -60, -205, 70, 186, 0, 37, 69, 306, 55, 143, 85, 108, -21, -70, 13, -157, 163, 206, 16, 24, -87, -10, -197, -290, -388, 116, 6, -123, -383, -129, -30, 84, 162, -319, 211, 49, -127, 100, -99, 113, 69, -405, -21, 144, 164, -56, -207, -253, 410, -169, 245, -138, -90, 210, -325, 224, 179, 137, 190, -94, 18, 64, 238, -96, 7, -119, -18, 116, 115, -92, 88, 50, 48, -65, -83, 109, 2, -86, 113, 223, -285, -280, 260, 100, 50, -132, 170, 153, 142, 46, 158, -29, -362, -45, 196, 256, -105, 86, 34, -137, 298, 311, 139, -64, -57, -5, 0, -3, 61, 26, 169, 129, -50, -82, 68, -384, 82, -71, 212, 98, 20, 50, 192, -18, -93, 43]
2611D3Ll80k8M50Pj57q9l0N6k6L43n27O44m31K62j98j50J59K28O3K5n13l9O13
2635C28l47J17R2k12j90J24L07Q4m21L53q2k6l22J22j16M4K75k22j6l32P01k61
2657@k47k1K28J29q9J18n7N0m3k09L6K03j95J22L5Q3n32L15L41J8L7j82j22N7
2681G5k15k9K37r5J20LJ23m32k45M71P3l17K86j9O3j6j54j69M55Rl34N0N4lj00
2706a09RqK21j44n9j89K26R3j27R7L07m97J95M7j21k5J29l2L02m41m5L25k00j4
2730f0k85M19J31l19oN3r0l7pJ28k10M43N2J12m52K51j85J66J88j08j67k5r7J49
2754D4L8j70j03O3j75J42J91p9K83n11M52k32k7K05k88K94l66N20k31K03k23j07
2776g7k8k32J02L35m91N56n8j51J19n0Q3l36K64JNJ59m33L3L24j63K6N3q2L54
$$ y = [43, 46, -334, -362, 88, 95, -62, -151, -181, -125, -151, 192, -335, 309, -122, 140, -58, -208, -49, 179, 242, 267, -246, -285, 328, -19, 98, 190, -22, -212, -88, 219, 303, -118, 235, 153, 127, -195, -73, -189, -145, 130, -92, -108, -440, 261, 0, -247, -268, -40, 89, 0, 118, 61, 111, 68, -141, -105, 98, -97, 25, 60, 143, -389, -74, 267, 285, 322, 140, 18, 75, -140, -169, 68, -27, 93, 96, 219, -213, -458, 13, 86, -231, 55, 36, 99, 83, -71, -240, 215, 224, -110, -60, -6, -9, -109, -100, -108, 113, -31, -90, -279, -53, 40, -87, 10, 317, -180, 15, 62, -59, -84, 45, 13, 315, -126, -171, 154, -46, -60, -345, 74, 205, -114, -120, -67, -157, -194, -201, -73, -283, 160, 212, 324, -128, 123, -62, 104, 292, 184, 17, -8, -105, 44, 82, -88, -191, -128, -303, -161, 30, -49, 234, -277, 175, -57, -84, 121, -167, 127, -239, 281, 50, 253, 30, -77, -105, -337, -235, 100, -391, 165, 107, -44, 75, 25, 108, -228, 36, 37, 42, 201, -232, -199, 125, -38, -12, 41, -41, 313]
2800C13p39M89l17J16l6n8J51J93m9k99L99M9k03L91o22K92k39K65J80j65q2n6
2822b7m9N6j66J90L3L33l74K81r77O97J86l09K13K5p41N66Q78j252O56n75N77
2843B21J6k29j11l1k20N44km96J30k42M21K30m77M91j36J75n63J47Q0k65J21J45
2865e1l27L98j18j63p7L70Mm41K60K42L66p83L09m6Nj27K00k49L9j39L60p7L3
2888a2J7j78L34j93k00M74m37K12m9lM5k94n1M70m5k90L03r9J71m8j79L50q0j59
2912E9p4J0o3J19K35q5n95L43K02j39K05J55m33P4J11m42N54l85K68k06LR0J66
2935A72l12k15L26p7j56K95j15j81L37P6j19O1L83p98M34j39J28j98J46l8l8J48
2957A20m23K95m0j8N6K65k52K35m69L53l76M39k04l6r7K92R1k74o0J22J2J5K6
$$ y = [313, -426, 63, -254, -138, -174, -232, -81, 112, 63, -236, 163, 212, 9, 400, -222, 70, -169, 96, 276, 111, 29, -27, -76, -20, -186, 4, 37, 370, -4, 277, -700, -3, 183, -126, 87, 112, -629, -63, 815, -437, 219, -356, 221, 237, 8, -103, -134, -354, 190, 188, -308, -178, -420, 1, 231, -246, 245, 109, 284, -279, -132, -52, -317, -196, -51, -378, 20, -98, -261, -338, 32, 36, -405, -145, 97, 463, -320, -11, -57, -52, -179, 21, -228, -189, -328, 32, -45, -12, 5, -173, 161, -32, -232, 242, -195, 17, -32, -35, 10, -284, -335, 135, 90, -200, 103, 4, 175, 127, -52, 298, 218, 59, -15, -5, -68, 51, 286, 201, -394, -51, 151, 12, 217, 372, -61, 13, 124, -318, 236, -149, 119, -87, -84, 6, 172, -140, -355, -29, -106, -262, 33, -82, -263, 74, 150, 31, 92, 475, -323, 111, -28, 100, -98, 48, 10, -28, 120, -303, -8, -48, -66, -10, 255, 3, 238, -231, 122, -254, 185, -19, -55, -152, 140, 231, -43, -103, 19, 31, 46, 72]
2980G2k38J80m2J07j59p8L85k09k29L63k90J26l1m05N02J83l65l2kJ14j07J59
3002Dj16Q3J82L9j21K04l52J08JL60l85n8L46m1k61L1n3J09j51L44j83j5j66K66
3026A75J0j95J52m23J70K0J87k4r6j37J94j47J11l9L3M2j19J27O5J33k9k25O6
3049E1K32l50N7R8P9k08J54l74J14K03k99M97m9k43O6K43j92k6K72m08K57j94
3071b0M7k01Q10o05m05J71K68k1R1j46K90k02j02J72l19P6j21O5J97k0k54J18
3093a11L8K8J69k30M48n29K64j05R9ql45N39l98O58n57j10L19J53j39J08k48j63
3115a20J72jj53P2k8L35l9l03QK10r6j37J07q0m3R6R6k12L6m9L96k01m1L86k32
3140A79l75J64K44j30j37l4PN8N9J50m27M04K4m03J24M08n52J14J58k27J24J69
$$ y = [72, -166, 14, -28, 79, -80, -158, 227, 18, -211, 152, -138, -12, -43, -448, 54, 237, -128, -160, -162, -48, -155, 4, -112, -29, 153, 192, 71, 275, -77, 31, 32, 392, 7, -51, 295, 254, -7, 24, -29, 80, -71, 273, 90, 75, -91, 175, 185, -10, 142, -281, -111, -91, 96, 72, -24, -161, 33, -114, -3, -42, -9, 33, -86, 41, 106, 239, 210, -15, 51, 283, -67, -10, 88, 167, -41, 113, -261, -147, 56, -243, 254, 205, -38, 28, 271, 79, 53, 325, -83, 174, -20, 27, -174, 636, 31, -374, -203, 65, 44, 135, -11, 279, 77, -25, 147, -172, -96, -217, -152, 45, 25, -229, -111, -73, -45, 124, -106, 342, -187, 77, -28, 71, 63, -282, 257, -141, 517, -40, -150, 169, 322, 183, 291, 43, -120, 52, 51, -102, -30, -58, 277, 238, -65, -57, 153, 57, -80, 27, -53, -96, 0, 96, -116, -80, -129, 267, 66, 25, 411, 179, -196, -32, 212, 82, -55, -89, -82, -24, 35, 185, -242, 162, 186, -217, -93, 315, -237, -123, 35, -192, -68, 101]
3162A01l56j0N87l47L3P0m11K04j47L59o8k16K13m25M47l3k81n5K8l14N65M25
3184C69j70j44J00L6K97o76R4O5J75k14j26J29M11k66r6P3J52l23J75j65J15j51
3206a40j31M83k19R0k8K5m9j11L51m37K7J4q6j8K46J8m50N02J83k46k36L67l84
3229b29M43m16L59j40o0j21K06m9k30N21l90K91M9j28m08L27k9o6K92k00M7k14
3251a45J39J88k42M11l17Q6K62m96J53N2k15K84l07J61J67k57P2P2M5r9j13K96
3273A97k3N7q4k08m6L38q8j41J20j09J38p0J73l44K42j85P2K34n54K22j15N12
3295C38l71J12k95K10l09L55j89L76J87o18K04p4K16O8l02k31L19K33m29P0m6
3316a76O9J62k16J13J45N9k59N8k17r1L63k53M60o6j84J0J54j69J58l6j14M25
$$ y = [101, -255, -265, 322, -25, 8, 78, -333, -129, -276, 83, 15, -201, 12, -413, 34, 1, -280, -335, -307, -621, -56, 369, 199, 55, 155, 191, 488, -188, -94, -29, 146, -68, -194, -65, 346, 80, -16, 57, 209, -114, 61, -104, 11, -140, -271, 212, -7, 83, 55, 80, 31, -80, 271, -166, -139, -125, -211, -229, 17, 35, -415, 87, 270, 24, -212, 155, -229, 214, -202, 157, 17, -43, -164, 42, -7, -237, 284, -106, 185, 234, 106, -302, 25, -4, -70, 222, 22, 69, -145, -6, 182, -60, 351, 34, 120, 382, -114, 39, 91, -124, 160, -147, 14, 181, -76, -4, 68, 113, 14, -99, 197, 174, 231, 147, -61, -107, 231, 143, 2, 122, 13, 151, 81, 254, -90, 152, -33, 39, 273, -281, -59, -174, 338, -33, 79, -216, -6, -315, 40, -149, 227, 414, -204, 0, -74, 142, 210, -92, -323, -4, 229, -200, -130, -176, -107, 55, -161, -48, 97, 156, -103, -45, -262, -353, 10, -243, 217, 151, -33, -23, 131, -38, 120, 84, -30, 395]
3338C95n65J57j26N9L1K81r3K10k05k17r1j34N14l21K57l93QL48r3k58J58j17
3360a95J02K08j33J83k06J23j98%J91j28k54L91K8M9l38L38n01L86p6q6R4K93
3382B71n14M51J90m35K21j41j53L26p4m33L44J63n19J47L05l58K81l19L32j1k20
3403a46PN1n1J44j7K6K8K85k76O6j10j36n0j72K73j68K21J93k24lK86J23l50J9
3427A9M7j12j6K6K22l66K0J89p7j61J95j9J30K16l06J43o3m28j24P34m12L46k11
3450hK42n6O7L2j73j26j19K58l24M18l73L33l74J41j52M55l01j05l7L34n05K84
3472h9K85n5m16K45L59m07K70j19K1L8qk18J50j32O4j01K41j12NK65l41q9J87
3495D3J12j78q5k65N98j76L3k37J49K43o4j49K5J61p8l28K48O5n8L93n04Q4K4
$$ y = [395, -170, -13, -139, -80, -49, 232, 139, 349, 144, -73, -164, -298, 216, -105, 152, -241, -233, 115, 22, -236, -78, -195, -93, 115, -18, 165, -41, 82, -116, -116, 75, -53, -307, 84, 112, 161, -177, 161, -340, 46, -30, -116, -22, 271, -243, 208, 398, -37, 184, 43, -110, 216, 142, -291, 53, 216, -303, -156, 149, -209, 72, -247, 85, 74, -146, -139, -88, -139, 5, -12, 14, 42, 327, 51, 117, 7, -129, -179, -351, -78, -246, -25, 168, -56, -59, 227, 350, 0, 19, 66, -46, -62, -36, 186, -180, -160, 29, -48, -209, -14, -33, 97, 313, 7, 150, 87, -341, -465, 269, -143, 203, -8, 234, 178, 245, 277, 104, -22, -141, 117, -207, 211, -162, 171, -203, -62, -214, 241, -60, -165, -202, 132, -373, -89, 196, 141, -275, -30, 329, -78, 192, 73, 94, 132, 124, -94, 56, -76, -12, -113, 128, 16, 21, 286, -55, -144, 43, 155, -23, -108, -373, 225, 49, 82, -155, -6, 237, 173, 24, 49, 210, 132, -196, 52, 117, 59, 452, -52, 32, 56]
3518E6o0K11l39M00l05O9l1j21R2K15l96L05j31j56J43k99L51l71L63J40m37K73
3540b8j0L46j67j28J36poK1j7k7j67Q5J4L42K7n88K68q9K10m12J75l30L50K7j47
3565a22N15l48k23K26rm0j67o9J32K47N1p7j87L3K22k76n3N3j93M10j78k66K62
3588e7l0L30l58j41L47L1n0j17j68K18K12k55o6k55L49l6K71l44j08J50L98j65
3610A56Q2l30K56m74K52K11l61K68Kj25n3J56j4K55j93j2l41k5kM81j79L2N5k42
3634a45L53k65M10O2m73K70l13K75k97J70J86j70k24L09l71L6K41o1J29k27J52
3655D7p7J5R0k88M4M61k64Q6r4o1M5j70J29L8j51M98l83L92l34k38M56k1k00J02
3679A22P7l67j1N2J35K28k12L9j84J28J45j55L85m20K77l60p8J07J12N3J99n58
$$ y = [56, -4, 207, -132, 268, -37, 32, 1, -120, -28, 187, -209, 96, -35, -191, -48, -347, 4, -367, -4, 136, -301, -28, -38, 308, 141, 13, 149, 142, 136, 157, 140, 113, -54, 31, 45, 387, 414, -174, 94, 5, 215, -197, -22, -352, -2, 25, -122, 393, 45, -178, 48, 39, -1, -168, -237, -105, 142, 193, 116, -71, -38, 184, -92, -145, -92, -285, 125, -53, -319, -57, -87, 243, -115, -256, 91, 122, 72, -45, -213, 5, 217, -38, -104, -359, -10, -46, 225, -119, -227, -77, 321, 156, 238, -92, 164, -310, -58, 153, -208, 60, 62, -63, -116, 40, 26, 281, 88, 76, -265, -290, -292, 189, 10, 42, 97, -145, 208, -57, 353, 415, -58, 212, -101, 174, -123, 47, 233, 63, -161, 148, -223, -187, 54, -7, 122, -105, 47, -30, -15, 75, -213, -169, 292, 28, 114, 20, -41, 4, -166, -37, 1, -150, 348, -35, 357, 23, -215, 241, 220, 20, 122, 199, -168, -179, -127, 8, 236, 24, 63, -121, 7, 152, -3, 382, -38, 239, -121, -199, -92, 20, 73, 272, -286]
3701b86L94J31m14J56N5j49L32m66K44k4k51M67k02J14j60k14L07J16j78L58o24
3722b94O24m52m1L58j01O1k87j44k65O03j16K08L4j04k70q8L2K74k04J67K74j90
3744G9nJ3l65K22m6J67J56L9j5n48J83n6J63j65L48m28O21n02M40n71M38j98l09
3767c39J12KK52L33j78Q4m03K82J02J84k20l46j97Q9M26m26N73k58Nk00M01k44
3789C4K26m61L88j97p8L3k77L71m4k22P0J04K48l15k94L94J15N3j7k30L63j58
3811A06j21L27j28l3j87l7R4K3j48l3J00o6j48r3J03Q4p8N30l15J87k14k0L6J07
3835G6p1k40L40P5m22K18K70k15J92m61L07R6l1k56M44k55p2P8l94L53k37j51
3857c56R9N30o67M96J5j29LL1m5J02J29k48M8k28J67k14N18l10N3p5J37k0k36
$$ y = [-286, 108, 239, -175, -19, 36, -113, 219, -247, -3, -27, -278, 189, -13, 101, -59, -273, 34, 150, -28, 330, -294, 330, -122, -163, 195, 94, 155, -132, -276, -541, 62, -54, 154, 188, 84, -186, -274, -242, 32, -172, -5, 269, 79, 74, 87, -278, -56, -102, 65, 221, 260, 245, -303, -120, -176, -13, -178, 170, -258, 363, -139, 301, -270, 168, -30, -339, -227, -225, 27, 360, 182, 266, -137, 145, 247, 431, 211, -135, -332, -243, 183, -243, 330, 72, 77, -123, 278, 34, 260, -201, 187, -10, -88, -55, -332, 39, -5, -227, -157, -53, 195, -120, -414, -20, 95, 148, 131, -99, 264, 106, -15, 312, 184, 151, -36, -73, 21, 44, -104, -137, -37, -103, -251, -344, -241, -157, -235, 295, -20, 167, -47, -67, -31, 76, 5, -235, 105, 180, -242, -24, 246, 31, 223, -238, 69, 165, 134, -122, 322, 67, -5, 73, -321, 32, -205, -356, -257, 273, -394, 102, 117, -12, -9, 22, -23, 79, 208, -40, 8, -220, -53, -267, 251, -59, -6, -81, 56, 36, -200]
3880b00M47m11L44J8k29J27L3k33j79L50k32K84k38K7J51J01j47M5N5k60K26N2
3902A31k00L3k06K35k20K96j93N5J21M5J80o07L31j71J55K9j11q6J96k53K08K45
3924B13j43j35K70j46K40n22J08L2J87J69k90L96m63J33J35l43J96k58M15k09
3944a5Q4M6j84k85J13ON43n32L35K4J7k20Q4M50m31J44L3j00k05k11L64J7J09
3967A86n58N18q1J73Q9k93k47N28l40J78l68N4K37j57P6p1p9p8M31l60MK41j21
3990c8P6O6O2l82J28N31k85rk05j15J28K80l63M76o01J56L44j18j93q6J10J62
4012A24R7O3j60R5l18j96L35RN2j1o23Q11l80J22K01M1l87K1J61l92K91L73m6
4035B83k64Rj67K16l06L42n4j03j95L31Oj36M85m29J39k69J31J42K1J55l22R6
$$ y = [-200, 247, -164, 180, 198, -31, 96, 129, -104, -283, 67, -165, 119, -119, -92, 59, 160, 13, 58, 113, -147, 79, 131, -69, -36, -242, -7, -227, 69, -124, -69, 52, 97, 277, -330, 1, -170, -15, 14, -97, -183, 13, -240, -32, 213, 70, -65, 205, 59, 299, -223, -115, -83, 104, 273, -17, 379, -84, 49, 184, -159, 37, -221, 194, -15, 69, 115, -69, -354, -241, -235, 308, -224, 111, 135, 152, -68, 16, 466, 35, 179, 212, 112, -93, -304, 60, 77, 186, -372, 146, 65, 238, 327, 34, -213, 315, -25, 153, -215, -161, 76, -81, -5, -76, -155, -233, 198, -162, -158, 83, -38, 38, 104, 166, -216, -88, 443, 158, 149, -56, -171, -43, 237, -126, 350, -251, -95, 249, 131, -62, -148, -38, 124, 221, 284, 124, 219, -99, -295, 40, 49, 101, 90, -533, 278, -102, 20, 221, 262, -125, -104, 57, -335, -44, 329, 283, 19, 28, -139, 77, -229, 113, 59, -44, -239, 92, 98, -38, 447, 18, 157, -112, 19, 161, 182, 337, 15, 111]
4057A11J25j61k49J40L1J87l1k70K94n5m08L74l50M10j39n6P1r5J21m34L01j41
4079b24J26J23K55m66M2J36N4k56L83l7K56n40O03K10l75l47R9N5k87KL60M3k28
4102a3M31j51l5l48L20l17P3p0M25n33M6L26j31m0m6J33K81m56K17k58K55P3n95
4125d13Q82k98m77M12K98p87L17k24K34j6p0K33l20M5M29m47N42k0m96L15PN93
4147G39p08j88m18L87R1M3j51N46k68L05m14J10K59l29l07j58K35j28QM88n72
4168d30J83K85J37o04L28O07p20L40J98p59N10j56k69M19J87j60m16J85k36L40
4188c1L68k19J23j75K05Mk77j18j19J89K3O6K9J10l36K00j7L55l72k26R0J32J94
4211A98m50J23L52l66j35L67o7J97N4m81M89k16J19j06L32l13j32l05P24j98j57
$$ y = [111, 236, 75, -174, -34, -3, 184, 153, -117, 177, 122, -286, 88, -262, 148, 9, -47, 24, -71, 50, -384, -83, -224, -98, 25, 280, -186, -144, -8, 46, -210, 173, 136, 392, -148, 455, 665, 290, -57, 42, 97, -190, -188, 172, 215, -13, 418, 267, 232, -116, 204, -113, -40, -110, 315, -218, -172, 154, 23, -17, -63, 70, 351, -105, 112, -146, 109, 182, -413, 469, 171, -306, 106, 404, -383, -66, -290, -56, -72, -142, 91, -229, -184, 245, -202, 340, 320, -176, 139, 146, 739, 31, -157, -575, -188, -97, -54, -205, 341, 73, 378, -36, 74, 333, 4, -303, -461, -226, -354, -346, 142, -430, -247, 38, 175, -429, -101, 506, -214, 126, 324, -435, 75, -81, -350, 69, 256, 96, -320, -135, -371, -31, 337, 118, 241, 66, 271, 275, -2, -120, -239, -50, -27, 39, 68, 178, -158, 42, 25, 380, 8, -218, -128, 4, 198, -252, -129, 223, -143, -278, 89, 22, 219, 273, -208, 281, 65, 184, 78, 410, 97, -35, -340, 384, 186, 29]
4232B9Q6k15Q2K1k9K6j83l34O67n67M99O9l40M29Q4p4r2k18M28k76K22j47m8j06
4256A3J31l93R9o8M8J70K69k41J44o7j69L97l74M5O3J84k2m2m52L52k08K42l39
4279b18J60L3RN2jl55K93L59o23K14nK42m8n7J5p1K30l75J73R9l92M33R2k75k70
4304b86M85k15k15p2J99j27k03M67q4jL62n87l80K80N75Pq8l59j91N44K7o6k98
4327b26M64n6n89K91r6J24J95l55L89l15j2L68p79J267p94J16j36L08j97k04M79
4348B42l4m44O86j3n90K01l90P4J86M37l43k53J30M77m75q8L76j45J7k36L5K27
4370G7q9oN06o59R1J8j84L30j71O8l2k45M87l25J5L6K19pm69K15O9K0J98R6j78
4395H0Jk44M12l87K47K07m28l63K79L76R3j77m83N57j08j39J33k2l3j1K58q98
$$ y = [29, 115, -100, -18, 3, -26, 0, -183, -517, 150, -417, 82, 151, -189, 240, 324, 250, 158, -60, 368, 92, 314, 167, 119, 13, 144, -249, -150, -218, -170, 0, 269, 28, 172, 105, -64, 333, -41, 4, 67, 251, 229, 187, -265, 87, -121, 121, -218, -58, -25, -16, 36, 35, -320, -27, 332, -291, -77, -82, 160, 112, 55, 70, -1, 229, -146, 27, 126, -266, 167, 259, -16, -286, 199, -16, -231, -303, -104, -231, -434, 33, -51, -52, 310, -277, -657, -377, 198, 205, 117, -242, -433, 111, 138, 72, -226, 238, 182, -407, -116, -212, -88, 107, -248, 141, -174, -186, 182, -597, 670, -124, -8, -144, 164, -33, -237, 242, 208, -236, 450, 437, -153, 48, -342, -268, -82, 355, 12, -241, -111, 366, -109, -197, 179, 34, 51, -185, -150, 77, -12, -18, 488, -171, -80, -62, -246, 84, -87, -19, -51, -296, 191, -134, -119, -83, 136, 129, -340, -125, -56, -36, 162, 258, 80, 81, -163, 249, -138, 109, 316, -112, -475, -196, 180, 273, 96, -387, 170, 62, -77, 56, 34, 1, -10, 248, -650]
4417f50Q68p00M83J82j70n7l13L69j62k16M93P8n00O54o08o7O9M50o2J07k67l56
4439c75L35jM26k92j34k79J87L08j63m65M21j1n5K53R0l47K99k25j90M10m52M61
4461B01j85k05k7K84k0l6m15M95o7k89JK85l36N7L93j63j37k5K96l97K30J87j3
4484A14k92P9L1K0K30Q9j94j46O6n6l2Q3J11k08J17J02k27K82l86m42J07J151
4506E99q29j48L90k64L0O98m00n7M34o76M17q72O43J93O1o02K29k12P87r64M28
4527a15k95N83J37n08L37o21M45l74O38l96L91n28O60j056J159j33q02O53n8O1
4547A78J11l66J7j46K05J94R5l07L89m23P70p70K70n34O13m94J41l61P58l01j5
4568B4K9l50J45k50O04j30k16N5j62K31j78R6m1M80l06K36m16M6O86m47qN2k77
$$ y = [-650, 218, -482, 1, 183, 13, -44, -357, 12, -150, -366, 127, 205, -295, 359, -249, -316, -247, 203, 141, 248, -19, -375, -40, -41, 385, 93, -41, -320, -133, 175, 12, -453, -32, -43, -98, 155, 245, -102, 197, -28, -218, 192, -260, 201, 16, -189, -216, 68, 48, 12, -403, 92, 25, -264, -263, 22, -314, -257, 136, -27, -164, -189, 107, -290, -60, 127, 114, -178, -99, -68, -48, 182, 271, 77, -69, -3, -59, -91, -8, 103, -105, 12, 114, -113, 169, -217, -659, -552, 599, -230, -378, 12, -252, -222, 476, 76, 19, 453, -223, 194, -678, -35, 158, 219, -383, -154, -366, 421, -543, -115, -410, 173, 310, -198, 139, -482, -37, -411, 227, -169, 222, -306, 354, -702, 457, 324, -478, 175, 117, 178, 289, -77, -60, -206, -1, 193, 288, -19, 370, -53, 717, -53, 217, -317, 296, -198, -57, -418, 340, 39, 24, 53, -297, -152, -402, 202, 72, -144, -89, -251, -20, -198, -102, -143, 337, 31, 267, -149, -103, 583, 136, 128, 180, -97]
4591i7o79P94k56k50J65J22J60j12M91l43O0K76k03o79P11J46p12J51K29M58r56
4612e24K25J96K40m90R02p51K01J51k72L62j46L6n43J36l28N74J33l1J39m23L62
4633A49K95m22j92k70O57L25q39n58M81Q5j68N35l0j26K82k94j75j3J45J05j18
4654a46P9l56L21r7J42j35J45j4j57M26k61J41l46K28J54k56L0K17l26L97k78
4675i2o4L21o76O53k03j37J80J61k26l58Q17j65j25q3J71k66L27m38J78j18L48
4696B05j74mJ73n81J67M59P5m8M5n00J52J92k80K7q0O0R6M6k33R2J03J06J26m8
4720A76l31K63k1j71K18j4k23K96m6J51l57K76m33J85m9k00K29K55o05K09J41
4741e1jj82K09N2J94M3l97J9J06J83l21K67k4L80o38k10J53K45K24k30n9J16j62
$$ y = [-97, -776, 18, -238, -488, -323, -201, -41, -153, 338, -5, 55, 331, 128, -551, 160, 306, -406, -255, -26, 432, -524, -299, -103, 137, -353, 549, -202, -1, 150, -122, 240, 94, 130, -413, -277, -605, -31, 102, 71, 210, -213, 149, 444, 22, -170, -440, 217, 542, -297, -855, -374, -289, -457, 78, 48, -78, 204, -90, -265, -278, -133, -28, -146, -67, -423, -102, -199, -57, -192, -47, -61, -218, 208, -53, 88, -258, -30, 124, -132, -102, 115, -211, 186, -92, -156, 165, -511, 142, -61, -198, -18, 143, -83, -441, 376, 211, 86, 3, 174, -92, 235, -203, -25, -143, 205, 31, 27, 200, -381, -214, 245, 320, 272, 317, -183, -31, 161, -119, -92, -172, -112, -16, 30, -203, -111, -8, 98, 224, 176, -155, 108, 87, -84, 134, 120, -103, 193, 147, 298, -59, 217, -216, -31, -80, -280, -51, 204, -401, -192, -51, -52, -234, -25, 27, 221, 264, -133, -114, -8, 175, -146, 121, 97, 477, -161, -371, -218, 27, 251, 21, -38, 78, -84]
4764h4j47L49k59M42m17j9K83j75j13k01N03j01m7l3M6J31p8k76J88p0M4m15M70
4787B1R4O5m04L05q2Pj38K07j74J74J44m35L90m76R9J09J05o8n9P1L52m53J83
4810C7j44j74J95L60k43n5l5L06q5O3l30J44j70K05O6n1J14k85K83l92qJ85R4
4833H0q1J92l03K06o7j31J30J32j20L2P0k09J80k08R3m2j83k48L88M52m30J20
4855E3J34j33k74M31q0q1j97J14M4j62m7M79l99J71K07k73J62m62M78m19J76m2
4877a20L3J76j68L3N4L2J75j35M5m84L50R8o6p6n1K05n5k59L02k08L10J5l21j0
4901a25J63R0n6r6l9J60j58J28l10K51J67l9lq5K38k92r1J45J96r5L0j82p3j66
4925b42N8L81n65M24j6J79m90m2M91j62Lk50K22j11N03n73J06J18j84r4K73Lo8
$$ y = [-84, -231, 118, -141, 301, -116, -135, 148, -27, -140, -341, 162, 61, 14, -19, 27, 158, 80, -196, -8, -78, -34, -449, 21, 115, 180, -224, 81, -1, 6, -132, 75, -99, 75, 219, -216, 174, -302, -203, -94, 11, -57, -116, -45, 307, -146, 37, -107, -281, -86, 274, 31, -24, -59, 247, 162, 225, -105, 39, -131, 74, 140, 89, 203, -82, 201, -191, -199, -14, 80, -1, 191, -112, 94, 27, -104, 26, 158, 38, 70, 140, -69, 111, -97, -4, -46, -229, -477, -89, 363, -67, 53, 187, 54, -220, 211, 131, 50, -147, -33, 11, -151, -198, 281, -118, 53, 260, -13, 149, -313, 165, -254, -78, -120, -87, 89, -79, -46, 8, 40, 215, 80, 125, -359, -9, 89, 23, -53, -104, 101, 46, -213, 89, -119, 191, 206, -115, -125, 38, 128, 72, -24, -63, 97, -61, 67, -243, 8, 175, 136, 133, 48, 286, -6, -97, 48, 244, 149, 179, -3, -76, -242, -184, 197, -368, 56, 40, 219, -271, -313, 178, 16, 19, -231, -9, -120, 383, -190, -84, 34, -150, -244, 29, 32, -36]
4948c6k82M75j92j4L37m7j81j8K11k41J89o6j12k42K55L97n35J24k56N52q2j40
4970I6k3n2k00Q%J02q1o5J9j98N04j24j10Q4K13l98J7L8J75J40j44K58l58q5L39
4995A55k21J26K08o0j57K3k04J86k39j66J77O9q0M36k23k73mK30J44r8M5j42K66
5018A98k07J82m0o1L9k73K58k89j27J94k1K80j29R0rK37L6l59L74l12l42M66m3
5041A42j51o8K1o8o8J19j34M05k31J60m62L49k9PJ56m16L44j35J16p0j37j53J68
5064a35K39j11P7r3J10k24K72R4k24m32O19m08j31L84J27m47J20J43J34j37j34
5085a57K26P6l26O2L35l84k39L89N6Q3l14M05Kj39m9P0O1m02M33k14l0k63L70
5108E1k52K90m49L21j26L43n41K82k25J74J75K6L1j68j42J00J73K27k88JM26m78
$$ y = [-36, -318, 157, -35, -49, 288, 241, 60, 42, 253, 12, 201, 135, 23, -219, 36, 433, -102, 22, -234, 318, 236, 96, 73, 21, -179, -171, -171, -69, -150, -215, -196, -394, 110, -14, -124, -40, 173, -225, -208, -170, 5, 145, 1, 259, -99, -184, 155, -66, 60, 268, 208, 51, 74, -130, 56, -183, -349, -172, -103, -183, 253, 30, -243, -247, -17, 127, 29, 74, -68, 198, -9, 173, 133, 72, 111, -162, 96, -193, -320, -126, -147, 133, 4, 94, 85, 322, 358, -1, 373, 61, -281, 185, 142, -9, -77, -56, -124, -192, -73, -207, 198, -33, 127, -335, 14, -15, -8, 148, -268, 76, -59, 57, -13, -150, -303, -135, 104, -7, 70, -23, 87, -137, 135, 229, 5, -427, 192, -216, -347, 37, 164, -283, -163, -20, 114, -23, -157, 69, 145, -181, -119, 216, -168, -407, -18, 38, 121, -193, 212, 214, 75, 26, 96, 157, -245, 188, -26, -56, -319, 51, -201, 89, -360, -39, -165, 178, -363, -81, -306, -132, 43, 69, 100, -68, -210, -110, 63, 290, 2, 3, 429, -49]
5130d9l34K60L07l1o72R11k63K61j06m85N42k52J56k19r8K23m94K65o10Q57J59
5151C28k39j78k21o7L9L28j57J67L95j90m46J40O41m55j52J82M58o80O40n12o
5172A5l96M69K6K41l46K53j39j76L3L9j43j53n9O74m19l5K65l3j32j07J3j0Q9
5195c1NK66o91O55kn06J7L12Q7j11n6J43k60L64j98j31K7O2K13j28n3K6K44k02
5219E2o2j78J94L23o5k12p8nK02k04J30k13n38R32o19O97m08K18o50J12N75j99
5241DJ28j80K06k46K47J22j83Mk37K8K85k23L72k61k43K16om10K52qO9K51j46
5264D1J07m5L15p79K44K74l36k11j03O45j22K84l96J92l17p0M25N0j67m27K74
5285a22J21J66k47j21K70o37M89J9n1O0j11M1J73l52J77M01l69Kj61L71l12n6
$$ y = [-49, -383, -123, 184, 153, -519, 392, 129, 390, 284, -201, 341, 89, 245, 26, -72, 151, -343, -78, -688, 169, 328, 89, -89, -310, -377, -338, -10, -167, 0, 395, 205, -241, -101, 540, 85, -67, 115, 573, -107, 533, 21, 15, -381, 88, 114, 355, 9, 262, 123, -53, -20, 19, -124, -277, -336, 338, -81, -116, 149, 116, -16, -123, -110, -120, -31, -26, 240, -451, 204, 202, -304, -287, 25, 112, 1, -55, 88, -172, 192, -6, -137, -110, -48, 165, 37, -16, 10, 254, 52, -10, -188, 6, 329, 264, 52, -26, -31, 171, -33, 97, -116, -654, 278, -341, 356, -52, 166, -484, -372, 203, 4, 132, -48, 158, -88, 159, 281, 98, 102, -135, -107, 178, -45, 327, 66, -177, 39, 33, -377, -125, -133, -64, 187, 41, 148, 103, 418, -361, -117, 157, -179, -390, -493, 152, 30, 314, -82, 110, -207, -277, 148, 198, 31, -396, -122, -1, 165, -82, -203, 67, -570, -81, -62, -113, -53, -164, -123, 50, -302, -125, 276, -93, -91, -252, 119, -193, -249]
5307b49J68L13k01R2P3j42k00K35l1k38j63K52L23k99L31m00K69K73m61M54o15
5328b16N19j47o09J96k09N61J88r27P72m98P79q83K56M38j30K88k58J02l63p3
5348b14j31J07L14J39m31L49L70k76n27o3M50K36m0j75l93j79k34O76k21M85r71
5369g29R31J83k41L0j35J39l62J83L2K3k4k30M2J43K22o83O32j74k75J67J49j00
5391g7k21O25m16k64O54p16n90J457o27P28n98L5K77J86q40K75m2N42oq68M75
5412a1J50j15j04k8L13k07K25l11P9M38o64m11Q1Q92J20r26P53j98j14L4J78j89
5434a5j53L0q1K11j6N80o57n8M01l04K4r2L5L34l68j26L26q3p7J08j64L30J73
5457C58p20P64k58j00ll97L2N57m8J94l11K43m00J47l49K39K7n13J53J84pj47
$$ y = [-249, -81, 232, 31, 123, 196, 54, -146, 89, 58, -180, -343, -91, 232, -67, 264, -136, 133, 406, -55, 399, -216, 303, 156, -453, -257, -466, 95, 283, -644, 128, -370, 409, -474, -218, 220, 90, 378, 120, 222, -141, -214, -345, -238, 76, 215, -216, 133, 503, 227, -300, -363, 87, 323, 283, 108, -285, -464, -698, -22, -243, 242, -729, 202, 385, 144, 174, 39, 178, -184, -1, 31, 54, 30, -200, -158, -15, 207, -476, 156, -18, -293, -126, 23, -77, -298, 327, -89, -353, 301, -415, -1005, 452, -175, 553, -45, -10, 267, 453, -387, -112, -154, 388, 382, -486, -11, 139, 24, -80, -108, 205, -2, 223, -88, -9, 429, -235, -646, -565, 327, 447, -479, 274, 76, -38, -4, 174, -15, -168, -138, -219, -8, -24, 556, -101, -159, 242, -62, -38, -130, -95, 239, -129, -255, 71, -12, -89, 19, -145, 185, 358, -362, 402, 144, 44, 41, -356, -324, 233, 185, 379, 68, 311, -89, 58, -291, -52, -25, -538, -385, -201, -208, -355]
5479c55L19O03l16o14Q97p64K89J48l82K60P9k44q0O26m66oK97j50j05n7J7k13
5501b17N09K40m91M7l06N20O1L40o60l17k65L43P28j31j32k63K48o19K15R69r24
5522a05J133p15m73q1J84K42N17l05n45J78k41r4l08J195n56j86J52K55k11j207
5542a171R44P81p21M82k03n77J87L74K88k46j34j30l19M58k94J07J36J41k68o
5562a71o0Q58q93L47P9o33M81l5j99J72oK25l93L0M25K30j225P78J0L3K31j66
5584A18n59O67K3m22l7J62J73j7j26r0J01M07l32O0j61%K16l18L15k59J32K9q
5607G4o6K66j62o07O14J16n06J73Q9K91k71l00L71J78l72J03J36k32K02m3l25
5628b71L72l63j47N96l29L5qK9P2J63j77k02O1J33n9rl2j09K17n5j4K18Rj30j19
$$ y = [-355, -36, 567, 251, -363, 534, -230, 59, 207, -175, 85, 164, -80, -160, 466, 0, -6, 291, 141, 36, -21, -4, -217, 292, 532, 41, 88, -218, 302, 363, 703, 43, -274, -539, -196, 532, 401, 269, 6, 254, -365, -150, 819, -105, 1028, 313, -160, -241, -57, 185, 702, 397, -148, 30, -211, -305, -613, 582, 26, -160, -8, 247, 36, -1171, -227, 554, -167, 315, 112, -465, -278, 96, 384, 138, 4, -126, -445, 13, -281, -174, -38, 103, -165, -171, -231, 627, -266, 81, 160, -473, 8, -27, -226, -54, -60, 165, -228, -198, 227, 457, -768, 10, 20, 53, 284, 118, -441, 226, 249, -173, -210, -48, 125, 108, -18, -108, -7, 400, 68, 128, -33, -33, 183, -135, 180, -79, 53, 82, 74, 8, 274, 112, -495, 119, 235, -271, -98, -9, 282, 11, -289, 82, 260, -112, -9, 127, -105, 97, 54, -271, 101, -262, -409, 187, -142, -107, -115, -86, -14, 149, -28, -230, -169, -36, -95, -104, -136, -245, -28, -83, -97, 121, 130, 0, -119]
5653a19J00J80q5j59L09k91J61k74K82k50L81l45m0J91K2l83K93k69K09M57n11
5674a41J85l01K63k7n1j11K5Q3k8N9O2j99K63j64L7o6L36j06j83K54r2j62J18
5697E4k68J51K12j66M3k60L76P7k90K53k77lJ83J20m79J84M4j03l4K50M9k20n3
5720a57J92J50J67m89N3j01J97n7L09n37M82n3j47J10k14K9O5q8J6J47O1%j98
5743f3J42J28L9o42N05k58L90k20R2L17n93L81J9p12M55J82Pl34L78j04o8k14
5765a73J97J05j57J43l24N26k96k67N13k22j9J71l82Q3l8K72J1j85j57K48j28
5786g9K2j6K70m43K11j67J49j40K32l09J84L36l76j8R8r6j28m2L52l12K76R3j2
5809H5j21k9K1M20q8k24P7k38K48k50K77n9j12K32l74K45N7k09j59L51j20K09
$$ y = [-119, -19, 161, 76, -83, 226, -65, 96, -178, 104, -146, 235, -110, -150, 41, 63, -320, -27, -296, -87, 370, -141, 44, -257, 6, -21, -72, -183, -158, -75, -103, -44, 18, -181, 82, -82, -45, -111, 225, 119, -64, 190, 98, -64, 54, -214, -63, 149, -17, 26, -234, 142, 219, -71, 182, -95, -98, 85, 205, -274, -90, -46, -149, -183, 67, 116, -104, -157, 35, 185, 352, -137, -84, -185, 12, -45, 264, -273, 209, 156, 9, 119, -95, -66, -1, -89, -73, 74, 135, 135, -63, 79, 207, 246, -396, 109, -149, 241, 21, 113, 430, -163, 218, 237, -475, -20, 162, 169, -165, 213, 109, 41, -173, 24, 129, -28, 115, -209, 317, 21, -246, 267, 45, 26, 197, -185, -102, -140, 132, 143, -42, -199, 49, -79, -57, -73, 197, -246, -35, -202, -53, -193, 39, -270, -86, 250, -126, -144, -46, -142, -270, -312, 40, -272, 4, 97, 85, -36, -65, -44, 376, 288, 64, 141, -97, 151, -99, 178, 119, 7, 239, -135, 110, 167, -42, -201, 150, 30, 239]
5831B39j70L62m69j46L9J89K39m79m1J79m5k9K51o2O8N7M1r4l80k18M44o1n6K18
5855G6m8N5j27J14M4r6J00l20n4K87l1j94K38j11J70M0j60N2r9K4J76j71o3J35
5879C7l13J03J79o3L28R6n12J5j9K17j56K9k8K99j90J31k17P8L8K04l48k16M14
5902A06j94r9Q5r0Q5M81l23r9j20J25J76K07j75j85j72M32k04j51L67l91L86l1
5924B16k43O5q3J10P4k4l13q4M62q0l04P3k39O31l07M01k43j20J70q5j97k4J47
5947Co5J05j45j2J10k33J96k00K55Pj43L4K3j73L96k12k18N37l46j25N41l07J40
5970A68J73o42M00l16M99r9k23r0K56l42M03k86j83M89l48Jk32N8N9O9L05m04
5992b85KM09O3l00M5j06K67k6j47Ql8k80N09P9m04J52J8j66J01J01j12Pk11J56
$$ y = [239, 69, 431, -38, -184, -145, 44, 283, -196, -237, -58, -103, -132, 119, 57, 125, 182, 223, 129, -251, -469, -25, -86, -142, 76, 28, 83, -44, 70, 114, 18, 118, -202, -256, 31, 0, -194, 44, -67, 103, 143, -17, 35, -64, -40, 136, -35, -98, 37, -276, -173, 6, -57, 271, 367, -145, -130, -149, 68, -88, -59, -87, 212, 22, 153, -64, 14, 52, 256, -92, -308, 106, -88, -187, -102, -192, -107, 374, 51, -48, -168, -43, 133, 340, 165, -20, -192, 240, 36, -115, 252, -139, 247, 216, -27, 38, -45, 65, 139, 115, -198, -282, 180, 100, -204, -131, -370, 261, -46, 355, 112, -8, 162, 77, -120, -144, 3, -62, 43, -102, -114, -4, -237, -41, -241, 14, 21, -122, -88, -65, -238, 158, -54, -272, 265, -81, -206, 335, 28, 168, 341, -301, 99, -217, 282, 183, -40, -130, 126, -216, 187, -99, -282, 207, -141, -140, -372, -314, -255, -186, 119, -285, -283, 126, 189, -111, -66, -172, 95, 69, -78, -70, -108, -388, 121, 200, -204, -52, -34, -200, -99, 2, -110, -103, -314, -158]
6016a58K80Qk5k42J79j08J60j42j28J28J82j36Kk73L80k42J13K4J89k32j51J83
6038iJ4k59K48o9Oj85N21L59n78K6J3k85o3M67r0j37oK37l04q6q7N20k01j02n4
6063a04J61l8Q2K65l81K26qL09j92k46j11n5J99o40M67Q4L6j57j4P7L92m89K64
6086A27J52n34J28N16k56j82J58l02J72j66RK76k46J85j40n6P9J36j64k8N1j1
6108i6K14M60m53j39j07k18J00J93r1K58m45J13Q1jJ21K94k50L72k62k19Q63p51
6130C7K47m62j2J58m40M02O34q58J82j59L16q6L66m0L89j147O35m98K17Q20o01
6151A00l43O09m20K12N90n75K74n29J76K21l66k41J25R3M85r03M79M87q47O24
6171B51kn76K33L76K60j192O79k14N80j11n49k06K94P7J89P2l36L84j35J16k62
$$ y = [-158, 122, 130, 105, -137, 42, -66, 94, -48, -176, -48, 134, -2, 0, -273, 107, -135, -22, 2, 191, -41, -192, -9, 5, -254, -6, -75, -69, -254, 267, 626, 48, 74, 87, -198, -261, 206, 116, -21, -27, 210, -94, -180, -267, 253, 52, -50, -104, 57, 19, 101, 366, -15, 211, 203, 512, 320, 74, -37, -92, 107, -533, -66, 18, 54, -103, -117, -40, 352, -137, 127, 279, -255, -127, 389, 133, -49, 109, -193, -21, -187, -178, 98, -148, 37, -103, -159, -80, 56, -108, -136, -85, -96, 118, 578, 125, -14, -121, -339, -239, -46, -137, 121, -324, -211, -130, -131, -10, 284, 34, 406, 144, -75, 788, 37, 284, -178, -190, -32, -472, -70, 564, -294, -112, -271, 45, -41, 325, 285, 674, -473, 162, -336, -119, 701, 100, -243, 366, -54, 158, 748, 173, 447, -82, 94, 315, -51, -292, -167, -74, 411, -492, -13, 474, -373, 251, 249, -327, -94, 282, 542, -650, 29, -185, 395, 284, -265, -471, -177, -100, 89, 161, -175, 209, 74, 190, -72]
6192g2J35j55J56L20k60q9k12K25j77j80qK53O9j62M43j73J8l92K50J81r0j00
6214b0J70J46n73J58J06O7L83j95k24n19J065r64O93n6L31k13J0j18o65P14j90
6235A06l75m92O36l82R53n23O3K00n16J4P37o81L24J02m36M99k29J36r3r7O4J49
6257A59l70O7p0L25k00m3K49O4k77L8N78n23P4P6k68pK39j60K51j98M7m0K49m59
6281a99M76l17k36J53R6J62J4o1r7J63k16K49l61J36J17J82m97J82J00j8J78o5
6303A41N9n60M36O1K29n63K3L12J2kl47L84m5l68M58j80o3q2J77K85l12rj81K39
6327A04O4p7k1N5r6l33K79j89K57J5l46K41J78k24j07M32l10j03M23n54N69m44
6349a87L20j4k20L01J06o18O98k22k2l27K22l30o3J22l5J32n46N73N8k47L98j52
$$ y = [-72, 63, -92, 64, 384, 124, 35, -177, 48, -129, -309, -317, -64, 5, -157, 286, 113, 131, -261, -11, 170, 80, -20, 150, 296, -277, -119, -13, 54, 437, 242, 18, -501, 564, -400, 293, 237, 568, 355, 365, 247, -418, 296, 106, -269, -761, -125, -507, 446, -77, -14, 186, -330, -316, 421, -260, 64, 166, -270, 229, 0, 136, 43, -54, 10, 159, -211, -144, -214, 111, -89, -132, 117, 181, -96, -58, 520, -3, 71, 147, -121, -128, 111, -49, 202, 4, 51, 11, 260, -199, 277, -40, -276, -123, -27, 135, 149, 88, -9, 154, -62, 187, -174, -38, 79, 261, -236, -54, 46, 28, 206, 141, 200, -360, 76, 137, 366, -197, -174, 138, 150, 148, -199, 185, 140, -228, 230, 50, -13, -95, 82, 367, 55, 46, -135, 104, 168, 91, 70, 125, 29, -304, -25, -214, 43, 58, -288, -47, 131, -93, -200, 232, -78, -181, 242, -312, 257, -187, 133, 119, -101, 200, 306, -312, 386, 164, 142, -185, 37, -293, -356, -234, -269, -137, -683, -110, -52, -299, 99, -53]
6371e3j48K26K17j17l10J22K91k59k77J241j281O0L96j61M6O5pJ06q4j23J65l49
6393b34n8N47m7l11L09k88pq9J80Q7l81p5Q31n52m9P0m0K76J8j06k02J34K78k86
6417Em1j39j70O44m40L02R1r9J4l32N94j03m5l60L46n38n3O28J6o53N89k46l61
6440c51q8N98j67K08Q3L5L8n39M63j24n3m8L8j07K09J13k18K23j11m11j23O0L48
6463G6k0k98K56J59o3r3j28J62O0k11M6P4l9J40j85o5L59m4j53k98l43N63L24
6486B79n00L75n36Q32m49j90m5oK51k92L41K55j21k55M73J05n66k86K18L60k47
6507dK76o86L37j03J5K22qk45L97k26O6m31Q01l61ok58J77L19k67j5J61k25K4
6530d0l13R73q07J15l72J5O40j80R2O7k14K5Ok29M21n65M15j46n10J103p4m08
$$ y = [-53, -201, 25, 242, 125, -185, -63, 228, -31, -308, 933, -348, -288, 108, -53, -7, 58, 51, 157, 73, -50, 115, -234, -292, 255, 208, -103, 206, -82, -89, -178, 2, 89, -292, -367, 464, -88, -137, -67, -107, 169, 187, 81, -121, 13, 291, 5, -36, -175, -345, 299, -141, 161, 252, 153, 167, -165, 429, 326, 281, -79, 267, -271, -324, 304, 320, -333, 256, 10, -351, -439, 159, -8, 200, 283, 318, 356, -183, 280, 156, 103, 55, 93, -14, 195, 308, 90, 313, 202, -209, -332, -272, 76, 56, -242, 14, 173, 110, 17, -111, 51, 111, -100, -54, 20, -19, 121, -64, -129, 230, 186, 33, -265, -608, -45, 279, -221, 154, -382, 450, 1, -189, -234, -240, 11, -281, 60, 315, 194, -61, 412, 517, -49, -335, -117, 243, -4, 272, -414, -77, -180, -165, 57, 49, -196, 201, -25, 41, -390, 411, 50, 44, -214, -37, 282, 15, 0, 161, -64, -40, -353, 620, -187, -72, -444, -429, 211, 31, 123, 190, -24, 1, 7, -222, 199, -366, 49, -97, -607, 496, 422, 14]
6552A4K42N99j085L62l67K90L9l31L60M87o75k97O13k74J74J62K23q74J56l3P14
6573D99k84m5l15L46m67O06l42k69J77K26l52p9L33j46J82k04K99r3j58j92M63
6594A85nK59o3n21q6M01J78l6N6p96N51q5J48o3k06m31M12L32o18L43n2K58k54
6617i3L53n28j96M75p8k50K11j36J15J21J89k34j84J88m4L4k47L88p2K47l29o
6639g6J5N51m50m32K32M57m12O09k77j36j95J10OK32l73k21J96k21O04j96j13
6660i0K16K05k62K1M7K83l02n6n7k60J38L18K06J07m26j2J40J10j50l6r0j04P1
6683A7K68k68k84M16l60M11j50j13J00R9r3J12k89J39J63j85l33M44k32J08K89
6704B59l14J85k43L46k34J0j79J86k17J79J10l94L50J81M93r94L92J0l10l79P22
$$ y = [14, 256, 855, -230, 132, -235, 55, 94, -237, 123, 610, -65, -362, 251, -23, 151, 313, 536, -338, -182, -215, 499, 215, 170, -145, 201, -266, 340, -2, -271, -94, 132, -220, -299, 34, -112, 70, -134, 165, 72, -86, -278, 185, 180, 439, 376, -145, -231, 170, 348, 312, 368, -428, 123, 38, 186, 123, -83, -514, -102, 230, -388, -45, -97, 161, -93, 260, -268, -464, 11, -67, -317, -106, -242, -127, -6, 183, -51, -235, -47, -91, -57, -304, 84, 12, 259, -70, -76, -61, 490, 40, -392, -160, 297, -115, 494, 217, 81, -114, -4, 2, 234, -139, -360, -164, -385, 219, 23, -90, 126, 331, 69, 90, 137, 420, 118, 62, 5, -255, -117, 201, 407, 514, 88, 76, 216, 326, 176, 140, 50, -54, 17, 285, 17, -267, 149, -211, 200, 50, -63, 37, 136, 43, 155, -134, 5, 168, -17, -350, 94, -138, -30, 259, -55, 130, -113, 233, -1, 9, -170, 16, -201, -22, 88, -306, 44, 225, 718, -276, 116, 126, -184, -563, 159]
6725A59k45k13J2J88j84N22m83j40K26J28K09k70J47n61Q9P33j36k64J77n76N36
6746E4P4j48M84j49J82n00J71l59K9L72p15J042n63L49n60N75Rl17R2j07l05M45
6768A55k33p2K87k09L67r5k00J52J71M0o03K88l12J34R9L5l31l2K56K69k27p5
6790a36K39J0j49L65n61O5J22R72j268j54L71J88k48N3oO0p8o8N89o52L08k95
6812b73N69j96L04l28j26j96O07k77K20k16m08K70j7J81k49M88l44J21k26J61
6832F5J04j69J1K49m44L40m3j83L74m63J20J66k65O2m14M99j38M42l86j82M5M80
6854B70l21J38j65J74k46J60O6j80L67n74L66k01K69n3l1J15k03j48K25K17l87
6875a42K19J49o0R9j04J03J31k84m37L84K69l94j8J83k66J11K10J6k69M24k76
$$ y = [159, -86, -299, -287, -99, -283, 239, -244, -384, -158, -30, 179, -91, 56, -505, -416, 317, 181, -83, 94, -482, 54, 128, -20, 464, 315, 497, -3, 168, -191, -162, 210, -505, 537, -26, 323, -237, 338, 347, 30, 122, 15, -290, 155, -78, -150, 137, -72, 295, 200, 0, 152, 323, 363, -240, 48, -264, -130, -31, 4, -327, -359, -103, 166, -61, -136, 103, 113, -36, 329, -232, -167, -45, 927, -341, -495, -124, 64, -184, -131, -137, -77, -155, -223, 366, -286, 22, -273, 296, 100, 404, 76, -50, -246, 361, 84, 304, 88, -320, -50, -67, 114, -135, 353, 9, 130, -96, 65, 169, 0, 11, 260, -184, 156, 113, -70, 304, -159, -39, 127, -138, -76, -490, 9, -129, 313, -73, -255, -210, 270, -51, 87, -78, 96, -150, 10, 76, -104, 263, -311, 55, -146, 123, 70, 39, 154, -49, -197, 28, 245, -142, 77, 226, 166, 265, 161, 264, 395, 111, -326, 58, 327, -67, -85, 98, -168, -57, 153, 169, -100, 324, 48]
6896D8K0p1j82N07k98J32K12k10m45k2N77k50R6n3j13j24J2K13K11L9l88j11L35
6919A35Q7m62K57j33K14LJ78J64o77M99j92K5j55K76M6l9j41k53O3J41j53J27
6941A0j08J96l54O6m8n75N48K26K6J00K16n30M61m28O21q9k80J71o3j00l51N98
6963C13k7k66k61m09J186l85J26k0L41j081O89k93k93J08N44J33p98J093m79j33
6983H8j38l86M99j20J59J90n47k15P32l99j87L18K57j40k5J85l08L27n24M29k39
7004d4l0J1k59k2K70k36K42p3M52m78J47O6l54K66J10q8R5J39k51j82R5L0kk12
7028c08L41J02m23O5N40l59r5J46J10j76M29k75j59j36L48m85j8L25J76Ol57M49
7050B46j15J46k72k97N41m49J84l04K85jo6L9L25q7p4P5N23o74J50o64M26K54
$$ y = [48, 68, -3, -185, 322, 24, 156, 368, 158, -287, -309, 268, 18, 114, 61, -52, -176, -164, 49, 260, 299, -89, -200, 135, 222, -240, 17, -116, 98, 101, 279, 443, -234, 265, 73, 98, -57, 219, 265, 226, 85, -168, -105, 36, -117, 10, -98, 98, -256, -190, -238, -813, -265, -39, -13, 87, 303, -227, 234, -194, 427, 338, 58, 229, 166, 66, -285, 313, 286, 20, -241, -650, 536, 151, 277, 257, 598, -483, 206, -87, -380, -272, 272, 405, -393, 700, 221, 88, -50, -436, 63, -57, 102, 292, -255, -470, 262, -137, -324, -6, 251, 111, 86, 271, -37, 290, -234, 195, -44, -74, -63, -322, -344, -74, -310, -68, -141, 311, -167, -20, 46, -308, -42, 68, -20, 75, 214, -37, -219, -124, -94, -96, -308, 33, 135, -288, -223, 317, -42, -137, 9, 119, -57, 372, 97, -62, -198, 150, -335, -353, -28, 148, 154, -203, 246, 131, 277, 5, -292, 249, -200, -16, -320, -35, -36, -102, -63, 262, 175, 101, 176, 699, 25, 175, -489, -63, 191]
7072A91j03k72K53m01K39L41k16j81K61N2j2j29k13L12j10j07J00P15r21q9K24
7093f6L86k43k06J44k09R3l73P32k47PK30J42k23m19K0K29K08k28L98n72J59J97
7115A59l1j43j01L74k23l6K99Nk53k24K41k6o3j7q9K32M2q6P0j97K81j90Q2j5
7139I1r1j08J68K02l99J20o6L32k1j51l85K79R8J69l30n1l82O88J03n75K79Q0
7161E0k7k0j83J67Nq0k36M89j50k24P33l89J2K84k49j61m53N56J60j12k9L8j99
7184a8j61J62K92n19K48j14J12Q9j98L66k45K51n08M65k89j64L62p9Nr7p0Q2K43
7207B15O6k79l3k85M76m8P9O4l05l1M9j59m8J52J47l13K47L0o6J18M1R0j95p9
7231f7J05j60K50m24j4M31j48l5K24l31L14p08Q65o64k80K79J85K41r9J90k24
$$ y = [191, 88, -184, 69, -332, -93, 248, 32, -149, 112, 164, 152, 23, -190, 122, 12, -95, 5, 720, -201, -290, -66, 320, 77, -129, 15, -194, -101, -474, 258, 11, 18, 248, 390, 167, -252, -232, -3, 205, -23, 375, -197, -38, 159, 128, -15, -116, 258, 35, -1, 298, 303, 50, -174, 67, 41, -22, -39, -128, 104, 146, 60, 130, -67, 214, 24, 106, 91, 0, -108, 60, 262, -137, -17, -83, 249, 228, 77, -308, -29, 69, 238, -92, -143, -525, 163, 266, -309, -30, 50, 23, 3, -180, -13, -8, -88, -324, 165, 15, -209, 524, 135, 147, 431, 182, 21, -432, 124, 284, 172, 143, 181, -18, -179, -17, 275, -244, 4, -110, 2, 91, -107, 259, 14, 265, -243, 222, -67, -231, 131, 52, 57, -40, -110, -28, 215, 281, 2, -31, -316, 160, 112, 191, 255, -50, -81, -32, -191, -239, -87, 60, -253, -6, 24, -42, 76, 117, 207, 12, -67, 38, -122, 128, -296, -310, 121, -27, -62, 162, -169, 145, -563, 302, -362, -642, -363, -178, 63, -36, 154, -70]
7252g0O7m4Q5k47n5k18M22j5j66K54O8j52k65J9N20k19LK07m44L20j01j4J59q0
7276C4o5q4J9J30n8k8K01n05Q5J59K30k56L37lk02nP7J11j47J14l5L0k44N8K49
7301B02k1k73K69J07n6j51l59L37J03J4j09j28O1j82R4n0j54M14n8j54K09j10
7323Ek3K10l27Q8n2K11j20M4j00L5j17L02K1j48Jj76P0k20N36l1m0n4j05K44k06
7348D8n7r1R2M2R9P8m50L14J61q7lk14o3j51J35l3L11k41M39m32k27J42J36k0
7372g2K1R1Q9j25J56k35M14k36Q3k41K66l24L87l55L9P0l3J11O8Q7m36J81j51
7395a45J93j73K78J38m18K36j05K06J6j87l03L59M79o67j44L53j74L6J84k30R8
7416C0Q1Nk92Q0j16K54n8l8j12K83N6k90M20l38k9J44K5P99q35n10M23J03j01
$$ y = [-70, -3, -47, 38, -209, -264, -482, -60, -75, -241, 13, 81, -71, -336, -317, 203, -16, -13, 194, -250, 70, -31, -45, 114, 34, -31, -115, -96, 34, -24, -52, 149, -356, -271, -112, 118, -138, 199, 196, -6, -11, 66, 177, 30, 144, 109, 139, -105, -47, 202, 181, -92, 177, 284, 228, 77, -282, 55, 158, 172, 63, -65, -4, -186, -92, -142, -296, 118, 60, -94, 115, 5, -18, 192, -135, -47, -99, 112, -8, 36, -64, -29, -146, 156, 177, 29, 30, -146, -76, -296, 240, 209, 169, 115, 10, 254, 48, -9, -100, -8, 34, 133, 211, -239, 75, 236, 149, 146, -68, -131, -282, -147, -180, 131, -110, 329, -103, -330, -188, -52, -72, -51, 40, 129, 4, 160, -75, 339, 103, 186, -55, 211, -113, 274, -81, -42, 28, -5, 106, 174, 261, -175, 6, -145, 48, -125, 153, 291, -127, 109, 4, 210, 226, 39, -264, 95, 574, -93, -237, 116, -58, -22, 162, -68, 30, 111, 116, -176, -96, -212, 42, -16, -54, -166, 117, 173, -117, 303, -35, -64, 80, 105, 904, 69, -441, -18, 85, -16]
7439a6j97M51k67R9o58Q18l67o0L00R3k36j49L08M16r46Q86m97l37L17p9j80N65
7461B64J43j97p43P20o12M89Q6n89K97J13j47J50P8k61L92k63K07j52j29j37L09
7482A8k7J94J77l92L1K04l74o5J06J46j01L1J83k92j25K99J34j92j0K10J13j41
7504A27j04k48J44J53n2N39k87k56J6m5K99k13k10K41J42k53l03J75J86r5L13
7525B69n95L30J49q1Oq0J07j19O6K51k43K4k75K81k14j16K25k5K75J1M1l35K30
7548A82k33J05k05L22q6j44J61N4k68J97k07O8J63k67j97L65j47K04j02L41k80
7569B6K91o82L17K2N6r9m8L20k31j48J10J8K34k65L87n27m47P31J53j98J43k71
7591a08m5L15j40K56k15K27l98K92R7k38nk10J86k7q0k39L96l53K18M55l66O9
$$ y = [-16, -213, 238, -29, 70, -588, 230, -137, -197, 103, 196, -40, -189, 119, 535, -411, 475, -22, -359, -42, -121, -301, 264, 407, 210, -533, 187, -425, 64, 150, -439, -142, -29, -176, -26, 52, -209, 183, -80, 127, -25, -154, -291, 18, -9, 185, 362, -30, 1, 205, -169, -234, -128, 18, -83, -52, 131, -161, -286, 13, 147, -45, -55, 155, 268, 127, 23, -225, -81, 72, 20, 559, 272, 16, 32, -13, 286, 73, -137, 104, 246, -7, -310, -135, 51, -44, 269, -326, 4, 153, 72, 78, -2, 105, -14, 52, 303, 60, 84, -191, 90, -124, -240, -15, -40, 235, 246, 287, -48, 182, -51, 54, -151, 171, 85, -59, 102, 156, -112, 85, -122, -54, 109, -158, -355, 10, -137, 67, -35, 306, 26, 317, -365, -48, -26, 30, -69, -117, 203, -28, -176, -66, -48, 186, -79, 308, -219, -666, 65, 218, 20, 163, -108, -153, 162, 22, 278, 63, 290, -108, 184, 281, 43, 38, -172, 14, -13, -93, -332, 64, -289, -71, 384, 18, 87]
7613H7J37m01J9j35J86J39J48p6l9L48m74k96K44J06j07k5K46j56P9j23j21L24
7635A10k83L39J61n53K04L0j25J29J00L60n94K89q4Q6m69P3K74Q1j57K57k18P3
7657H3j63J38P2j13j67k1K06j59J70j22j00J20L3j48L81l23L2j08N17n36LM47
7679B42l22j14j0J80k9N4O0k54k86L92K91k29K28L5m78L42K66k90j3j60NL4L83
7702C27m49J00j20K8NJ4K90j44l9L02l87k75K29N6q0J14K80o46O96o07N47J1l08
7725e6M98o85M81j3m56M30M6j75p8J09k2L20q00O63m29j20m6P40j05o81N26n45
7747c98K37J97j28N2j18K21Q0j42K50m6k16J88n50M23K7L04m35J48j96k14J70
7768a46J46l4K25k45J67j95K41J27l16M00r00P28o21O91l5k59m7J16L21o11M96
$$ y = [87, 224, -177, -158, -293, -107, 32, 180, 104, 65, 413, -61, -357, -113, -7, -114, -139, 107, -49, 30, -93, -214, 110, -173, 166, 327, -226, -22, 8, -117, 12, 112, 472, -122, 167, 83, 169, -300, -227, 47, 128, -29, 228, 10, 83, -80, 58, 130, 17, -150, -171, 35, -124, 46, -76, -176, -56, -23, -171, 210, -113, -81, -189, 328, -208, -205, 242, -80, -194, -204, -24, -53, 1, 61, -193, -479, -87, 204, -25, 203, 238, -240, 102, 368, 78, 65, -95, -90, -56, 327, -122, -22, -142, -114, -109, -95, 195, 51, 12, 314, -73, -348, -119, -63, -143, -29, 251, -395, 301, -306, 241, 252, -56, 442, -243, 238, 225, -231, 199, 245, 70, -8, 101, 79, 399, -401, 262, -167, -287, -333, 407, 302, -379, 147, -398, -161, 36, -92, -40, -158, 63, 143, 1, 251, 205, -11, 177, -373, 50, 77, 381, -54, 94, -102, -316, -146, 0, -34, 191, -54, 113, -82, 159, 286, -30, 370, -530, 198, -423, 268, 233, -26, -73, 43, 364, -247, 249]
7789B49o7qj78r9J99k03J09J90k51J36J64l02J12k59K55j3Mq2K77m07N39j33j70
7812F2m02M04l9L81m16j26M53m90N85m98l83N59J1k36j87K65K52k34J5J20l50
7833b54M38l12k3L88M6k41j59J75j26J54j63L58J93l07j74o7j00l14r4J35M22
7854b5l2K28m67J48k69P96m54O99n91j15J89l76N12o56L91l3r0P5K79m8l99L19
7876H1J76l90M7j71L14P8R2k71J13J01q7j66p8M52j84Ok43Q0K2l7j59L37l25M2
7900a70K75l99L77j40J32Lj70Pl31N53m48J54j38K16J57n1M0K70m90J59K10k76
7922f0j36L29r1J00l6m6N9L6j6r7m5q2J42J3k00N12m04J8J74l50M05j73R6J49
7946B97k75K69l15P4l8q9N1k23J43K35M5l85M2K37j81K13k99K1L31j69o5M21k59
$$ y = [249, 182, 174, -4, -103, 96, -107, 2, 192, -59, 77, 241, -61, 51, -208, 47, 34, 38, -44, 233, -174, 365, 232, 62, -340, 64, 25, 406, -10, -136, 317, -173, 412, -86, -469, 90, 101, -135, -322, -57, 195, -39, -24, 96, -254, 184, -128, -151, 237, 283, 42, -117, 58, -68, 86, -77, 281, 474, 167, -7, -74, -174, -488, -582, -447, -25, -57, 171, -296, -148, -417, 379, -75, 624, 33, -82, 107, -269, 243, -413, -22, -55, -145, -70, 209, 161, -238, 81, 257, -133, -86, -257, 57, 135, 227, -44, 69, 170, 83, -83, -161, 291, 107, 113, -130, -50, -28, -65, -224, 113, -212, -170, 105, -294, 83, -57, 75, 78, -92, -85, -416, 137, -311, -157, -295, -79, 78, 27, 67, 337, -153, 6, 216, -60, -196, 133, 42, 142, 106, 60, 119, 155, 139, 42, -3, -85, 57, 70, -130, 382, -22, -4, 170, -180, 225, 52, 148, 297, 22, 291, -24, 50, 12, -77, -26, -249, -106, 129, 174, -211, -169, 68, -113, 100, -199, -178, 153, -16, -81, 340, 81]
7969H1K33k11J2p4q3P6M10m28nJ6M77r4l32l97j52M86J75p1j89M62k11L6r37J319
7993E99o79k45L35m7j06K32Q6n84O1P02n55M46J66l46K0J23o61M59J77k79p3l95
8015e64J9O65o55J87K5J001l46k49L81k27n20L83l8M30j082Q33p23J71L28k33
8035b14K93m97Q03r5p59J47M12m24k11L60J85m9m94N89m11K2M61J78m58J36J51
8056A25K74j53r00M81O44o32k32J046j63m80ml30R2m16L12J71q1L1L40n87J99
8077b63L60mj14k88R6K30K6k72O1M54j53l26N7P5K03n3m8P92o99k37O34l71NM
8101A69J06l08n4J28N00q42J04l83Q38n04K19K78M03m23p8n9M0k98M67n7k09L45
8123C82p3M9k65K14n12k29L78j12J3j43K65L54m15J60j25k62M35j06m4J23o46
$$ y = [81, 314, 103, 115, 41, -42, 34, 444, 16, 11, 27, 504, 410, 78, -319, -471, 15, 190, 119, -70, 392, 181, 217, -720, 599, -80, -325, 10, -37, -143, 89, 175, -409, -348, 354, -201, 245, 411, 65, 85, 208, -453, 6, 183, -96, -169, -564, -545, 120, -535, -348, -323, 678, 332, 83, 464, 237, -283, 100, 62, 492, -590, 243, -480, -309, 19, -214, 79, -418, 385, 290, -469, -322, 90, -334, -545, -185, 0, -49, -543, 46, -365, -343, 118, 296, -162, -26, 125, 399, 246, -654, -173, 471, -161, -393, 653, 490, 10, 6, -324, -232, -648, -336, -165, -246, -215, 125, -462, -263, 97, 93, -21, -309, -213, 17, 43, -229, -168, 286, 133, -193, -136, -61, 142, 89, 41, 833, 134, -103, 531, 160, 165, 169, 275, -33, -87, 41, 541, -301, -197, -580, 258, -246, -27, 251, 654, 231, 153, 94, 134, -164, 303, 246, 37, 382, 309, 358, 93, 307, -205, -434, -56, -168, -155, -298, -33, 321, -94, 66, -59, -321, 114, 8, -36, 87, -559]
8144e59M05K97k51k0m03O38j49M96m52M46n09N74m16o09L69m9J79K40p46P39m44
8165b24Q5K5P8j1L01k35L4L09l13J35L0P0j28o7j08m87N14K38m70L74o80R74o16
8188a72J63L47o21
$$ y = [-559, -154, 143, -108, -128, -531, 107, -42, 454, 2, 448, -61, 513, 97, -512, -143, -192, -13, 227, -519, 220, -224, -139, -114, -36, -47, 254, 19, 53, 362, 49, 184, 214, 284, 156, 89, -19, -506, 8, 246, -224, 150, -530, 444, -172, -9, 338, -283]
8191b83
$$ Imaginary data points
##PAGE= N=2
##DATA TABLE= (X++(I..I)), XYDATA
0@%%%%%%%%%%%l1O3o4O4o4R6j28J59j91K23k86L50m13M76n40O18p15Q29r56J085
31E75j244J434j625J824k048K304k590K901l240L610m016M457m936N463o040O667
47C496p352Q107q933R841j0843J1952j3183J4558j6101J7857j9864K2178k4901
60a3188K8145l2087L7006m3346N1859o3977Q2739j15923J92071o90770j23908
71f91379J222712k46047p91718j84099Q70900M71946l72420n72212J64372M83093
81C55148J51861l58040k67225P4834K57680L58k49294k19927J16501K46014L2166
92A40076k61883j55869J57750K26516r7737k99441p7783K84554K42822j15950
102D3055k58294O0800L44315J48998k48902k15644J90061L12568p4472l48531
$$ y = [0, 0, 0, 0, 0, 0, 0, 0, 0, 0, 0, 0, -31, 32, -32, 32, -32, 64, -64, 95, -96, 127, -159, 191, -222, 254, -286, 332, -383, 446, -510, 575, -669, 765, -860, 964, -1084, 1220, -1370, 1531, -1709, 1901, -2115, 2342, -2594, 2869, -3171, 3496, -3856, 4251, -4682, 5159, -5684, 6268, -6915, 7643, -8458, 9399, -10465, 11713, -13188, 14957, -17130, 19876, -23470, 28389, -35588, 47151, -68772, 123299, -567471, -691379, 531333, 285286, -506432, -690531, 180369, 652315, 279895, -292317, -127945, 355148, 507009, 148969, -118256, -43422, 214258, 214616, -34678, -254605, -138104, 107910, 140076, -121807, -277676, -119926, 106590, 8853, -290588, -368371, -83817, 159005, 43055, -215239, -154439, 189876, 338874, 89972, -125672, 64389, 376957, 302485, -46046]
112d6046p7768K69830R2302l22584k85775J53803K91432o0363l05034m9663K95963
123d3903K11858j40386k29037N0254K82374J49420j52241k11566M5776K48336
133B10885Q5145k32113k40493Q2995K55221J4973k66885j53925J71149K05527
143A32479q5341k41028l6000K02158J26040j13915j46953N6269J79974N2708j18118
154H273p8991R4992J33270j3689j15305k6556Q9503M1164r1748j01659P281N3840
166C75k0867q1047l1601M6477M8703q800l6113M957O7566P2309M31n5935l068
179C387R1574O5819p5032j17798J7948J21517Q950j51802r5335R7983J19471o4491
191B2191j57673j1740J41745P1841r8156j02881N4352J31451K7021r0865n1848
$$ y = [-46046, -123814, 146016, 238318, -84266, -370041, -216238, 75194, 14831, -290203, -339866, -43903, 167955, 27569, -201468, -151214, 131160, 280580, 128339, -83227, -37451, 210885, 296030, 63917, -176576, -93581, 161640, 176613, -90272, -244197, -73048, 132479, 47138, -193890, -229890, -27732, 98308, -15607, -162560, -106291, 73683, 126391, 8273, -70718, 24274, 157544, 143855, 28550, 1994, 91497, 132661, 40913, -60746, -53465, 375, -20492, -101539, -133140, -86663, -37960, -46760, -82873, -77916, -10350, 61959, 62390, 6455, 3387, 94961, 160780, 85748, -32050, -14102, 107415, 116365, -35437, -130772, -32789, 86682, 22191, -135482, -147222, -5477, 66364, -31792, -134673, -80321, 51130, 78151, -12714, -64562]
202f4562P0179R3737l454p5899k9385N2145M8000k6759o5413k6639K3009J8755
214A3714k5078m5331j8092K3876K9217p842k8980O557N0069L0784k3944j9027
226a4077M2077N0029k0543n5265R687O1330p43p8972l9342N5057M4639n6380p7026
239g9529J8620P3840M975o8665l1264N2280N3859j5438m3890O75M5361L3285r104
252C5005k6618m270K5330K8438m432l7072k6701J7526L1150j4691n8494k9520
264f4349L4696L8005k5937n5478L251O2483L1562l5394k9136L8540N4834m702
276D8375m0255O62L8851O349l8184k0556K0136R514l0760k6173J5141K0393j5612
289a2119k7632N574K7519O138j8257p908J4985J6150K282m854k291L067J1539
$$ y = [-64562, 5617, 99354, 95900, 20001, -9384, 42761, 90761, 64002, -1411, -28050, -5041, 13714, -11364, -56695, -74787, -50911, -21694, -29536, -58516, -51959, -1890, 28894, 4950, -14077, 28000, 78029, 57486, 2221, 11908, 73238, 72495, -6477, -45819, 9238, 53877, -2503, -79529, -60909, 12931, 17906, -50759, -82023, -29743, 24116, 8678, -35212, -34537, 10824, 44109, 35005, 8387, 4117, 29447, 57885, 53453, 16381, -10320, 7206, 38356, 23665, -34829, -64349, -29653, 8352, -17585, -73063, -69812, -7329, 24233, -11161, -40297, -1757, 53077, 48375, 8120, 8782, 47633, 53982, 15798, -4758, 15378, 24892, -5868, -32041, -16900, 3493, -12119, -39751, -34177, -6658, -520, -18777, -26685, -11700, 4450, 6732, 1878, -413, 2654, 14193]
302A4193J4698o73j7892p142J9036J7859j7960l5312m434K7663O632l6138l0453
315d9923J6190L2102m466l1352l963L3722K4660j1007j4773J3011K4885L921j3363
328A9644m915N446r76p351n138k739j0446r095L821O824o563j2005L315J5385
342d793L634r980j503J2552O935p218j844J0697N132j0264n337J4537J0669j2601
356A0616j7546Q100K0790m173k5628j0599J7747J1623j7537k0801N603J9367J505
369i33j3770k616J3888J0017j460j623N379L669k430J034M605l960j2611k204
383c015R475P19j5732j0330J0441J3490q207j4318M735J6980K234j1726l102J2667
397D311N463q642m922Q348N305q368o999Q608R078p619j1972M392J2234o83j4537
$$ y = [14193, 28891, 28218, 10326, 3184, 22220, 40079, 22119, -13193, -17627, 10036, 16668, -19470, -49923, -33733, -1631, -6097, -37449, -41412, -7690, 16970, 5963, -8810, 4201, 29086, 33007, 19644, 14729, 20175, 19199, 11848, 6710, 3971, -6475, -15570, -11749, -4925, -11488, -23493, -20178, -4793, -1159, -11139, -12642, -90, 6845, -373, -2217, 8480, 13612, 3348, -1989, 12548, 23217, 10616, -6930, 1170, 21960, 17787, -7841, -18440, -693, 10930, -6607, -27408, -21805, -2438, -933, -14703, -17319, -3431, 6586, 5126, 3503, 8882, 12551, 10121, 11155, 15760, 11800, -811, -3015, 6460, 7179, -8553, -18883, -8442, 5048, -3159, -17477, -12742, 4238, 6472, -5254, -8356, 4311, 9774, 1132, -3790, 4558, 9863, 1495, -5504, 3104, 12182, 4563, -7409, -3017, 9217, 8534, -6003]
412f003n124J1160O605r565r095N500P579j432k783J570L668j321j59O987K825
427A0412q735o774R037R835q738j6377R54J6021L048j6300r315J2674J3258o691
441B309j2142L758J2385J361q266j843P473J591o937m62N470O4p993k343P731
456B156L306p830o999O940P724m375q641K000Q577N55p622p3O917J480m935l30
472a150O531R65p164j388P980K595r752o379P915Q683p921j2944K863J2506J778
487E118j2401m861J0687Q594n169p457L813P118n87m545J952L861k616m293L166
502B380M170m492q108J555Q436m59r643l131P816N565o281o586M535P208j698
517A267n357L057O483p32o342J876O946o07q371j008Q984J959r340o218O668O855
$$ y = [-6003, -11127, 33, 6638, -2927, -12022, -6522, 1057, -375, -3158, -1588, 2080, 759, 600, 7587, 10412, 1677, -5097, 3940, 13775, 5037, -11340, -10386, 5635, 8683, -7617, -16932, -4258, 9000, 2309, -9833, -6075, 6310, 7671, -595, -2438, 5035, 6626, -311, -773, 4697, 4761, -3232, -5575, 2156, 5462, -2368, -9367, -2427, 5297, 922, -7719, -5719, 2858, 3413, -4209, -4282, 2635, 4115, -820, -1150, 5381, 6346, -818, -2206, 5774, 8369, -1383, -7762, 153, 8836, 915, -12029, -9166, 3340, 5118, -7283, -12144, -1457, 7137, 1968, -5489, -1676, 5442, 4855, 310, 2262, 6123, 3507, -786, 2380, 6550, 2058, -6050, -4495, 3941, 3482, -6161, -9292, -1476, 4089, -2192, -8778, -4243, 2965, 1267, -4090, -1033, 5450, 4718, -1624, 252, 7198, 6591, -1780, -2788, 6196, 8155, -1185, -7403, -735, 6120]
533F120o462r532L133R499j061q328m91Q217K455o074j945N924L483l777j548
548c87M264L004n047l794M614M225n405o926L516P347k040r400j451P499K983
563C002o709m065M919M859k023l143L053L326k781k562L576M756l043n830L404
578G39P031j402q872k651P127L281o910n119M411N650l177n752J366N009j426
593f95m112K942N472l61o237J306P215L78q103j757P351L923o371n314M810O007
609F454l987p939P73O752k21o018r56N702J697m573j418L491J978m272j588N529
625A404L983m403m909M095O475k404p902p07P810K722o406m208M493M235l618
640F60n119J495M643j556m039J975M764j549n642J272N224R40n504k082P314L671
$$ y = [6120, -342, -9874, -6741, 2758, 1697, -6631, -7122, 1095, 3550, -2524, -4469, 1455, 4938, 1161, -387, 3877, 6881, 1834, -1960, 2654, 6879, 1474, -5452, -1936, 5411, 3371, -6029, -7480, 19, 3002, -3707, -7772, -2853, 2006, -17, -3160, -107, 3219, 438, -2124, 1452, 6208, 3165, -2665, 739, 7770, 6368, -2504, -5155, 1972, 5253, -1657, -6776, -2365, 3285, 108, -5644, -4278, 731, -695, -4807, -1865, 3607, 3246, -2991, -1685, 5530, 5908, -2195, -3952, 3399, 7322, 951, -4363, 447, 6454, 2467, -5472, -4699, 2053, 1832, -4186, -5142, 560, 2257, -2316, -3734, -243, 1735, -2537, -4125, 1404, 5387, 984, -3925, 170, 6645, 4241, -3661, -4368, 3442, 6164, -242, -4450, 43, 4278, 660, -4459, -2964, 1679, 123, -3916, -1941, 2823, 1274, -4368, -3096, 2128, 3068, -2436, -4518, 2796, 6467]
656F467n040m337K228N789k852m849M81L817J853l797j890K988L07l569K68K592
672D56O57k936j46K726K328l985k476K897K243j011l636J472M244P53l991j268
688a673K210K552k517k114J423J686j374j077R18N93j154k879J350K860l05l752
704c253J091L663J492l683k863K858K759p60k087Q25J343j83j260J042J237k136
720H5k197K151L043j928l557J079L105n39l380j987K899K459j863j854K137J887
736A540j423j086O91J573l93r82J324J752q5l186M60P26J225l216j244J814K641
753B131k206l129J038K466L22k992n55K752J419j810n61J671J598j337o75J136
769A268J149k208n02J911J547k499k443J453K156j595l211L57K666M77k396l10
$$ y = [6467, 1427, -2910, -682, 5107, 2255, -2594, -2113, 1704, 3557, -240, -2130, 858, 1165, -2404, -2136, 456, 1113, -1823, -1969, 757, 3085, -900, -3376, -479, 1764, 753, -2883, -1411, 2833, 3586, -405, -1673, 537, 3089, 572, -1542, -119, 1567, 193, -884, 34, 627, -527, -3406, -2056, 804, 499, -3253, -2162, 1501, 2993, -690, -3553, -695, 2064, 1304, -783, 42, 1385, 1202, -58, 984, 2221, 85, -2112, 39, 3082, 1154, -2403, -1324, 1781, 1242, -2138, -4125, -1226, 1233, -630, -2484, -347, 1540, 117, -969, -278, 1295, 902, -80, 1244, 2996, 2911, -275, 185, 911, 2136, -1080, -2324, -510, 2131, -75, -3204, -2166, 300, 622, -2370, -2925, -173, 1246, -564, -1125, 546, 2144, 807, 132, 1268, 2417, 209, -293, 1618, 3165, 666, -1777, -324, 1832, 237, -2974, -2617, 49, 526, -1870, -2180]
785b180K049K51j022o87K206K90j617J101K116P53k307j456J269J595j304j791
801g34J68J993K30k094j321R84L91l73j270J485O37p78o63N74J578o29j184Q59
819a47K427p12j973P0K352P74k990o94K033Q56j692k693J559K229r38k480J056
836i63J611p95j155L91J707j30j783M53K157L5k009m34K014J628k090j406P74
853EJ715l68k030p3R32K30o12j040O22l3j84o20J399L30p51j179J840J006m45
872G44k036Q52K175j77j868r46J843J315k526m22J659J444k117j483J640N26j72
889D51k182J335J734j444j972R98J785o90j700N0K252M07j020r10J404J294p50
906A042j440O56J069k7r38j38o7L35r81N4O94l98j219l03J605Q21j156j611J436
$$ y = [-2180, -131, 120, -902, -1589, 617, 907, -710, 391, 2507, 3260, 953, -503, 766, 2361, 1057, -734, -566, 1427, 1657, -437, -1758, -774, -383, -756, -2026, -541, 96, -682, -1345, -771, 807, 178, -1006, -147, 2280, 1568, -405, -335, 2017, 2791, -199, -893, 1140, 1996, 304, -2389, -830, 1399, 461, -2019, -963, 648, -147, -1302, -911, 796, 666, -1117, -664, 1493, 1528, -481, -915, 1099, 2727, 637, -769, 5, 1720, 1352, -678, -751, 181, 411, -201, -1241, -619, -652, -836, -1456, -57, 273, -478, -1657, 183, 1189, 744, -1292, -440, 1735, 1558, -310, -1256, 587, 1902, -624, -1046, 613, 2057, -60, -1543, 97, 623, 451, -1731, -396, 1338, -106, -2078, -1080, 705, 15, -1685, -1635, 617, 1024, 4, -906, 498, 1792, 1042, -398, 258, 1327, 1300, 362, 224, 157, 492, -489, -435, 259, -139, -1358, -1661, -56, 765, -391, -2002, -566]
925e66K248j426j384L45J423O88j253q11J810N02p46j450J533R60j322j194J131
942D88J128j848j675N84J702o24j896O08J365L78j228l89K017M55o46m65R36M41
960A331n15p55J603m91l81j366R64P94p76k141J68J388J060j328j211Q55J442
977F41j122j160P66J221j56l42l88J318O02j175J68P75N44k298N14J236M49j718
995a25j158J010J183j529q65r1J732J00j745K69J466j9j059J79J423L6n30m18
1013a41J249M12j182n02O69Q82j157o14n58J412r5q53l42R22l55l17m58J023J27
1032A22k05j082J048J050r83l90Q37K85k30n53M82O73K40j225q52J591K62j225
1050a55p25N55P66k02j428P25Q7M36q44L19R71R9j147M43J471q9j502k65J476
$$ y = [-566, 1682, 256, -1128, -783, 640, 1328, 75, -736, 1074, 1576, 830, -620, 913, 1873, 551, -643, 488, 1616, -232, -1907, -1323, 379, -245, -2141, -1533, -168, 210, -1018, -1407, 610, 1065, 419, -46, 890, 1331, 816, 61, 1664, 1173, 792, -574, 390, 1184, 408, -1733, -1565, -177, 883, -445, -1656, -801, 641, -481, -1641, -875, 346, 190, -152, -540, 778, 1380, 205, 373, 1148, 1692, -606, -92, 1144, 1593, -125, -1283, -273, 910, -619, -1484, -1575, 157, 257, -1488, -1219, 247, 228, -831, -652, 771, 807, 277, -141, 1108, 1520, 338, -164, 505, 1387, 230, -384, -942, 470, 375, -478, -820, 102, -253, -570, -1028, -5, 122, -83, -1165, -117, 933, -50, -440, 397, 682, 452, -101, 381, 1054, 1294, 69, -783, 808, 1070, -155, -880, -325, 441, 239, -1189, -464, -377, 59, -785, -466, 505, 604, -543, -100, 1371, 1282, -220, -485, 991]
1069I91M27j078q71O50Q73k60j146k80J578m73r63j85P71J80p17n73J045m54l02
1088g87m24R59J054j050r31J024O44O30j353o76J966j96p25k41N66P77j137p42
1106f42N53J35l75m16O61L81o31j080L57J308k56j015K84J248M43j160k36O42
1124B01J211j090p22K78N50K57m71J42O0J46j282m2O27M80j442j70J667K05j023
1143d18o74J150J57k60j22m29J262J47q18L29O4M70m69l10O64P1r24m96R23L66
1163F83j139m63K54M21l05k95q7J249l93n68j08Q68J62j9l28K79M16K80p14k18
1183b5O93n49l80K50P44k91m63q18J041m03p53m59J283O59j228L45m49L69N82
1202A48n11m41Q14K08M90j38q5L75n78j59O23k16r05m27J016N6j93j041J65O61
$$ y = [991, 1418, 340, -531, 119, 992, 732, -414, -694, 884, 411, -552, -737, 34, 214, -503, -1076, -31, -485, -787, -1211, -252, 802, -248, -1179, -155, 489, 1119, -234, -910, 1056, 860, 135, -106, 460, 1237, 100, -642, -89, 46, -329, -745, -84, 297, -334, -1414, -1057, 251, -5, -1020, -736, 512, 955, -205, -441, 201, 1412, 322, -400, -122, 428, 685, 214, 356, 416, 562, -720, -762, -135, 345, -1097, -1267, 400, 605, -418, -1092, 58, 215, -45, -167, -596, 666, 813, -5, 324, 388, 858, 389, 79, 743, 814, -110, -606, 317, 683, -456, -919, -665, -244, -549, -844, -931, 318, -75, -643, -751, 117, 279, 260, -68, 211, 627, 907, 193, -25, 668, 119, -261, -11, 733, 442, -21, -839, 202, -201, -954, -1413, -130, 529, -699, -354, -803, -434, 148, -363, -804, 10, 218, 708, 570, 485, 860, 282, 123, 746, 530, -375, -802, 214, 270, 77, -964, -799, -138]
1222a38N9m38n43M67P83N5j59p9q7J14J45K27K55k79j64O48j29o97j98m6K40O4
1244A00n41L75J85rm16l72L63J6k64J1K27M35j57L47J29J77o66K52K47O7k20m7
1266B39l30O21J54m24o58n7J41J00J6K22j90J34j93k0l00J24j92N01Q94n27j28
1287A27p3K58J09k80l37K53P05n95l79K99J10j52q0l64J56jl07M00J14k83l85
1308g05O48K44k86l80O7Q77M72m23n34N08J3k70n99L93k92K95J46M9k3p58J60
1329c98K03k7L6l60K9P96N8l58l98M73J96j18n11L88L61M03n92k1r6J29k30PN23
1352D93m50l53j83R81k65o61k95M29Q18o28o82J70R51n9k37Q4k0K56j36o8K26
1373C71Q0n02K52K05j39n52q8O02M91o12m70j0O84k98k80l96N04PK24p00M77K41
$$ y = [-138, -79, -517, -1060, -593, 190, 245, 86, 7, -80, 34, 179, 406, 661, 382, 218, 866, 737, 40, -158, -204, 36, 100, -441, -66, 119, 110, -306, -678, -315, -299, -563, -552, -325, 110, -47, 300, 429, 606, -60, 192, 439, 506, 286, 239, -91, 530, 684, 260, -398, -455, -314, -214, -198, 24, -166, -32, -225, -245, -545, -421, -613, -112, 782, 255, 127, 54, 312, 421, 141, -196, 57, 762, 167, -212, 87, 197, 45, -35, -399, -243, -244, -551, -151, -37, -320, -705, -57, 187, -99, -479, -412, 465, 937, 514, -20, 488, 501, 231, -368, 25, -267, 28, 174, 223, 200, -558, -398, -195, -222, -186, -546, -517, 279, 337, -21, -419, 54, 250, 132, -379, 9, 370, 773, 181, 160, 64, 193, -37, -30, 493, 43, -310, -493, 488, 223, -438, -733, -304, 514, -114, -796, -626, 325, 266, 29, 113, 93, 349, 213, 145, 371, 451, -51, 201, 406, 267, -285, -373, 229, 720, 108, -362, -372, 312, 14, -266, -662, -158, -151, 73, -627, -150, 91]
1395I1Kl50K54L17l36L5Q2Q89m39m93r9M32J68p41p62J084M29p50n87L21N23L43
1417D13r16O3K16J96L5P7K13J86n12K71J80L67q85m44P62L45j66o76J00N35j27
1438B33n28l19Q10j31j64n55M12K3J16m93M16M97p03J46L18L18Q2r27M4J165k76
1459D84m05l22O68J47n66l82L97P4m86k26K59M34n5l96q4O17J18o58O7Q30K66
1480G81n55m45P13J73l04j49o25J041jo96l47K18K32k87P0j85j37K67J0J47o4
1501a43K07l78J42O40o23k99J60P94q6m24l02N01J69M6o84M66j5J91p79L66J09
1522E8l78j30J94K77j98l68K57N52K15n71k84J006N3j49p96O53o5J67o71L50j13
1543E9L24m67l44K30L16o26M39P79n32k72n88M93J128j221J22j65L32K03k6o03
$$ y = [91, 93, -257, -3, 314, -22, 13, 95, 984, 545, 52, -47, 385, 553, -188, -950, 134, 563, -187, -774, -453, 70, 413, -503, -440, -224, -28, 7, 84, 297, 483, -29, 242, 422, 789, -96, -540, 222, 567, 401, -275, -175, 360, 233, -295, -614, 196, 65, -99, -654, -242, -219, -103, -596, -180, 317, -386, -240, 78, 396, 478, -449, -405, 760, 484, 79, -243, 425, 572, 6, -376, 21, 95, -391, -617, -358, 76, 21, -375, -459, 158, 276, -382, -315, 515, 781, 226, -219, 494, 667, 363, 214, -411, 630, 629, -67, -414, -196, 36, -251, -181, -366, -503, -236, -226, -79, -143, 64, -314, -172, 468, -155, -454, -294, 500, 414, -10, -312, 189, 358, 404, -280, 186, 171, 362, -417, -51, 58, -320, -450, -256, 21, -177, -545, -288, 264, 479, -92, -376, 630, 683, 534, -262, 391, 326, 493, -178, 172, 59, 383, -84, -428, -198, 118, -508, -69, 710, 178, -94, -682, -189, 939, -282, -160, -325, 7, 210, 184, -419]
1563d19J008j78K89l65p13O34k57K28J1L72o31m69n0R93r45k65jQ70K13n89l38
1584f02P90M36o43j14M05J54L50r99O13j03l26l06P87j6o91J43k52K75K5p0L08
1605A64K02l78J9r4M2J71m01N6M06j46J95k89m63R38l34j39M68l49M33o68P7J19
1627B9J25n27j51J89P23q33L82j10l44Q19l84j1L2l2M48k99M26k41o12P48k23
1648A54K1L8j65O04l79J6k57k39L50O1r79O1K19M86K79m87l83j50O91J08J34p50
1670e67P06l44K3P73o67j84R14k5o93O47o48K71O1j4n62J58l6k41K01L4M05k60
1692d8J51m41N44o35k8l83J134k48K83m4l7l18L11m64K96nj8l77k96N62J69k28
1714a20K5J99o59j21Q05k62K72j41J37n4k07j37j44P09M73r06R3j04L08K95p05
$$ y = [-419, 589, 411, 700, 335, -378, 256, -1, 227, 238, 610, -21, -490, -540, 453, -492, -757, -758, 112, 325, -264, -602, 188, 624, -19, -133, 272, 426, 776, -223, 390, 287, -39, -345, 442, 426, -265, -122, -374, -99, -74, -144, 164, 366, -12, 7, -87, -45, 126, -275, -219, 187, 41, 236, -53, -516, 422, 88, -51, 417, 68, 501, -167, -90, 29, 154, -373, -524, -335, 388, -445, -63, -173, -517, 302, -82, -93, -61, -93, 355, 56, 482, 241, -371, 377, 154, 175, 213, 48, 652, 273, 289, 32, -207, 143, 204, -775, -714, -495, -9, 270, -217, -600, -750, -59, 49, 183, -567, 139, -205, -182, 591, -76, -260, 654, 629, -64, 583, -65, 206, 267, 253, -309, -151, -187, -428, -227, -193, 212, -48, 103, -338, 206, -429, -457, -840, 294, 46, 329, 285, 248, -70, 241, -223, 73, 68, 50, -327, -623, -61, 108, -120, -95, 104, -555, -676, 129, -133, 139, -2, 135, 81, -126, -263, -407, 302, 775, -131, -38, -142, 166, 461, -244]
1735b44K44K87k93O5l80K35k08o0K31L21l12K7j84M82k46M24m91J81j3M29p02
1756b07P2L90K31M4j50j54k96PN38p79m96M87O48n88O50o23j6K55l1J23Q3n45
1778c57K06Q11q13M33j0j80m11J66M20j76J99l8L0o36K86o34O52k14L35k32l7
1799b00M09l09o7j03J18M39j09O6l80P9k05M04N7j87J80j30L55o54O98p05P3R4
1821g7L46l54m92L62M7N0j50N05l16j58m21Q41j31p0L6j46J78l90N78J72j27l82
1843i9Oj13L33k52j56L2N17m55j26J86P7k72J55L85n54M5l6P80j083P17p8l07
1865b98N28m58K06J84l45M00K52m63r41J451o15M68r04k4N08K85j04j89L37o4
1885B14k36n04k30J188l25K31m53K11k32l1O58j25J72m33J02n31Q18m01k64m12
$$ y = [-244, 0, 287, -6, 59, -321, -86, -294, -354, -123, 198, -114, -87, -271, 211, -35, 389, -102, 79, 66, 495, -207, -135, 255, 486, 530, 380, 226, -70, -63, 475, -304, -800, -313, 335, -253, 397, -226, -242, 13, -18, 105, 188, -357, -151, 660, -153, 280, 270, 90, -321, -155, 265, 89, 288, 250, 280, -356, -70, -704, -52, -266, 69, -163, -200, 209, -100, -167, -270, -152, 287, 178, 244, -136, -57, -262, 142, 199, 12, 192, 62, 417, -237, 461, -244, -171, -77, 269, -85, -577, -215, -168, -118, -268, 237, -79, -237, -658, 183, 52, -18, 18, -128, 50, -340, 238, 410, 283, -99, -93, -206, 127, -125, -281, -249, 268, -187, -313, -127, -50, -322, -167, 218, -336, -291, -327, 453, -630, 87, 9, -298, 230, -228, -22, 162, -183, 217, 469, 6, -935, 516, -99, 369, -535, -559, -51, 234, 130, -59, 278, 214, -22, -526, -756, 432, 107, 338, -115, 96, -136, -167, 491, 366, 538, 105, 207, -324, 494, 93, -171, -583]
1905e83P01k60P09r45O41n55L06j56j08P55p04M24o8K83l28K14j88N7L07p20O4
1926a54m5J052r21k33N34q56M06J45r4M97j93l70J61K66n38J02PL67j44L07J84
1947D80p05N37l42P0j1j6l93L61L36n72N43p5o82J091p48K13o32M61K23l77j13
1968c51M28j71k87M7P47r8k36J22J83j82j35J16K16j121J001l31n7K98k03%n41
1989e55O41J72j0k84k06j47M75L3Rj13j67N35o2j09j98l41N06L32l06l33m88R20
2011C04n79K58j27k3O38k71j058J013n02L29l31K04L46j0l79l16J271o50J97o03
2031b89M25K77k42L88m43k16K51k2k99k32L28K00n39J99j17j2K05K06k5N4k53
2052a56K22l03J46R87n17L7n26J61O0p9K29l52k56M87J02m75k5J68J73j33j23
$$ y = [-583, 118, -142, 567, -378, 263, -292, 14, -142, -250, 505, -199, 225, 157, 440, 112, 326, 138, 195, 502, -218, -154, -199, 853, -68, -301, 233, -623, -217, -72, -166, 331, 138, -232, -71, 195, -343, -241, -234, 133, -11, 296, 480, -225, 312, -30, 40, 29, 13, -380, -19, 317, -255, 288, 213, -469, 622, -126, 87, -545, -84, 139, -238, -351, 77, -94, -381, -334, 413, 315, 79, 201, 384, 202, 67, 183, 399, -722, 279, -52, -109, 189, -14, -14, -555, 86, 258, 248, -36, -242, -389, 86, 119, 128, 15, -152, 383, 321, 212, 14, -327, 179, 511, 205, -128, -616, 304, -275, -17, -144, -167, 471, 200, -858, 155, -347, -18, -349, -145, 201, 191, -188, -504, 767, 117, 314, -289, 136, 413, 171, 559, 116, -100, 151, 129, -170, -402, -74, 126, -413, -214, -331, -343, -138, 68, 43, 97, -156, 66, -237, -91, 896, 379, 416, -110, 51, 111, 32, 261, -91, -347, 140, 242, -233, -258, -90, 83, -50, -173]
2073a73L51j24J11k69m41M59j29L62M80Q8m63n8j55j31K26J73M6n05K97L90n38
2094cm15M11j32K03k96n7M22K1l9k60K77m3k31P3kk87NP82n20M7L84J23q37K07
2118a67L13n37J09N39r2N3k60l4N0K9L7j70k58M44n93O89j78n2P9pL43m17j26
2141b06M04j94J1o6j44J24j43J12J35l08P54p26J7m20K27N81m06k16N72k31J49
2162B6k55O26k52L3m08O32j43n25JN5K98R0m4o51P21l61K79R1m87M90l43J4J96
2185H3l07r%M27l39N9j37JK61L72k10j98J10P2J0j69L10o58L75nrr2J28k78L98
2210A95l77k51M26RlK04k97J76M73l81N0j01j4J6J14k92J02J69j21M8k84M10n16
2233b45L46N8j35J95l68M0K53r0k66oJ58K2l30J59N60m2j32L1j67J34k83j34K93
$$ y = [-173, 178, 54, 165, -104, -545, -86, -215, 147, 627, 715, 252, 194, 39, -92, 134, 307, 353, -152, 145, 535, -3, -418, -7, -139, 64, -232, -289, 133, 154, 115, -145, 132, 89, -142, -69, -71, -358, -353, 429, -91, -44, 340, 463, -374, -167, 146, -391, -282, 257, 165, 218, -42, -76, -26, 3, 40, -130, -388, 56, -537, 152, -26, -78, 1, -6, 337, -80, -206, 198, 4, 15, -51, -195, -71, -214, -102, 33, -275, 479, -247, -230, -650, -423, 158, -248, -464, 108, -123, 26, -229, 397, 145, 178, -230, 402, 259, -266, -265, -210, 88, 178, 134, -517, 204, -157, 122, 213, -274, 216, -127, -113, 83, -224, -233, -233, 194, -145, -86, -223, -222, 39, 411, 201, 3, 113, 185, 195, 26, 336, -322, 53, 48, 39, -53, 75, -203, 195, -182, -433, -7, 2, -1, 203, -94, 82, 555, 174, 224, 123, 109, 125, 239, -53, 49, 218, 97, 145, -139, 271, -245, 101, 159, 24, 219, -149, -109, 144, 54, -212, -218, -60, -38, -368, -209, 351, 309, 177, 208, 41, 175, -108, -242, 51]
2256E1J67J7l32O1j17J42J88k64l7J90J45m93L97m19K99k0M9j0j7J76k49L97k39
2279H2j6k02N3l2J35M8n2k21l4K40l8K80L9m75L1P5J16J24j58K61j47j84J18J38
2303A81l10M18j66J88r8j33J85j73J85r3Oj32L08m55O1jk14P1J63j43p0J34j27
2326b15j66m8N29pj50M44l93J92P6k97n7N9J65n92M95J37J29r8l25K00J04l81
2348a99O5O6J23pl02O71k77J12j82J41j36J01r1J66p8k56J64j4J4K2k3j40K34
2371A74l83L23l0m55K85j7m2K99n9q1O7P8K31k71n36N75Q2K59l71j62J16M4l15
2394a89M70m66j29L57k18L12o4j63P9L98k13l64K81l00L04k81K32m12P09q6l31
2415g4r2P8J57k32P1L59L6l67O9ol8NM5k89L76j41l16L81P8O6j58p8k14M45q0
$$ y = [51, 218, 235, -97, -36, -153, -11, 177, -87, -124, 66, 211, -282, 115, -304, -5, -25, 24, 14, -3, 173, -76, 321, 82, 66, -136, -83, -115, 20, 68, 16, -205, -239, 1, -37, 243, 282, -193, -162, -87, 29, 153, -5, 256, 109, -75, 43, 181, -129, 289, 123, 311, 213, 80, 265, 92, 277, 184, 190, 58, 366, -89, -28, -29, -243, -172, -9, -152, -222, -88, -215, -381, -429, 100, 93, -57, 387, -6, 186, 262, -35, -92, -33, 132, -460, 35, 172, 301, 203, -122, 78, 182, -199, -134, -68, 55, 48, -254, 417, 140, 252, 70, 211, 75, 176, 85, 251, 173, -83, 81, 67, 81, 103, 80, -60, 174, -209, 114, 84, -371, -86, -103, -145, 154, 95, 14, 81, 159, 390, 119, -417, 158, 240, 499, 128, -34, 82, 126, -189, 281, -185, -314, 43, -175, 137, 73, -90, -11, 387, 174, -190, 91, -209, 95, -186, 46, -366, 343, 257, -74, -166, -88, 69, -163, -92, 267, 303, -64, 5, -1, -39, -34, 11, -278, 98, -43, -359, 22, 100, 166, 8, -70, -284, 161, 81]
2440H1L9j15J25j38j56Q8J20Q8J2O8n0j55o1q1J24L52k77j09o13O62P4l97K03
2463a16L53K5N1k46k24L50j68r1M62m55j38M01l61K57p9j59k06L15J29M5l39O7
2485a27L09l24K61r6J89l55L17j42j72K83j11k1o3m9J23k5l13K30J60J5j58N96
2507E27o64K99j87j18L76k52K18m15N82k96k30M55j82J55k63j37M6M22n25N89
2527D00p1j16J1k21j81J16o8LK9R5Qk51K38Nj56K84J56j41l83K73J70Rm08J50
2551d9J62J05j90J46l5l48L22l27K66L88k88j25j49K12j41J51M1k33q7N32n07
2572a54M3J01j51K03K49k90M6j63k7J1k6o8K65L2n87M69k21J15K94Qk90j31J00
2595a72J61k08K52P7K41n18L74j50n3K10l57J14j5k64L98j90r6M08l31K81J58
$$ y = [81, 120, 5, 130, -8, -164, -76, 44, 132, 144, 212, 162, 7, -54, -135, -11, 341, 64, -45, -658, 4, 78, -319, -116, 237, 262, 313, 67, -157, 193, 25, -66, 396, -59, -197, 204, -157, 100, 21, -138, -344, -29, 100, 145, -194, -127, 182, -142, 119, 23, 212, -143, 174, 32, -140, 143, 32, 11, -52, -101, 22, -3, -316, -86, 74, 89, -69, 527, -137, 162, -25, -143, 233, -19, 199, -216, 366, 70, -160, 295, 113, 268, 5, -132, -86, 336, -189, 400, 329, 213, 224, 3, -178, -62, -130, -127, -98, -3, 5, -246, -8, -3, -159, 125, 281, 140, -243, 30, 200, 209, -199, -49, 113, 218, 28, 174, 139, -209, 113, -214, 52, 440, 152, 27, -122, 90, -51, 100, 141, -92, -179, 353, -154, -111, -10, -161, 42, 291, 1, 47, -116, -143, -132, -158, -226, 39, 71, -516, -47, -268, -153, 141, 149, -141, -272, -172, -11, -219, 33, 110, 351, -167, 207, 57, 4, 214, -143, -29, -44, -308, 90, -100, -196, 212, -119, 162, 320]
2616C20j66qm40L41j88r8M37k68k34J54J75J02j44K4l5k19J76l15N35R0N6m02
2638a07L04K5j61m2k31J18n1J06j82o5L48q6Q4p7K23M6l56K18J41j74l3K79l90
2661f3M9l62L11K19O3k89J20J70k50L54m63P7r3P9K15k20J4K59m07Q6j4k54p8
2684d77M31K81l05J84k30j43L17o3mJ10j3M9j37qj11j01N2J4J56k09M16l4k67
2707i2P4m33K78O4L69o4k67M5k5k24N74J60k22j43N5l04M4K35j43r7o9L89l64
2730a60N92q2l84N4J28k65L61k16j72j41K98m8P9q2Qj83K09M6k85m9L88m68O49
2753B77k90Q8M3o0Q4j69q0J37m5l24N71j87J78r4m25L35j83N3K31j70K65k82M12
2776C65q23L49r3RL07l75K67J73km44J79q3o5J63J6O6r1j6Q6K76k33L64l04KL84
$$ y = [320, 154, 146, -294, 47, -141, -239, 198, -70, -304, -150, 25, 127, -17, 7, -28, -247, -71, -386, 149, 239, 295, -107, 197, 222, 61, 19, -212, -94, -145, -39, -221, -286, 62, -24, 60, -17, 206, 252, -104, 114, 255, 81, 48, 327, -63, -14, -376, -65, 154, 217, -72, 48, 218, -32, 322, -141, -64, -157, -78, 137, -83, -69, 190, -217, -131, -145, -399, -477, -46, 235, -70, 114, -116, -259, 58, -5, -9, 101, 88, 137, 0, -8, -119, -220, -168, -154, 2, -207, 209, 175, -92, -18, -451, -173, -109, 260, 196, -71, -26, -51, -275, 299, 459, 237, 94, 149, -155, -111, 124, -19, -116, -185, 204, -160, 432, 350, -34, 20, 148, -117, 244, 28, -144, -285, 13, -35, 44, -38, -30, -213, -4, 42, -243, -292, 96, -372, 277, -13, 75, 118, 58, 142, -27, -107, 30, -15, -339, 232, 45, 223, 129, -296, 39, -144, -91, 140, -30, 235, -47, 365, -458, -109, -202, -193, 114, -261, 6, 179, 177, -267, -88, -171, -236, -73, -57, 9, -82, -98, -12, 264, 31, 395, 91, 93, 477]
2801D77l22OQl02j48M2M29K0k77j47J03K0P4k4K42o0o67K23M03Jl24K2L67j47
2825A9j24O4M8L05q11N16J0Q7j87LM3k92N84l88N15k95j53L43j75J00k52K17p55
2848e78N88R0R2j3k98O77o61K64M5q8M58o77J82r4l1k92j10N43k75j2J53j18K56
2871A01o5J33k61J06n7J69q0JK28j23k34M9K85n51L23j67M06k86J03j17K41k25
2893b1j74J50p6L33j58K18k47MK0K78r3l6k74J23k69K64R2p8l14K83j0n1J79m80
2917c37N16k03j0p7J82m28J28L00J4k16J60Q6j05K22l88M57m24q6L04j66O3J25
2939A17j16J08l89J7J53J66K27l7k50J91m45K80k77M10r2j1p9K67k43m5K08j68
2961hj78J6K04J87j2p8k3l07M36m86K80n8k54L65J72m05j33K12l88N50l12M4L75
$$ y = [477, 155, 161, 169, -133, -281, -239, 190, 210, -67, -214, -111, -91, -17, -41, 201, 141, -526, -303, 100, 101, -223, -201, 166, 19, -105, -41, 7, 312, -499, 17, 27, 114, -73, -70, -27, -319, 265, -123, 392, 97, -56, 287, 112, 212, -40, 177, -578, 10, 100, 192, 179, -119, 558, -103, 161, 206, 118, 576, -101, 81, -13, -44, -336, -446, 97, -178, -190, -37, -155, 101, 36, 169, -92, 14, -43, 126, 46, 47, 275, 152, -82, -33, 252, -299, 24, -143, 263, -23, 80, -37, 204, -21, -195, -45, -121, 212, 54, 272, 25, 29, 49, 327, 234, 198, -76, 47, -222, 42, 134, 56, -258, 25, 15, -36, 143, -337, 179, -24, -34, -111, 71, -357, -229, 71, 85, -131, 29, 115, 10, 232, -156, 301, -123, -209, 95, -71, -8, 117, 1, 109, -280, -263, -110, 56, 283, 246, -4, 187, -258, 22, -255, 155, 63, 52, -27, 240, -3, -48, 160, -8, -186, -170, 34, 221, 209, 131, 108, -199, 237, -249, 31, -27, -281, 84, 256, -149, -282, -70, -458, 92, -220, -176, 199]
2984A99J1k63r3J52k8J50J06n6k58M8J30L37k75j43Q9k10J44j3j81J93N8j89J34
3007D2L5jj67L00m20L26m27K20K60k56J25j70L72l19K33j86Pk15N84k27k61K13
3029F8j84J69j39N6P7J1Jpk39L9L48l7k92J17k50N51l36M04k70O3j74j60J96J66
3053A78L8k63O8l7l9L52l95J69J59k37r7o8L19j25k48K51o7J54k03l81M66p2k9
3076a07M10p7l66L50j55k55M20j96n4k21M5K51o5l7n7J48l12q2N43j75m0lK0P8
3100F3j67K12j3k05L64j37R9N8p7l26J25K26j99J40r5n8k6J48j04K4O7m5j29K25
3124A70r7j76N1K9k0K64j09j19q5J44J53q9k68j19L52k17K86k49k60L73L3k26
3146a79l18M63O6j71O5j05J92R4K09n01M44J12j09j74L53o66J39J35K45k21l7
$$ y = [199, 210, -53, -146, 6, -22, 128, 234, 178, -80, -32, 98, 435, 160, 17, 106, -104, 40, 27, -154, 39, 97, -92, 42, 77, 76, -91, 209, -211, 115, -312, -92, 168, -88, 37, -133, 239, -80, 153, -33, -26, -241, 343, 116, -145, 68, -116, 53, -86, -30, 47, 58, 59, 52, -187, -148, 200, 163, -129, -12, -262, 289, -47, 357, 87, 150, -24, -184, 12, 178, 216, -47, 21, -16, -55, 297, -98, 71, 230, -7, -104, -172, 147, 22, -226, 25, -42, 112, -91, -472, -6, -78, -107, 303, 226, -140, 210, 55, -200, 220, 24, -30, -251, -206, 45, -20, -57, -114, 34, -278, -360, 183, 8, -32, -35, -15, 63, -104, 108, 95, -110, 254, 117, 216, 274, 197, -129, -4, 222, 23, 163, 68, 10, -16, 132, 28, 52, 119, 74, -55, 170, 73, -103, -52, -23, -43, 221, 112, -7, -92, 52, 205, 116, -152, -271, 81, -136, 150, -99, -359, 14, 47, -179, -497, -34, 32, -139, -74, -179, 13, 107, 316, -185, 259, 371, 262, 88, 441, -225, -86, 49, 294, 73, 36]
3167C6J24j7j82r9J29j61M16k50M11m29J56k97L05k36K08k77j15L11l19K79k11
3188b18r0K81J38l42K48K58m65J04p7K13l97K08J29k89K61q8L25k50N51k74j49
3209G7J13q4K06m32k9K42L9J05n8l52j51K77j56J8L19Qk50o8j3q1L06O7l54N53
3233C02k68j69K66j41J71K38k14j27n9L1j68J46M9j24L5K08l31J68j8m1J47m56
3255c55L38l7J1l3J91r2k88L80nk91M56m46L57k08L30l24R0j10k70M94o8J0k26
3278i6P1j26l4l6K93Ol1l6k33R0J19O5J5j58J34N9qo69Q38j69j25q7P7m48O90
3303B01m85L43R3M3J49l34m1K25l47j63L67j92J58L2K4k3J68P4m57J71K00m17
3325b11J99R6P3j82k3K1L38m84P6J54n7K62n89j17Q09o19J38l0k18K96MJ45Jk11
$$ y = [36, 160, 143, -39, -138, -9, -170, 246, -4, 407, -22, 134, -163, 142, -94, 114, -163, -278, 33, -286, -7, -218, -308, -27, 111, -231, 17, 275, -190, -86, -163, 50, -347, -139, -10, -299, -38, -126, 199, -51, 500, 226, 77, 190, 106, 312, -120, -149, 93, 132, 237, 179, -173, -324, -47, -203, -185, 134, 142, -108, -176, -189, -270, 36, 103, -251, 302, 34, -135, 131, -10, 161, 399, 185, 58, -1, 30, -138, 8, 57, -67, -32, 176, -155, 13, -5, -46, 101, -355, -17, -54, -43, -76, 115, 23, -265, 115, 110, -181, 275, -171, 186, -22, 308, -16, 74, -36, -306, 188, 120, 130, -96, -25, -151, -185, -221, 72, 78, 47, 11, -222, -132, -13, 52, 67, -91, 43, 102, 94, -575, 263, 94, -31, -118, -41, -489, 201, -284, 59, 152, 195, 344, 10, -31, 194, -153, -316, 51, -141, 17, 49, 73, 50, 218, 292, -165, 6, 206, -211, -12, 84, 157, -25, -48, -27, 311, -173, -97, 57, 0, 262, -327, -444, 365, -254, -116, -146, -364, -68, -64, 81, 82, -129]
3349a29N10n08o2K95j65J12k31K17Q7j06l55J73K66K23m50K10K7LKn6k25J24K34
3372A96K11n26L08m9j45l78J81O9K12Rm5k60K99J10l69N38l34k30j07M76k35J56
3394H7k28P9O4j07J91j1J38o1l01K14L2l16m1kL2K51J3J09l09kJ49K07k36K42
3418A94j18J9m6L1K2m28K82N7k89J82J03J94j39r1j38J49L8J27L0r2j09l24L61
3441A5k24MJ31K03N2r5K5l23N3K22P6j40l0N14n82r2JK85Kj36K89k48R9l08N50
3466C43l55k22J98K06p7k06K80j80j38K00l60K69K72p6l14J4l06N15p4p3O6k32
3488b50k0K15J31l1m7j38Q1j78K65j57L18Po4J9j73J43j10M09j94P6l03q6R3j22
3512a16K94m3k8M6n01K96O3M0J03kj0j43J52k90R7J27k52R7J53k07J14k8J42j50
$$ y = [-129, 381, -127, -189, 106, -59, 53, -178, 39, 126, 20, -335, -162, 104, 327, -123, 87, 114, 117, 119, 63, -162, -38, 196, 407, -119, 189, 140, -5, -383, -202, -133, 79, 88, 43, -217, 82, 192, -177, 361, 27, -203, -310, 166, -69, 87, -141, -62, 2, -105, 86, 75, 213, 152, -149, 65, 97, -219, -260, -262, -230, 21, 34, 143, -166, -168, -19, 188, -48, 194, 76, 95, 49, 80, 102, -326, -44, 13, -276, -94, 9, 203, 64, -27, -165, -16, 22, 149, 179, 87, -22, -346, 15, -209, -205, -74, 129, 181, 86, 111, -212, -159, 63, 139, -1, -31, 483, -99, -191, -190, 95, 97, -39, 250, 2, 101, -207, 343, -12, -234, -36, 170, 93, -113, 167, -13, -151, 49, -311, -42, 230, 154, -160, -146, -452, 63, -11, -84, -18, -250, -270, -55, 76, 45, -2, -140, -59, -237, 28, -129, 189, 196, 132, 151, -22, 121, 11, 420, 226, 302, -1, -87, 6, -116, 178, 135, 107, 153, -348, -52, 11, 51, 154, 152, 142, -1, 151, -139, -42, 85, -167, -70, 83, -124, -10, -38, 104, -46]
3536d6L7QK75k78j14J0J47j22k1J85K4p1m2L0O8j35j40M6J16J16p7J16J60k08
3560H4k44K5j64N26nj59J23j02k4r7N1Q3K5j93M2k56M13J21k29r8J56K86l23P7
3584A18j83J70m26L73k21k84O81m16j52L75J43n21M65j43q0K08j26j76K19K41
3604B65m76J53o6L90p9j47P4J05J42m27J0P9K13l87J48Q2k80K66m54M30K34l84
3626a09O7J63o5p6L62l66L02k01l28J27K91n6j68p9l5J19J84k9J64k27r9J8j85
3649b26L06M1m02L91J33k99J24J2j96j58K49p3j60KP0N72o45K31l02j66N03j8
3671a1K24q8P0l94J94%O9l19K37k24K14K01j36J00q8p9j2k28M88j57j17J76j6
3694A04oj79K15j65J34K3k99J8J75L4r0R2RR3J99l47L00m41K29L11n27J72N6j15
$$ y = [-46, -9, -1, 274, -4, -118, -108, 39, -83, -104, 81, 105, 34, -8, 22, 90, -45, -185, -139, -23, 93, 16, 132, 292, 84, -160, -135, -299, 227, 222, 63, 186, 84, 60, -37, 14, 97, 122, -71, -29, -285, 128, 249, 20, -78, 78, 364, 41, 118, -65, 105, -321, 52, -169, -453, 228, -188, -340, 35, 178, -343, 122, -21, -101, 107, -19, -195, 24, 265, -211, -58, -124, 266, 187, 40, 114, 219, 361, -66, -56, 23, 236, -151, -3, 79, -201, 65, -389, 41, 275, -109, -42, 121, 56, -20, 342, -24, 278, 77, -251, -124, 167, 111, -57, -136, -171, -52, 132, 103, 267, 40, -59, -41, -226, 80, 121, -281, 110, 243, -56, 68, 80, -116, -274, -25, -98, -258, -256, -186, 386, -259, -28, -330, -496, 7, -11, 213, 125, 195, -199, -5, -5, 64, -255, -18, -242, -28, 173, 37, 137, 49, -30, -42, -270, 218, 61, -56, 120, 104, 98, -81, 134, -31, 103, 126, -173, -155, 20, 54, -36, 56, 65, 158, 357, 10, 310, -131, 98, 409, -118, 54, 110, -5]
3718eJ7M8k83J55J22M8o1k4Mm8k0R9k70P4K08k53m9Q6K14Q3k05K57Jj38M45m76
3744B9r5J30l3n3J16j04oK61l82J07o6K99p1L53m97J89j62j66K41j27q3K76Lj55
3768Dj70L1O14p49j9L08P1m4j27L22n22K6L36q9Q9OJ36J02k20K0j47oj56L12j27
3793Aj5j93K75N0j61M9k20K0M50q0l02K01p4l9j90j34J59P42m64J27k80O1k6J50
3817A07j82K83j99K43j91j08K3p5k03M86l95M51k1r8j69J73lp1J40r5l10L09k11
3840a16n2n2L70J02l25J75K32j90M3K54o55J59j62N7M30k11l2k71L28R2l98L62
3862A40m9J19n23K65J42j34P6j10L12k4P2k92K22n73L56J32l80K59K07n03J23
3883a63L32j26J42n36K11N39k54l18J47o6K26%k6J35l38J21K5n1P1p5m33M43M01
$$ y = [-5, 12, 60, -223, -68, 54, 102, 41, 17, 21, -27, -47, 52, -218, -144, 64, -189, -238, -152, 62, 145, -60, 197, 198, 60, 505, 29, -66, 64, 31, -22, 94, -10, -16, 245, -137, -30, -96, 203, 132, 485, -12, 177, 15, -151, 90, -37, -120, 156, 159, 4, -166, -135, 479, -270, -289, 19, 90, 46, -81, 241, -281, -255, 81, -8, 81, 87, 223, 325, 105, 125, -22, -28, -184, 128, 1, -14, -207, 68, 118, -43, 6, -214, -194, 256, 176, -126, 75, 1, -38, -228, -362, -203, 539, 75, 202, -78, -17, -43, 107, -75, 208, 9, 252, 61, -47, -24, -99, -302, 184, -211, 240, 219, 121, -48, 125, 122, 51, 191, 96, -214, 95, -116, -168, -220, 150, 252, -73, 102, 334, 144, 187, 441, -214, -55, -217, -160, 270, 59, 27, -244, 84, 176, -222, 140, 91, 210, -313, -48, 94, -40, 36, -74, 238, 214, 286, -6, 216, -357, -1, 131, -249, 10, 217, -286, -163, 169, 43, 185, -351, -140, 399, 145, -173, -26, -92, 134, 134, 108, 243, -95, 26, 51, 0, 71, -4, -437, 6, 407]
3906D07l84r1K3p3M90m72J01Q8l33K93m5K93k26m03N35l7J5j26j4l72L39L10l30
3929a2K8j70LJ45J37k84J50n7J59j94K57Q6l97O01o10N41n52P2N29m41Q1L67l72
3952F7L7K35l54j00L68k00k31N36l6m73j30J29L61J3m04L36l14M8J85lN4j19r0
3975h5K6J19j03M0K33K7k03q5J26J62m04j45J13K10k05K37J19l03N09j67l13L2
3997f0j16j19J09K28j57L36j88L2m0K6J66j93j84J59j06O3K36k64K36r7j14j19
4019a66q0J09n9M85k67J00J22J7j07l31r1J26J0pK11j68J90R4j54K6j62j88M34
4042A44o10M65m6J83j72k35L64J2k75N8R1k55L04K0O9k94L86l46l6L24k94M5M39
4065C41l01J79J95m41J51m2k41R9R6j00L70n96K02L97j45ok62L95j51j63Lk97
$$ y = [407, 23, -68, -45, -118, 372, -100, 1, 89, -244, 49, 4, 297, 71, -332, 203, 166, 181, 55, 41, -331, 8, 318, -12, 16, -154, -151, -6, 131, -153, -3, -60, 99, -95, 162, 248, -149, 452, -158, 383, -169, -97, 432, -9, 72, 439, 67, 104, 339, -15, -115, 253, 53, -178, 358, 322, -151, -281, -152, 209, 222, -182, 154, -160, -112, 73, 70, 124, 5, -85, -59, 60, -43, -3, 230, 257, 54, -31, 95, 257, -147, -292, -179, 31, -174, 63, 182, -121, 388, 221, -92, -60, -176, -295, -186, 42, -115, 221, 33, 65, 25, 51, 217, 24, -160, -1, -107, -44, 192, -72, 164, 67, -47, -166, -246, -137, -196, 289, 22, 122, 244, 261, 154, -177, -268, -142, -132, -139, 72, -96, 94, 188, 34, 60, -102, -290, 144, -466, -1, -47, 136, -36, -271, 93, 105, -170, -112, -21, -276, 28, 48, 117, -177, 209, -137, -173, 151, -143, -98, 341, 40, 219, 414, -27, 124, 82, -159, -60, 36, -64, 306, -290, -88, 309, 164, 158, -104, 291, 140, -23, -20, -317]
4087c17L35j51L42n80J72P06j73m42J98j57J24j2j59J16o1M24m60q1O48p06Q7
4108a47K71m98K44k30K40j29j4M57p8o49O07l03L72J93k81k06L27N0n20j94J312
4129H24p68L4L7M1o63K72p1J83M98o28L0O2P59j086R15p19J064k76j21n42R9n03
4151e59R63m61L88q70j74R82k58n7j39O02k77n91Q59k18K76l48Jl29k58O94m08
4172a82L98k48k73M16l74K23N51l89O8j13k35O4K71J24l70Q4R3j90m4j58K67O6
4194D9r5K63k3m60K71J56k84R5l2q0J48j53r6N02m04K22k61J06J41n2J37l15l22
4217d87L71K50qj33J33j27J74l1k35M5j58J92P6m0R1q9Q1%j46L6pK1N1L9m3R0
4243A46J3j53p4K43m49M94j36p0m69P35k00K65k87m04P42o86O60k17j85J6R9k96
$$ y = [-317, 18, -133, 209, -371, -199, 507, 334, -108, 90, -67, 57, 45, -114, 2, -59, 365, -95, -176, 472, -234, -147, 124, -374, -130, -360, -120, -249, -263, 194, 116, -533, 74, -229, 143, 336, 55, -151, 176, 226, -294, -488, 824, 56, 90, 127, 168, -495, -223, -294, -111, 387, -241, -211, -149, 610, -476, 439, -280, 784, 508, 387, -155, -56, -559, 404, -57, 331, -539, -713, 269, 11, -46, -185, 417, 140, -451, 408, 190, 466, 118, 119, -210, -468, 226, -182, 216, -32, -305, 111, -263, -40, 511, 122, 190, 77, -158, -94, 177, 301, -69, 15, 108, -82, -126, -284, -17, 49, -46, 217, 194, -266, 5, 161, -123, -28, -60, -140, 8, -145, -241, 261, -143, 79, -182, -76, 65, 13, 150, -165, -487, -116, 134, 126, -7, 126, -1, 173, 142, -93, -48, -206, -14, 62, 22, 113, 24, 105, 105, -41, -5, -12, 9, 60, 99, 56, 146, 159, 6, -68, 175, -274, 220, 84, 14, -455, 280, 80, 345, 58, -346, 396, -290, 370, 153, -32, -16, 83, -213]
4265b13M19j36N0m7r5j48J01j3j69N97k08j17K40r9k51p8j76K70o6K9Q5P0k99
4288b54M19l05J53J71j96J58k52k02K26K9K30o80P57L1k45P4K20j98k57K71k36
4309h6M09p17K38p8P9L70j03j35J44j32M3q5K09j75Q8J30J7J52j83j29J66o7L23
4332D78o80N06m47M68m80o2l41M38p1K81M0j74j24L26p3o8m0P9Q6m26j97N36j47
4355i2P6O32q27K33Llr7K4K50J77o36O06l34m81K22JK85j25J79k08J0M6J35l18
4379b42R2L0K05%P5l96K46l52N39Rl56J22j2K97R3m25J5n9j40L44L12k58k63J49
4403B5k45K8M18k51L66p63M19j29k58M66M8n22L02O91q81R9L46m14P77m23j25
4424b6K76k58J98m70M11k20l60N91n86O47L59q61O2Q3L26Q5nJ41m29k99L45J11
$$ y = [-213, 206, 70, 120, 73, -22, -170, -69, -82, -251, 346, 138, 21, 261, 162, -89, -167, -343, -73, -139, -110, -25, 45, -254, 165, -140, 13, 184, -12, 146, -106, -308, -82, -53, 177, -503, 254, 285, 40, 114, 334, 136, -121, 150, -86, 323, -394, -156, -234, -155, 215, 112, -23, 121, -11, 32, -53, 156, -19, 69, 199, 216, 368, 185, 56, 222, 155, 478, -202, 304, -143, 325, -155, -217, -558, -120, -191, 90, 130, -44, -168, 158, 85, 17, -23, 56, 142, -284, -481, 55, -92, -16, 616, -211, 22, 25, 22, -75, -51, 199, 376, -260, 346, 12, -469, -247, -246, 39, -86, 93, -115, -105, -59, 76, -242, -150, -120, 85, 85, 160, -236, 10, -342, 197, 206, -150, -28, -40, 257, 350, -75, -60, -119, -259, 85, 397, 139, -124, 25, -220, -192, 226, -25, 341, -422, -3, -132, -390, 76, 124, -398, -96, 595, -286, -187, 159, -255, 522, 99, -26, 250, -8, 190, -280, 131, -89, -449, 142, -444, 203, 562, -299, -237, -154, 172, 257, 252, 393, -36, -335, 10, 121]
4446A21r8k15O8l4J46J04l74L39k30J45O5K34n44L80k41Q9N5K52k05Q2k57r6K37
4469B3O3K88m68Q9l45K79J41J93j82K07o36L51j06K0p4M9K34k59q0L81n1j74J78
4492A21j77k4r6M44k01j54L77j17k42jj59L1J10M75o12K65l37J16k62L08L70k47
4514a2q1K89l37L18k82L53l48k8K9M58k24k97k58N11o98O35L91Nj5o45J08p1O0
4537a39K31J14j81P9l89L23R5M30n40L82k66R5m8l3k36r6L52m91K75L69Nk44o2
4560B5L39n86M06j29Mn5m16Q60k56k37r9M77r9n8n4J5j56J36M0k86O1L37R8q12
4584d45O60l30L37k53J36l76M07k11k67K22K44j52j60L9J99j53J30k47J38K77
4604A95m29J40p0O49o84k88k7M89J94J12O76p86J45l63j40K47l61L78l40Q00j059
$$ y = [121, 23, -192, -124, -158, -12, 92, -282, 57, -173, -28, 37, 271, -273, 107, -134, -45, 10, 262, 57, 139, -118, -214, 23, 86, 374, -94, -5, -350, -71, 70, 263, 81, 288, -348, 3, -103, -83, -157, -108, 126, -133, -213, 168, 117, -57, 121, -56, -80, -176, 268, 67, -87, 290, 173, -69, -70, -229, -198, -88, 387, -225, 40, -297, -181, -443, -135, 235, -12, -93, 196, -141, 177, -105, 248, -100, -128, -99, 359, 135, -162, -420, 91, -607, 28, 419, 424, 409, -236, -128, -199, -139, 92, 206, 25, 104, -285, 38, 133, 563, 23, 405, 139, 234, 186, 153, -83, -179, 173, -318, -43, 326, 331, 87, 25, 364, -222, 184, 55, 59, 4, -412, 448, 192, -45, -144, 333, 234, 176, 122, 137, -19, 117, 157, -129, -68, 269, 367, -445, 215, -115, 222, -31, 105, -271, 136, -75, -342, -120, 124, -28, -188, -149, 50, -103, 27, -220, -82, 195, -234, -94, -164, 485, -199, -487, -514, -25, 169, 281, 957, 171, 316, -47, -187, 60, -301, 77, -263, 537, -522]
4625e22l17J101M7m07N96p18O98n12l56L83k66l4N29j34M2l51J46O94p75K39j48
4646f5l29M31J46N8m17P1K99n00L56K28k02J95j034J26O26K23j5m08J65N8M3L6
4668I1J16n11J40K60%n2J61K25m24j17J74j62M50l37L23k71k66J26o8K24K5m8
4690E9P5k4l51L50j72j9J5j73N5M10m85L24J02k76k4K16J21k74O9j66J38J15Q5
4713A70k02j05K23k69L90k64oL47j84k31L60j59q5n3mj54L40j86K31j35k94O05
4735C35k56mk86J91L41n23K74M7r4j41K26j46J25j73j76L14J90l64n6j75J87K26
4757F2K53l1m02P3j47L35q4k2j99M23k53j24K02J00p8Q0k10J8r0J61n8j49K68
4780A28l49J87O41p62J38R3j66K47J28l09M3J69q2J87j47q5mJ9K2J8Q4l18k20
$$ y = [-522, -839, 262, 309, -98, 498, -220, 478, -34, -390, -7, -273, -307, 222, 88, 130, -221, -75, 619, -156, 83, -65, -394, 37, 183, 241, -176, -105, 194, -306, 50, 278, 76, 271, -763, -637, -11, 212, 197, -211, -46, 12, 55, 91, 207, -304, -164, 96, 96, 44, 205, 430, 6, -111, 63, -99, 351, 14, 337, 66, -200, -74, -142, 82, 107, 59, 134, 110, -241, 109, -63, -82, -67, -240, -185, 225, -260, 64, 166, -110, -134, 82, 203, -71, -2, -168, -30, 85, 170, -32, -137, 86, -183, 207, -57, -63, 284, 100, -131, 229, 70, -15, -68, -72, -226, 114, -72, 159, 24, -270, 335, 79, 75, -211, -20, 321, -202, 72, 119, 25, -116, 110, -36, 89, -84, -260, 54, 244, -120, -176, -351, -164, 62, 315, 284, -118, -45, -192, 143, 59, 37, -162, 261, 8, -116, 86, 186, 108, 188, -22, -4, -94, 67, 9, -140, 128, -221, -34, 607, -155, -17, 76, -90, 157, 285, -24, 19, 188, 106, 293, 146, 61, 57, 76, 98, 116, 200, -118, -338]
4803c38K12Kn1ON31j34m15j50L82K88j9m47O0N78p77K59K29l52L26k98J67K06
4825B65m40L39m15K47k54K10o8J7j43J09L00J74J6o08M22r2m18J71K55j25M63
4846D25l69P0k50K23k58mO5K99k15J9o4J53J90n83L02R2k79j1o2K89MO3K00k07
4870I2n9qk82M65j60l88N89j59k03O2J33r3k6J40J59j85k26J9J55m4K44K59q87
4893d03L85Pr2L15J52o53L70o3j12M01k28j48m0q1j02k75P09j89q5K78P4j53J49
4916B16l43K01j55Kj3K35J81n02N09k51K60m25L39n04L6pK84j82l9M60k05l6j56
4939i5K17j18P9k26M42j98j25J1j29P3O2k23J68M2k66K7P6L1K13k46K01K12l17
4962h9L23j59l09K81j20K1j40q7P00p98M53n0K57o12M33j04j19J38p6l3Rj63M50
$$ y = [-338, -126, -124, -175, -169, 362, 228, -187, -337, 45, 333, 314, -133, -73, 505, -272, -13, 216, -136, 190, -108, 59, 265, -175, 164, -251, -4, -258, -48, -116, -99, -242, -133, 167, 341, 357, -251, 171, 79, -339, -168, 87, -38, 425, 56, 126, -124, 99, -159, -163, -98, 201, -14, 5, -59, 94, 284, -299, 3, 95, -184, -195, -257, 32, 36, 99, 299, 92, 33, 25, -257, 208, 48, -340, 249, 90, -113, -51, 82, -11, -37, 103, 262, 77, -149, -130, 25, -19, 225, 484, -403, -18, -11, -103, 212, 364, -289, 81, 18, -94, 307, 79, -69, -109, -190, -292, -567, 142, -47, -132, 146, 220, 67, 216, -127, 74, -81, -79, -92, 143, 324, -178, 331, 80, 340, -85, 254, -250, -214, -221, 63, -119, -158, 302, 97, 61, -95, 122, 4, 83, -143, 299, 101, -24, -13, -142, -69, -7, -230, -62, -20, -286, -259, -183, -152, 61, -185, 16, 228, -89, 234, 75, -234, 47, -73, -52, -192, -279, 421, -377, 76, 26, 283, -329, 104, 0, -119, 19, -57, -90, -81, -244, 206]
4985B06k82r8J72n2J33Mjl10J14l15M17m2J79o3j59K90J2m55m9L60O1P1k04K23
5009B12k06J33k51R5N6j78K37j55P5J03N4r1k0L0n5n1K55l51l6j82J25K66j30
5032f5q8o2O9o1L32k64L71k26p0J76j38K7J90l30J6K06l16J86j18J80O8n9L0k12
5056a58J47n0J10K72j55J08j48j39N8P1k20j50K20R9P9j37l4jm1j13L91k83R9
5079B5j19K39k38J9J00k21J33M9M7N5J27p9l7O4j04j98N65n46J08L07k01k76J04
5102g7N3R8p1J60j31j94K54Q0k45j43L15j17L16l06L10k45K19M8l05n03O11M65
5124E92n90N7J12O5l15K62k64M0J72k56n0L24k25N10j78m60M33m04P67m92j38
5145c8J51L09j93m70M47m34J36O3K48q4k03l49R6M56Q2o81M40j12J77k04N42m9
$$ y = [206, -76, -174, -2, -54, 79, 83, 82, -228, -114, -429, -12, -54, 125, 62, -97, 193, 205, -250, -299, 61, 122, 193, -11, 212, 6, 139, -112, -17, 39, -139, 98, -57, 18, 121, 175, 84, 64, 94, 39, -12, 243, -108, -144, -326, -201, 65, -65, -153, -215, -146, -207, 125, -139, 232, 6, -64, 112, -26, 1, 191, -139, -123, 83, -233, -47, -165, 15, 83, 24, 54, -158, -11, -61, 49, 321, 166, 274, 126, -13, 45, 116, -104, -254, -34, 65, 144, 7, -27, -28, -69, -182, 209, -74, 25, -94, 145, -93, -74, 26, -195, -62, -13, 34, 89, 216, 137, 100, 164, 60, -138, 427, -119, -11, 296, 95, -181, -77, -24, 74, 3, 163, 32, -162, 92, 172, -73, -216, 99, -18, 298, -8, 302, 57, 276, 324, 19, -484, 127, 592, 2, 59, 171, 236, -79, 183, -81, -41, 131, -125, -175, 149, -76, 434, 256, -204, 229, -175, 592, 100, -38, 113, 422, 229, -241, 206, -228, -92, -29, 219, 135, -68, -417, -321, 135, 217, -464, -24, -136, 41, -163, 379, 330]
5167C30n54J27j62K0M80k62R7J9L38n44k10O21k88j45J57L96l70Q7k06n4k15N50
5189B12m83L60l33K67j35o9J44j99L95l33K35l23J11j9M16m5k45J71k64l2L78
5210B09m04MJ78M3m03L20j63K82K24l63O2p7J78m8j44K05J44j90j2m2K92n91N23
5233B27m15L84j2j43K5J5J93j23J38K0o28N58j16j0J24k04l9j5K94m27K94n61
5255d21K93rj76M31l72J01L07k42N21o16J15l5k4%J08o9k04N77o55K07n3l41M73
5278h4L26J55k07l40L46N4m67j67L41Jj04N76m92N35m91k5r2K22n67N38N2j58
5300d8M56m91J25m52N87k94N02j44j89k29L03N4q5k16L14j08j40r1N92m22J35
5321A59p2J68m01j49J35M16k12k32J39K24J01m48L7J68O90q32m5k8O66n09O7J40
$$ y = [330, -224, -97, -259, -239, 241, -21, 76, 95, 433, -111, -321, 300, 12, -133, 24, 420, 50, 137, -69, -123, -338, 212, -271, 89, -244, 23, -112, -181, -37, -236, 159, -174, 61, -262, -151, -170, 246, 201, -44, 127, -137, -169, 209, -195, -191, -13, 30, -373, -53, -216, 66, 290, -73, -11, -88, 90, 42, -102, 103, 247, 57, 45, 3, 295, -296, 227, -188, 196, 184, 41, 66, 81, 274, 151, 289, 309, -319, 239, 123, 113, 237, 33, -6, -21, 273, -154, 140, -421, -128, -137, -313, 118, -254, -153, 154, -88, 433, -183, -68, -103, -127, -127, -19, -88, -292, 285, -370, -163, -216, -557, -84, 242, 397, 190, -150, 196, 250, -217, -384, -43, -42, -146, 430, -62, 473, -18, -43, -135, 87, -480, 58, 110, -48, 408, -83, 42, -410, 177, -117, 385, 241, 52, -177, 126, 180, 95, -121, 193, 85, -55, -146, 446, 24, 159, 87, 255, -146, -295, -160, 256, 44, -188, -49, 175, 276, -172, -135, 33, 723, -109, -154, -182, 484, -25, 42, 182]
5343A82o19M87M2J27q07K71j03L72o64N69L71m15L27n77J99N06m06J43M67k05
5363B67Lm13L55p2k10k70K36k25M28J45l83j86M45rm18J96P34p15Q8m5Pj95L94
5386A57Q6n46O17k99k44L24k07R67o25q17P12r4Q7o44Q85n7k83N00l72j46L29
5407C30n42j12j65P15n50M99k07l34N09P8j82J1l68J11J78j42j15L15l72L83j04
5428f4J45j79K01j12l1n6J80m70K07K4k70M02j74M81n23j24M92m38L19l03L91
5449I8om2O3m0l5P9l73L13l6j0r0K60j42J3m0J69j24M6j12oK32r9o7l20M58k18
5475b9M4J48k26N2n8L66J6N19n89l89L40k60L8K4K55q1l98J07m4J7m02P07L38
5498D95o49l9J41J05o0l44k34P66j4p35M88K62j065J083O15p25n71R19j327R50
$$ y = [182, -437, 50, 92, 219, -588, -317, -420, -48, -712, -143, 228, -187, 140, -437, -238, 268, -138, 5, 472, 267, 270, -143, 212, 140, -70, -340, -104, -329, 99, 244, -139, -325, 120, 111, -307, -111, 623, -92, -4, -49, -42, -237, 157, 243, -303, 314, 15, -229, 95, -112, 855, 230, -587, 125, 31, 118, -526, 359, 302, 19, 519, 147, 1, 330, -212, -324, -489, 226, -324, 175, -32, -366, 143, 221, 39, 50, -318, -207, -29, -171, -286, 29, -343, 40, -64, 81, -98, 103, -9, -40, -96, 84, -386, -179, -155, -425, -23, -197, 284, -239, -363, 129, -309, 10, -293, 98, 92, 50, 113, 73, 38, 117, -256, 57, 21, 11, -79, 181, 39, 52, 12, 181, 57, 103, -9, -15, 217, 118, 51, -269, 189, -29, 15, 163, -63, -11, -69, 297, 313, 832, 243, -146, 194, -66, -28, -4, 251, 170, -228, -121, -165, -148, -550, 157, 495, -154, -193, -52, 53, -7, -351, -585, 181, 167, -568, -80, 182, -883, 200, 815, 90, -481, 438, -889, 61]
5518F1J40j23M5k76n55J010o54J180p58P14j062O13l90m76P67n45L98q5M17L76
5538G97p84m38N11J33o0n6J13m63L52k39M52n58K39O8J7n8K4N3l13J38j74J37
5560a09q8j61M72j61JL03k25k10N65j39n64m2M11m26M27m8P4j36N35o51L90j98
5582B0l21J20J84j56J52O3l61L52K3k71K2L05n4jQ1j42Q2l37K38Ol65L94j00L
5606f3l5O01m80N34m56m33N27L2q9M26l68J6k11l38L58j85L57m20J15K54j80l3
5628g1J15J92l37J11QN8Q4k58J12Pj1j80K33pNk7K52m85k29K88O7l6Q0o5n6L56
5654B06k41r2k02J17r6M8J68O9j19J48N8l5K2k6l16M82m72O38J11K8l68k7k16
5677a15l81j74J036m69j14K41K14l49l0J37K73L2k30K56m1k63l5j49K44k15j2
$$ y = [61, 201, 78, 123, -153, -708, 302, -352, 828, 70, 784, -278, 335, -55, -531, 236, -309, 89, 4, 421, 797, 13, -425, 86, 219, 159, 103, 216, -247, 105, -134, 318, -240, -1, 67, 84, 26, 50, 103, -210, -72, -246, -109, -197, -358, 114, -47, -46, 257, 32, -178, 387, 248, -316, -358, 53, -373, 54, 6, 80, -56, 479, -172, 218, 20, -301, -181, 3, -153, -1, 62, -299, 53, 76, -195, -173, 132, 78, 77, 158, 16, 98, -239, -1, 5, -360, 34, -66, -63, -98, 503, 23, 557, 101, -332, 195, 227, 138, 564, 196, 212, 1, -337, 21, -164, 193, -227, -112, 142, -38, -71, 44, 236, -101, 10, 18, 76, 160, -98, 14, 21, 10, -170, 63, 56, 61, 34, 286, -199, -428, -140, -73, -109, -29, -94, -150, 206, -35, -127, -329, -212, -308, -260, -92, -23, -142, 6, 64, 29, 51, 25, -291, 191, -281, 357, 468, 496, 128, 101, -115, -496, -670, 366, -103, -217, 24, 238, -111, -141, -4, 269, 301, 71, 327, 286, 23, -12, -161, 83, -132, -144]
5698a44K57j79K07m52K32k8q5L21N0r0J20l24L7M13l59j50L75l51N1j95L56n2
5720A0K41N3m77l35M36J27m3j07J80j47j11K10J58P7o8K2j93K82j34n46N25j8
5742A42l17J49j33J70Kj07M20m79L57m46M01l18M67n64q4K97L57k88O9M8k17j1
5764h5O5N96o35K34k43J80k03r2K8K56k92m9R6o0K0Q6J28j44P6n3J62L3J20l87
5788a63M17l47M8M33j78m06K15K92l49J13R5l80K21j45J56K10k44j34j1J73j60
5809a44K09k93J21J93k82q2J25J28J62j74O16l11l96m8K50J95m58J3K67j76J66
5830H1o5k92K49q0M77m29L8l9J40j31Jj22K02J0J41j10Qn7M8k56P4j85K72M1j55
5855a39J80k54J22K96m98J95j34J33J48k74N32l19L7J83J65l68j69r5L38j12n
$$ y = [-144, 113, -66, 141, -311, -79, -107, -192, 129, 179, 89, 209, -115, -78, 335, -24, -174, 201, -150, -99, -294, 62, 10, 251, 304, -173, -508, -72, 55, 12, -95, 85, -62, -173, 37, 195, 272, 204, 226, 33, 315, 181, -365, 160, 142, -175, -26, -159, 11, 13, -94, 326, -153, 204, -242, 159, -159, 308, -256, -340, -43, 314, 26, 95, 143, -74, -85, -20, 576, -59, 175, -68, 112, -91, -183, -155, 101, -191, -240, -144, -204, -184, -98, 30, -114, -38, -91, 71, 104, 224, -163, 254, -93, -45, 388, 210, -196, 19, 311, -38, 75, 170, -210, 11, -134, 22, 232, -12, -146, -157, 16, -144, 65, -228, -107, 86, -196, -278, -153, -25, 137, -37, 579, 268, -128, -176, 74, 269, -189, -176, 91, -85, 81, 16, -276, -27, -107, 370, -59, -21, -60, 80, -51, -50, -172, 30, 40, 181, 71, 79, 22, 70, -186, -112, -297, -25, 16, -139, 41, -213, -91, 205, -293, -98, -232, -99, 49, -225, 307, -12, 25, 208, 373, 5, -164, -259, 79, -33, -38]
5876c8j16J84J10k82N7l11P84p85R2R1L96j07m26J65p9J91N33l04k77m7K31J24
$$ y = [-38, -154, 30, 140, -142, -85, -396, 388, -397, -305, -214, 182, 75, -351, -186, -265, -74, 459, 155, -122, -169, 62, 186]
$$ [...]
8191i2
##END NTUPLES=NMR FID
##END=
