##TITLE=1H ikalashn
DE-76H_2
12.12.2024
##JCAMPDX= 6.0         $$ Bruker NMR JCAMP-DX V2.0
##DATA TYPE= NMR FID
##DATA CLASS= NTUPLES
##ORIGIN= UXNMR, Bruker Analytische Messtechnik GmbH
##OWNER= root
$$ TOPSPIN		Version 1.3
$$ 2024-12-12 14:57:32.390 +0400  Irina@DPX200
$$ Compression mode = diff/dup
##.OBSERVE FREQUENCY= 200.131300845
##.OBSERVE NUCLEUS= ^1H
##.DELAY= (6, 6)
##.ACQUISITION MODE= SIMULTANEOUS
##.ACQUISITION SCHEME= undefined
##.AVERAGES= 32
##.DIGITISER RES= 18
##SPECTROMETER/DATA SYSTEM= spect
##.PULSE SEQUENCE= zg
##.SOLVENT NAME= CDCl3
##.SHIFT REFERENCE= INTERNAL, CDCl3, 1, 17.49637
##AUDIT TRAIL= $$ (NUMBER, WHEN, WHO, WHERE, WHAT)
$$ ##TITLE= Audit trail, TOPSPIN		Version 1.3
$$ ##JCAMPDX= 5.01
$$ ##ORIGIN= Bruker BioSpin GmbH
$$ ##OWNER= Irina
$$ $$ F:/spectra/data/iren/nmr/1H/4/audita.txt
$$ ##AUDIT TRAIL=  $$ (NUMBER, WHEN, WHO, WHERE, VERSION, WHAT)
(   1,<2024-12-12 14:57:08.734 +0400>,<Irina>,<DPX200>,<TOPSPIN 1.3>,
      <created by zg
	started at 2024-12-12 14:54:58.859 +0400,
	POWCHK disabled, PULCHK disabled
       terminated by command 'halt'
       configuration hash MD5:
       BE 6D 3F 07 2A EA 11 49 91 17 2B D3 AF B3 58 0D
       data hash MD5: 16K
       33 E4 34 33 4D 65 2B B4 68 EB E6 CB B1 49 5F D8>)
$$ ##END=
$$ 
$$ $$ hash MD5
$$ $$ 75 DD 35 6D 4F A0 E6 D4 D6 96 58 AC 82 75 55 70
##$RELAX= 
##$RELAX= 
##$RELAX= 
##$RELAX= 
##$RELAX= 
##$RELAX= 
##$RELAX= 
##$RELAX= 
##$RELAX= 
$$ Bruker specific parameters
$$ --------------------------
##$DU= <F:/spectra>
##$EXPNO= 4
##$NAME= <1H>
##$PROCNO= 1
##$TYPE= <nmr>
##$USER= <iren>
##$AMP= (0..31)
100 100 100 100 100 100 100 100 100 100 100 100 100 100 100 100 100 100 
100 100 100 100 100 100 100 100 100 100 100 100 100 100 
##$ANAVPT= -1
##$AQSEQ= 0
##$AQ_mod= 1
##$AUNM= <au_zg>
##$AUTOPOS= <>
##$BF1= 200.13
##$BF2= 200.13
##$BF3= 200.13
##$BF4= 200.13
##$BF5= 200.13
##$BF6= 200.13
##$BF7= 200.13
##$BF8= 200.13
##$BYTORDA= 1
##$CFDGTYP= 0
##$CFRGTYP= 5
##$CHEMSTR= <none>
##$CNST= (0..63)
1 1 145 1 1 1 1 1 1 1 1 1 1 1 1 1 1 1 1 1 1 1 1 1 1 1 1 1 1 1 1 1 1 1 
1 1 1 1 1 1 1 1 1 1 1 1 1 1 1 1 1 1 1 1 1 1 1 1 1 1 1 1 1 1 
##$CPDPRG= <>
##$CPDPRG1= <>
##$CPDPRG2= <>
##$CPDPRG3= <>
##$CPDPRG4= <mlev>
##$CPDPRG5= <mlev>
##$CPDPRG6= <mlev>
##$CPDPRG7= <mlev>
##$CPDPRG8= <mlev>
##$CPDPRGB= <>
##$CPDPRGT= <>
##$D= (0..63)
0 2 0 0 0 0 0 0 0 0.06 0 0.03 0 0 0 0 0.0002 0 0 0 0 0 0 0 0 0 0 0 0 0 
0 0 0 0 0 0 0 0 0 0 0 0 0 0 0 0 0 0 0 0 0 0 0 0 0 0 0 0 0 0 0 0 0 0 
##$DATE= 1734001026
##$DBL= (0..7)
120 120 120 120 120 120 120 120 
##$DBP= (0..7)
150 150 150 150 150 150 150 150 
##$DBP07= 0
##$DBPNAM0= <>
##$DBPNAM1= <>
##$DBPNAM2= <>
##$DBPNAM3= <>
##$DBPNAM4= <>
##$DBPNAM5= <>
##$DBPNAM6= <>
##$DBPNAM7= <>
##$DBPOAL= (0..7)
0.5 0.5 0.5 0.5 0.5 0.5 0.5 0.5 
##$DBPOFFS= (0..7)
0 0 0 0 0 0 0 0 
##$DE= 6
##$DECBNUC= <off>
##$DECIM= 32
##$DECNUC= <off>
##$DECSTAT= 4
##$DIGMOD= 1
##$DIGTYP= 9
##$DL= (0..7)
0 120 120 120 120 120 120 120 
##$DP= (0..7)
$$ [...]
##$SW= 21.9926040160658
##$SWIBOX= (0..15)
0 0 2 0 0 0 0 0 0 0 0 0 0 0 0 0 
##$SW_h= 4401.40845070422
##$TD= 16384
##$TD0= 1
##$TE= 300
##$TE2= 300
##$TE3= 300
##$TEG= 300
##$TL= (0..7)
0 120 120 120 120 120 120 120 
##$TP= (0..7)
150 150 150 150 150 150 150 150 
##$TP07= 0
##$TPNAME0= <>
##$TPNAME1= <>
##$TPNAME2= <>
##$TPNAME3= <>
##$TPNAME4= <>
##$TPNAME5= <>
##$TPNAME6= <>
##$TPNAME7= <>
##$TPOAL= (0..7)
0.5 0.5 0.5 0.5 0.5 0.5 0.5 0.5 
##$TPOFFS= (0..7)
0 0 0 0 0 0 0 0 
##$TUNHIN= 0
##$TUNHOUT= 0
##$TUNXOUT= 0
##$USERA1= <user>
##$USERA2= <user>
##$USERA3= <user>
##$USERA4= <user>
##$USERA5= <user>
##$V9= 5
##$VALIST= <valist>
##$VCLIST= <CCCCCCCCCCCCCCC>
##$VD= 0
##$VDLIST= <DDDDDDDDDDDDDDD>
##$VPLIST= <PPPPPPPPPPPPPPP>
##$VTLIST= <TTTTTTTTTTTTTTT>
##$WBST= 1024
##$WBSW= 25
##$XGAIN= (0..3)
0 0 0 0 
##$XL= 0
##$YL= 0
##$YMAX_a= 228054
##$YMIN_a= -374859
##$ZGOPTNS= <>
##$ZL1= 120
##$ZL2= 120
##$ZL3= 120
##$ZL4= 120
##$ABSF1= 10
##$ABSF2= 0
##$ABSG= 5
##$ABSL= 3
##$ALPHA= 0
##$AQORDER= 0
##$ASSFAC= 0
##$ASSFACI= 0
##$ASSFACX= 0
##$ASSWID= 0
##$AUNMP= <proc_1d>
##$AXLEFT= 0
##$AXRIGHT= 0
##$AXTYPE= 0
##$AXUNIT= <>
##$AZFE= 0.1
##$AZFW= 0.1
##$BCFW= 1
##$BC_mod= 2
##$BYTORDP= 1
##$COROFFS= 0
##$CY= 7568.61572265625
##$DATMOD= 1
##$DC= 2
##$DFILT= <>
##$DTYPP= 0
##$F1P= 17.9538593292236
##$F2P= -4.03888763876832
##$FCOR= 0.5
##$FTSIZE= 32768
##$FT_mod= 4
##$GAMMA= 1
##$GB= 1
##$INTBC= 1
##$INTSCL= 1
##$ISEN= 128
##$LB= 0.02
##$LEV0= 0
##$LPBIN= 0
##$MAXI= 945.577
##$MC2= 0
##$MEAN= 0
##$ME_mod= 0
##$MI= -402.1523
##$NCOEF= 0
##$NC_proc= 0
##$NLEV= 6
##$NOISF1= 8.587773
##$NOISF2= 6.764455
##$NSP= 1
##$NTH_PI= 0
##$NZP= 0
##$OFFSET= 17.49637
##$PC= 1
##$PHC0= -35.1467
##$PHC1= 8.961438
##$PH_mod= 0
##$PKNL= yes
##$PPARMOD= 0
##$PPDIAG= 0
##$PPIPTYP= 0
##$PPMPNUM= 100
##$PPRESOL= 1
##$PSCAL= 0
##$PSIGN= 0
##$REVERSE= no
##$SF= 200.13
##$SI= 32768
##$SIGF1= 18.5376
##$SIGF2= -6.396296
##$SINO= 400
##$SIOLD= 32768
##$SREGLST= <1H.CDCl3>
##$SSB= 3
##$STSI= 0
##$STSR= 0
##$SW_p= 4401.40845070422
##$SYMM= 0
##$S_DEV= 0
##$TDeff= 0
##$TDoff= 0
##$TI= <>
##$TILT= no
##$TM1= 0
##$TM2= 0
##$TOPLEV= 0
##$USERP1= <user>
##$USERP2= <user>
##$USERP3= <user>
##$USERP4= <user>
##$USERP5= <user>
##$WDW= 1
##$XDIM= 8192
##$YMAX_p= 0
##$YMIN_p= 0
$$ End of Bruker specific parameters
$$ ---------------------------------
##NTUPLES= NMR FID
##VAR_NAME=  TIME,          FID/REAL,        FID/IMAG
##SYMBOL=    X,             R,               I
##VAR_TYPE=  INDEPENDENT,   DEPENDENT,       DEPENDENT
##VAR_FORM=  AFFN,          ASDF,            ASDF
##VAR_DIM=   8192,          8192,            8192
##UNITS=     SECONDS,       ARBITRARY UNITS, ARBITRARY UNITS
##FACTOR=    0.0002272,     1,               1
##FIRST=     0,             0,               0
##LAST=      1.8609952,     -38,             70
##MIN=       0,             -374859,         -374859
##MAX=       1.8609952,     228054,          228054
$$ Real data points
##PAGE= N=1
##DATA TABLE= (X++(R..R)), XYDATA
0@%%%%%%%%%%%%%%%%jL3o4O4o4O4o5R7j28J28j60J92k24K56k88L45l78M17m80
$$ 0 0 0 0 0 0 0 0 0 0 0 0 0 0 0 0 0 -1 32 -32 32 -32 32 -33 64 -64 64 -96 96 -128 128 -160 185 -193 224 -256
35b56N44o09O86p81Q66r63J082j199J329j468J619j787J973k175K398k644K907
$$ -256 288 -321 365 -416 450 -513 569 -630 699 -769 850 -937 1036 -1139 1259 -1385 1522
52A522l203L537l905M320m788N323n942O667p531Q578r884J1555j3790J6963k1829
$$ 1522 -1681 1856 -2049 2271 -2517 2806 -3136 3531 -4000 4578 -5306 6249 -7541 9422 -12407
67a2407L0384m9801J73306R772k75323o906k0192n0363m7859J24664J53152Q4119
$$ -12407 17977 -31824 141482 151254 -124069 -130975 -151167 -201530 -249389 -124725 28427 112546
79A12546N960M8360K6665n7202j28030p8907m3287m4672l1615O8484J21723P5812
$$ 112546 118506 166866 193531 136329 8299 -70608 -113895 -158567 -190182 -121698 25 75837
91G5837M911K5199M9896q832j06003j05267l7584n270k4119O565Q1549J04855
$$ 75837 80748 105947 155843 147011 41008 -64259 -101843 -107113 -131232 -124667 -43118 61737
103F1737M1870r917l206J693m4596p7804m7175k43m15j1099K4321P3335O4693
$$ 61737 103607 93690 90484 92177 47581 -30223 -77398 -77641 -78056 -89155 -64834 8501 73194
116G3194J3819j2113m921j7289n1606n6336k0716O702N219J2247M2576N5109K6528
$$ 73194 87013 74900 69979 52690 1084 -55252 -75968 -69266 -64047 -51800 -9224 45885 72413
129G2413n989j0410j1163l4144n0372k7438R808J7804O232J3890L6472L5054O012
$$ 72413 66424 56014 44851 10707 -39665 -67103 -57295 -39491 -33259 -19369 17103 52157 58169
142E8169j4081j2247j3366k8948l3173j2597J0666J6162J5239K2859K6939J2718
$$ 58169 44088 31841 18475 -10473 -43646 -56243 -45577 -29415 -14176 8683 35622 48340
154D8340o914j3996j2374j8350k5353j6106M407J5628J3647J3516J8641J5443
$$ 48340 41426 27430 15056 -3294 -28647 -44753 -40346 -24718 -11071 2445 21086 36529
166C6529K72j2710j2896j1200j4659j5140n117Q567J3406J2395J3636J3427N483
$$ 36529 36801 24091 11195 -5 -14664 -29804 -34921 -26354 -12948 -553 13083 26510 31993
179C1993o964j3108j1919j0825j0362n904L492J0739J1530R910R152O221j559
$$ 31993 25029 11921 2 -10823 -21185 -27089 -23597 -12858 -1328 8582 17734 23955 22396
192B2396r184j1054r625p742n441M62O933R878Q925P225N295N13n184q791r133
$$ 22396 13212 2158 -7467 -15209 -20650 -20188 -13255 -3377 5548 12773 18068 18581 13397 4606 -4527
207d527p194m442n76M196P730Q087O429M325R97l106o430p259o502m266j167K431
$$ -4527 -11721 -16163 -16739 -12543 -4813 3274 9703 14028 15025 11919 5489 -1770 -8272 -12538 -13705 -11274
223a1274N547O709O122L930J201j965m599n867n444m015j551J588M055N064N019
$$ -11274 -5727 982 7104 11034 12235 10270 5671 -196 -5640 -9655 -11206 -9618 -5563 -499 4520
238D520M015J599j061l707m594m363l597j947O67L114L999M201L300K104l92k640
$$ 4520 8535 10134 9073 5366 772 -3591 -7188 -9135 -8468 -5354 -1355 2846 6146 8250 7858 5218
254E218l754l744l107j945J82K100L514L204K865J716O27k112k992l208k447j616
$$ 5218 1464 -2280 -5387 -7332 -7150 -5050 -1536 1668 4533 6249 6876 4764 1772 -1436 -3883 -5499
270e499n17J258K715L167K153J682N19j090k413k664k131j584m84P00K000K677
$$ -5499 -6016 -4758 -2043 1124 3277 4959 5478 4388 1975 -689 -2820 -4404 -4888 -4188 -2188 489
286D89K109J261L66l60j581k475k046j222l38L26J141K221K078J197L67k54j053
$$ 489 2598 3859 4225 3865 2284 -191 -2237 -3459 -3797 -3471 -2330 -109 1969 3166 3533 3279 2226
303B226k065j845j163l84L34Q10J557J886J118N48m43o85j410j662j082n01K80
$$ 2226 161 -1684 -2847 -3231 -2897 -2087 -530 1356 2474 3022 2579 1894 484 -1178 -2260 -2761 -2481
320b481O33J126J463J237N20j65o41j032j246j157o26J75O26Q09J286Q96P85k47
$$ -2481 -1848 -722 741 1978 2498 2333 1692 660 -586 -1743 -2369 -2194 -1568 -759 527 1423 2208 1961
338A961n36p48q91j165n79O3M79Q19Q85P08Q54L8o00n87r11q78n02L0K74P87N32
$$ 1961 1425 677 -214 -1379 -1958 -1895 -1416 -597 288 996 1850 1888 1288 701 -210 -1088 -1590 -1560 -1286 -499 33
359C3Q23L88K86k45o10q27n75m53k34K80M61P88M91M89O9j17l47o57o06l35m80
$$ 33 856 1244 1530 1285 675 -152 -727 -1180 -1414 -1134 -673 115 606 1095 1164 1047 700 43 -563 -898 -1378
380a378L87L66N74N01M22K43pl04o41n54m43r2m7M13L86N01L83K49m5m72k88m59
$$ -1378 -991 -625 -51 450 872 1115 1108 804 163 -391 -834 -926 -973 -560 -174 327 710 959 914 442 154 -305
402c05n14l0J6L05K28M78L93K88j5j91m73m41k71k20m1K75L06K85K90J94K06k37
$$ -305 -819 -849 -833 -528 -300 178 571 859 844 653 180 -261 -532 -752 -793 -518 -212 73 363 557 763 526
424E26k15m83j81l49PJ51M07K97K86J5J86j60k07l00k47k61j00J40K26K93J43
$$ 526 311 -172 -353 -702 -695 -544 -137 160 446 461 647 487 280 -20 -267 -528 -628 -488 -262 31 174
445A74K58J11Ll24j83k42l24l4JK55L01K32K81q3J4o9m12j80k19j8M5O9L18K48
$$ 174 432 543 546 222 39 -203 -527 -561 -560 -305 -4 228 509 426 440 371 -41 -221 -440 -458 -413 -344 -26 222
469B22J39NO2j97k80l8k66nl4R2J61K43K63k9jK8k05l01j61q8J34k0J14L07J22
$$ 222 361 366 428 231 -49 -87 -353 -358 -392 -300 -139 104 367 338 337 365 160 -141 -302 -390 -256 -276 -162 145 267
494B67J46j85o6r2k64r0O3O5p5J8J86J59M2L5Kj67k9k14j37K1K22n3lJ33K47L5
$$ 267 413 228 162 70 -194 -284 -221 -156 -231 -213 -27 132 174 209 211 44 15 -199 -336 -315 -93 -146 -149 -16 231 266
520B66r5j09j18j4l4k25P8J98J2K35r8N6Q9k14l7J1j89P7o5J23OJ09k3J57p5j50
$$ 266 171 62 -56 -70 -104 -329 -251 -53 -41 194 96 152 241 27 -10 1 -188 -111 -176 -53 -47 62 39 196 121 -29
546b9Q6p3r3o1o3P7J56P1K7J1K4l4n3j5j64J26p3M4j25K26q0L7J59kq9k34N6n7
$$ -29 57 -16 -109 -170 -233 -156 0 71 98 109 133 99 46 31 -133 -7 -80 -36 -161 65 -15 22 181 179 90 -144 -88 -145
574a45J8K0J32R1r2R3j06J8K3j1j42Q7j43J35K6QM0L4oR2r6o9p2j01K1K2J98j99
$$ -145 -127 -107 25 116 24 117 11 29 52 41 -101 -14 -157 -22 4 12 52 86 80 172 76 7 -65 -166 -145 -123 75 -124
602a24J17N9J0J51j93l6o1K9l9j18R2J46j08JQ3J3J63k50J7j01N2Nj31J56O3%
$$ -124 -7 52 62 213 20 -16 -77 -48 -87 -205 -113 33 -75 -74 9 22 185 -65 -48 -149 -97 -92 -223 -67 -4 -4
628dr0O9K5j23R6o3J9K0Q4J6l5J71j44k4J08o5Lj30P6k6k7q5K39j9j13P6oP8n2
$$ -4 -94 -25 0 -123 -27 -90 -71 -51 33 49 14 185 41 17 125 60 63 -67 9 -17 -44 -129 110 91 -22 54 48 126 74
657G4n6j77R1K4O3r3J4R9po1PO2j41J75q0m2K0l4K6Q6r0J0N7R4n4k07J51P4j9
$$ 74 18 -159 -68 -44 19 -74 -60 39 32 -29 -22 40 -101 74 -6 -48 -28 -62 -36 50 -40 -30 27 121 67 -140 11 85 66
686F6Jk3j02qL6O2n5j8o8L0M7n3P1QO4M6r3Q1k5o6L6m6j19N8M4K4Qj14P9O5q8
$$ 66 67 44 -58 -66 -30 32 -23 -41 -109 -79 -32 -85 -14 -6 58 104 11 92 67 1 37 -9 -128 -70 -26 -2 6 -108 -29 36 -52
717e2l4P1O8Rj49O3o5N8P5on9O7j24J9J22l1q8N4m5R1j30M5l9M3Qk5L6K1J36k68
$$ -52 -86 -15 53 62 -87 -24 -89 -31 44 38 -21 46 -78 -59 63 32 -56 -2 -47 44 -86 -41 -80 -37 -29 -54 -18 3 139 -129
747a29P5Q0n9J50j59M3j00P3rQ0j5nM5Nj45K0L2K6n5j21K19p8r4K17j88K21q1
$$ -129 -54 26 -33 117 -42 1 -99 -26 -35 45 30 25 70 75 -70 -50 -18 8 -47 -168 51 -27 -121 96 -92 129 48
774D8j01M8L0o8m7O7j16J34n3K0KJ43j19j9J1l9J46l0m8J6p4J04q0l1qJ8Q0q3
$$ 48 -53 -5 25 -43 -90 -23 -139 -5 -58 -38 -36 107 -12 -31 -20 -59 87 57 9 25 -49 55 -25 -56 -64 -46 34 -49
802d9k6n6J57k3o0J48k18J74K5l3j03j8J6O9l4o5J6QJ69o3M6l2K6q8j1K0J17o5
$$ -49 -75 -131 26 3 -57 91 -127 47 72 39 -64 -82 -66 3 -31 -96 -80 -72 97 34 80 48 74 -14 -25 -5 112 47
830D7Rj67J66p4QQj6M9j1j11L3O4m1N2J5k2P2o9K3n7j6J08J7p0K4nm4Nm1J1k9
$$ 47 56 -111 55 -19 -11 -3 -19 30 19 -92 -59 5 -36 16 31 9 81 12 35 -22 -38 70 87 17 41 36 -8 -3 -44 -33 -62
861f2Mj0k2k1J7R3J26j54J15j07O2p6q5N0J30p6P1j58O3N7j2n5p0P8M9j24Q3P
$$ -62 -58 -68 -90 -111 -94 -1 125 -29 86 -21 41 -35 -120 -70 60 -16 55 -103 -40 17 5 -50 -120 -42 7 -117 -34 -27
889b7n6J05p6R0Kq3M0kQ5j95O0N7o2J76j31L8NO0l3j45K2J19jK9j16m5J49q4l4
$$ -27 -83 22 -54 36 38 -45 -5 -7 78 -117 -57 0 -62 114 -17 21 26 86 53 -92 -70 49 48 77 -39 -84 65 -19 -53
918e3J00p7k8P6l7o0J03K3p4o0J05Q2j08mOj37L8M9o2J00l8j6M3j1R7n2rl4R1
$$ -53 47 -30 -58 18 -19 -79 24 47 -27 -87 18 100 -8 -12 -6 -143 -105 -56 -118 -18 -56 -72 -29 -40 57 5 -4 -38 53
947E3j81J02j3m4J66j35l7n8J47N5J9o4j32J19q9O6poR1onr8L0Km5R4l8l9Q2J4
$$ 53 -128 -26 -39 -83 83 -52 -89 -147 0 55 74 10 -122 -3 -92 -26 -33 -39 52 46 41 -57 -27 -25 -70 24 -14 -53 29 43
977D3k3O3q5N2r1kJ31r5RK4L3p9J39q0j1Jk9r3M7l9K4J1Q8J08j41NO1Qn3J45k34
$$ 43 20 83 -2 50 -41 -43 88 -7 2 26 59 -20 119 39 28 29 0 -93 -46 -85 -61 -50 38 146 5 10 71 79 26 171 -63
1008f3J18r6pl2J01J13j07j18N4Qp0m2P4J18L4r7n9O3J9j17J81j27M2k3l2n7J72
$$ -63 55 -41 -48 -80 21 134 27 -91 -37 -29 -99 -141 -67 51 85 -12 -71 -8 11 -106 75 -52 -10 -33 -65 -122 50
1035E0o1N1o0J3r7J57r3J20j4j34J36n2L1k3L1j07N8J09n2j0mo7n6J63k08K31
$$ 50 -11 40 -20 -7 -104 53 -40 80 66 -68 68 16 47 24 55 -52 6 115 63 53 49 -18 -74 89 -119 112
1061A12l6p1L9K4m7l1r4J80j54l8P9n2R7m9M3j09J37o4M0j51J37j4J65k41J44
$$ 112 76 5 44 68 21 -10 -104 76 -78 -116 -37 -89 8 -41 2 -107 30 -34 6 -145 -8 -22 143 -98 46
1086D6j4l2Q2k41L15k25M9J0K6J16k25J7K26j1j1q5m4o0R3q2q4J35k6l8K21j52
$$ 46 32 0 82 -159 156 -69 -20 -10 16 132 -93 -76 150 139 128 43 -1 -61 32 -50 -134 1 -25 -63 158 6
1112FQP9j32Q8m9k1n5lK2k5k4P5K02j39Ln9K1r2R5m3O9k6q7J77j36L4nj30J22
$$ 6 14 93 -39 49 0 -21 -76 -79 -57 -82 -106 -31 171 32 35 -24 -3 -95 0 -43 26 0 -87 90 -46 -12 -17 -147 -25
1141b5j32J78K5K2P8j62R5j34R0L1O9j05p9J25j36QR7O0o6K0j16J17l0j39N0K1
$$ -25 -157 21 46 68 146 -16 79 -55 35 66 135 30 -49 76 -60 -52 45 105 39 59 -57 60 30 -109 -59 -38
1167c8N4J3l1K9Mm0%L4L2j6l3n8L3J01k29J42R9j29k6K57k48o6K05q1q5N0L8j06
$$ -38 16 29 -2 27 31 -9 -9 25 57 41 8 -50 -17 84 -145 -3 96 -33 -59 198 -50 -116 89 8 -77 -27 11 -95
1195i5J62n9N6KP6j13o0m2J01o4R0j29R3o6pJ36j77J08j78J90r7L5j03J17Rq3
$$ -95 67 8 64 66 142 29 -31 -73 28 -36 54 -75 18 -48 -55 81 -96 12 -166 24 -73 -38 -141 -24 -15 -98
1221i8J61p4K11k15n4K5r9P8M4L6j02J26l2J68j62m1j01O1M1l5J60j50J31j93
$$ -98 63 -11 200 -15 -69 -44 -143 -65 -21 15 -87 39 7 175 13 -28 -129 -68 -27 -62 98 -52 79 -114
1245a14RJ57J3l7p2J68p6o5R2Rr5O0j6pN0N4j23j45Q7L7N7l1l7j1j6jJ32n3r5
$$ -114 -105 52 65 28 -44 124 48 -17 75 84 -11 49 33 26 76 130 7 -138 -51 -14 43 12 -25 -36 -52 -53 79 26 -69
1274f9M1N7l7o6L5l4R5n3N4j08K50j66J5p7Nk1J84n7j6q1K4M1j0n4J7O3m6n3R9
$$ -69 -28 29 -8 -74 -39 -73 22 -31 23 -85 165 -1 14 -63 -58 -79 105 48 32 -49 -25 16 6 -48 -31 32 -14 -67 32
1303C2QL2k4p6M4o5M7P5l3j38J30r6J4K9j8j2K7m2M1l8J16j7j37J17j1n7L5j67
$$ 32 40 72 48 -28 16 -49 -2 73 40 -98 32 -64 -50 -21 -39 -51 -24 -66 -25 -63 53 36 -101 16 5 -52 -17 -184
1331a84K26p4O6l9q3K8kJ11n3p3N0J3J17oj09pJ9M1j97K21j14k8J09N5j55J71
$$ -184 42 -32 34 -5 -88 -60 -62 49 -4 -77 -27 -14 103 97 -12 -19 0 41 -156 65 -49 -77 32 87 -68 103
1357A03q9mj0P9j23O4m9K9J1op0p1L7R9j11o2K21K1k20Q7n2M9J80j46o5J26n1
$$ 103 14 10 0 79 -44 20 -29 0 11 5 -65 -136 -99 0 -111 -173 48 69 -151 -64 -116 -67 113 -33 -98 28 -23
1384b3k7R5r9L2P5L4lP4k88R0J21p1N7j09M6l9R2M8J5j51J34m8j05P8n6LN9j43
$$ -23 -50 45 -54 -22 53 87 84 158 -130 -40 81 10 67 -42 4 -35 57 105 120 -31 103 55 -50 28 -28 -25 34 -109
1412a09J28nM8l2o0O4L5p7j0J09j13p6qj9M1M6l5N3L4L7k9p7P6q3M5j5K7mm2J21
$$ -109 19 14 62 30 -30 34 69 -8 -18 91 -22 -98 -106 -125 -84 -38 -73 -20 14 51 22 -55 21 -62 -17 -32 -5 -9 -51 70
1442G0L5j0j04K3NJ43j90k3m9J34l8N5q7K5K2j2q0J13r4J26l2R1j30j2N3qj22
$$ 70 105 95 -9 14 19 162 -28 -51 -100 34 -4 51 -36 -11 11 -1 -81 32 -62 64 32 123 -7 -19 34 26 -96
1469i6O9M1kLo7K8m5O4j14J03%M4J30j76j66K00M4n3klo0L7kN9q6N9k23J47L7
$$ -96 -27 14 12 15 -52 -24 -69 -5 -119 -16 -16 28 158 -18 -184 16 60 7 5 2 -58 -21 -23 36 -50 9 -214 -67 -30
1498c0P1r7J02j00jJ8l4P1J3K3P0j16m6J87j53o0M8k4P3NN2j17r9P9J25n9N0j34
$$ -30 41 -56 46 -54 -55 -37 -71 0 13 36 106 -10 -56 131 -22 -82 -34 -58 15 20 72 -45 -144 -65 60 1 51 -83
1526h3L6J52p0qN2O8k01n5P5R6n9j03j1N6K3Q6j8K6j29P1K2L9j48R7o5L6J8nK7
$$ -83 -47 105 35 27 79 147 -54 -109 -34 62 3 -100 -111 -55 -32 54 36 62 -67 4 26 65 -83 14 -51 -15 3 -2 25
1555B5j35O2PN3N5q3O8n4P9n1j39O5L4o8J9k2J49k03J23K0rO1KP8j52K2r1O0r
$$ 25 -110 -48 -41 12 67 -16 52 -2 77 26 -113 -48 -14 -82 -63 -85 64 -139 -16 4 -5 56 58 136 -16 6 -85 -25 -34
1584c4j4R4k6k8P4j42J63n5r9Q1P1j31m9J86r4P8j68J04J4K8N6l2k5p0J4J24o1
$$ -34 -48 46 20 -8 66 -76 87 32 -67 14 85 -46 -95 91 -3 75 -93 11 25 53 109 77 52 -18 -4 120 59
1611E9k5M0l5n0R8j00N3j02N2n8J7K5r0J30l7k6JK3QrQ5nj11mj15J75n0n0J22
$$ 59 34 74 39 -11 87 -13 40 -62 -10 -68 -51 -26 -116 14 -23 -49 -48 -25 -17 -26 59 54 -57 -61 -176 -1 -51 -101 21
1640B1j31j7OJ45l2Ol3M1n4L5jm8Q8m0JK5M0L6r7J05j53K0O8o0n8J47P9j30l0
$$ 21 -110 -127 -121 24 -8 -2 -35 6 -48 -13 -14 -62 26 -14 -13 12 52 88 -9 96 -57 -37 31 -29 -87 60 139 9 -21
1669b1m9J98q1P5j52K8N2K8j09j04P7r4J37m6m1j1J23k3j6O6j47N7L2J40j65j01
$$ -21 -70 128 47 122 -30 -2 50 78 -31 -135 -58 -152 -15 -61 -102 -113 10 -13 -29 37 -110 -53 -21 119 -46 -147
1695a47N5J41o5J09j23L3l8m5J37j70J96j4m6k0j44J11lN7m9K7N5o1m3l9J87n7
$$ -147 -92 49 -16 93 -30 3 -35 -80 57 -113 83 69 23 3 -141 -30 -33 24 -25 2 57 -4 -47 -86 101 44
1721D4k01J25Ml2P5m6K17j68o8Q1q2K6J3K9j19NO5jo5M3Mn6L05k69J7M5J6K8l1
$$ 44 -157 -32 -28 -60 15 -31 186 18 -50 31 -51 -25 -12 17 -102 -97 -32 -33 -98 -55 -51 -107 198 -71 -54 -9 7 35 4
1750Dq9J17Qj10J03L2l0r2l7jR5Q1n9Ml4j46Q7Q5j52J14j7Q0%l8p0J53L2k21J90
$$ 4 -85 32 40 -70 33 65 35 -57 -94 -95 0 81 22 26 -8 -154 -67 18 -134 -20 -37 43 43 5 -65 88 120 -101 89
1779H9j61O4l5Q1p8o5O4nl0M3J16l3m7O6n0j30Q5q6R9l3l2J74j13k7J19j11J6
$$ 89 -72 -8 -43 38 -40 -105 -41 -46 -76 -33 83 50 3 69 19 -111 -26 -112 -13 -46 -78 96 -17 -44 75 -36 -20
1806b0J35q9m9O2L3j04O6l6N1m8o6M8M1p3N7j5o2K0J11j1p5J2R1j35j5O7l3n0
$$ -20 115 26 -23 39 72 -32 34 -2 49 1 -65 -17 24 -49 8 -7 -69 -49 62 51 -24 -12 79 -56 -71 -4 -37 -87
1834h7J8J1M1j15M4K7L7j34Q9j0P7j2LK8r9J20q6j5L1RM9L8j02K9j14O5J32Kj18
$$ -87 -69 -58 -17 -132 -88 -61 -24 -158 -69 -79 -2 -14 -11 17 -82 38 -48 -63 -32 -23 26 64 -38 -9 -123 -58 74 76 -42
1863d2K7n3J20O9j01k0k1O2q6L8j5m1lJ16j0k0j06J11j05P8l8o0J78j6p4%L5J9
$$ -42 -15 -68 52 121 20 0 -21 41 -45 -7 -22 -63 -66 50 40 20 -86 25 -80 -2 -40 -100 78 62 -12 -12 23 42
1891D2K4j52N3O4m5j7L8j01J32p1J24p4P3j55N0j5J08o7m8r3L5M1J09o2K9M1k
$$ 42 66 -86 -33 31 -14 -31 7 -94 38 -33 91 17 90 -65 -15 -30 78 11 -37 -130 -95 -54 55 -7 22 63 61
1918F1r7Q0j00k0J44j18J11o0j05J42M0j29J03r2K4Pj8J49jj07m1j15J32r3J65
$$ 61 -36 44 -56 -76 68 -50 61 1 -104 38 78 -51 52 -40 -16 -9 -27 122 121 14 -27 -142 -10 -103 62
1943F2Rn5j7K3k2j5O5J5j63J22m3K9l0l7PJ16j56R5j08L4K9J01J6r5j9Ql8J02
$$ 62 71 16 -1 22 0 -15 50 65 -98 24 -19 10 -20 -57 -50 66 -90 5 -103 -69 -40 61 77 -18 -37 -29 -67 35
1971C5p7J10K0j36J91j37K7q4J82j26j24Q2pJ7M7n3J03m5n0j7Q8nj62j1J12O5
$$ 35 -42 68 88 -48 143 6 33 -51 131 5 -119 -37 -44 -27 20 -33 70 25 -25 -42 46 41 -121 -132 -20 45
1997D5m5k1L7K7k4l7M4N5k62J49J26j95J26o6oK00j41J43q5j31L3qO0K4l4q3M4
$$ 45 0 -21 16 43 19 -18 26 81 -181 -32 94 -101 25 -41 -47 153 12 155 70 -61 -28 -36 24 48 14 -69 -25
2024b5O0m9k4k7J22j18J78j15pM5OO7Kj38K6o9R4m2J2j0k7P3O3r9k24K54M1j15
$$ -25 35 -14 -38 -65 57 -61 117 2 -5 40 46 113 115 -23 3 -66 28 -14 -2 -12 -39 34 97 -2 -226 28 69 -46
2052d6J19j25O9k4J16k56K15r6l1J29j28J5q5J06Q8ko6n5P1k9O8rj14J60n9r9
$$ -46 73 -52 17 -7 109 -147 68 -28 -59 70 -58 -43 -128 -22 66 64 -2 -57 14 -15 53 44 -70 90 31 -68
2078f8K8L3J8rj67J12J40j01l1r0pJ92o7k9P1j75J13m2m5J12R1j32P8k2K9K4p
$$ -68 -40 -7 11 2 -165 -53 87 -14 -45 -135 -142 50 -17 -46 25 -150 -37 -79 -124 -12 79 -53 25 3 32 56 49
2105D9j20l0J18m5j1j89K68j42J32m2n4n0J37O2l5j7j90K45m7ok8j50J28p0J09
$$ 49 -71 -101 17 -28 -39 -228 40 -102 30 -12 -66 -116 21 83 48 31 -159 86 39 33 5 -145 -17 -87 22
2130B2q0J4P2M8k17J91p7L4o8o9J63M7o1o2PJ10r8O8j54J49o8O8k5o5J13j62J6
$$ 22 -58 -44 28 76 -141 50 -27 7 -61 -130 33 80 19 -43 -36 74 -24 44 -110 39 -29 39 14 -51 62 -100 -84
2157h4l2J85j40J18kj33O7N3jL7M1N4j00j8J15m3j72q2R2P8m8q1J90j39qP2JM6
$$ -84 -116 69 -71 47 45 -88 -21 32 31 68 109 163 63 45 160 117 -55 -137 -45 33 -15 -96 94 -45 -53 19 20 66
2185F6j41K8l8O0j30K57j12nOl5R9n1O6q1J69j10m2K7o7K5J6N4j9k2L7j20N2P5
$$ 66 -75 -47 -85 -25 -155 102 -10 -15 -9 -44 55 4 70 -11 158 48 6 33 -34 -9 7 61 42 20 57 -63 -11 64
2213F4r9O8n0p6J28L1j22J08j10Q3Q9j40R4rn0J3MMm3k4J98j61Q4k3n9O0j28P4
$$ 64 -35 33 -17 -93 35 66 -56 52 -58 25 114 -26 68 59 9 22 26 30 -13 -37 161 0 84 61 2 62 -66 8
2241HL4j17n4R7l9j0K5N8kM4p7l0p3O1J11j66R6J34j87K4Q5o9Q5p5Lk7q0P5R0
$$ 8 42 -75 -129 -32 -71 -81 -56 2 0 44 -33 -63 -136 -75 36 -130 -34 100 -87 -63 22 -47 38 -37 -34 -61 -141 -66 24
2270B4K6k8n4J09j13Q5j23N6Q8K4k18J67j35R8j6Om5Q7l1k0K0k11J77N4n9Po6
$$ 24 50 22 -32 77 -36 49 -74 -18 70 94 -124 43 -92 6 -10 -4 -49 38 7 -13 7 -204 -27 27 -32 -25 -91
2297i1O3k9n5J10j02J14o4M3j1Q5k0n6L1m1m4K1k1J41p9j7j40L15j34j4jl8J93
$$ -91 -28 -57 -112 -2 -104 10 -54 -11 -22 63 43 -13 18 -23 -67 -46 -67 74 -5 -22 -162 153 19 5 4 -34 159
2324A59k15p2K22p8j9J55j79K9J06N8j13o8j16J02r1J25k3O3j56P2o7J21j34J23
$$ 159 -56 -128 94 16 -3 152 -27 2 108 166 53 -15 -131 -29 -120 5 -18 45 -111 -39 -106 15 -119 4
2348Dj34J30n5N7o3P2k2M5Q4j89R9N3j09J1N3q3P2j03J0L9j2J33o4QN0j70J07
$$ 4 -130 0 -55 2 -61 11 -11 34 118 -71 28 81 -28 -17 36 -47 25 -78 -68 -29 -41 92 28 36 86 -84 23
2375B3K3r9N4O7M8j13j2N7j36j8J73m4Kj30N5q2R5K0l9J58j05Op3J50n2Nn2M6
$$ 23 46 -53 1 68 116 3 -9 48 -88 -106 67 23 25 -105 -50 -132 -37 -17 -56 102 -3 3 -70 80 28 33 -19 27
2403B7Np1KQ1j11j2Q6l0Q0l6p5J63j01o5K15j17n4k5RL9j4K2j2l8J33j07m1O7
$$ 27 32 -39 -37 44 -67 -79 7 -23 57 21 -54 109 8 -57 158 41 -13 -38 -29 10 -4 18 6 -32 101 -6 -47 20
2431B0q4J03M7j69L1Q9K0j8Rj17l1J85L2j19L9k9K0j47J08M1m2N2j11PO4J06N3
$$ 20 -64 39 86 -83 -52 37 57 39 48 -69 -100 85 117 -2 37 8 28 -119 -11 30 -12 40 -71 -64 0 106 159
2458A59j61j18P5J02J1q4J9J30j85Q2p9Q1j09P2j38J19P0K4o8j09J29j26R4P7
$$ 159 -2 -120 -45 57 68 -16 3 133 -52 30 -49 32 -77 -5 -143 -24 46 70 2 -107 22 -104 -10 67
2482F7m3Q5j23oJ16M7n1j20k4O0j0J1j05K74k27o8Q1J82k89J19R1k17K50p2K1
$$ 67 24 109 -14 -20 96 143 92 -28 -52 8 -2 9 -96 178 -49 -117 -36 146 -143 -24 67 -150 100 28 49
2507D9j34J17Jj21RL3J3l0J67j40O7l6n0j21K83j57j27J47r3N9J13Mr0O5Pk15
$$ 49 -85 32 33 -88 -79 -46 -33 -63 104 -36 31 -5 -55 -176 107 -50 -177 -30 -123 -64 49 53 -37 28 35 -180
2533a80J15J93j01j03L5n7J41k2j23N6J33k19J44j28Q9J32j53J09N9j88j9J82
$$ -180 -65 128 27 -76 -41 -98 43 21 -102 -46 87 -132 12 -116 -27 105 -48 61 120 -68 -87 95
2555I5p8j64L1J35m2n8J38j15j0P4l1n4J19n4K4q0n2R5J1R3j07J2q3J51K7m6k1
$$ 95 17 -147 -116 19 -23 -81 57 -58 -68 6 -25 -79 40 -14 10 -70 -122 -27 -16 77 -30 -18 -101 50 77 31 10
2582A0j31K08j18O6K0l5j42J25N6p5oj35J27pj42K48j38J21q1J21k2l6j0k6m7
$$ 10 -121 87 -31 35 55 20 -122 3 59 -16 -22 -157 -30 -37 -179 69 -69 52 -29 92 70 34 24 -2 -49
2607d9o0J95j88O1O2o3J12k73J21J27j14P0m1N0r7M4O4l9Q3j11j53L12k55J47
$$ -49 -109 86 -102 -41 21 -42 70 -203 -82 45 -69 1 -40 10 -87 -43 21 -18 65 -46 -199 113 -142 5
2631Ek6N1j78J20q5J16n1k5j8J56K2l6p5q2J61q9J6j00M9j4J22j40J64j61M1K3
$$ 5 -21 30 -148 -28 -113 3 -48 -73 -91 65 87 51 -24 -106 55 -34 -18 -118 -69 -83 39 -101 63 -98 -57 -34
2657c4o6J55j80L3k3J36j80J61j04Q2kp3O9o0R2J3l4j5k3J11j79K94r4p2l0J87
$$ -34 -100 55 -125 -92 -115 21 -159 2 -102 -20 -22 -95 -26 -86 6 19 -15 -30 -53 58 -121 173 79 7 -23 164
2683A64k02J01j29J56r2m2J4N4n6q5K00MM7j93L2K7O9m9o3L4L4r2Q4l5n8oR8j02
$$ 164 -38 63 -66 90 -2 -44 -30 24 -32 -117 83 87 134 -59 -27 0 69 20 -43 -9 25 -67 17 -18 -76 -82 16 -86
2711h6J8K7Q6j4j04K9L5q5N6M5P9j21M8%o7P2j02j1J28j59J51pK2k0n0J7l1L6
$$ -86 -68 -41 45 31 -73 -44 -9 -94 -38 7 86 -35 13 13 -54 18 -84 -95 33 -126 25 18 40 20 -30 -13 -44 -8
2739ho3J29m3O3j16J02j67Q7j37J43p1M1KJ06j10J56k80l5K07L7k4p0K5n4O8M
$$ -8 -71 58 15 78 -38 64 -103 -16 -153 -10 -81 -40 -38 68 -42 114 -166 -201 6 43 19 -51 -26 -80 -12 -8
2765hn7J2N7lJ00j67L3J08op0N7o5K4L5j9K4J2n8N0k15Q0K9n0J42J4p8O9o0j30
$$ -8 -65 -53 4 1 101 -66 -33 75 69 -1 56 -9 15 50 31 55 67 9 59 -156 -76 -47 -97 45 59 -19 50 -10 -140
2794a40K3J09j87J12KJ20j80O7nM6M3j8j21N8Q2N8j85O4l2P9j00J13n1k2J16r1
$$ -140 -117 -8 -195 -83 -81 39 -141 -74 -79 -33 10 -8 -129 -71 11 69 -116 -52 -84 -5 -105 8 -43 -65 51 -40
2820d0J56j11m8Q9j36O4R9k00J50p8O6q6M7Q6j06J8j8M1J3JL8o5P7n7p2L3J17
$$ -40 116 5 -43 46 -90 -26 73 -127 23 -55 11 -75 -28 58 -48 -30 -48 -7 6 7 45 -20 57 0 -72 -39 78
2847G8r4j6j41J65nJ36m3k03P4R1m8r2J11K3J6n9j38R7J6Jl7J80j47R0L5j83R5
$$ 78 -16 -32 -173 -8 -13 123 80 -123 -49 42 -6 -98 13 36 52 -7 -145 -48 -32 -31 -68 112 -35 55 90 -93 2
2874BM6j8J6r2j7Q1P5j29m2J59j48R9k0o2k3J63j70K5K0k7J9q3J44j67N6P8n4
$$ 2 48 30 46 -46 -63 18 93 -36 -78 81 -67 32 12 -50 -73 90 -80 -55 -35 -62 -43 -126 18 -149 -93 -15 -69
2901f9NP2L7j95J71q5%j9P4m7Jl9J03Rr6K16j15LRr0R9q1Nl6N9l5L1j3P0k2pm0
$$ -69 -64 8 45 -150 21 -64 -64 -83 -9 -56 -55 -94 9 18 -78 138 23 26 35 -55 44 -37 -32 -68 -9 -44 -13 -26 44 22 15 -25
2933b5J1J04o0j4l3k3R4n6J04k00J77j3Q2k45n9K74k60J26k6J06j36J09j89J84
$$ -25 -14 90 30 16 -17 -40 54 -2 102 -98 79 66 148 -97 -156 118 -142 -16 -42 64 -72 37 -152 32
2957C2M0j80O2q7K4R1p8M4J24%oj38Q5L5k06J71m5M2pq0L1Q6j00P4l4r6J25k6
$$ 32 72 -108 -46 -133 -109 -18 -96 -52 72 72 66 -72 13 48 -158 13 -32 10 3 -77 -46 40 -60 14 -20 -116 9 -17
2985a7M3j47R8K7k4J3L7m6Mp2J77k4j56P3Nn0J19m5j21R9K4L7r3o3J46p5pJ18
$$ -17 26 -121 -23 4 -20 -7 30 -16 -12 -84 93 69 -87 -14 -9 -59 60 15 -106 -7 17 54 -39 -102 44 -31 -38 80
3013H0mj23J05j15l1j9R4L9j21k5Q6k3j2m3L4J70q2r4J28j1K4J8q9J02j12m1P6
$$ 80 76 -47 58 -57 -88 -107 -13 26 -95 -120 -34 -57 -69 -112 -78 92 10 -84 44 33 57 75 -14 88 -24 -65 11
3040A1J9k0Q8q6p2N4J9K1P8j15O5jjn5J17p9n4p0M1O6K1j30M9k8J05q5M0r3Q4
$$ 11 30 10 98 12 -60 -6 13 34 112 -3 62 61 60 5 122 43 -11 -81 -40 26 47 -83 -34 -62 43 -42 -2 -95 -11
3069a1O3j61K04j31J50j53j1K17j64n6J00k0L3j16R0r5LL2J4j28Q9P8M4o3%om4
$$ -11 52 -109 95 -36 114 -39 -50 167 3 -53 47 27 60 -56 34 -61 -58 -26 -12 -140 -51 27 71 8 8 2 -42
3096d2Jn2K5J03j11M9l7P1kq8R9r8O1n9j9J47j01P4o6L7n6L5LqJ68k11K3N4l6
$$ -42 -41 -93 -68 35 -76 -27 -64 7 5 -83 16 -82 -21 -80 -99 48 -53 21 -45 -8 -64 -29 -26 -34 134 -77 -54 0 -36
3125c6J45m4j7k25J90Mr4O2j5K0j07j2J4K15l10J86J14j38P2Ok3r9R6o6J30j48
$$ -36 109 65 48 -177 13 17 -77 -15 -30 -10 -117 -129 -115 100 -210 -24 90 -48 24 30 7 -92 4 -62 68 -80
3151h0mO0m6K8K2j3rJ14r5j60J47LP3j41N2p3R9O6R9j04j49J14Kj07J60j65K9
$$ -80 -84 -24 -70 -42 -20 -33 -42 72 -23 -183 -36 -33 40 -101 -49 -122 -23 43 142 38 -111 3 5 -102 58 -107 -78
3178g8L6j37J71n3j4J73o6j25P3k5J11j69K8N6O4o0J8J1j08N5j6P4m3K5J9j83
$$ -78 -42 -179 -8 -61 -75 98 32 -93 -20 -45 66 -103 -75 -19 45 -15 3 14 -94 -39 -55 19 -24 1 20 -163
3204a63J37J48j16n6m4k0J55P8o0r5O6o8l4N4N5j48J63p3o3NN9J43L1l6q1J3l3
$$ -163 -26 122 6 -50 -94 -114 41 119 59 -36 30 -38 -72 -18 37 -111 52 -21 -84 -79 -20 123 154 118 37 50 17
3231A7o8Q0l8l2M1M5k6j0N4Q2j04n7nJ02j83LM7k9Q0O8J8J1m1p6m6rP7q7J53o5
$$ 17 -51 29 -9 -41 0 45 19 9 63 145 41 -16 -21 81 -102 -99 -52 -81 -1 67 85 96 55 -21 -67 -76 1 -86 67 2
3261Bk1n3l3J63j73K30j22O6qq1j6N5n5J9j4K2J6O1j11k7pQ4n5j4J50p3P1r3k
$$ 2 -19 -72 -105 58 -115 115 -7 59 51 -30 -46 9 -46 -27 -41 -19 -3 58 -53 -80 -87 -3 -58 -72 78 5 76 -17 -19
3290a9l3J17j09r4J89j55J57j2m3NK1Ql6lQ1P1k26P4j5L6j18Q6J08p4o2Q7j31
$$ -19 -52 65 -44 -138 51 -104 53 41 -2 3 24 32 -4 -7 74 145 -81 -7 -22 14 -104 -18 90 16 -46 41 -90
3317i0M1q2J04q8J27O6j2q2o8p2J53k6l9j2J29K1k01J53k9K2o9m0Q8k5K6m1J04
$$ -90 -49 -131 -27 -115 12 78 66 -16 -84 -156 -3 -29 -68 -80 49 70 -131 22 -7 15 -54 -94 -6 -31 -5 -46 58
3344E8M7j27J83j87Q7j51J54o4%j17J60j41J61j41NK02m7m5q6M7J5j41R0j1L8
$$ 58 105 -22 161 -26 61 -90 64 0 0 -117 43 -98 63 -78 -73 129 82 37 -49 -2 13 -128 -38 -49 -11
3369a1lj9Q5om4QkL8m8Mm2P0M6l7r4k5k7L4J90n8l1J9qj60P8P7o5J93n3j74O3
$$ -11 -14 -33 52 46 2 10 8 46 -2 2 -40 30 76 39 -55 -80 -107 -73 117 59 28 47 39 -121 -43 34 -31 162 109 -65 -2
3400bK0l0k2P1qj13Q4n2j7JJ34o4J51j42j16P1J3p2n7J26rM3j30Q1K7P6m1m9L2
$$ -2 18 -12 -34 37 29 -84 0 -52 -69 -68 66 2 153 11 -105 -34 -21 -93 -150 -24 -33 10 -120 -39 -12 64 23 -26 6
3429Fj05KJ96m3r0N1N0j6K5k7r9J14o6Qj65J73L1J3j74Q9M8PJ0j52%O6N9j7O3
$$ 6 -99 -97 99 56 -34 17 67 51 76 49 -50 64 -2 6 -159 14 45 58 -116 -27 21 28 38 -114 -114 -48 11 -6 57
3458E7q3J1Q3K8k26P4j3R4l7J1m7J5L8m8P8L1j9o5P0o2J13J04j10Rj1j15m0J65
$$ 57 -26 -15 68 96 -130 -56 -69 25 -12 -1 -48 -33 5 -43 35 66 47 -18 52 -10 103 207 97 106 95 -20 -60 105
3486A05j04M2j68P1l8K7J04m4J9r6J2M1M5J4o3o5K13j59mqRJ64j71o7N9O7l1p2
$$ 105 1 43 -125 -54 -92 -65 39 -5 14 -82 -70 -29 16 30 -33 -98 115 -44 -48 -56 -47 117 -54 -121 -62 5 -26 -98
3514i8K7o4J50j2l9nm1QM6L5m0j3n3O4J54k53J08j8q0Q9P4p7J08j15L2N3r1J22
$$ -98 -71 -135 15 3 -36 -41 -82 -74 -28 7 -33 -46 -99 -35 119 -134 -26 -44 -124 -35 39 -38 70 -45 -13 40 -51 71
3542G1j17j41J57J42r3k3%O1q0O4NJ24k55M4J08o2J43k11Rm1Lj0L5M5K8j25P9
$$ 71 -46 -187 -30 112 19 -4 -4 57 -23 41 46 170 -85 -41 67 5 148 -63 -54 -95 -92 -102 -67 -22 6 -119 -40
3569d0R1k36J69p0J36r1r2Q5J01j6k9m7n2J43p8P3j17J11m7K9j33J84n6K2j53
$$ -40 51 -185 -16 -86 50 -41 -133 -48 53 37 8 -39 -91 52 -26 47 -70 41 -6 23 -110 74 18 40 -113
3594a13J08kO4j21J68k51R9J0R1n4k0l4M7k1N5L4J2j82Q4M1k5M2j7p4J33j49j4
$$ -113 -5 -7 57 -64 104 -147 -48 -38 53 -1 -21 -55 -8 -29 26 60 72 -110 -26 15 -10 32 15 -59 74 -75 -89
3621h9J17p1M5j20J48j4l1k0L1m4P6M6j74J20jM1j55J71o2j10R4N2m4n0J68j01
$$ -89 28 -43 2 -118 30 16 -15 -35 -4 -48 28 74 -100 20 19 60 -95 76 14 -96 -2 50 6 -44 124 23
3647B3k2k0K2j03J00l1j00J23L4P5j13j17N9J72q9qn9L2M7O6jj29rR4m8k9J38
$$ 23 1 -19 3 -100 0 -31 -131 -8 26 101 -12 -129 -70 102 13 5 -54 -22 25 91 90 -39 -48 46 -2 -31 107
3674A07j40N9j8M3j83qK64k10O4jQ2j43J07nq2J19o0Jj3k2J54m2k09Q3M9l5qQ9
$$ 107 -33 26 8 51 -132 -140 124 -86 -22 -23 59 -84 23 18 -64 55 -5 -4 -17 -39 115 73 -136 -53 -4 -39 -47 42
3702D2n1jl4K2KN8j6n9J02m2o1J21p0k8j40J21o5Q4k3M7p9ooJ21j7o5J12j37P
$$ 42 -9 -10 -44 -22 -20 38 22 -37 65 23 -38 83 13 -15 -155 -34 -99 -15 -38 9 -70 -76 -82 39 22 -43 69 -68 -61
3731f1k2R8M5q6J17o2j13L4QM3K2J1j33J26j8o0R8%J12j39j91K10Nq9oQ2QL6j43
$$ -61 -83 15 60 -26 91 29 -84 -50 -42 1 23 34 -99 27 9 -51 47 47 159 20 -171 39 44 -45 -51 31 39 75 -68
3760f8O7j6R0m3m8K0j19J13m0k6M4K1lM9p7p4K13k20J01K0NL0Jq1M6M5j06J58
$$ -68 -1 -17 73 30 -18 2 -117 -4 -44 -70 -26 -5 -8 41 -36 -110 103 -117 -16 4 9 39 40 -41 5 50 -56 102
3788A02o5j12k7J39n5n9K22n5Jn4j46N7J20M5p2M2p9L2j44N8J09Qj19j6N3K5L6
$$ 102 37 -75 -102 37 -18 -77 145 90 91 37 -109 -52 68 113 41 83 4 36 -108 -50 59 67 -52 -68 -15 10 46
3815D6r6Q3n3j3N5j45Q2o0J06j53Q2N2QJ23j61J29j44p2J01L1k9q5J18Qm4J38
$$ 46 -50 33 -20 -33 22 -123 -41 -101 5 -148 -66 -14 -6 117 -44 85 -59 -131 -30 1 -28 -113 5 13 -31 107
3841A07k14M7M3n9K00n5p0j20L7N6K08j53%L2M5j58n3J3J02k3J2M5n6Q5kM0j04
$$ 107 -107 -60 -17 -76 124 69 -1 -121 -84 -28 180 27 27 59 104 -54 -107 -94 8 -15 -3 42 -14 71 69 109 5
3868Er9L0m0L9Q6J7k7n0P6Jj42J17Oj36J73n9l6K08j66m0J61k13J58K6p2j78K56
$$ 5 -94 -64 -104 -65 21 38 11 -39 37 38 -104 13 19 -117 56 -3 -39 169 3 -37 124 -89 69 95 23 -155 101
3895A01j40R4k8J27j34m9k0OK4m1J58j30N3j37K47k9k04Q9o5l8Q6j6J10Jj04r
$$ 101 -39 55 27 154 20 -29 -49 -43 -19 -60 98 -32 21 -116 131 102 -102 -13 -78 -116 -30 -46 64 65 -39 -48
3921d8P0j33J32j6N8o1j06J12j38P6J38M8j57m0J06j1m9ol7K2M2Q2m8j13l1l3
$$ -48 22 -111 21 5 63 2 -104 8 -130 -54 84 132 -25 -65 41 30 -19 -25 -62 -40 2 84 36 -77 -108 -141
3947a41R7J68j13m3R0q7o1J51k3j63P1KK8R1r0K8O5r7m7J46L2k4Qj21K1k1O3j30
$$ -141 -44 124 11 -32 58 -29 -90 61 38 -125 -54 -52 -24 67 -23 5 70 -27 -74 72 104 80 88 -33 -12 -33 30 -100
3975a00P7j3N3p8O2r9R2R1j26N6j50J13L1j32J98p2n5j09Q2R4p2M8L6p7J03k58
$$ -100 -23 -36 17 -61 1 -98 -6 85 -41 15 -135 -22 9 -123 75 3 -52 -161 -79 15 -57 -9 27 -50 53 -205
4001b05K50n2l7J17o7J3J0pq7J6J09j3P3r8j8L2mk8n0j06K15n6O8m1p9O0j0oL9
$$ -205 45 -7 -44 73 6 19 29 22 -65 -49 60 47 120 22 4 36 32 4 -46 -152 63 7 75 34 -45 15 5 -1 38
4030C8r9L5m8P1j27R1k2M7k0l9k0j7mJ27m6L8O9j59QM5O2j25N1J84k38P5n7R8
$$ 38 -61 -26 -74 -3 -130 -39 -61 -14 -34 -73 -93 -110 -114 13 -33 5 74 -85 -77 -32 30 -95 -44 140 -98 -23 -80 18
4058A8l9O7o2J08qr3Q1j07M3J47j84J5p2pJ05L3p6J3OJ0R7j69Q6j7K4j8M6j00
$$ 18 -21 46 -16 92 84 -9 72 -35 8 155 -29 -14 -86 -93 12 45 -31 -18 -12 -2 95 -74 12 -5 19 1 47 -53
4086e3O7%pQo2K4n9K4J41j00m7J32m6J7M7j73J07j68N0N6N0N4j6Kk5q2L1k3L8
$$ -53 14 14 7 15 -47 -23 -82 -58 83 -17 -64 68 22 39 86 -87 20 -148 -98 -42 8 62 46 48 23 -59 -28 -51 -13
4115a3M4j33j7P4J23l9j56J13L0j32J73K2o2P0n4J5j48J9K9Q2j62J91jj08Q3O7
$$ -13 31 -102 -119 -45 78 39 -117 -4 26 -106 67 89 27 97 43 58 -90 -71 -42 40 -122 69 68 -40 43 110
4141A10j52mP4o6N5p0R6j13J42q9L0k7l3J37j95J00O7n6n7K12j76O7o0O9k3k3
$$ 110 -42 -46 28 -38 17 -53 43 -70 72 -17 13 -14 -47 90 -105 -5 62 6 -51 161 -15 52 -8 61 38 15
4167A5o4J12j44J18rr0R4o3PJ3J6j6j14J69J04k19M2m6N0j8Q8R9j57P7O5p6k0
$$ 15 -49 63 -81 37 28 -62 32 -31 -24 -11 5 -11 -125 44 148 -71 -29 -75 -25 -43 45 144 -13 64 129 53 33
4194C3J5n9R6j13J12N5l04J82lo5P8k00K34o6j12K24J7r5Rk2N6N8n9j51J20L7
$$ 33 48 -11 85 -28 84 139 -165 17 14 -51 27 -173 61 -5 -117 107 124 29 38 16 72 130 71 -80 40 77
4220G7j3q6N5Q2q4m3n7P9q9J79nl5p8q8J23j42J00M4l2J7j45J98o9k4J7L9n8q3
$$ 77 64 -22 33 115 31 -12 -69 10 -79 100 95 60 -18 -106 17 -125 -25 19 -13 4 -141 57 -12 -36 -19 20 -38 -121
4248a21J02rM5J7O1k20J57N5l7o3m2R4j4Qn5O8j4r5Q1n9P3p8l8J42q4J2l1J00
$$ -121 -19 -28 17 34 95 -125 32 87 50 -13 -55 39 25 33 -22 46 32 -63 18 -41 32 -46 -84 58 -26 -14 -45 55
4276E5j15J53Jj13J70j03pj90J66nj31K46o4%j9k6k3L0j11J56j30N7rj8m2N5L1
$$ 55 -60 93 94 -19 151 48 41 -149 17 12 -119 127 63 63 44 18 -5 25 -86 70 -60 -3 -12 -30 -72 -17 14
4303A4Lq7P6L1l1J3LN4j07MJ2QO2m6l6j31K29l6o3J32q2r0J3J67k26J62n1l9M0
$$ 14 17 -70 6 37 6 19 22 76 -31 -27 -15 -7 55 9 -27 -158 71 35 -28 104 22 -68 -55 112 -114 48 -3 -42 -2
4332bjJ05l8j6j39M1P4r5k6J16Q9j51q1Q3N0r5P9KK1M5j16N9j07O0O1L3K5p3j14
$$ -2 -3 102 64 48 -91 -50 24 -71 -97 19 108 -43 -124 -41 9 -86 -7 -5 16 61 -55 4 -103 -43 18 51 76 3 -111
4361a11J27lp5K0R7p0J00j66K7J51o6K3J04n7L4j17p8K9k4K8%K9Qo1l0M0O6J4
$$ -111 16 13 -62 -42 55 -15 85 -81 -54 97 31 54 158 101 135 18 -60 -31 -55 -27 -27 2 10 -51 -81 -41 25 39
4389C9n4l9J68qr8L8j32R6j1N7l9Pn2k2l6M3k5J8Q3q6J4J28k9l3k6M9Pj8P1r8
$$ 39 -15 -54 114 106 8 46 -86 10 -1 56 17 24 -28 -50 -86 -43 -68 -50 33 -53 -39 89 60 27 1 50 57 39 110 12
4419A2M3L3o6M8j45nL4K8M4q8J87k23M9Q9j37J69j55J70j15j0q0O3M2R3j61N3
$$ 12 55 88 22 70 -75 -80 -46 -18 26 -62 125 -98 -49 40 -97 72 -83 87 -28 -38 -118 -55 -13 80 -81 -28
4445b8O5p4j3R5q9J1J02j45J14N1j20kM4m6k6p9O5J62M4j43P7n2n6J26k2r2L8
$$ -28 37 -37 -50 45 -44 -33 69 -76 38 89 -31 -33 11 -35 -61 -140 -75 87 131 -12 65 13 -43 83 61 -31 7
4472Gj12M1Q8j1K5k2j19J26N0j17K0p4P4n0N4N8q5R4l9q3m0J45k0J4m2r2J86n0
$$ 7 -105 -64 24 13 38 16 -103 23 73 -44 -24 -98 -24 -74 -20 38 -47 47 8 -75 -115 30 10 24 -18 -110 76 26
4500B6j14J04Nl1l7n0M5R8l4qj0K01k02k7L4n9J01N5q2J6j9k7P0j01j4K6P9k01
$$ 26 -88 16 21 -10 -47 -97 -52 46 12 4 -6 195 -7 -34 0 -59 42 97 15 31 12 -15 55 -46 -60 -34 45 -156
4528a56J08O9m4j39J27J38j74J19p7rk4O4j43J61k8n8J71p7p2L0mQ6j21O5n3j11
$$ -156 -48 21 -23 -162 -35 103 -71 48 -29 -38 -62 2 -141 20 -8 -66 105 28 -44 -14 -18 68 -53 12 -41 -152
4554a52N2K8j0P9l1J07k7q2k9P2J02j12mr5K24k58K05j01J0M7j23Q4j20N5M1j0
$$ -152 -100 -72 -82 -3 -34 73 46 -36 -65 7 109 -3 -7 -102 122 -136 69 -32 -22 25 -98 -14 -134 -79 -38 -48
4580d8Q7p1Q0j07N9M8o3J26p3ok3J00j52L3l2j06J13J42j33K7Q7m6j1Q9j36k2
$$ -48 39 -32 48 -59 0 48 -15 111 38 32 9 109 -43 -10 -42 -148 -35 107 -26 1 88 42 31 120 -16 -38
4606c8R8p7J20n1j18N5j30N8Q3l7j6J22j31k1P4j27J71K0n7J00j54l9K3P2R8j48
$$ -38 60 -17 103 52 -66 -11 -141 -83 0 -37 -53 69 -62 -83 -9 -136 35 55 -2 98 -56 -95 -72 0 98 -50
4632e0R4L1O6j87K4jl1Q1km3m0J3J4LmQj2Qq4J20j14Q2L1o2J6J2lm1Q3R2j38J11
$$ -50 44 75 141 -46 -22 -23 -54 27 25 -18 -58 -45 -31 -28 -32 -24 -36 -28 -112 8 -106 -24 7 -55 -39 -27 -30 -71 12 104 -34 77
4664G7l4j2p9l9L4j8J76j32j4R1j22O5q1J34j73R8k2L0M0j21K14j61O6K1j43O8
$$ 77 43 31 -48 -87 -53 -71 105 -27 -41 50 -72 -7 -88 46 -127 -29 -51 -21 19 -102 112 -49 17 38 -105 -37
4690c7N2P2r9J6L9n5Q8k31J37n9l7O9L6J97k25O6J8%k5j06J43o1J2L6nq3P0k2
$$ -37 15 87 -12 4 43 -12 76 -155 -18 -77 -114 -45 -9 188 -37 29 47 47 22 -84 59 -2 10 46 41 -42 28 6
4718FJ29j91R4r3q7J48pp5OJ13o6O1m5j30K21j02r3J45r2LM7m8L3lk2R3n7J2m2
$$ 6 135 -56 38 -55 -142 6 -1 -76 -70 43 -23 38 -7 -137 84 -18 -111 34 -58 -55 -8 -56 -23 -26 -48 45 -12 0 -42
4747d2m2l5K0jJ10l8NnK3j16K02j52NN7J2LomK9l8MM3p6%N1pj9J3K1N1Pk5q9L9
$$ -42 -84 -119 -99 -100 10 -28 -23 -28 -5 -121 81 -71 -66 -9 3 6 0 -4 25 -13 -9 34 -42 -42 9 2 -17 -4 17 68 75 50 -39 0
4781@R5j83O4j7J7L3L1k3l8JJ09p7m2J7M2jMN6j90R8R1j38N7k1l5j0l4J01K3j05
$$ 0 95 -88 -24 -41 -24 9 40 17 -21 -20 89 12 -30 -13 29 28 32 88 -102 -4 87 -51 6 -15 -50 -60 -94 7 30 -75
4811g5O9Q0L9n3l2J77m2l0n6Ok7j14j6Q0Jp3J20j3J4j69J64r2J7mj5n5J68p5P3
$$ -75 -6 74 113 60 28 205 163 133 77 83 56 -58 -74 6 7 -66 54 41 55 -114 50 -42 -25 -29 -44 -99 69 -6 67
4840F7o5n5J16j24Q5q1KP0j00J97m8o1n7J12j12P6p1Km8J24L2m2o3J06j49J52
$$ 67 2 -53 63 -61 24 -57 -55 15 -85 112 64 3 -54 58 -54 22 -49 -47 -95 29 61 19 -44 62 -87 65
4866F5Ok09J39Mm0l5RJ16q3mJ56k10P4J45j08K1l6QL0j62P7N5%K7j7j46J76k09
$$ 65 71 -138 1 5 -35 -70 -61 55 -28 -32 124 -86 -12 133 25 46 10 18 48 -114 -37 18 18 45 28 -118 58 -151
4894a51L09k30n5R9J9k6j0M1j15J17l7L3l6k3K1ql2K3l0J1Q0M6p8J22j02j30J99
$$ -151 158 -72 -127 -28 -9 -35 -45 -4 -119 -2 -39 -6 -42 -65 -44 -52 -84 -61 -91 -80 0 46 -32 90 -12 -142 57
4921E7r9k6j4K07r9J03j30P7Q6j25k9J18k22J47j20J02j21P0k3P0q5P2P6q6K6
$$ 57 -42 -68 -82 125 26 129 -1 76 162 37 8 126 -96 51 -69 33 -88 -18 -41 29 -56 16 92 6 32
4946C2j5%L4Mm3K3j75LN1K3J01O4r3J29r8n1nR4j37O0P2j3L3j04Nk5l5J06n7P6
$$ 32 17 17 51 55 12 35 -140 -137 -86 -63 38 102 9 138 40 -11 -16 78 -59 1 73 60 93 -11 -6 -31 -66 40 -17 59
4976E9j86N8J08Jk8j15J21n3qP7P8q4L4o2Q0j70N5L2j5j72J69M3J9n5m9J56q5
$$ 59 -127 -69 39 40 12 -103 18 -35 -43 34 112 28 62 0 80 -90 -35 -3 -18 -190 -21 22 41 -14 -63 93 8
5003HLm1rk6L8N8n4J08k3q3nJ04l9m1q1K4J56l7L7o4o0N2L6m9r1J49p3L5m9L2
$$ 8 11 -30 -39 -65 -27 31 -23 85 62 -21 -26 78 39 -2 -83 -59 97 60 97 33 -27 25 61 12 -79 70 -3 32 -17 15
5033A5k7%J6m9K8j2P3j27J57j20N3Q7J9j24K1j17P6k4K5M4j0k2m7P4p5R3j03P9
$$ 15 -12 -12 4 -45 -17 -29 44 -83 74 -46 7 94 113 -11 10 -107 -31 -55 -30 14 4 -18 -65 9 -66 27 -76 3
5061Cr7L3j04J16O8k5o5J42m2r0L8L1R8j84J29j32J12K4q5O9k0n2k1J9l8O5R8
$$ 3 -94 -61 -165 -49 19 -6 -71 71 29 -61 -23 8 106 -78 51 -81 31 55 -30 39 19 -33 -54 -35 -73 -8 90
5088I0n0n2L8L1O1k34P6R0%j41J27j3p7N7r9J76J16j99J9J37j95k1N2K7M3j33
$$ 90 40 -12 26 57 118 -116 -40 50 50 -91 36 23 -54 3 -96 80 196 -3 16 153 -42 -63 -11 16 59 -74
5114g4lJ76J10k46m1Q4l2J19l6P2j04%P6p0m5M9r9J4jQQ8j54K3K2pK46k86M3M8
$$ -74 -77 99 209 -37 -78 6 -26 93 57 129 25 25 101 31 -14 35 -64 -50 -51 -43 45 -109 -86 -64 -71 175 -111 -68 -20
5143b0J59l2j19Ol5PO4N1q5R7j28K0J0P3k1j05M8jP5r7R1j86J61q7Q0j07P0Q0
$$ -20 139 107 -12 -6 -41 -34 30 81 -4 93 -35 -15 -5 68 47 -58 -10 -11 64 -33 58 -128 33 -54 26 -81 -11 69
5171F9l5o8j00J12M4K3m6%qnn5J04J00k11R5N6j17k8J22k18J46M2n0R7N4j30l2
$$ 69 34 -34 -134 -22 22 45 -1 -1 -9 -14 -69 35 135 -76 19 75 -42 -70 52 -166 -20 22 -28 69 123 -7 -39
5198c9J4K1n1j7Q6j5l0kKO2j02P2j00R9m3j5kP2M6l6j20Q4Ln9k4J45j34J09n8
$$ -39 -25 -4 -55 -72 14 -1 -31 -33 -31 31 -71 1 -99 0 -43 -58 -60 12 58 22 -98 -14 -11 -70 -94 51 -83 26 -32
5227c2J13o7L0RK6j2j35n8L3J58P0j58j1Q9j28J33j20L0M7N0j40N8J02j85M8J67
$$ -32 81 14 44 53 79 67 -68 -126 -93 65 135 -23 -34 55 -73 60 -60 -30 17 67 -73 -15 87 -98 -50 117
5253A17p8j00Lk0j7P2p9J70p0Q0q1q1M3J25l5N9j62k3M6j03R7J40j48l5NP3Nm6
$$ 117 39 -61 -58 -78 -95 -23 -102 68 -2 78 -3 -84 -41 84 49 108 -54 -77 -31 -134 -37 103 -45 -80 -75 -2 3 -43
5281d3P1K0J5j17J34j80R3j2J50k07J2J27j15o7J16M3lQ9l6j48M1OJ6o1l8L5R4
$$ -43 28 48 63 -54 80 -100 -7 -19 131 -76 -64 63 -52 -119 -3 40 37 126 90 -58 -17 -11 5 -56 -94 -59 35
5308C5n9L1QM8M3j13Mm2J12q2O0Q2k7j0R7j66K7Q9j21R5j69L8P0pj12P5j4J40
$$ 35 -24 7 15 63 106 -7 -3 -45 67 -15 45 127 100 90 187 21 48 137 16 111 -58 -20 50 43 -69 6 -8 132
5336A32j81L5Pl9O6m8L9j3l6J48q9j5jl5J04o8j08K40j65J77n5j50M6PR9j02J1
$$ 132 -49 -14 -7 -46 20 -28 11 -2 -38 110 21 6 5 -30 74 6 -102 138 -27 150 95 -55 -9 -2 97 -5 6
5363Fo5J11j10l%K5N7j31J42p3J21q0nM5j44J10j11J21j1N6j44K1M1O1M3r9L8
$$ 6 -59 52 -58 -61 -61 -36 21 -110 32 -41 80 0 -5 40 -104 6 -105 16 5 61 -83 -62 -21 40 83 -16 22
5390B2N3j9J9j09j00J18M6j26K5j0j3M0O6Q5j63r7K69j53J7Oj0K5J01q4PN3p9
$$ 22 75 56 75 -34 -134 -16 30 -96 -71 -81 -94 -54 12 97 -66 -163 106 -47 -30 -24 -34 -9 92 8 15 68 -11
5417a1J27m4n3J8j07N1Q9j10K3j4J3J02p5q9O2M6o8J0j07J54J9n2O3o5l1l8R1
$$ -11 116 72 19 37 -70 -19 70 -40 -17 -31 -18 84 9 -80 -18 28 -40 -30 -137 17 36 -16 47 -18 -49 -87 4
5444Dm5k0Q1o4p3P7J24q6J21j54O9M0Krj32N0P5j02m2K3O8m2N0K0J1K7m3l6J54
$$ 4 -41 -61 20 -44 -117 -40 84 -2 119 -35 34 74 76 67 -65 -15 60 -42 -84 -61 7 -35 15 35 46 73 30 -6 148
5473A48p8r8m0K%N7O4K3j00P7q6k9Q0j1K1P0o6M8j19P8j23J06O6j17Q4J0k5j68
$$ 148 70 -28 -68 -66 -66 -9 55 78 -22 55 -31 -60 20 9 30 100 34 82 -37 41 -82 24 90 -27 57 67 42 -126
5501a26J07O4o5P3k3o1Q6l5N3r5Q7r3Q5j78J15j3j12J65Q1P3k30J32j71P0L9J5
$$ -126 -19 45 -20 53 30 -31 55 20 73 -22 65 -28 57 -121 -6 -19 -131 34 115 188 -42 90 -81 -11 28 43
5527D3r1P3jl9mR1k7J78p5r9m7P0l3Pq7J27j02J8N9j27O5j20J45q7Q5J48j70o7
$$ 43 -48 25 24 -15 -19 72 45 223 148 49 2 72 39 46 -41 86 -16 2 61 -66 -1 -121 24 -63 22 170 0 -67
5555f7J74n8k4j1KK6lj47R2J59j76k1l4P1K6K3j03m8K37k22K59m8p8N3ol6q6L5
$$ -67 107 49 25 14 16 42 39 -108 -16 143 -33 -54 -88 -17 9 32 -71 -119 118 -104 155 107 29 82 76 40 -46 -11
5583a1P0jP4q0k19J51n7J74j62K54j47k3j49L8L3P6K5Nj40R1m2K2j03J39l8j4
$$ -11 59 58 132 52 -167 -16 -73 101 -61 193 46 23 -126 -88 -55 21 46 51 -89 2 -40 -18 -121 18 -20 -34
5609c4M0O5j18qJ28K1r7q6J42o7m9kJ56j6j83K07J04j81o6J49o7l5L1J2L4j78
$$ -34 6 71 -47 -55 73 94 -3 -89 53 -14 -63 -65 91 75 -108 99 203 22 -44 105 38 3 34 46 80 -98
5635i8K08k1o0J04j56j2j8k6J85j24j6l5L7J4q2P8j6mP5j08J98p4J6J4l7j04J5
$$ -98 110 89 29 133 -23 -35 -53 -79 106 -18 -34 -69 -32 -18 -100 -22 -38 -42 33 -75 123 49 65 79 42 -62 -47
5662d7J11p4L0m8J6O3P7j77J5l2j46J93j12J00J62j02r4J19p2N7K4N7K1m8j25
$$ -47 64 -10 20 -28 -12 51 128 -49 -34 -66 -212 -19 -131 -31 131 29 -65 54 -18 39 63 120 141 93 -32
5687c2n2mK5L5K3j01J8K3J71j74%K2P1j35J06O0p1O3m4%O3j71J4P9J0O7j61R5
$$ -32 -84 -88 -63 -28 -5 -106 -88 -65 106 -68 -68 -46 25 -110 -4 56 -15 48 4 4 67 -104 -90 -11 -1 66 -95 0
5715@ON2J6j09J2MJ7r2J56k36L15k40Q2j4O3J37j24m8jj11J29m6NM2L5j42M7O7
$$ 0 6 58 74 -35 -23 -19 -2 -94 62 -174 141 -99 -17 -31 32 169 45 -3 -4 -115 14 -32 -27 15 50 -92 -45 22
5743B2m5N0o3J3mn5J64j74J4mkN7Pj2j26J55P3J1q4J3p1nJ5J27r5k0j6O7RqNp2
$$ 22 -23 27 -36 -23 -27 -82 82 -92 -78 -82 -84 -27 -20 -32 -158 -3 70 81 -3 10 -61 -66 -51 76 -19 -39 -55 12 21 13 18 -54
5775e4J20l7j34J27K5nn2K2J3m7m3R6J7j2n1m9K4L2N4r9J30j03K2rj3m8M3Ro0
$$ -54 66 29 -105 22 47 42 -10 12 25 -22 -65 31 48 36 -15 -64 -40 -8 46 -53 77 -26 -4 -13 -26 -74 -31 -22 -82
5804h2J09q8Q3n7R7m4k34L40m7j2l7%k14J45o1J38m8q6J25M2n5m0R4j68Q4M2P
$$ -82 27 -61 22 -35 62 18 -216 124 77 65 28 28 -186 -41 -102 36 -12 -98 27 69 14 -26 68 -100 -16 26 33
5831C3j6o9k1oQ5M5L6M6j93J30j16O1j7k3J0P8q3J73k14J15j08Qj9Q1k0m6L3P8
$$ 33 17 -52 -73 -79 6 51 87 133 -60 70 -46 15 -2 -25 -15 63 -20 153 -61 54 -54 -46 -65 16 -4 -50 -17 61
5859F1k2o5L2q4N0O5q4OpJ02L1o9O4r0M1q2KM7M2j23Q4k5j9P3r1P7K8p7NJ13J24
$$ 61 39 -26 6 -78 -28 37 -47 -41 -48 54 85 16 80 -10 31 -51 -49 -2 40 -83 1 -24 -43 30 -61 16 44 -33 -28 85 209
5890B09k81J72o8j10J13j85K66j39K7j8rJ38o0kj16J2l7J37q4L1k3M0l5m5J4%
$$ 209 -72 100 32 -78 35 -150 116 -23 4 -14 -23 115 55 53 -63 -51 -88 49 -35 -4 -27 13 -22 -67 -53 -53
5916e3J11j8j48P4K3j24R6qL5j9K5j03P8rK4J17q8Q2l1P7m6J6l2j85P6k5J14m0
$$ -53 58 40 -108 -34 -11 -135 -39 -47 -12 -31 -6 -109 -31 -40 -16 101 13 95 64 141 95 111 79 -106 -30 -55 59 19
5944A9mq7K3M0o6M6R4l4KK6q9jp3J90M2j21j01M1O1J20k41J42j47O6J37j37J8
$$ 19 15 -72 -49 -9 -75 -29 65 31 33 59 -30 -31 -104 86 128 7 -94 -53 8 128 -113 29 -118 -52 85 -52 -34
5971c4J3K6M0q7M3j6J6L1j7J20k60R4K7r7J12R5j24P9k8j27J77j41O2l4M0M4j27
$$ -34 -21 5 45 -42 1 -15 1 32 15 135 -125 -31 -4 -101 11 106 -18 61 33 -94 83 -58 4 -30 10 54 -73
5998g3O9J52k22R9M9p4l4M7M6l1l0L3k4L5k4j36J68j5j7M4m1j7L8j64Q8R8Lr0
$$ -73 -4 148 -74 25 74 0 -34 13 59 28 -2 31 7 42 18 -118 50 35 18 62 21 4 42 -122 -34 64 67 -23
6026b3o1J08N6j08Q8k2K0k11J04J9n2M6N9N0j47OK6K8m4N2q4J94l0nn9o5k2J14
$$ -23 -84 24 80 -28 60 38 58 -153 -49 -30 -82 -36 23 73 -74 -68 -42 -14 -58 -6 -90 104 74 69 10 -55 -77 37
6054C7n1m1K5o8q0K40qN3q7l8J78n0k03P6Rn2J36j40R4j13R7j0m3R2qr8J21n4
$$ 37 -14 -55 -30 -98 -178 62 54 107 20 -18 160 110 -93 -17 -8 -60 76 -64 30 -83 14 4 -39 53 45 -53 68 14
6082A4NM1j63Q7K4N1j78J25j23R0L1m0R9o2J24m2q3J38j82J27j48J2J07q2l2J26
$$ 14 19 60 -103 -16 8 59 -119 6 -117 -27 4 -36 63 1 125 83 0 138 -44 83 -65 -53 54 -28 -60 66
6108F6o7o4P2j22J94j13j1L4J34j76L5k5MJ09j55n5J26j5Q8M8p1RM3j58Q5o5O3
$$ 66 -1 -65 7 -115 79 -34 -45 -11 123 -53 -18 -43 -39 70 -85 -140 -14 -29 59 107 36 45 88 -70 15 -50 13
6135A3R8n7m1m7J41no0j03J65k50K84j37Jj14Q5Q7j74o7J48o2J48q8R6Mj73J90
$$ 13 111 54 13 -34 107 102 42 -61 104 -146 138 1 2 -112 -27 60 -114 -181 -33 -95 53 -35 61 65 -108 82
6161H2j42N8p2J13k0m8M4nk7L7j0P6j00j6N2j13J04kj28K02j14O5r8J60n9n0J3
$$ 82 -60 -2 -74 39 19 -29 15 10 -17 20 10 86 -14 -30 22 -91 13 11 -117 85 -29 36 -62 98 39 -11 2
6188BL4L6j63J99j71K2J5J04j06Q6j5n3n8M4J3q0P3j8P0j3Rq0Q9k9rj3k0N1o2
$$ 2 36 72 -91 108 -63 -41 -26 78 -28 58 43 -10 -68 -24 -11 -91 -18 -36 34 21 30 -50 39 10 1 -12 -32 19 -43
6217d3J57j57l3Q4M6n1p6J53j32PJ7n4J11o8j9J2M8n0n7K8J21K4m8o7J5O5Lo0
$$ -43 114 -43 -76 8 54 3 -73 80 -52 -45 -28 -82 29 -39 -58 -46 2 -48 -105 -77 44 68 20 -47 -32 33 36 -24
6245b4Q8j20J2L1m2O0j3PRl7J0j6P4j62J81m5m8m3O9K1o4m7J69l5j06l1MrO9l0
$$ -24 64 -56 -44 -13 -55 5 -8 -1 8 -29 -19 -35 39 -123 58 13 -35 -78 -9 12 -52 -99 70 35 -71 -102 -98 -107 -38 -68
6275f8nO9M9OOk9q4r5R8RN1P0mj00O5P4j08r5O7j5M9m4K4J47j78l4K04k22J08
$$ -68 -73 -4 45 51 57 28 -56 -151 -53 -44 7 77 73 -27 38 112 4 -91 -24 -39 10 -34 -10 137 -41 -75 129 -93 15
6304A5n0L5M2n7J29q9l6K6N8r5o1j0J46j30J00j27K18Q7l40J73Lkj22Q8k7n6R2
$$ 15 -35 0 42 -15 114 25 -11 15 73 -22 -83 -93 53 -77 23 -104 114 201 -139 34 37 35 -87 1 -26 -82 10
6331A0J50k83P5O6j7P3j58M1R2M3o6K6n3o8M1m1J03q6lO9O5j22j0P3k1l1k4K8
$$ 10 160 -123 -48 18 1 74 -84 -43 49 92 26 52 -1 -69 -28 -69 34 -52 -55 14 79 -43 -53 20 -1 -32 -56 -28
6359b8K51j61l16K78Q2q4j4M1l2o0P9p1k0L6R7j64JJ61j58M1P9j54R5PJ03j10
$$ -28 223 62 -254 24 106 22 8 49 17 -43 36 -35 -55 -19 78 -86 -85 76 -82 -41 38 -116 -21 -14 89 -21
6385b1l9L9J65k22J42j55J0N1J07n1p0O4Lk4P4k0o3M6Pm0M7l1J0k2j3N6q4O2n7
$$ -21 -60 -21 144 -78 64 -91 -81 -30 77 26 -44 20 23 -1 73 53 -10 36 43 3 50 19 29 7 -6 50 -34 28 -29
6414b9m6K5J7O4j56J87p7k8Q9K7o8p0J72j8o0r7J52O5n3m4k05J45L6j10R5M8k9
$$ -29 -75 -50 -33 31 -125 62 -15 -43 46 73 5 -65 107 89 29 -68 84 149 96 52 -153 -8 28 -82 13 61 32
6441C2J8q5J03q2N0N7r8R6p8j3P1j80KJ91j29J36Mj63k6O3J2P6k0j73J68j39R4
$$ 32 50 -35 68 -14 36 93 -5 91 13 0 71 -109 -107 84 -45 91 95 -68 -94 -31 -19 57 37 -136 32 -107 -13
6468a3J4n8M1Q7j9j03j2M7Ok3l3J0j2jJ59k16Q9N9L6j08L4Q0q1O4j14J29L3N3
$$ -13 1 -57 -16 71 52 -51 -63 -16 -10 -33 -66 -56 -68 -69 90 -126 -37 22 58 -50 -16 64 -17 47 -67 62 95 148
6496A48r2j71J61L0n3J60j96J00%j05p4Q1Rl1J30l0k5j58J38j80J73k4O3m9L1
$$ 148 56 -115 46 76 23 183 -13 87 87 -18 -92 -11 -2 -33 97 67 42 -116 22 -158 15 -9 54 5 36
6521C6j09Q7R3j21n1L09k82l5J8O4L0j67J87r9K18j15K4j75J0R6q3O8O1j35qR2
$$ 36 -73 14 107 -14 -65 244 -38 -73 -55 9 39 -128 59 -40 178 63 87 -88 -78 18 -65 3 64 -71 -79 13
6547A3k3J42j14M9r9N1m8J4M7L1r6P6o3J0p6J34k2O3n2j0LjL3O5r9q8rJ04QP1
$$ 13 -10 132 18 67 -32 19 -29 -15 32 63 -33 43 -20 -10 -86 48 26 89 37 27 30 29 62 127 28 -60 -69 35 43 114
6577A14q9o7K6o7Q4l5K6mJ8o7O9K3O0o2N5K4j95K5N1pL5p3l7J40n1K8R8j49P8
$$ 114 25 -42 -16 -83 1 -34 -8 -12 6 -61 8 31 91 29 84 108 -87 -62 -11 -18 17 -56 -93 47 -4 24 122 -27 51
6606E1j07M2l2R3j0k0m8K5Ln0Q9q1J1J4l5N1J2j23J41o6N2p4O6m7L5N6q1J7J08
$$ 51 -56 -14 -46 47 37 17 -31 -6 -3 -53 36 -45 -34 -20 -55 -4 8 -115 26 -40 12 -62 4 -43 -8 48 -33 -16 92
6635I2J2j57J23k17J77P8j1r8j56J38J23j11Ql1O3q6J02m5m5j8J39j8o0J24j35
$$ 92 104 -53 70 -147 30 108 97 -1 -157 -19 104 -7 1 -30 33 -53 49 4 -41 -59 80 62 2 126 -9
6660im3J75q8l0q1PM9O4n5m1j02R0l9J86o9k1r2J38l7KK3j1M8j17K2M8j9M2r3
$$ -9 -52 123 35 5 -76 -69 -20 44 -11 -52 -154 -64 -103 83 14 -7 -99 39 2 4 27 16 64 -53 -31 17 -2 40 -53
6689e3J16j08J57o4j0L7Op5P2r2L3j7l1Ml0P3l1L5l3n2K2J85j67m1lQ8n4Q1n5
$$ -53 63 -45 112 48 38 75 81 6 78 -14 19 2 -29 -25 -55 18 -13 22 -11 -63 -41 144 -23 -64 -67 21 -33 48 -7
6718gk0L9J8pj15K29k40j0L5J90p1j7pJ6n4p7J02K8j1o8P9n5l2P0J16p7k1l1m3
$$ -7 -27 12 30 23 -92 137 -103 -113 -78 112 41 24 17 33 -21 -98 4 32 21 -47 32 -23 -55 15 131 54 33 2 -41
6747d1L0O9n9Kj0J00j49J09o7K5L9j9k7M8r0J02o6ojJ71j93oK4K9O5j0j6j2J6
$$ -41 -11 58 -1 1 -9 91 -58 51 -16 9 48 29 2 50 -40 62 -4 -10 -11 160 -33 -39 -15 14 79 69 53 41 57
6776E7o6j27P1J20j3j4lj6l0Q3%o8n7r4R4R0q1K4Q1j48L4J17k1q0l2K23j42K3
$$ 57 -9 -136 -65 55 42 28 25 9 -21 62 62 -6 -63 -157 -63 27 -54 -30 51 -97 -63 54 33 -47 -79 144 2 25
6804B5m4J33p8r6K17j01r0M3j8M0q2Q8M2l0m0l9N9L7n1n9N7L4K1%m9o5J19j15
$$ 25 -19 114 36 -60 157 56 -34 9 -9 31 -51 37 79 49 9 -30 29 66 15 -44 13 47 68 68 19 -46 73 -42
6832d2J17o6r3N5P5K7p5M2r7M1J74q7k08Q6J04j39O0k6J1J93j75O8k9Q5m7m6M5
$$ -42 75 9 -84 -29 46 73 -2 40 -57 -16 158 71 -137 -51 53 -86 -26 -52 -41 152 -23 45 16 101 54 8 53
6859E3n8J09J1m3o0q%mm3j8O4J48l03N2J66j37J44q0L4q0o8J94j1j05J04m1o9
$$ 53 -5 104 115 72 12 4 4 0 -43 -61 3 151 -152 -100 66 -71 73 -7 27 -53 -121 73 62 -43 61 20 -49
6886d9K5j3P3o7O5n2M8q6j0Q1K9M7m6q9M4m7O3O9l9j04J42j79J66p3n9l8J93j80
$$ -49 -24 -37 36 -31 34 -18 30 -56 -66 15 44 91 45 -44 0 -47 16 85 46 -58 84 -95 71 -2 -61 -99 94 -86
6914h6K2R5n8J11j52J8J66j38M5M3j53J40o5P9r4J9j8J3j10J45j7M5k9qN8o8n3
$$ -86 -64 31 -27 84 -68 -50 116 -22 23 66 -87 53 -12 67 -27 -8 -26 -13 -123 22 5 50 21 13 71 3 -50
6941e0m8M9kl3k4J65m7l5K2o1Q5N6j04m5k7Q8NJ26k51J81K9r7M8m5M1n0K6%j55
$$ -50 -98 -49 -51 -84 -108 57 10 -25 -3 -64 21 77 -27 -72 -99 -11 -6 120 -131 50 79 -18 30 -15 26 -24 2 2 -153
6970a53J08k0J21J7k2j24K0Q4k8N5r7m9o1J92j25J19n8K1R3q5Q8o0m7o1P4m5j42
$$ -153 -45 -65 56 73 51 -73 -53 31 3 58 -39 -88 -149 43 -82 37 -21 0 93 8 96 36 -11 -72 2 -43 -185
6997a85J20J04m6n3P5N5j56J35K4l5l4J0k3j12J72n2j33J81kj21N6k9K2k6j11
$$ -185 -65 39 -7 -60 15 70 -86 49 73 38 4 14 -9 -121 51 -1 -134 47 45 -76 -20 -49 -27 -53 -164
7022a64K12q5j8o2O7J33p7J3P3n1M2q3j12K12k5o7L3o9l7m8J67j46N0J25j15L4
$$ -164 48 -37 -55 -117 -50 83 6 19 92 41 83 0 -112 100 75 8 41 -28 -65 -113 54 -92 -42 83 -32 2
7048BJ90r6L4j17j0N3jn4o3J20Mj33m1J22j20J32o4O2o6j1J10j3n5p8P7K6L5l2
$$ 2 192 96 130 13 3 56 55 1 -62 58 62 -71 -112 10 -110 22 -42 20 -46 -57 53 40 -15 -93 -16 10 45 13
7076A3l8j17J52N4j22J0O7O1k01J64n8n3k7J09O1J7m7j8p5j6N3pP7o5R5j27O0
$$ 13 -25 -142 10 64 -58 -48 19 80 -121 43 -15 -68 -95 14 75 92 45 27 -48 -64 -11 -18 59 -6 89 -38 22
7103B2L8J4m0j3LP8j64k9N2MJ69j09Qp2J29j04J4K2r2Q1pn0o7J24p8J93k7j43
$$ 22 60 74 34 21 24 102 -62 -91 -39 -35 134 25 33 -39 90 -14 0 22 -70 11 4 -46 -113 11 -67 126 99 -44
7131d4K6l0K5N7J50j75J58k41L6j15O0J8J30k9j48J62J50j94%m8rP9n8R0R2m1
$$ -44 -18 -48 -23 34 184 9 167 -74 -38 -153 -93 -75 55 26 -122 40 190 -4 -4 -52 -61 18 -40 50 142 101
7157A01j5o3m6J27j13j26J40No2P0m9o8k8j8J43j2k1RR2k5j7k1q2P3N5Q1k14R5
$$ 101 86 23 -23 104 -9 -135 5 10 -52 18 -31 -99 -127 -145 -2 -14 -35 -26 66 41 24 3 -79 -6 49 130 -84 11
7185A1j72J00N3q8J16j21J13%Q4j93jQ9M9q3K9O6ol2j0l8r4R7J07j36NJ22pk9
$$ 11 -161 -61 -8 -96 20 -101 12 12 96 -97 -98 -9 40 -43 -14 52 46 14 4 -34 -128 -31 76 -60 -55 67 60 31
7213C1m7P8L1L8q2j49L3O3m7o5J17J5j22k2O2Q1N9j69N4P0l9m1N2k8M1Q1k05O0
$$ 31 -16 62 93 131 49 -100 -67 -4 -51 -116 1 16 -106 -128 -66 15 74 -95 -41 29 -10 -51 1 -27 14 95 -110 -50
7241e0k8P5O6rm4Q6n7q2o3R8o5O4Q2j14Q4o2q8J62l8r3J38j12L1K6p9O3j8J33
$$ -50 -78 -3 63 54 10 96 39 -43 -106 -8 -73 -9 73 -41 43 -19 -107 55 17 -76 62 -50 -19 7 -72 -9 -27 106
7269A06q1N6j95J40r4M0O3K7n8m5J23p3j3K4L6k8l6l8k6J21p6M4m2Q4L5q6j3P
$$ 106 25 81 -114 26 -68 -28 35 62 4 -41 82 9 -4 20 56 28 -8 -46 -72 49 -27 17 -25 59 94 8 -5 2
7297BK0K1n4L2J0n0k4J2P9M5r0P3p1J04j48N0K0M6k06N2M1mL9p6J90k71K20l1
$$ 2 22 43 -11 21 31 -19 -43 -31 48 93 3 76 5 109 -39 11 31 77 -129 -77 -36 -40 -1 -77 113 -158 62 31
7325C1k0J2K9m4q4O2K8r4PP8k2J60j75N7oR5q1m0O5k46K7K34L2j83J15m6o2j37
$$ 31 11 23 52 8 -76 -14 14 -80 -73 5 -17 143 -32 25 19 114 33 -7 58 -188 -161 73 105 -78 37 -9 -71 -208
7353b08J46L6O1o6M4L8q6N5L8n2M1r8M5J4o1O9J45k37J05qk8L4k3m4KPp3J37q4
$$ -208 -62 -26 35 -31 13 51 -35 20 58 6 47 -51 -6 8 -53 16 161 -76 29 21 -7 27 4 -40 -38 -31 -104 33 -51
7382e1RP7j69J30P3j00K5M9j0J7j2r8J59o2q1R8j09J10k7J18j18j7Q5m3l3Q0j58
$$ -51 -42 35 -134 -4 69 -31 -6 43 33 50 38 -60 99 37 -44 54 -55 55 28 146 28 11 96 53 20 100 -58
7409e8Q7r3P5m6J1lR1j47J42j09k0J80Rj02j31J08k9P3j12J58j12Nj02L6J51k3
$$ -58 29 -64 11 -35 -24 -27 64 -83 59 -50 -70 110 119 17 -114 -6 -35 38 -74 84 -28 -23 -125 -89 62 39
7435C9r3O1q5L6N9K8j44K36j56N1j58pN8J07q3l5R7p1r8O1J32o5O6l7O5k1l9l9
$$ 39 -54 7 -78 -42 17 45 -99 137 -19 32 -126 -133 -75 32 -51 -86 11 -60 -158 -97 35 -30 36 -1 64 43 4 -35
7463c5J61l6j06M9K5M3j50P0L8j1n6L8o9R7K0l6m3K9oj7P7j24p7P6K0L2R8j36
$$ -35 126 90 -16 33 58 101 -49 21 59 48 -8 30 -39 58 78 42 -1 28 22 5 82 -42 -119 -43 -23 9 107 -29
7491b9j4M7%J2l7R2m6k0j6k2qJ32r7o6O7J8M0J9l5n8J32j13r6J09j7M0J7j8N9
$$ -29 -43 4 4 16 -21 71 25 5 -11 -33 -41 91 -6 -72 -5 13 53 72 37 -21 111 -2 -98 11 -6 34 51 33 92
7520I2j41P2R9r9O8L0j07Q5j45R9p7m8N6O2n6Q3N5k09J04n6o7K02j36m3K7K61
$$ 92 -49 23 122 23 91 121 14 99 -46 53 -24 -72 -16 46 -10 73 128 -81 23 -33 -100 102 -34 -77 -50 211
7546B11k30j9J01o8l8J26m4L3n0Ko2L0k1K6L5j31N3O0o3J07j16J40n3nL2j64J37
$$ 211 -19 -38 63 -5 -43 83 39 72 22 24 -38 -8 -29 -3 32 -99 -46 14 -49 58 -58 82 29 24 56 -108 29
7573B9Jon3O1L5j24J66n5O0J0l0q0k1O1j20k2P0N6j89J46%l1L4Q3j64M7o0O7m
$$ 29 30 24 -29 32 67 -57 109 54 114 124 94 14 -7 54 -66 -88 -18 38 -151 -5 -5 -36 -2 81 -83 -36 -96 -29 -33
7602c3J62j60L1n7J43l5j41J61m2r0m3P1j7kO8K%n1lM2L0j89QJ19Q4n1j3P7j80
$$ -33 129 -31 0 -57 86 51 -90 71 29 -61 -104 -33 -50 -52 16 18 18 -33 -36 6 36 -153 -145 -26 58 7 -6 71 -109
7631a09J28M3N1j15L5j31J11Q9j40o4QP9j2J25L2j78MJ1K0N2k6qo3Q4M0o3M6p3
$$ -109 19 62 113 -2 33 -98 13 102 -38 -102 -94 -15 -27 98 130 -48 -44 -33 -13 39 13 5 -58 26 66 3 49 -24
7659b4J9M8K7l3jk5pp9P9rqK10q8j5o2j3P2k49Q0J01O2j78K8N2k7J00m4O0j74
$$ -24 -5 43 70 37 36 11 4 -75 4 -5 -13 197 109 94 32 19 91 -158 -78 23 85 -93 -65 -13 -40 60 16 76 -98
7688i8J14j48J55k0n8K3p1J79j04J1R6o9m0Po1m8R1P3m7O0k7LNR7p2l4l5n4QN0
$$ -98 16 -132 23 3 -55 -32 -103 76 -28 -17 79 10 -30 -23 -84 -132 -41 32 -15 45 18 21 26 123 51 17 -18 -72 -64 -14
7718a4Q1j59J21q8nN6O1q0J01Oj13Rm9J29k4l1j49K70qk52J54j20J82j28J03m8
$$ -14 67 -92 29 -59 -64 -8 53 -27 74 80 -33 -24 -73 56 32 1 -148 122 114 -138 16 -104 78 -50 53 5
7744Ep8R0j56J41mJ2l3k9p5R9J92k05N3k7k7p2J24p6N8R7j12Mo2K29r0k1m1Jj3
$$ 5 -73 17 -139 2 -2 10 -23 -52 -127 -28 164 -41 12 -15 -42 -114 10 -66 -8 89 -23 -19 -81 148 58 37 -4 -3 -16
7773a6J2r6O8J38j62O1K7j52K19k7n9j11RJ07p2M3P1j3m3J2N7j43j9J40q0J0M3
$$ -16 -4 -100 -32 106 -56 5 32 -120 99 72 13 -98 -89 18 -54 -11 60 47 4 16 73 -70 -89 51 -29 -19 24
7800B4j15J59p2k4n8N2O7j06O6k0M7k2L4Mo9J43o0j8j28J21qp3PKO1mp6J21m1
$$ 24 -91 68 -4 -28 -86 -34 33 -73 -7 -27 20 -2 32 36 -33 110 50 32 -96 25 17 -56 -49 -47 14 10 -66 55 14
7829A4j17J78r0J64j62m4J59j69L2pO0m1m0J36r2PJ10m3j14J43j1j71K6J06j09
$$ 14 -103 75 -15 149 -13 -57 102 -67 -35 -42 18 -23 -63 73 -19 -12 98 55 -59 84 73 -98 -72 34 -75
7854g5J3Q8o4J04m8j54J29J67j26m5K1L5p7j03J36M3L7r6p0N6J3N0j14J50l0L2
$$ -75 -62 26 -38 66 18 -136 -7 160 34 -11 10 45 -32 -135 1 44 81 -15 -85 -29 -16 34 -80 70 40 72
7880G2q0%KJ06j96P9M6j75J44J8q2k0J49j31Q7m2o6JJ50m4j27JP4n6L9k3J23k
$$ 72 -8 -8 -6 100 -96 -17 29 -146 -2 16 -66 -86 63 -68 19 -23 -89 -88 62 18 -109 -108 -34 -90 -51 -74 49 47
7908D7Pr3r2J46p3Q3o3L3Np1J13P5l2rj15K09j66R8q0l3O0j1K6k04Q6J26j1k05
$$ 47 54 -39 -131 15 -58 25 -38 -5 0 -71 42 117 85 76 -39 170 4 102 22 -11 49 38 64 -140 -54 72 61 -144
7936a44R7P0l2J4OK6P0k30J56j56J70m5rm0J22j38%O5K9p9R9j32O1J09k57N1Q8
$$ -144 -47 23 -9 5 11 37 107 -123 33 -123 47 2 -7 -47 75 -63 -63 2 31 -48 51 -81 -20 89 -168 -117 -29
7963b9K0Q5j07LJ98k00K7k8J2J15j89P8QQ1r3J01j2m7J02j40n5Q3mn0N6M5k9r8
$$ -29 -9 76 -31 -28 170 -30 -3 -31 -19 96 -93 -15 -7 74 -19 82 70 23 125 -15 -70 13 9 -41 15 60 31 -67
7991f7O7m5r9L3K20k53P5RJ5L5Jk7Q6r2k9J8%J11k9j6m5j5J8J55j07j37P1J18
$$ -67 0 -45 -144 -111 109 -144 -69 -60 -45 -10 -9 -36 50 -42 -71 -53 -53 58 29 13 -32 -47 -29 126 19 -118 -47 71
8019G1j76J42p2Q4r0K8r3J73j73K9P2k1K1pK1J9K6j81J64o9J05O0l9m2Lq3Q2j20
$$ 71 -105 37 -35 49 -41 -13 -106 67 -106 -77 -5 -26 -5 -12 9 28 54 -127 37 -32 73 133 94 52 55 -28 54 -66
8047f6Q3j6m3K2Qq8Q8J17j14oKMJ15k04N5R3k55J02Q7K6n2M2rl1k0J70j62oK04
$$ -66 17 1 -42 -20 -12 -100 -12 105 -9 -15 -13 -9 106 -98 -43 50 -205 -103 -16 10 -42 0 -9 -40 -60 110 -52 -58 146
8076A46k41J15J9j20M5L8j08P8n4O2N7p9M4L8K5j19J01k0k0R4j43L7L1Or6M7j51
$$ 146 -95 20 39 -81 -36 2 -106 -28 -82 -20 37 -42 2 40 65 -54 47 27 7 101 -42 -5 26 32 -64 -17 -168
8103a68J13K17r1k90K15J14k16P7M9QN5j73J16j04M0J00j29J31j37O1L5K7mQn5
$$ -168 -55 162 71 -219 -4 110 -106 -29 20 28 83 -90 26 -78 -38 62 -67 64 -73 -12 23 50 46 54 -1
8128aj4J13j12N2m4J10j50J5J0O6j24O8O6j87J70k01J04N6p4P3j7L2n1Pm2K54
$$ -1 -15 98 -14 38 -6 104 -46 -31 -21 45 -79 -11 55 -132 38 -163 -59 -3 -77 -4 -21 11 -40 -33 -75 179
8154A79k63J24r6J57m9j4j9l0J4L1j01R5Ro8L6j46P7L8J06o0p9O0N7J6l6rn5J34
$$ 179 -84 40 -56 101 52 38 19 -11 3 34 -67 28 37 -31 5 -141 -64 -26 80 20 -59 1 58 74 38 29 -26 108
8182A08p7l4k0O8j00J14N4j4j37
$$ 108 31 -3 -23 45 -55 59 113 99 -38
8191c8
$$ Imaginary data points
##PAGE= N=2
##DATA TABLE= (X++(I..I)), XYDATA
0@%%%%%%%%%%%%%%%%%%%l2O4o4O4o4O4o9J01j28J28j60J92j92K24k56K88l35L67
$$ 0 0 0 0 0 0 0 0 0 0 0 0 0 0 0 0 0 0 0 0 -32 32 -32 32 -32 32 -37 64 -64 64 -96 96 -96 128 -128 160 -175 192
37A92m16M78n33N86o49P21p95Q73r65J070j178J295j429J575j738J918k115K336
$$ 192 -224 254 -279 307 -342 379 -416 457 -508 562 -616 679 -750 825 -913 1005 -1110 1226
55A226k584K866l189L566m014M548n199O017p082Q540j0656J3999k0162L5276
$$ 1226 -1358 1508 -1681 1885 -2129 2419 -2780 3237 -3845 4695 -5961 8038 -12124 23152
69B3152j38204k59807J17325J18545M7559L1882J53304J31767K531r0884m6561
$$ 23152 -115052 -374859 -257534 -138989 -91430 -59548 93756 225523 228054 137170 90609
80I0609m0559r6119j18980k7402M3364M5965M5182J03367J10119K2889o3173m4734
$$ 90609 50050 -46069 -165049 -192451 -149087 -103122 -57940 45427 155546 178435 115262 70528
92G0528j1903n3801j12763o8014L1883O9115L8002M2970Q3155O7266k0726p3991
$$ 70528 58625 4824 -107939 -175953 -144070 -74955 -36953 6017 89172 156438 135712 61721
104F1721n0028k3244m5730n3904l327M9752M3254J9462L5822N8997K5197l7943
$$ 61721 11693 -11551 -57281 -111185 -114512 -64760 -21506 -2044 33778 92775 117972 80029
116H0029n7461l2860k4592l8136k4417K1982M6813L3352K2848L3436K7029j2693
$$ 80029 22568 -10292 -34884 -73020 -97437 -75455 -28642 4710 27558 60994 88023 75330
128G5330m4235l6964k1064k5353k4641P682M2151L8068J3280R453K0617Q846k3574
$$ 75330 31095 -5869 -26933 -52286 -76927 -69245 -27094 10974 24254 33707 54324 63170 39596
141C9596l7787k3321j1416j4745r468J5476L3821K7708J3365R499N662j1344k7246
$$ 39596 1809 -21512 -32928 -47673 -57141 -41665 -7844 19864 33229 42728 48390 37046 9800
154I800k4871j2808q377o968O228K3819K6582J3749M620L335l019j6833k3041
$$ 9800 -15071 -27879 -36256 -43224 -36996 -13177 13405 27154 31774 35109 32090 15257 -7784
167g784j4878m641k240O38J0866J9939J7023P740J857j594r514j7639j6626p566
$$ -7784 -22662 -27303 -29543 -28905 -18039 1900 18923 26663 28520 26926 17412 -227 -16853 -24419
181b4419o43K239O767J3741J4956Q554J664j992n519j1048j3800r448k190K173
$$ -24419 -25062 -22823 -16056 -2315 12641 21195 22859 20867 15348 4300 -9500 -18948 -21138 -18965
195a8965N185Q963J1688Q903L092j429m217p508j0268r015m064Q86M237P024Q878
$$ -18965 -13780 -4817 6871 15774 18866 17437 13220 5712 -4556 -13571 -17635 -16749 -12512 -5488 3390
210C390Q003M230m15l597o017p421p435m358n02K808N407P010O733M302Q59k479
$$ 3390 11393 15623 15208 11611 5594 -1827 -9262 -13620 -14122 -11314 -5907 1103 7836 12138 12997 10518
226A0518m786o269n860l966j199J558M017N697N483L861J402j180l380n134n187
$$ 10518 5732 -537 -6397 -10363 -11562 -10004 -5987 -290 5193 9054 10456 9276 5896 762 -4425
241d425l637j168Q44K717M262M891L497J373m89k202l920m512l342j403M24J887
$$ -4425 -8062 -9230 -8386 -5669 -1407 3484 6981 8354 7865 5663 1743 -2769 -6111 -7514 -7090 -5203
257e203L222M183L166J408m90j427k636l529l374j778N11J529K104L016L212J611
$$ -5203 -1981 2202 5368 6776 6286 4859 2223 -1306 -4680 -6458 -5947 -4418 -2314 702 3914 5525
273E525J62j463k071k689k765j816m1J247J890K160K562J830K52j085j612k135
$$ 5525 5687 4224 2153 -536 -3301 -5117 -5158 -3911 -2021 139 2701 4531 4783 3698 2086 -49
289d9k241j656m75J019J578J702J789J731P66p86j458j667j722j487o51M87J256
$$ -49 -2290 -3946 -4421 -3402 -1824 -122 1667 3398 4164 3378 1920 253 -1469 -2956 -3607 -3120 -1864
306a864J594J481J324P72l74j201j455j240j214p73J42R74J364J318J042O91J9
$$ -1864 -270 1211 2535 3307 2933 1732 277 -963 -2177 -2950 -2808 -1834 -470 848 1890 2581 2600
323B600r02j162j382q98n71j29Q13J172J110P98O56J36o20j097j036q98m37n5
$$ 2600 1698 536 -846 -1744 -2315 -2444 -1631 -459 651 1449 2105 2241 1621 524 -512 -1410 -1847 -1902
341a902M24P78J165Q30N01J01m41p03r51r44l88j02L16O51Q51P66M47R1k18n52
$$ -1902 -1478 -700 465 1295 1796 1897 1456 753 -198 -1142 -1530 -1632 -1316 -665 186 952 1399 1490 1272 720
361G20q68p55l68m8Q3N33O46O65N77J69k25n62n79n92n02j23J13N47M50O36L95
$$ 720 -148 -903 -1271 -1319 -1236 -703 -57 608 1185 1354 1129 567 -12 -604 -1106 -1229 -1116 -569 -119 517 912
382I12J77M8m53o68n06l75k22O5M91L64N84L20K93rm97l47m48m31k13J26J79M08
$$ 912 1089 1137 684 16 -490 -865 -1087 -1022 -531 -167 417 737 1030 1021 524 177 -271 -702 -915 -789 -610 -202
404b02M57M74P7j6l27l43l01l70j95L0R9L14N14L10J23np1l83k69l56l17QJ18
$$ -202 255 729 806 790 463 120 -181 -551 -746 -716 -617 -303 211 521 644 639 568 185 -84 -440 -757 -749 -631
427f31K82M96K40R4J48j4l52l85j91l20J02J68J12L33L25J70Oj41j17l25k50l06
$$ -631 -349 147 387 481 629 615 263 -122 -313 -633 -531 -363 -251 82 407 577 583 442 325 0 -250 -556
449e56k9J43J88J55L71J34J89k19j68k00j67k98J09P5n9K21J65L22O2O3l42r0
$$ -556 -585 -442 -254 -99 272 406 595 376 208 8 -159 -457 -348 -273 -332 -111 54 376 438 501 159 69
471F9k09j47p9L0Q9J22J54J98J80n9o8j93l40N1j29l8J62Q7J52K05J5m8j2p3k44
$$ 69 -140 -287 -366 -336 -247 -125 29 227 407 348 280 87 -253 -202 -331 -369 -207 -120 32 237 252 204 192 119 -125
496a25j07j32J66jJ79J12O1J29pj07m5j18k11K2j88J57M1J87L1K2K07j65l0O2
$$ -125 -232 -364 -198 -199 -20 92 153 282 275 168 123 5 -206 -184 -372 -215 -174 13 44 66 273 108 78 140
520A40l84R1lj32J65P0K80k20K74j52j9m7j64M8j12N1L0Q4JO1K8L1j6j5j44m4
$$ 140 -244 -153 -156 -288 -123 -53 227 7 281 129 110 63 -101 -53 -165 -114 -84 0 1 62 90 121 105 90 -54 -98
546i8Lm1O9J41N2J25l5j41N5j93P4r7Q4q2m2mK39jN5j59M5n5J9k3j71J3q4J62
$$ -98 -95 -136 -67 74 126 251 216 75 130 -63 11 -86 -2 -84 -126 -130 109 108 163 4 49 -6 13 -10 -181 -168 -252 -90
574i0J74jK3r9L7K2k36K2N7Kr0R9P5JJ17j10J44j39rj2j97Q6N9N8QN3Q4R8k06
$$ -90 84 83 106 7 44 66 -170 -148 -91 -89 -179 -80 -5 -4 113 3 147 8 -1 -13 -210 -124 -65 -7 1 54 138 236 30
603C0Q8j68K4r1P3qJ17j05RJ23j43J27n5P0j88j0O9j16M3J13q0R6J15j10J19n7
$$ 30 118 -50 -26 -117 -44 -52 65 -40 -31 92 -51 76 21 91 -97 -107 -38 -154 -111 2 -78 18 133 23 142 85
629H5k03K09j46L1q7L8O6j6N1n4J21m1o4j07L1L7P1m7Q0q6l2L6J18q2m2j2m8J48
$$ 85 -118 91 -55 -24 -111 -73 -7 -23 28 -26 95 54 -10 -117 -86 -49 22 -25 55 -31 -63 -27 91 9 -33 -45 -93 55
657E5o9n9%K2M3J49j03p2N1Kn3j9N0j2L3j53N3O8q0J47j05J10q1q5N3N1P7l7j34
$$ 55 -14 -73 -73 -51 -8 141 38 -34 17 19 -34 -53 -3 -15 18 -135 -82 -14 -94 53 -52 58 -23 -108 -55 -4 73 36 -98
686i8J68K5j17lp1j03J67m3LQ8J08r0J3j9K1q5P3n6J00j23qJ61n7Mk08J89P7k9
$$ -98 70 95 -22 -25 -96 -199 -32 -75 -72 16 124 34 47 28 49 -36 37 -19 81 -42 -50 111 54 58 -150 39 116 87
714H7q9N2k9n6l2J9L6K0J02l4k21J39rq3j3m8PJ62NJ55k30N9n9q6J97l6k2q5J70
$$ 87 -2 50 21 -35 -67 -48 -12 8 110 76 -145 -6 -15 -98 -111 -159 -152 10 15 170 -60 -1 -60 -146 51 15 -7 -92 78
743G8j13l7Q7l1O4n9P0L5j08o4N1l1J84l1j29N8M5n2q7J01o8pJ47r8r3J23Oj18
$$ 78 -35 -72 15 -16 48 -11 59 94 -14 -78 -27 -58 126 95 -34 24 69 17 -70 31 -37 -44 103 5 -88 35 41 -77
771g7J17j34J28j57O4R1n4L3N5o4n1P7L7j77J18n2J32q4M6n4O6K8j04LM7J7m3
$$ -77 40 -94 34 -123 -59 32 -22 11 66 2 -49 28 65 -112 6 -46 86 2 48 -6 60 88 -16 -13 34 51 8
798Hp8N8Q2o3J2pRO9l5K2j21rL5J94j60j35K4J41m7J6N5k46J09P8q4J9j5J7N8
$$ 8 -70 -12 70 7 19 12 21 90 55 77 -44 -53 -18 176 16 -119 -95 46 -1 15 70 -176 -67 11 -73 -54 -69 -52 6
827Fr5J3J21o8N5o5Q1o9R5j09j4M1j08J68o3N6j47J28l8K1N8k09J07J9K7m3Oj5
$$ 6 -89 -76 45 -23 32 -33 48 -21 74 -35 -49 -8 -116 52 -11 45 -102 26 -12 9 67 -142 -35 -16 11 -32 -26 -41
855d1J54j47N9k2j29O6M7J52j26L6j0K3j02K6j5l3r4J12J7k4J4M9p2J09m2r8J35
$$ -41 113 -34 25 3 -126 -60 -13 139 13 49 39 62 -40 -14 -29 -62 -156 -44 -27 -51 -37 12 -60 49 7 -91 44
882D4j61k6Q8K3q5J11J22j12J06n8nn0j08J46p9J02j02J7rJ19K7q1j73O5J38r5
$$ 44 -117 -143 -55 -32 -117 -6 116 4 110 52 47 -3 -111 35 -44 58 -44 -27 -36 83 110 29 -144 -79 59 -36
908c6r2J22m5N1Q0N5n4k35P8R4m9R9j12p7R4J20j11M3k4n3J43l5J0N4j89%Qj3
$$ -36 -128 -6 -51 0 80 135 81 -154 -76 18 -31 68 -44 -121 -27 93 -18 25 1 -52 91 56 66 120 -69 -69 -61 -74
936g4J66j80KK33q4p0j01qP7RJ46k02K03k54J62rM3j14Q5j51N8r1J64J6k2p7J05
$$ -74 92 -88 -86 147 63 -7 -108 -116 -39 -30 116 -86 117 -137 25 16 59 -55 30 -121 -63 -154 10 26 4 -73 32
963C2l0M6j3oj0k8J75j11j37k8LJ71k8L9k36O4J32j12L8l9o1l9J72k8l4r7J78
$$ 32 2 48 35 29 19 -9 166 55 -82 -110 -107 64 36 75 -161 -97 35 -77 -39 -78 -139 -178 -6 -34 -68 -165 13
990A3l3mo5N5J4j2l6M1J08J2n2q8J45j48J8n0ml5J17J01k0Rj32J43p6o1N9lr1
$$ 13 -20 -24 -89 -34 -20 -32 -68 -27 81 93 41 -47 98 -50 -32 -82 -86 -121 -4 97 77 86 -46 97 21 -40 19 16 -75
1019g5J23r2J32j26J06j64l0J45O6J2j15j17J87p7L7J80p1j28M2J46k45J06j80
$$ -75 48 -44 88 -38 68 -96 -126 19 85 97 -18 -135 52 -25 12 192 121 -7 35 181 -64 42 -138
1042a38K6J06lr1K34k40J40Km0k2K8k4L5K8p0J43j32J15j44O0j1l3J26ql5j28
$$ -138 -112 -6 -9 -100 134 -106 34 36 -4 -26 2 -22 13 41 -29 114 -18 97 -47 13 2 -31 95 87 52 -76
1068g6k8J41p2J54j50L0J06q7J4m7qk6l6OJ00J4r6N4L2o1qO4m0r9J18Q2k7q9o
$$ -76 -104 37 -35 119 -31 -1 105 18 32 -15 -23 -49 -85 -79 21 35 -61 -7 25 -36 -44 20 -20 -119 -1 81 54 -35 -41
1097d1M4R6k2j33j5j00R8M6MK8k2J00o7J20N6l01Q1j8Q1K2r1k2J09j16M8O7p0
$$ -41 3 99 77 -56 -71 -171 -73 -27 -23 5 -17 83 16 136 192 -109 -28 -46 35 57 -34 -56 53 -63 -15 52 -18
1124a8o8mJ15k7j47J60k7j0J6K2N5j89K16k01m8J02O1l9nk12K00P1L0rp8l0L7
$$ -18 -86 -90 25 -2 -149 11 -16 -26 -10 12 67 -122 94 -107 -155 -53 8 -31 -36 -248 -48 23 53 44 -34 -64 -27
1151b7L6%K7J4Q4j08L3j04K6j3J19o0K0L1p0j08K3J82j33r9K20j6j03O9K2j80
$$ -27 9 9 36 50 134 26 59 -45 -19 -32 87 27 47 78 8 -100 -77 105 -28 -127 93 77 -26 43 65 -115
1177a15Q3N5o1J2J0J4o3J36m5M5j03q6M8J62k00R3N0n3j24N8Kp9Q4J17l9L2m6
$$ -115 -32 23 -38 -26 -16 -2 -65 71 26 71 -32 -118 -70 92 -108 -15 35 -18 -142 -84 -82 -161 -77 40 1 33 -13
1204a3J11L5p4J7J8q9p5M8m4R8r2PJ09j29J08J5p7N5K7M5n7J1o1M7L3j12K5k3
$$ -13 98 133 59 76 94 5 -70 -22 -66 32 -60 -53 56 -73 35 50 -27 28 55 100 43 54 -7 40 73 -39 -14 -37
1232c7nJ23j88K33j89J23l5l4k4JJ26j40O2q7o5J04L0K8p7J95l6j06QL9Kj20R6
$$ -37 -42 81 -107 126 -63 60 25 -9 -33 -32 94 -46 16 -71 -136 -32 -2 26 -51 144 108 2 10 49 51 -69 27
1259B7n0Q7j75J21R4o7j8M4N6j29ko6O3R2j03j03J58p2L8j0J4J35j59P3l9n0Q5
$$ 27 -23 64 -111 10 104 37 19 63 119 -10 -12 -78 -15 77 -26 -129 29 -43 -5 -15 -1 134 -25 48 9 -41 44
1286D4j53J05J3k0J2n1L0RRo4J37r7J3n2K0L3N4K3M7m1k2r6m0R1O0j06qK7P3N
$$ 44 -109 -4 9 -11 1 -50 -20 -11 -2 -66 71 -26 -13 -65 -45 -12 42 65 112 71 49 -47 -87 4 64 -42 -50 -23 50 55
1316E5j44M5J52j83J07J2p8p2M6M1P6o1p7O6l5R2J8q1q4K3J51p3q6R3J3L7l8m9
$$ 55 -89 -44 108 -75 32 44 -34 -106 -60 -19 57 -4 -81 -15 -50 42 60 -21 -105 -82 69 -4 -90 3 16 53 15 -34
1344c4Q6O9k29J38n7pKJ4Q0Km7r1P1L1M8n7R5j79J47M8j90K5n6J26p8%l0J3M8
$$ -34 52 121 -108 30 -27 -34 -32 -18 62 64 17 -74 -3 28 76 19 114 -65 82 130 -60 -35 -91 35 -43 -43 -73 -60 -12
1373a2M5o7R5k09R6l5J02l2N9m5m3J75K1j20k1N5k0o7J6j51P0m9L0K15k0j41K0
$$ -12 33 -34 61 -148 -52 -87 15 -17 42 -3 -46 129 150 30 9 64 44 -23 -7 -158 -88 -137 -107 108 88 -53 -33
1400c3J08N8j3n4l3n2N5r2N9rjj77J99n8l4J20K6j86K26k00M4J83j46LR7k9k00
$$ -33 75 133 120 66 33 -19 36 -56 3 -6 -7 -184 15 -43 -77 43 69 -117 109 -91 -47 136 -10 -7 90 61 -139
1427a39J96j21O4l9Ojn1J21j13lM4R4n8K8p7J19j11N8r6J36l4j8l4O8k4j2K1K8
$$ -139 57 -64 0 -39 -33 -34 -85 36 -77 -80 -36 58 0 28 -49 70 -41 17 -79 57 23 5 -29 39 15 3 24 52
1455E2j48K2J22P8j50J17j65j5J59k02P4K84k58J14j39K6J49j26J4j12P9k6l3
$$ 52 -96 -74 48 126 -24 93 -72 -87 72 -130 -56 228 -30 84 -55 -29 120 -6 8 -104 -25 -51 -84
1478h4R3j44N5J23p1l6N7m5P2kK3m2K8M5l4r7m4M1L3O0k7qR1j30o8P5JQ5j51Q
$$ -84 9 -135 -80 43 -28 -64 -7 -52 20 18 41 -1 27 72 38 -59 -103 -62 -29 31 4 -4 87 -43 -111 -36 -35 50 -101 -93
1508i3J43p0J42J1j19j27O6J61k11K10j00j55J10R8j25R3O6j29J12n8Jr2J06l5
$$ -93 50 -20 122 133 14 -113 -47 114 -97 113 13 -142 -32 66 -59 34 100 -29 83 25 26 -66 40 5
1532EQl4J9K0N5J1j49O8Q5j00n9q6J62Q2P5j16r2J16j94J74p2l9J00pO1p7J8j3
$$ 5 13 -21 -2 18 73 84 -65 3 88 -12 -71 -157 5 87 162 46 -46 70 -124 50 -22 -61 39 32 93 16 34 21
1560B1j83J02N2J11o4j16J7O3k8O1j15J03O9L4j23o6Q7l6m1m1l1J12M6R6j9m2
$$ 21 -162 -60 -8 103 39 -77 -60 3 -25 36 -79 24 93 127 4 -62 25 -11 -52 -93 -124 -12 34 130 111 69
1586F9q0J02m9K9j30J65j09R6j29NJNm6kj0l3M2o3P2M3m6L7R9j32J22q9L4k83
$$ 69 -11 91 42 71 -59 106 -3 93 -36 -31 -30 -25 -71 -73 -83 -116 -74 -137 -65 -22 -68 -31 68 -64 58 -31 3 -280
1614b80K97o6R9j19K28j76n6K17j98J56m7N7j15L6p1J08j7j33N6PR6j4N6j87J48
$$ -280 17 -49 50 -69 159 -17 -73 144 -54 102 55 112 -3 33 -38 70 53 -80 -24 -17 79 65 121 -66 82
1639H2l5j12PR6oK5m8j42J18P5j86R0oJ79k88J01K14l45K18j9Q9p0j6J0J3m5J11
$$ 82 47 -65 -58 38 32 57 9 -133 -15 60 -126 -36 -42 137 -151 -50 164 -181 37 18 107 37 21 31 44 -1 110
1666A10o4r4J93j71O0r4O2N8P4j09r1Q3o6N5l1kP3r9J4j5J21r3o1O3J06k67R5
$$ 110 46 -48 145 -26 34 -60 2 60 134 25 -66 17 -49 6 -25 -27 46 -53 -39 -54 67 -26 -87 -24 82 -185 -90
1693i0k2J82pk09K04j28J01KN9j14J06o9j07L4L0p9O4n7J86j99M9K13j81J80j17
$$ -90 -112 70 63 -146 58 -70 31 33 92 -22 84 15 -92 -58 -28 -107 -43 -100 86 -113 -64 149 -32 148 31
1718C1n9nj9J15R4k81J11K5J8m4l6J17j09J96r5o0k7M0j2k4P8p6N3m5j2J9N9k26
$$ 31 -28 -33 -52 63 157 -124 -13 12 30 -14 -50 67 -42 154 59 -1 -28 12 0 -24 54 -22 31 -14 -26 -7 52 -174
1746a74J91N7j52O7M3m6M6q8Nlj38J22O2%J9N3m8L2o9N3j0M1r8J15p1l1J23j23
$$ -174 17 74 -78 -11 32 -14 32 -56 -51 -54 -192 -70 -8 -8 11 64 16 48 -21 32 22 63 -35 80 9 -22 101 -22
1774b2J40m5l0K9Mo1O3q3P9j49m1L00k32j8P7J00j05j14P5J01Kj19R7j4N8po7
$$ -22 118 73 43 72 76 15 78 -5 74 -75 -116 184 -48 -66 11 111 6 -108 -33 68 70 -49 48 34 92 85 18
1801A8n5J0k08K03k8R8k6l7J10j73J04j27J52r5J44j94J21P0k6m5m1k8M1J17m0
$$ 18 -37 -27 -235 -32 -60 38 12 -25 85 -88 16 -111 41 -54 90 -104 17 87 61 16 -25 -53 -12 105 65
1826F5l2l4k1J13k3o4l6PJ58j73N5o2N7j62K72j11j31J76J7j75K4M3J04n5m2l
$$ 65 33 -1 -22 91 68 4 -32 -25 133 -40 15 -47 10 -152 120 9 -122 54 71 -104 -80 -37 67 12 -30 -33
1852c3J26k06J97j25K1R3k48J63L8KO3m4k9mr0J3J65q1j2j7P6j83J53q3k9R1j59
$$ -33 93 -113 84 -41 -20 73 -175 -12 26 28 91 47 18 14 -76 -63 102 21 9 -8 68 -115 38 -45 -74 17 -142
1879a42J87j0j72K02q6J39j17N0k8n0J49j19P6n3rj4J3K1jk5O0j83K27r4j5j12
$$ -142 45 35 -137 65 -21 118 1 51 23 -27 122 3 79 26 17 3 16 37 36 11 71 -112 115 21 6 -106
1905a06K02o5rJ2n3P7l3q7J60qj08Q7q6Q6r3R4k6j28N4J15m4p8P7J1j30j15J96
$$ -106 96 31 22 34 -19 58 25 -62 98 90 -18 69 -17 69 -24 70 44 -84 -30 85 41 -37 40 51 -79 -194 2
1932BL5j19K40j28M5m9k2q7J31O9j60R0j19O2j03J28n2No4J7J07l6M5j02nJ16
$$ 2 37 -82 158 30 75 26 4 -83 48 117 -43 47 -72 -10 -113 15 -37 -32 -96 -79 28 -8 37 -65 -70 46
1958D6k4j2o9N6P1p1j15R4j8N4L2J7m5N8k7N4j41O3l1l2J61j51QrP9j22J74j30
$$ 46 22 10 -59 -3 68 -3 -118 -24 -42 12 44 61 16 74 47 101 -40 23 -8 -40 121 -30 -22 -31 48 -74 100 -30
1986c0m5J6N0L0j24J75l5K2q5O1N6j39Q6m5L8J0j1O1r3k6K9q4J64p3Ql5R5j46
$$ -30 -75 -59 -9 21 -103 72 37 59 -26 35 91 -48 38 -7 31 41 30 91 -2 -28 1 -83 81 8 16 -19 76 -70
2014g0L8J43l6qj11P9j5q8N1M7o5M9j7PQ5J8Q3k22q1J91k2J5M4k68K08%j30L1
$$ -70 -32 111 75 67 -44 35 20 -68 -17 30 -35 14 -3 4 89 107 190 -32 -113 78 56 71 115 -153 55 55 -75 -44
2042d4O0O3j18q8KJ31j7J9j04P5j6N7j06Q7J43j26j3Rk37J91kk7R0j50J09lo2
$$ -44 16 79 -39 -127 -125 6 -11 8 -96 -21 -37 20 -86 1 144 18 5 14 -223 -32 -34 -61 29 -121 -12 -15 -77
2069g7m4j8K00Ok8n7J85r1j30K13j89J09q4O9r6M5j1k0q2J5J43J9m5l0J4q5R5
$$ -77 -121 -139 61 67 39 -18 167 76 -54 159 -30 79 -5 64 -32 13 2 -18 -100 -85 58 77 32 2 16 -69 26
2096B6l8P6j42q4PJ37m4O8Q4no1M9j65l4K29j41R0k0j44J01j02O7J60j38R9Lj16
$$ 26 -12 64 -78 -162 -155 -18 -62 6 90 85 24 73 -92 -126 103 -38 52 32 -112 -11 -113 -46 114 -24 75 78 -38
2123c8k4N5J63j71Q3l3o1O4r1J16j15O1m5J04m5m4R7j50l7K2Q0q1R5O0k7n9Nk4
$$ -38 -62 -7 156 -15 68 35 -26 38 -53 63 -52 9 -36 68 23 -21 76 -74 -111 -89 -9 -90 5 65 38 -21 -16 -40
2151d0K9k4J81j24N2j93J13m3O2p2J34j51N4k6O6j27J74n6N5j58J39r3M5P7j14
$$ -40 -11 -35 146 22 74 -119 -6 -49 13 -59 75 -76 -22 -48 18 -109 65 9 64 -94 45 -48 -3 74 -40
2176d0Q7n5P6Q5o2o3j25P1J28j87J48m3OK4j00l5R4L9p6KJq9O7nJ14n8k3J11r9
$$ -40 47 -8 68 153 91 28 -97 -26 102 -85 63 20 26 50 -50 -85 9 48 -28 -26 -25 -114 -47 -52 62 4 -19 92 -7
2205gL1l4j4M3n5J35k3j07K3m0R1m2N4n9J9K0KN5k1j01l5J5O1Q7m3j23J40j14
$$ -7 24 -10 -24 19 -36 99 76 -31 -8 -48 43 1 55 -4 15 35 37 92 71 -30 -65 -50 11 98 55 -68 72 -42
2233d2J3Q1M7j41M1O8jj3j02O6k3J03k48J82p5M3O7J1j60l4J42m2p8J21m3K4p0
$$ -42 -29 52 99 -42 -1 67 66 53 -49 17 -6 97 -151 31 -44 -1 66 77 -83 -117 25 -17 -95 26 -17 7 -63
2260f3J4K0n8J98j50J2O5j6j8p1M0L5j61J59J9p7K3O9O7l6p8p1L34l75P0N2J41
$$ -63 -49 -29 -87 111 -39 -27 38 22 4 -67 -27 8 -153 6 25 -52 -29 40 107 71 -7 -78 256 -119 -49 3 144
2287A44p8K3j2j42J73m7Q6j55j24J17J64j80pm4j5J65J7q7J2Qn2L5Oj26L9N8K4
$$ 144 66 89 77 -65 108 61 147 -8 -132 -15 149 -31 -38 -82 -97 68 85 -2 10 18 -34 1 7 -119 -80 -22 2
2314Br3J07r3Q9Q4n8Q1j78P9N6oO3r4n2j7L7P8n2n4j24J21J28j3o1q9J04LJrp4
$$ 2 -91 16 -77 12 96 38 119 -59 20 76 70 133 39 -13 -30 7 85 33 -21 -145 -24 104 91 30 -59 45 48 49 40 -34
2344c4P3P4r6M1l9n8R0Mj10N9L8O5o0j31N4j2J26j35P3j00O5K9j30O8N2J26r1
$$ -34 39 113 17 58 19 -39 51 55 -55 4 42 107 47 -84 -30 -42 84 -51 22 -78 -13 16 -114 -46 6 132 41
2371D1lK5m5J3k6q0J60r3L1L9j52J13j02P5Q1j15L4R5j85Q2N4q0O5nNm4M0p7M9
$$ 41 38 63 18 31 5 -75 85 -8 23 62 -90 23 -79 -4 77 -38 -4 91 -94 -12 42 -38 27 22 27 -17 23 -54 -5
2400ej6j0oN7J5o4K6l6Nj3N5N4j76K32r6j46l2J36n5R2o3M2M0L8O3n7j98J66J11
$$ -5 -21 -31 -37 20 35 -29 -3 -39 -34 -47 8 62 -114 118 22 -124 -156 -20 -75 17 -46 -4 36 74 137 80 -118 48 159
2429A59k22N9p8K11j64R9l4m6J14j58O8onj1N1M0K9J3p6k8n3n2L8J06j12J86j76
$$ 159 -63 -4 -82 129 -35 64 30 -16 98 -60 8 2 -3 -14 37 77 106 119 43 15 -38 -90 -52 54 -58 128 -48
2456d8J43p5m9J17j48J61j76q6O3m6K32j03J03J93k04k10lJ63o5J15k4O1j38O5
$$ -48 95 20 -29 88 -60 101 -75 -161 -98 -144 88 -15 88 281 77 -133 -136 27 -38 77 53 114 -24 41
2480D1q0J22j17M1ml3j5N2J4nk9M7N3j76J66j17L4J00q9q6N0M5O4l4M3j49N6o1
$$ 41 -39 83 -34 7 3 -30 -45 7 21 16 -13 34 87 -89 77 -40 -6 94 5 -81 -31 14 78 44 87 -62 -6 -67
2508f7L7n8Q2l5k9J1J7q7K28Jq7N6j12oJ27R4q5j31M6ml3J22l0N6j00qL3p0j1
$$ -67 -30 -88 -6 -41 -70 -59 -42 -129 99 100 13 69 -43 -49 78 172 87 -44 2 -2 -35 87 57 113 13 5 38 -32 -43
2537d3kOJ20k02J79q9R9j04q1J06O5q6L3J6m4O7j62J37n2Q8j3n3k3N9K3j01J6
$$ -43 -45 -39 81 -121 58 -31 68 -36 -117 -11 54 -32 1 17 -27 40 -122 15 -37 51 38 -15 -38 21 44 -57 -41
2564d1K2P9rj4J7j45J33J3p8j4kJ00qm8m5J5LJ10m4r2J7j4K8Q7p4o0K1o1Q2k4
$$ -41 -19 60 51 37 54 -91 42 55 -23 -37 -39 61 53 5 -40 -25 -22 88 44 -48 -31 -45 -17 70 -4 -64 -43 -104 -22 -46
2594d6o6R9Q1qL0n2M2k0j95J35o4K9or3J31n1O9J7k3p0N9N7l7L3o4P4q1m2J40
$$ -46 -112 -13 68 60 90 38 80 60 -135 0 -64 -35 -41 -134 -3 -54 15 32 9 -61 -2 55 18 51 -13 61 -20 -62 78
2623G8p0p5K39k39J49j2j03J53j32n1O1P6j65J71o7p1J08J2j38K19j41j0P2j03
$$ 78 8 -67 172 -67 82 70 -33 120 -12 -63 -2 74 -91 80 13 -58 50 62 -76 143 2 -8 64 -39
2647c9L5n5J5P6j41J46n9J4Q3p9j9r5N4J08m4j19R6J0m3p2J79r9P6M2p5J5j56
$$ -39 -4 -59 -44 32 -109 37 -22 -8 75 -4 -23 -118 -64 44 0 -119 -23 -13 -56 -128 51 -48 28 70 -5 10 -146
2674a46J84J29j91K4K2j07K13K1L7k33J61p4j8L2L5M2n9r1J08j30n9J17M1n1r
$$ -146 38 167 -24 0 22 -85 128 149 186 -47 114 40 22 54 89 131 72 -19 89 -41 -100 17 58 7 -2
2699bO2p8Q1m8j7k4M3j18Q5N0j22R7l9J02q0r0R6n6l4k7J28K9j5p3o0J71k6m3
$$ -2 60 -18 63 15 -2 -26 17 -101 -16 34 -88 9 -30 72 -8 -98 -2 -58 -92 -119 9 38 23 -50 -110 61 35 -8
2727hO1J3j6j37n3J54N3j35L9M2j0O8j32R3j1K4N3j53jkK2MJ04Qj67M8k9%jK45
$$ -8 53 66 50 -87 -140 14 67 -68 -29 13 3 71 -61 32 21 45 98 -55 -56 -58 -36 -32 72 80 -87 -39 -68 -68 -69 176
2757A76j42j79J52O3l7n2J62j17r8P0k3Q2n4O2o2k0K1MJ54j64O5K6l3j2J24j37
$$ 176 34 -145 7 70 33 -19 143 26 -72 -2 -25 57 3 65 3 -17 4 8 162 -2 63 89 56 44 168 31
2783C1o8N3Q3j55J90j03l0l7P4o8J39m8m2O8q8K21l06J19ql0o4Q5r7Q2o5M1m0
$$ 31 -37 16 99 -56 134 31 1 -36 38 -30 109 61 19 87 -1 220 -86 33 25 -5 -69 16 -81 1 -64 -23 -63
2810f3k0J72n4j07N9P0o9RK7j32N3R8r5J%k3J54r5n5R2k0P0qQj18O0j39J32KP3
$$ -63 -83 89 35 -72 -13 57 -12 -3 24 -108 -55 43 -52 -51 -51 -74 80 -15 -70 22 2 72 64 72 -46 14 -125 7 9 82
2840H2m4j27L3J09m8J3Q1j51rP9M8r4J4M4R8j50P1L3j01k8N4l5J30o2O8j8p6P
$$ 82 38 -89 -56 53 5 18 99 -52 -61 18 66 -28 -14 30 128 -22 49 82 -19 -47 7 -28 102 40 108 90 14 21
2868B1R%j39L2R6J50k22j26K91j17p4J25M4r1P8j02J02k01J87M1k47K35m5p7N3
$$ 21 30 30 -109 -77 19 169 -53 -179 112 -5 -79 46 90 -1 77 -25 77 -124 63 104 -143 92 47 -30 23
2893B3n9J20K8q9k21K52j71N8OO7p9O9j1o2j51K68o6K4R2j57n5J07o5o6O5O8o
$$ 23 -36 84 112 23 -198 54 -117 -59 -53 14 -65 4 -7 -69 -220 48 -18 6 98 -59 -114 -7 -72 -138 -73 -5 -11
2920a1n2J13j2l5p9K13j81O2p1N1j3r0Q7k4J59j14l4J12m1q0q8K22j53J11n2O6
$$ -11 -63 50 38 3 -76 137 -44 18 -53 -2 -15 -105 -18 -42 117 3 -31 81 40 -40 -128 94 -59 52 0 66
2946F6n4Q3j55R0p3M3N6j01O1K7k6n7M1r5J79j46J5L7j2k5qK8j52J76J9lj07j5
$$ 66 12 95 -60 30 -43 0 56 -45 16 43 17 -40 1 -94 85 -61 -46 -9 -21 -46 -54 -26 -178 -2 17 14 -93 -108
2974a08O7L0m1p2P4N5m5O2j01M5N1k6L4j09PK16j25K4P8q1m6J1O4j06q6Q2N7N2
$$ -108 -41 -11 -52 -124 -50 5 -40 22 -79 -34 17 -9 25 -84 -77 139 14 38 116 35 -11 0 64 -42 -128 -46 11 63
3002F3j21J08n1O1j80J67q4K5OJ2Oj7Oq0J16l6J5j61J32N4l7l9Q8l7MJ3j4m9Q6
$$ 63 -58 50 -1 60 -120 47 -37 -12 -6 6 12 -5 1 -79 37 1 16 -145 -13 41 4 -35 53 16 20 33 19 -30 56
3031E6L8r2o7K6j7l9j9J41r1%J14n0J0K5Q5j21R2j91R7k3p2K2J83K2j95Q5n9K5
$$ 56 94 2 -65 -39 -56 -95 -114 27 -64 -64 50 0 10 35 120 -1 91 -100 -3 -26 -98 -76 107 129 -66 19 -40 -15
3059a5J24l9j26N9l0K3J23j25ml8M3j63K48q4j4m9J10j11N8k1M5N1mj13j30K59
$$ -15 109 70 -56 3 -27 -4 119 -6 -10 -48 -5 -168 80 -4 -18 -67 43 -68 -10 -31 14 65 61 -52 -182 77
3085G7o6J4M4Q9k32J22j0L5n3n9J35j48L9J41j55j0J53k8n9k3K8l7J11p7j53J14
$$ 77 11 25 69 158 -74 48 38 73 20 -39 96 -52 -13 128 -27 -37 116 88 29 6 34 -3 108 31 -122 -8
3111hM6q1Q1j08P9j29K74p5j73J91r9Q0n0j41K26k7n0N4p5p0M9n5M7J74j36k6
$$ -8 38 -43 38 -70 9 -120 154 79 -94 97 -2 78 28 -113 113 86 36 90 15 -55 -6 -61 -14 160 24 -2
3137bj8N4m2P7j82N8m1O3O9pj12N5J7J14Pj30m2J92k9j61P3k3l9J3J33k56J19
$$ -2 -20 34 -8 69 -113 -55 -96 -33 36 29 -83 -28 -11 103 110 -20 -62 130 101 -60 13 -10 -49 -36 97 -159 -40
3164d0N5j19O1p1K6J49k25J90mp2%P4Nj42N0J09J35j72J22p5j09N4r1O5P9r2N2
$$ -40 15 -104 -43 -114 -88 61 -164 26 22 -50 -50 24 29 -113 -63 46 181 9 131 56 -53 1 -90 -25 54 -38 14
3191A4P2j51o1K29j15L7p1o4K02l9%q9J15L5j08o9N5l3J26n7m4P5Jl5j22Q1Jo8
$$ 14 86 -65 -126 103 -12 25 -46 -110 92 53 53 -36 79 114 6 -63 -8 -41 85 28 -16 59 60 25 -97 -16 -15 -83
3219h3Q4O9rp8K2%J15j39k9J17r1RrN9R9j67N5l2l1J07o4j1n2J00n0n4K28j09
$$ -83 1 70 61 -17 5 5 120 -19 -48 69 -22 -13 -22 37 136 -31 24 -8 -39 68 4 -7 -59 41 -9 -63 165 56
3247E6l2j08j08K26J45j56m0RJ04j63P4M8j0Rj9j00M3L1l8k5J8O6k14L88l19R1
$$ 56 24 -84 -192 34 179 23 -17 -8 96 -67 7 55 45 54 35 -65 -22 9 -29 -54 -36 30 -184 204 -115 -24
3273b4L9j2o6M9rP0p9j4J29k54K36j70N7R7N5j09K7O2nN4k00m1J28k5Q2j36k0
$$ -24 15 3 -63 -14 -23 47 -32 -46 83 -171 65 -105 -48 49 104 -5 22 84 79 133 -67 -108 20 -5 77 -59 -79
3300g9J14o0q7K0K46j81J10j13J14l8k5m4q0J67nj79K42m7r0o0j2J08nNp0J16
$$ -79 35 -25 -112 -92 154 -27 83 -30 84 46 21 -23 -103 64 59 -120 122 75 -15 -75 -87 21 16 21 -49 67
3326F7j60J21k3r4N5n9J78r4J12k43K7P4LN4m2J42n3m0L5l4ol1kP1q0K9OJ6l8
$$ 67 -93 28 5 -89 -34 -93 85 -9 103 -140 -113 -39 -36 18 -24 118 65 25 60 26 20 -11 -13 58 -22 7 13 29 -9
3355iJ16N1k63J15J28j16m8m0K34k96J81n1j69K02m0k8k2J47j49J44j60J70j01
$$ -9 107 158 -105 10 138 22 -26 -66 168 -128 53 2 -167 35 -5 -33 -55 92 -57 87 -73 97 -4
3378dN0P2r6jo7O7Nr1r8M9L2J32n8m4N1rM3n8j25J39j4J8j4j6J33k11J05J28k06
$$ -4 46 118 22 21 -46 21 26 -65 -163 -114 -82 50 -8 -52 -1 -10 33 -25 -150 -11 -25 -7 -21 -37 96 -115 -10 118 -88
3407h8MM4J69k04R5k0M3l3m1KP6j61R1pL2P1o1j4K2M2N4q8j1Jj61L19j71K1l0
$$ -88 -84 -40 129 -75 20 0 43 10 -31 -29 47 -114 -23 -30 2 73 12 -2 20 62 116 28 17 18 -143 176 5 26 -4
3436dL1j34J38l2r8Q2M7j18O6o5J75j08J26j58L1Q3j07K5M7l9P3M6j43N9j1n6
$$ -4 27 -107 31 -1 -99 -17 30 -88 -22 -87 88 -20 106 -52 -21 62 -45 -20 27 -12 61 107 -36 23 12 -44
3462d4J53m0Qj24qo5Q8L6r2J38j01k2LJ23j43j6J85j42J40M2ol4j08O5j42J73
$$ -44 109 69 77 -47 -55 -120 -32 4 -88 50 -51 -73 -70 53 -90 -106 79 -63 77 119 113 79 -29 36 -106 67
3488F7j00J0Q1l1PM5r2j5j09L33j18jj5k7L4r7p6J03L5j28J28j43N4j2N2K2%J23
$$ 67 -33 -23 58 27 34 79 -13 -28 -137 196 78 77 62 35 69 -28 -104 -1 34 -94 34 -109 -55 -67 -15 7 7 130
3516A30j51l0k2P8J5q2N7J05l2n3q0J7K2J27j43K1j23J74j26O3J33q8Q8j57O9
$$ 130 -21 -51 -73 5 20 -62 -5 100 68 15 -65 -48 -26 101 -42 -21 -144 30 -96 -33 100 12 100 -57 12
3541A2M8j41L7N9j8J6r9J36j26J38J4jj02J90j68j1n5J57M0j08M3q5K6l1j4j22
$$ 12 60 -81 -44 15 -3 13 -86 50 -76 62 76 75 -27 163 -5 -16 -71 86 126 18 61 -24 2 -29 -43 -165
3567a65J26J43j04Q4l04J84J2j30K31j63J57r4J6o3N4O3r7O1K6k2N4j29J6N9k2
$$ -165 -39 104 0 84 -220 -36 -24 -154 77 -86 71 -23 -7 -70 -16 47 -50 11 37 15 69 -60 -44 15 -7
3592gN7k1r4L5o9J75l6r4J57j78Q9nq6RP1l3J00j57K7J15j10Q0p0N4oO4j87J26
$$ -7 50 29 -65 -30 -99 76 40 -54 103 -75 14 9 -77 -68 3 -30 70 -87 -60 55 -55 25 -45 9 3 67 -120 6
3620Fk9R0k00Q7JQ6m4J19j60p2J13Mk6k5J4J68j87nJ11k14J28K1O2J7j01l1M5
$$ 6 -23 67 -133 -46 -45 41 -3 116 -44 -116 -3 1 -25 -50 -36 132 -55 -60 51 -163 -35 -14 48 65 -36 -67 -22
3647b2N7l5L6j34O9L3J15r4J4n1O4o6M8l0N8k5j25K59k09J6M2r0J27j04n6J07
$$ -22 35 0 36 -98 -29 4 119 25 39 -12 52 -14 34 4 62 37 -88 171 -38 -22 20 -70 57 -47 -103 4
3673Dk0o9R7L5n2j6n3M4j4kQ4j23o2J44K5j01N2l2P7J6r6Q7M4Qp8n0J95j21j17
$$ 4 -16 -85 12 47 -5 -21 -74 -30 -44 -46 38 -85 -147 -3 22 -79 -27 -59 18 34 -62 25 69 77 -1 -51 144 23 -94
3702i4J57K6j19M3n5J01n5J1o7M9K8m4j39J16R4p6K1P0r6J32k38N9J31k7K7j30
$$ -94 63 89 -30 13 -42 59 4 15 -52 -3 25 -19 -158 -42 52 -24 -3 67 -29 103 -135 -76 55 28 55 -75
3728g5K51k13M9R0j27m8P2q3M7J10r6P5J0po3J12j0o4j9o0J13k0r3J03rj02M1
$$ -75 176 -37 12 102 -25 -73 -1 -84 -37 73 -23 52 62 55 -8 104 94 30 11 -49 64 44 -49 54 45 -57 -16
3755a6K0j16J59j7j56O3kJ88j42o6P7o4kO0oO5q9J26Mj56M1n6J7Nk0RR8jPq4J18
$$ -16 4 -112 47 30 -126 -63 -65 123 -19 -85 -8 -72 -74 -14 -20 45 -44 82 86 -70 -29 -85 -68 -63 -83 -74 24 23 30 -54 64
3786F4j04j27J50LR8k20J93n4n5J16j14k4L6No4j5J17K5L3q6m8L3k4N9L9lN2j23
$$ 64 -40 -167 -17 -14 84 -136 57 3 -52 64 -50 -74 -38 -33 -97 -112 5 30 63 -23 -71 -38 -62 -3 36 33 85 -38
3814c8N8l2O2r1M7k4K06j91m6L4m2R9o3p2J13k5j36K63o2n3l9m1J45k23J95j33
$$ -38 20 -12 50 -41 6 -18 188 -3 -49 -15 -57 42 -21 -93 20 -5 -141 122 60 7 -32 -73 72 -151 44 -89
3840h9N6J43n0P0m6k05N5K4R0p8j3J58l2j01oP5p4J10l0L3r8Kj6kJ43r9K9j19
$$ -89 -33 110 60 130 84 -121 -66 -42 48 -30 -43 115 83 -18 -24 51 -23 87 57 90 -8 -6 -22 -24 119 20 49 -70
3868g0K02j76J84l00K73o0p6N9k5K2q2J10q0N9l2L3m1j6r0NQ8M2o9n4K28j56K0
$$ -70 132 -44 140 -160 113 53 -23 36 11 33 -49 61 -19 40 8 41 0 -16 -106 -101 -13 29 -40 -94 134 -22 -2
3895bj51L16r8j57KN5Q1j5j65Q7J56q7N4m9Q6j07K3K2q6N7l0nk3J6J22pl1l8K1
$$ -2 -153 163 65 -92 -90 -35 46 31 -134 -47 109 22 76 27 113 6 29 51 -35 22 -8 -13 -36 -20 102 95 64 26 47
3924D7J19j59m4M7r8Q0l5P1q8J8L0j2R2r0j4M0n7J09j00M3K2j25K2j8J91j07J16
$$ 47 166 7 -37 10 -88 -8 -43 28 -60 -42 -12 -24 68 -22 -36 4 -53 56 -44 -1 21 -104 -82 -100 91 -16 100
3951A00j33l4P8oQMO2j91K32n4O7o6o4M5r8J06j30L4J13n6J87j67j29J68j09O
$$ 100 -33 -67 11 5 13 17 79 -112 120 66 133 67 3 48 -50 56 -74 -40 73 17 204 37 -92 76 -33 -27
3977b7L5l7J9Kj02O6l3J9o7K2J72j03L6j6J0p8J6M3p8J61r8N4K2j0r4m1J58l6
$$ -27 8 -29 -10 -8 -110 -44 -77 -58 -125 -103 69 -34 2 -14 -4 -82 -66 -23 -101 60 -38 16 38 28 -66 -107 51 15
4005A5Or8J8M8n0R9o9Q9M6j10M3O7k81K83j10O2j06L7N4k0Pmn3L1o0K4j00L8J02
$$ 15 21 -77 -59 -11 -61 38 -31 58 104 -6 37 104 -177 106 -4 58 -48 -11 43 23 30 26 -27 4 -56 -32 -132 -94 8
4034Hk1P5j26J23r6N0k1r4J21N3j22l9J43j3m0K8q6R4K7o6o6J12j27oN9Q4p4K5
$$ 8 -13 62 -64 59 -37 13 -8 -102 19 72 -50 -89 54 41 1 29 -57 37 64 -2 -68 44 -83 -89 -30 54 -20 5
4062EJ35j69O4J33k28lJ31r9P6j15pML4J69j21k6j4R5p4J03j14L6q7L0j0J00j61
$$ 5 140 -29 35 168 -60 -63 68 -31 45 -70 -77 -73 -39 130 9 -17 -31 64 -10 93 -21 15 -72 -42 -52 48 -113
4089a13J20Q2j26J81k02l8O2M5pl8J00n4p1j3P4P0o0L9pp6m7LN3P8m2q2K4KK7
$$ -113 7 89 -37 144 -58 -96 -34 11 4 -34 66 12 -59 -72 2 72 12 51 44 -32 -79 -76 -23 55 13 -69 -45 -43 -16
4118a6R5j01K27k05m4O7J8l1P7j39Mp1J28p8P9N9Q8m3j64O4r5P8J12k77J77l2
$$ -16 79 -22 205 0 -44 23 41 10 87 -52 -48 -119 9 -69 10 69 157 114 -50 14 -81 -3 109 -168 9 -23
4144b3lJ5n9m6J33j0L5M4j89R2n1K4M7r4J12o5Ol6K7J25mr5P5q6N0N4j93J58J1
$$ -23 -26 -11 -70 -116 17 7 42 86 -103 -11 -62 -38 9 -85 27 -38 -32 -68 -41 84 80 -15 60 -26 24 78 -115 43 54
4173E4m9J9n7R3r7J11k04J25nn6M2k2K19k15L3kL5J8n2P4p3O0j40R3R0J9o3j14
$$ 54 5 24 -33 60 -37 74 -130 -5 -10 -66 -24 -46 173 -42 -9 -11 24 42 -10 64 -9 51 -89 4 94 113 50 -64
4201f4J58j11P2n8M3Q1j50O9m6q2J11o6J45p4JQ6q8L2K3j7o1j6O9o3O3o8K7J14
$$ -64 94 -17 55 -3 40 121 -29 40 -6 -88 23 -43 102 28 29 115 27 59 82 65 4 -12 57 -6 57 -11 16 130
4229A30j96m7J89k3Mj34K25j71j33K13o0oM1p7R6j9J8j29J5k6Q8q3J6O4L5O5j51
$$ 130 -66 -113 76 53 57 -77 148 -23 -156 57 -3 -9 32 -45 51 32 50 -79 -64 -90 -2 -85 -69 -5 30 95 -56
4256e6J83j43J34j05L4m8q2l2PJ07Q0j38Q0K5Om0Q5j47K15k08M7j3l1J54n5r3
$$ -56 127 -16 118 13 47 -1 -83 -115 -108 -1 79 -59 21 46 52 12 97 -50 165 -43 4 -9 -40 114 59 -34
4282c4Q1q1LJ45j66Ln0J15Km2j57K53j77rJ04K4q0m0K34k06L0K8N3k03J81O2k2
$$ -34 47 -34 -31 114 -52 -49 -99 16 18 -24 -181 72 -105 -114 -10 14 -66 -106 128 -78 -48 -20 33 -170 11 73 51
4309E1j8O1jl1o0J6M0q8pRP1q7L7Rj6P5m7nl4L0l7M3K3j7o5O4o1n5R9j8j6L7L
$$ 51 33 94 93 62 2 18 58 -30 -37 -28 43 -44 -7 2 -14 61 14 9 -25 5 -32 11 34 17 -48 16 -45 -100 -1 -19 -35 2 5
4342EP9r3N5l9q4J01p7J66j78j7Q0O9q5NP6k2L0m0J3K0J1M6j65k6K4P8O5j16k2
$$ 5 84 -9 46 7 -77 24 -53 113 -65 -82 -2 67 -18 -13 63 41 71 31 44 64 75 121 -44 -70 -46 32 97 -19 -41
4371d1J16O2k56J64j53J50j55J56m2K0n7l8J24j2j24J00Qk9kk9J7n9Q6n7q8Q3
$$ -41 75 137 -119 45 -108 42 -113 43 1 21 -36 -74 50 38 -86 14 22 -7 -9 -38 -21 -80 6 -51 -139 -56
4397e6J08j62J25Q8o9kn0m5R5l8n5JK41o2k00R8p0jJ13J2N1k68K06pJ2M3p2J76
$$ -56 52 -110 15 103 34 32 -18 -63 32 -6 -61 -60 181 119 -81 17 -53 -54 59 71 122 -146 60 53 65 108 36 212
4425B12k25k0j32K62Nm2p7P0j4oJ3p8PO2j65K4P2m6M0MM3Q0j10k1J3J52j32J0
$$ 212 -13 -33 -165 97 102 60 -17 53 39 33 46 -32 -25 37 -128 -104 -32 -78 -38 -34 9 89 -21 -42 -29 123 -9 1
4453AN8j94J03N5j03k6J40N4q9nR3j59J00N1p9L4m9r2J03M1m3M2RN2j03Q4jj53
$$ 1 59 -135 -32 23 -80 -106 34 88 -1 -6 87 -72 28 79 0 34 -15 -107 -4 37 -6 36 45 97 -6 78 77 -76
4481g6J98j76JP8P7j22j2J02r4k9j8P7J04j31j5l2J04j26K3k7J22j38Q8l1oJ92
$$ -76 122 -54 -53 25 102 -20 -32 70 -24 -53 -71 6 110 -21 -36 -68 36 -90 -67 -94 28 -110 -22 -53 -59 133
4507A33j81L6N4r0J9J6RR8P6j43K3nL1j47L3O7K3N6j23o0J8J14L2k3r7Q0j3r3
$$ 133 -48 -12 42 -48 -29 -13 -4 94 170 27 50 45 76 -71 -38 29 52 108 -15 -75 -57 57 89 66 -31 49 36 -57
4535e7K6j2R0n2%q3O8%M9L7j63k6K09o7j92K35o0p0P8mj06J01M2k1p5p3J40m4
$$ -57 -31 -43 47 -5 -5 -88 -20 -20 29 66 -97 -123 86 19 -173 62 2 -68 10 6 -100 1 43 22 -53 -126 14 -30
4563c0L9m5J39l2K7p9l6R5j95L6O1N0p2PP2l9R0p9mR7m0j10L2j3O6j33J73j05
$$ -30 9 -36 103 71 98 19 -17 78 -117 -81 -20 30 -42 -35 37 -2 88 9 5 102 62 -48 -16 -29 37 -96 77 -28
4591b8m7J66j63L5N6j9o4N7n0oJ64l1k42K32k6o0L5m1P1j67J14M4j25K35j24o5
$$ -28 -75 91 -72 -37 19 0 -64 -7 -57 -63 101 70 -172 60 34 -26 9 -32 39 -128 -14 30 -95 140 16 -49
4617d9K9mo0J64j61J56j10M8O2j26J19k8o0Q1N2q5n6L6R8n7j4j6Q1j6q3M2Jj47
$$ -49 -20 -24 -84 80 -81 75 -35 13 75 -51 68 40 -20 61 113 28 -28 8 106 49 35 19 100 84 1 43 44 -103
4645a03J60o5o0Q2j03K2O3n3n7P6l3L9R1K4j03N5M3j44J00Ro8J57k05M1pLJ79
$$ -103 57 -8 -68 14 -89 -67 -4 -57 -114 -38 -71 -32 59 83 -20 35 78 -66 34 43 -25 132 -73 -32 -39 -36 143
4672A43q6j21P1M2J7r8N1Mr5J59j63K1L3k3R3nj95J32N5j75Q0O5Klj20J16mK7
$$ 143 57 -64 7 49 66 -32 19 23 -72 87 -76 -55 -22 -45 48 43 -152 -20 35 -140 -60 5 7 4 -116 0 -4 23
4700B3nj7j7O0P1j98J64N1p7m9r3N9K7j74J61j6j9P3k9k0O7Qj1j2j65Q0J6k7L2
$$ 23 18 1 -16 44 115 -83 81 132 55 6 -87 -28 -1 -175 -14 -30 -49 24 -5 -25 42 50 39 27 -138 -58 -42 -69 -37
4729c7L2N7j24J82p1r3L6l8J69j82J7k2R8r2J93j58L0j8q5N6l2J42Lj04J14o6
$$ -37 -5 52 -72 110 39 -54 -18 -56 113 -69 -52 -74 24 -68 125 -33 -3 -21 -106 -50 -82 60 63 -41 73 7
4755GM4j14MQJ3L7N4j8j0L7j15O4N0p7R9l1q2M7K8N1k12J21J15l5o3Jl6J3n6P8
$$ 7 51 -63 -59 -51 -38 -1 53 35 25 62 -53 11 61 -16 83 52 -30 17 45 96 -116 5 120 85 22 23 -13 0 -56 22
4785B2kn8N0j2N6O1q0k3K0o8O0k5q9O5J56j02Q6j07N3n8n0O4j0n9J96j86KN5m1
$$ 22 20 -38 12 0 56 117 37 14 34 -34 26 1 -88 -23 133 31 117 10 63 5 -45 19 9 -50 146 -40 -38 17 -24
4814b4n9K5J73j43l1R2M6o3n8K0k7L8OR1M6j82K6J%k9J17j46J49j11K4j22o4K18
$$ -24 -83 -58 115 -28 -59 33 79 16 -42 -22 -49 -11 -5 86 132 -50 -24 -23 -23 -52 65 -81 68 -43 -19 -141 -205 13
4842A3r6J2K0n5P5J12j45L6N9o3L9J2K4j6j54K41k71R5N0r9K16j36J4l4J2Q9p3
$$ 13 -83 -71 -51 -106 -31 81 -64 -28 31 -32 7 19 43 27 -127 114 -157 -62 -12 -111 105 -31 -17 -51 -39 50 -23
4869b3n6J78n6p5l5R8j5n8J10j49J5K38j03np9k4J17j18j11J18k7J29O0j97O6
$$ -23 -79 99 43 -32 -67 31 16 -42 68 -81 -66 172 69 64 -15 -39 78 -40 -151 -33 -60 69 129 -68 -2
4894bP7o7R6k33J60J5O3j00j59J44KJ25r9j6m1J06K7j45J21j31R1L9o1j4m0J35
$$ -2 75 8 104 -129 31 46 109 9 -150 -6 -4 121 22 6 -35 71 98 -47 74 -57 34 73 12 -2 -42 93
4920I3q2N6o2j10M7rJ3O4q1lN3m3J26n3j8k7l7J0q0M7J26j19mQ6J0p2j1J08l6
$$ 93 11 67 5 -105 -58 -67 -54 10 -71 -74 -21 -64 62 9 -9 -36 -73 -63 -143 -96 30 -89 -93 -7 3 -69 -80 28 -8
4949hm8l2J09m8j2o2J47l4m4N0k7j15J46L1%o7j02J23O8j6q5K6O8K1j55kP8q8
$$ -8 -56 -88 21 -27 -39 -101 46 12 -32 18 -9 -124 22 53 53 -14 -116 7 75 59 -26 0 68 89 -66 -68 10 -78
4977g8J01n6j0J33q4L7l8L3j09n9J16M7p1O1l6k0j7O6k7J41l33J59j3KQQ8M6K8
$$ -78 23 -33 -43 90 6 43 5 38 -71 -130 -14 33 -38 23 -13 -33 -50 16 -11 130 -203 -44 -57 -55 -47 41 87 115
5005A15j30o8J08l1o4m0J81j53J11j38Q3R6n7J12j48K3P1j61O8N3K4q0Q6j17j03
$$ 115 -15 -83 25 -6 -70 -110 71 -82 29 -109 -26 70 13 125 -23 0 71 -90 -22 31 55 -25 61 -56 -159
5030a59P5K3M5M0k7K2j3n7LK16j20n1R5N2r3m7Oj06nl9P2mJ25P7q4kp0J2o4L2
$$ -159 -84 -61 -16 24 -3 19 6 -51 -48 168 48 -3 92 144 51 4 10 -96 -101 -140 -68 -72 53 130 46 44 -26 -14 -78 -46
5060d6Q2N3l4j84J41j18J50o8R4L6j76J31m1M6q9j8J16j74K26j42J6n4K10j87
$$ -46 36 89 55 -129 12 -106 44 -24 70 106 -70 61 20 66 -23 -41 75 -99 127 -15 1 -53 157 -30
5084c0m6J00N4m9m7M9r9M2nqpO0q0O4J30j21q8M3O6m4p7P4j8l9J21j23Q4Ol4N3
$$ -30 -76 24 78 29 -18 31 -68 -26 -31 -39 -46 14 -66 -2 128 7 -81 -38 28 -16 -93 -19 -37 -76 45 -78 6 12 -22 31
5114C1n9O2j12Q1O0j24l3j2O5q2J80j00J0n1%J15j8L6p1J11Pj33L4P1l3rqpoN7
$$ 31 -28 34 -78 3 63 -61 -94 -106 -41 -123 57 -43 -33 -84 -84 31 13 49 -22 89 96 -37 -3 68 35 26 18 11 5 62
5144F2o9j45R0J74k36J62M5m3Kj13L5k7J7J00j86J80p6Q8m8k03K15lj26J66m0
$$ 62 -7 -152 -62 112 -124 38 83 40 42 -71 -36 -63 -46 54 -132 48 -28 60 12 -191 24 21 -105 61 21
5169B1J75j49k3L4m5J0O3k0j58R5O3n1N3j40R1J3P6j20K14j74J52p7j55K03K0
$$ 21 196 47 24 58 13 23 86 66 -92 3 66 15 68 -72 19 32 108 -12 202 28 180 103 -52 151 171
5194A71p5j31l4l4Q8J4m4N7m1j0L5p5j3J38pL0j07k5J13k9Q8j04m5K8J4k9N4M0
$$ 171 96 -35 -69 -103 -15 -1 -45 12 -29 -39 -4 -79 -92 46 39 69 -38 -63 50 21 109 5 -40 -12 2 -27 27 67
5222F7j15mL7M3m2n8J23j2O3k33J30J5k3Q6J3j31J60m2j02m9Q6m1kOoLL2o6J09
$$ 67 -48 -52 -15 28 -14 -72 51 39 102 -131 -1 14 -9 77 90 -41 119 77 -25 -74 12 -29 -31 -25 -31 -28 4 -62 47
5251D7j16L5P0J5r5J1M0j6R2L0j97K1M8M0j16L6JKOJ12j12n4P6lj6R4J07p6p9
$$ 47 -69 -34 36 51 -44 -33 7 -9 83 113 -84 -63 -15 25 -91 -55 -54 -52 -46 66 -46 -100 -24 -27 -43 51 158 82 3
5280CJ4K5n2J29k0o4l2j3R0j8r4J80j72m6N5Kj4J39j24L0l2j5J22p5Rk3L9p0M2
$$ 3 17 42 -10 119 99 35 3 -10 80 62 -32 148 -24 -70 -15 -13 -27 112 -12 18 -14 -29 93 18 27 4 43 -27 15
5309A5N0j72oQ5N2j28k3J86n6N5j15m2K8J43n6pP2j53J16mJ6m3K0j0K0P5j09q6
$$ 15 65 -107 -113 -28 24 -104 -127 59 3 58 -57 -99 -71 72 16 9 81 -72 44 40 56 13 33 23 43 118 9 -77
5337g7J20j10O5K1n3j7J48j77K5J11n1J9k9r5J71q2j26J37m1J44k25K23k02PJ98
$$ -77 43 -67 -2 19 -34 -51 97 -80 -55 56 5 24 -5 -100 71 -11 -137 0 -41 103 -122 101 -101 -94 104
5362A04m7M1j05O4j13k5K8J11Nr4L2j7J09m1l6j2l6P9r7R4k9o1J51j30O5j6j10
$$ 104 57 98 -7 57 -56 -81 -53 58 63 -31 1 -16 93 52 16 4 -32 47 -50 44 15 -46 105 -25 40 24 -86
5389h6K2NP9Q9p2o9N2Mk3L0K5j61J06N6L5j88N5jlJ6q8O6O5l7j5P0o6N0j00J28
$$ -86 -64 -59 20 109 37 -32 20 24 1 31 56 -105 1 57 92 -96 -41 -42 -45 -29 -117 -51 14 -23 -38 32 -34 16 -84 44
5419D4P5j10L9KMn8o6M8O4j44P6N1o3NL8O6j07J31j04O2M7mj79K30p8m7kRj45
$$ 44 119 9 48 50 54 -4 -70 -22 42 -102 -26 25 -38 -33 5 71 -36 95 -9 53 100 96 -83 147 69 22 20 29 -116
5448a16K3Q5j11K51j30J8m1l6L6O5n6K4J5m9p8M0J9K4m9l4O9M4Np0KK1Jk9J87
$$ -116 -93 -8 -119 132 2 20 -21 -57 -21 44 -12 12 27 -22 -100 -60 -41 -17 -66 -100 -31 13 18 -52 -50 -29 -28 -57 130
5477A30j02q7M4J72p0L5q1j24K31k92O2L9M2q0J47%j83J83mN8p3R5k12J47j13
$$ 130 28 -59 -15 157 87 122 41 -83 148 -144 -82 -43 -1 -81 66 66 -117 66 62 120 47 142 -70 77 -36
5502c6L7%l1L0L2l1k0J06m0j16P0K18k39R2j17L4o7J4J00q5NQ6OM2n4j1j52J22
$$ -36 1 1 -30 0 32 1 -19 87 47 -69 1 219 -20 72 -45 -11 -78 -64 36 -49 -44 42 48 90 36 25 -127 -5
5530er3J68ok7L9j56K01j17M4Jjj20K6N2M7m1Ok4J01o7m2N2oN0j13K5L3m9K7l8
$$ -5 -98 70 64 37 76 -80 121 4 48 49 48 -72 -46 6 53 12 18 -6 95 28 -14 38 32 82 -31 -6 27 -22 5 -33
5560c3Oj0Q4o0kq9J85Qj44M5J2k9M3M2q4m2M6J4M9J1j26J08L6n5j10M8L9L8R5
$$ -33 -27 -37 47 -13 -15 -104 81 89 -55 -10 2 -27 16 58 -26 -68 -22 -8 41 52 -74 34 70 15 -95 -47 -8 30 125
5589A25j10L5p9j1O5Nl9L2k5N3P3j07o5j1R7k2O9o3L9k3j07O3O9J5k1o7K1Q9n5
$$ 125 15 50 -29 -40 25 30 -9 23 -2 51 124 17 -48 -59 38 16 85 22 61 38 -69 -6 63 78 57 -10 11 100 45
5618D5j07J7On3j1J71p7K0J0l8K8o5O7rPJ63j44O9k6j41Q2l0J92j47l9m2O7jK4
$$ 45 -62 -45 -39 -92 -103 68 -9 11 21 -17 11 -54 13 4 11 174 30 99 73 -68 14 -16 176 29 -10 -52 15 14 38
5647C8m4NL4l2Q0O2j22p9J76j57J06j0rK5p7Q0Pl3l6P3j08r7J3J26k2k2O8j8m3
$$ 38 -6 -1 33 1 81 143 21 -58 118 -39 67 57 48 73 -4 76 83 50 14 87 -21 -118 -105 21 -1 -23 45 27 -16
5676a6k6P9o3O6j6n7l1L8L9QPN5p8O1n9J23rj73k6J68m0l6PJ62j81j1M8n6M6L5
$$ -16 -42 37 -26 40 24 -33 -64 -26 13 21 28 83 5 66 7 130 121 -52 -78 90 50 14 21 183 2 -9 39 -17 29 64
5706F4%j74kR7l9k5J73q2Pq4P1j0R5j22m6L4K1L8p2M2P1Oj47J06k9N4M6j61K1
$$ 64 64 -110 -112 -15 -54 -79 94 12 19 -65 6 -4 91 -31 -77 -43 -22 16 -56 -14 57 63 -84 22 -7 47 93 -68 -47
5735d7L7%Q3m2o8P6j1L5M0k38J64O8j62P5Oj4P9j21J17l9j52Q4M2Omj26RJ23j7
$$ -47 -10 -10 73 31 -37 39 28 63 103 -135 29 97 -65 10 16 2 81 -40 77 38 -114 -30 12 18 14 -112 -103 20 3
5764Cj48J91r1J3J06j41J37j53J30o5n0o5J1J19R4j07JO8l3n7o2l6J11O2j19N7
$$ 3 -145 46 -45 -32 74 -67 70 -83 47 -18 -68 -133 -122 -3 91 -16 -15 53 20 -37 -99 -135 -24 38 -81 -24
5790b4K6l8n0M9L9jP0m4Q2j87j1J85m8n5L2or7R7j4R9j29Q5r5m5j8K74l35J7J62
$$ -24 2 -36 -86 -37 2 1 71 27 109 -78 -89 96 48 -7 25 19 -78 19 5 104 -25 60 -35 -80 -98 176 -159 -142 20
5819B0k2qo0R4J6j9j09K46j42q6R5O3j64J00J4P6j88Q3m0P0j23P4P0p9n0j8K15
$$ 20 -2 -10 -70 24 40 21 -88 158 16 -70 25 88 -76 24 38 114 -74 9 -31 39 -84 -10 60 -19 -69 -87 128
5846A28r0N7j74K62j19j1%r5J46l7j30J71j82J71o0p1J69k42O0r1N9J01K8m6J26
$$ 128 38 95 -79 183 64 53 53 -42 104 67 -63 108 -74 97 37 -34 135 -107 -47 -138 -79 22 50 4 130
5871A30j85j0R5l0k3MKQ8k16K57j74R6Jk12J34N6m3N2r9N7R2%n2lj20J77r2N1
$$ 130 -55 -65 30 0 -23 -19 -17 71 -145 112 -62 34 35 -177 -43 13 -30 22 -77 -20 72 72 20 17 -103 74 -18 33
5899C3K5j68J08L5J1l9k0l6M6PN3m3j32J27J22j58P7j31J0J47j9R2k15O0j7J4
$$ 33 58 -110 -2 33 44 5 -15 -51 -5 2 55 12 -120 7 129 -29 48 -83 -73 74 55 147 -68 -8 -25 -11
5925a1p7J62j84P1K7pJ9j43K80k41J25j10J18j60K72j70K2M0n4J06q0Q2n7p7Q2
$$ -11 -88 74 -110 -39 -12 -19 0 -143 137 -104 21 -89 29 -131 141 -29 -7 33 -21 85 5 87 30 -47 35
5950C5j18Q7O8l7J8j17P9j23J16R3n9l4n9P4L1N1j41j7J60m3j31J4J14j46n3J54
$$ 35 -83 4 72 35 53 -64 15 -108 8 101 42 8 -51 23 54 105 -36 -53 107 64 -67 -53 61 -85 -138 16
5976A6j0K3j04o8K13m3p2L2J31n0r0P6n1L3j5q2o0J71l0on8J5R1j24R7q8JQJ01
$$ 16 6 29 -75 -143 70 27 -45 -13 118 68 -22 54 3 36 21 -61 -121 50 20 14 -44 -29 62 -62 35 -53 -52 -44 57
6005E7o3q2O4k0R2Oj11R7r7J5P6r3K55k26j7j1J56j18J2O4j9P8j40J4J2N7m1r0
$$ 57 -6 -88 -24 -44 48 54 -57 40 -57 -42 34 -59 196 -30 -47 -58 98 -20 -8 56 37 115 -25 -11 1 58 17 -73
6033g3L1n0Q9j5J00M9j63O4J6j41N9R0j19J06j66M6lJ11lj32K10l6j17N6mK6n
$$ -73 -42 -92 -3 -18 82 131 -32 32 48 -93 -34 56 -63 43 -123 -77 -80 31 28 -104 106 70 -47 9 5 31 26
6060B6o9J6L9J31j83J8Q9o0K6n3j8l9J21L9l1o9mK9k2l4Po3J60r6J12l3p9%J16
$$ 26 -43 -27 12 143 -40 -22 67 7 33 -20 -38 -77 44 83 52 -17 -21 8 -14 -48 -41 -104 56 -40 72 39 -40 -40 76
6089G6m2L1l6p7j9J47P5j09j38J31p5K7J06j0m0o3Q7n8Q9j08L2j11R0K4j69J91
$$ 76 34 65 29 -48 -67 80 155 46 -92 39 -36 -9 97 87 47 -16 71 13 102 -6 26 -85 5 29 -140 51
$$ [...]
8191G0
##END NTUPLES=NMR FID
##END=
