##TITLE=1H ikalashn
DE-76H
11.12.2024
##JCAMPDX= 6.0         $$ Bruker NMR JCAMP-DX V2.0
##DATA TYPE= NMR FID
##DATA CLASS= NTUPLES
##ORIGIN= UXNMR, Bruker Analytische Messtechnik GmbH
##OWNER= root
$$ TOPSPIN		Version 1.3
$$ 2024-12-11 15:50:32.828 +0400  Irina@DPX200
$$ Compression mode = diff/dup
##.OBSERVE FREQUENCY= 200.131300845
##.OBSERVE NUCLEUS= ^1H
##.DELAY= (6, 6)
##.ACQUISITION MODE= SIMULTANEOUS
##.ACQUISITION SCHEME= undefined
##.AVERAGES= 32
##.DIGITISER RES= 18
##SPECTROMETER/DATA SYSTEM= spect
##.PULSE SEQUENCE= zg
##.SOLVENT NAME= D2O
##.SHIFT REFERENCE= INTERNAL, D2O, 1, 17.49637
##AUDIT TRAIL= $$ (NUMBER, WHEN, WHO, WHERE, WHAT)
$$ ##TITLE= Audit trail, TOPSPIN		Version 1.3
$$ ##JCAMPDX= 5.01
$$ ##ORIGIN= Bruker BioSpin GmbH
$$ ##OWNER= Irina
$$ $$ F:/spectra/data/iren/nmr/1H/4/audita.txt
$$ ##AUDIT TRAIL=  $$ (NUMBER, WHEN, WHO, WHERE, VERSION, WHAT)
(   1,<2024-12-11 15:50:21.593 +0400>,<Irina>,<DPX200>,<TOPSPIN 1.3>,
      <created by zg
	started at 2024-12-11 15:48:11.687 +0400,
	POWCHK disabled, PULCHK disabled
       terminated by command 'halt'
       configuration hash MD5:
       BE 6D 3F 07 2A EA 11 49 91 17 2B D3 AF B3 58 0D
       data hash MD5: 16K
       F5 47 4A 79 89 90 E9 03 1A 39 5F 00 BD 85 75 28>)
$$ ##END=
$$ 
$$ $$ hash MD5
$$ $$ 70 47 55 3A 54 BF 79 1D 23 EB 8E C0 83 AE 25 4A
##$RELAX= 
##$RELAX= 
##$RELAX= 
##$RELAX= 
##$RELAX= 
##$RELAX= 
##$RELAX= 
##$RELAX= 
##$RELAX= 
$$ Bruker specific parameters
$$ --------------------------
##$DU= <F:/spectra>
##$EXPNO= 4
##$NAME= <1H>
##$PROCNO= 1
##$TYPE= <nmr>
##$USER= <iren>
##$AMP= (0..31)
100 100 100 100 100 100 100 100 100 100 100 100 100 100 100 100 100 100 
100 100 100 100 100 100 100 100 100 100 100 100 100 100 
##$ANAVPT= -1
##$AQSEQ= 0
##$AQ_mod= 1
##$AUNM= <au_zg>
##$AUTOPOS= <>
##$BF1= 200.13
##$BF2= 200.13
##$BF3= 200.13
##$BF4= 200.13
##$BF5= 200.13
##$BF6= 200.13
##$BF7= 200.13
##$BF8= 200.13
##$BYTORDA= 1
##$CFDGTYP= 0
##$CFRGTYP= 5
##$CHEMSTR= <none>
##$CNST= (0..63)
1 1 145 1 1 1 1 1 1 1 1 1 1 1 1 1 1 1 1 1 1 1 1 1 1 1 1 1 1 1 1 1 1 1 
1 1 1 1 1 1 1 1 1 1 1 1 1 1 1 1 1 1 1 1 1 1 1 1 1 1 1 1 1 1 
##$CPDPRG= <>
##$CPDPRG1= <>
##$CPDPRG2= <>
##$CPDPRG3= <>
##$CPDPRG4= <mlev>
##$CPDPRG5= <mlev>
##$CPDPRG6= <mlev>
##$CPDPRG7= <mlev>
##$CPDPRG8= <mlev>
##$CPDPRGB= <>
##$CPDPRGT= <>
##$D= (0..63)
0 2 0 0 0 0 0 0 0 0.06 0 0.03 0 0 0 0 0.0002 0 0 0 0 0 0 0 0 0 0 0 0 0 
0 0 0 0 0 0 0 0 0 0 0 0 0 0 0 0 0 0 0 0 0 0 0 0 0 0 0 0 0 0 0 0 0 0 
##$DATE= 1733917818
##$DBL= (0..7)
120 120 120 120 120 120 120 120 
##$DBP= (0..7)
150 150 150 150 150 150 150 150 
##$DBP07= 0
##$DBPNAM0= <>
##$DBPNAM1= <>
##$DBPNAM2= <>
##$DBPNAM3= <>
##$DBPNAM4= <>
##$DBPNAM5= <>
##$DBPNAM6= <>
##$DBPNAM7= <>
##$DBPOAL= (0..7)
0.5 0.5 0.5 0.5 0.5 0.5 0.5 0.5 
##$DBPOFFS= (0..7)
0 0 0 0 0 0 0 0 
##$DE= 6
##$DECBNUC= <off>
##$DECIM= 32
##$DECNUC= <off>
##$DECSTAT= 4
##$DIGMOD= 1
##$DIGTYP= 9
##$DL= (0..7)
0 120 120 120 120 120 120 120 
##$DP= (0..7)
150 150 150 150 150 150 150 150 
$$ [...]
##$SW= 21.9926040160658
##$SWIBOX= (0..15)
0 0 2 0 0 0 0 0 0 0 0 0 0 0 0 0 
##$SW_h= 4401.40845070422
##$TD= 16384
##$TD0= 1
##$TE= 300
##$TE2= 300
##$TE3= 300
##$TEG= 300
##$TL= (0..7)
0 120 120 120 120 120 120 120 
##$TP= (0..7)
150 150 150 150 150 150 150 150 
##$TP07= 0
##$TPNAME0= <>
##$TPNAME1= <>
##$TPNAME2= <>
##$TPNAME3= <>
##$TPNAME4= <>
##$TPNAME5= <>
##$TPNAME6= <>
##$TPNAME7= <>
##$TPOAL= (0..7)
0.5 0.5 0.5 0.5 0.5 0.5 0.5 0.5 
##$TPOFFS= (0..7)
0 0 0 0 0 0 0 0 
##$TUNHIN= 0
##$TUNHOUT= 0
##$TUNXOUT= 0
##$USERA1= <user>
##$USERA2= <user>
##$USERA3= <user>
##$USERA4= <user>
##$USERA5= <user>
##$V9= 5
##$VALIST= <valist>
##$VCLIST= <CCCCCCCCCCCCCCC>
##$VD= 0
##$VDLIST= <DDDDDDDDDDDDDDD>
##$VPLIST= <PPPPPPPPPPPPPPP>
##$VTLIST= <TTTTTTTTTTTTTTT>
##$WBST= 1024
##$WBSW= 25
##$XGAIN= (0..3)
0 0 0 0 
##$XL= 0
##$YL= 0
##$YMAX_a= 482415
##$YMIN_a= -783926
##$ZGOPTNS= <>
##$ZL1= 120
##$ZL2= 120
##$ZL3= 120
##$ZL4= 120
##$ABSF1= 10
##$ABSF2= 0
##$ABSG= 5
##$ABSL= 3
##$ALPHA= 0
##$AQORDER= 0
##$ASSFAC= 0
##$ASSFACI= 0
##$ASSFACX= 0
##$ASSWID= 0
##$AUNMP= <proc_1d>
##$AXLEFT= 0
##$AXRIGHT= 0
##$AXTYPE= 0
##$AXUNIT= <>
##$AZFE= 0.1
##$AZFW= 0.1
##$BCFW= 1
##$BC_mod= 2
##$BYTORDP= 1
##$COROFFS= 0
##$CY= 7568.61572265625
##$DATMOD= 1
##$DC= 2
##$DFILT= <>
##$DTYPP= 0
##$F1P= 17.9538593292236
##$F2P= -4.03888763876832
##$FCOR= 0.5
##$FTSIZE= 32768
##$FT_mod= 4
##$GAMMA= 1
##$GB= 1
##$INTBC= 1
##$INTSCL= 1
##$ISEN= 128
##$LB= 0.02
##$LEV0= 0
##$LPBIN= 0
##$MAXI= 945.577
##$MC2= 0
##$MEAN= 0
##$ME_mod= 0
##$MI= -402.1523
##$NCOEF= 0
##$NC_proc= 0
##$NLEV= 6
##$NOISF1= 8.587773
##$NOISF2= 6.764455
##$NSP= 1
##$NTH_PI= 0
##$NZP= 0
##$OFFSET= 17.49637
##$PC= 1
##$PHC0= 341.3103
##$PHC1= -13.36521
##$PH_mod= 0
##$PKNL= yes
##$PPARMOD= 0
##$PPDIAG= 0
##$PPIPTYP= 0
##$PPMPNUM= 100
##$PPRESOL= 1
##$PSCAL= 0
##$PSIGN= 0
##$REVERSE= no
##$SF= 200.13
##$SI= 32768
##$SIGF1= 18.5376
##$SIGF2= -6.396296
##$SINO= 400
##$SIOLD= 32768
##$SREGLST= <1H.CDCl3>
##$SSB= 3
##$STSI= 0
##$STSR= 0
##$SW_p= 4401.40845070422
##$SYMM= 0
##$S_DEV= 0
##$TDeff= 0
##$TDoff= 0
##$TI= <>
##$TILT= no
##$TM1= 0
##$TM2= 0
##$TOPLEV= 0
##$USERP1= <user>
##$USERP2= <user>
##$USERP3= <user>
##$USERP4= <user>
##$USERP5= <user>
##$WDW= 1
##$XDIM= 8192
##$YMAX_p= 0
##$YMIN_p= 0
$$ End of Bruker specific parameters
$$ ---------------------------------
##NTUPLES= NMR FID
##VAR_NAME=  TIME,          FID/REAL,        FID/IMAG
##SYMBOL=    X,             R,               I
##VAR_TYPE=  INDEPENDENT,   DEPENDENT,       DEPENDENT
##VAR_FORM=  AFFN,          ASDF,            ASDF
##VAR_DIM=   8192,          8192,            8192
##UNITS=     SECONDS,       ARBITRARY UNITS, ARBITRARY UNITS
##FACTOR=    0.0002272,     1,               1
##FIRST=     0,             0,               0
##LAST=      1.8609952,     -103,            -48
##MIN=       0,             -783926,         -783926
##MAX=       1.8609952,     482415,          482415
$$ Real data points
##PAGE= N=1
##DATA TABLE= (X++(R..R)), XYDATA
$$ plain form
0 0 0 0 0 0 0 0 0 0 0 0 0 0 0 22 -32 32 -32 32 -64 64 -64 96 -96 128 -128 160 -192 224 -256 288 -321 382
32 382 -417 480 -544 609 -684 769 -863 959 -1070 1184 -1318 1462 -1615 1784 -1969 2170
48 2170 -2391 2635 -2903 3200 -3526 3891 -4298 4761 -5282 5879 -6581 7401 -8386 9599
62 9599 -11119 13104 -15811 19740 -26012 37627 -66507 295082 291248 -291500 -267446 -289986
74 -289986 -418460 -518584 -223178 93039 211469 199630 341378 429271 294479 18484
84 18484 -125028 -221511 -363205 -448857 -267257 20679 171164 173366 241582 346641 301921
95 301921 71198 -126660 -197024 -232737 -300426 -278498 -102636 111829 215322 228573 228924
106 228924 207624 98876 -60268 -166329 -186519 -184706 -187461 -137568 -3639 138809 199824
$$ packed form
0@%%%%%%%%%%%%%K2n4O4o4O4r6J28j28J60j92K24k56K88l52M16m80N44o09P03
32C82p99Q97j024J153j293J453j632J822k029K254k502K780l077L399l753M139
48B170m561N026n538O103o726P417q189R059j0043J1161j2460J3982j5787J7985
62I599k0718K4223k8915L5551m5752O3639j04134L61589l834n82748K4054k2540
74b89986j28474j00124K95406L16217J18430j1839J41748Q7893j34792k75995
84A8484j43512r6483j41694q5652J81600K87936J50485K202O8216J05059m4720
95C01921k30723j97858p0364l5713o7689K1928J75862K14465J03493J3251L51
106B28924k1300j08748j59144j06061k0190J813k755M9893J33929J42448O1015
$$ plain form
117 199824 186400 160832 122905 26690 -106213 -187426 -184579 -148656 -109959 -30867 89963 172407
129 172407 166635 122940 92083 39507 -62763 -148801 -146914 -96948 -75962 -61239 13237 117673
141 117673 154249 114717 72926 48882 -8273 -97461 -142017 -111941 -64525 -37889 2501 71522
153 71522 117279 103185 67319 44293 9745 -56725 -110352 -105033 -64217 -32251 -4582 42479
165 42479 86889 90675 60392 32413 11100 -23829 -65934 -84098 -69214 -42085 -13835 22963
177 22963 61836 79621 65966 37311 8264 -20680 -48405 -63275 -57397 -37962 -13389 11782
189 11782 37424 54666 56379 41862 17404 -10291 -34181 -48632 -50845 -39460 -18053 7435
201 7435 28117 40341 44106 37726 20667 -2548 -23071 -35501 -39864 -36229 -21807 -213 19859
$$ packed form
117A99824j3424k5568l7927r6215j32903q1213K847L5923L8697P9092J20830Q2444
129A72407n772m3695l0857n2576j02270q6038J887M9966K0986J4723P4476J04436
141A17673L6576l9532m1791k4044n7155q9188m4556L0076M7416K6636M0390O9021
153G1522M5757j4094l5866k3026l4548o6470n3627N319M0816L1966K7669M7061
165D2479M4410L786l0283k7979k1313l4929m2105j8164J4884K7129K8250L6798
177B2963L8873J7785j3655k8655k9047k8944k7725j4870N878J9435K4573K5171
189A1782K5642J7242J713j4517k4458k7695k3890j4451k213J1385K1407K5488
201G435K0682J2224L765o380j7059k3215k0523j2430m363L635J4422K1594K0072
$$ plain form
214 19859 31389 35601 32792 21205 2391 -15868 -27000 -31439 -30204 -21010 -4954 11941 22922
227 22922 28232 27648 20599 7008 -8609 -19587 -25502 -25744 -19306 -7272 6194 16638 22486 23552
241 23552 18335 7986 -4034 -13263 -19545 -22010 -18199 -8681 2221 11311 17391 20207 16879 8604
255 8604 -1106 -9110 -14854 -17729 -15823 -9108 -314 6519 12295 16197 15441 9276 1268 -5997 -10835
270 -10835 -14253 -14307 -9125 -2064 4623 9325 12526 12735 9394 2892 -3668 -7700 -10796 -11860 -8940 -3490
286 -3490 2843 7004 9301 10367 8515 3875 -1738 -5999 -8341 -9227 -8128 -4298 827 4991 7469
301 7469 8365 7613 4405 -3 -4254 -6726 -7452 -6842 -4108 -568 3343 6020 6674 6162 4368 1150 -2418
318 -2418 -4890 -6082 -5705 -4219 -1716 1827 4506 5345 5070 4086 1401 -1517 -4192 -4831 -4864 -3715 -1857
$$ packed form
214A9859J1530M212k809j1587j8814j8259j1132m439J235R194J6056J6895J0981
227B2922N310n84p049j3591j5617j0978n915k42O438J2034J3466J0444N848J066
241B3552n217j0349j2020r229o282k465L811R518J0902R090O080K816l328q275
255H604r710q004n744k875J906O715Q794O833N776L902p56o165q008p265m838
270a0835l418n4N182P061O687M702L201K09l341o502o560m032l096j064K920N450
286c490O333M161K297J066j852m640n613m261k342q86J099L830N125M164K478
301G469Q96p52l208m408m251k472p26O10K734L540L911K677O54n12j794l218l568
318b418k472j192L77J486K503L543K679Q39k75r84k685k918k675o39l3J149J858
$$ plain form
335 -1857 504 3062 4432 4563 3588 2038 -220 -2538 -4012 -4158 -3229 -1888 136 1887 3577 3861
351 3861 3076 1755 88 -1815 -3227 -3536 -2917 -2051 -356 1265 2445 3111 3048 1721 378 -948 -2048
368 -2048 -2942 -2565 -1809 -457 724 1711 2535 2144 1734 527 -583 -1604 -1987 -2305 -1507 -989 117 1268
386 1268 2018 2063 1643 729 -73 -1262 -1777 -1786 -1348 -658 33 686 1509 1703 1444 859 44 -745 -1343 -1467 -1256
407 -1256 -633 -348 608 824 1269 1315 1029 475 -223 -1023 -1250 -1229 -915 -318 -14 570 1150 1157 897 220 160 -726
429 -726 -916 -926 -633 -336 -61 576 728 1099 722 577 -90 -386 -657 -1024 -708 -442 -71 280 532 572 849
450 849 393 72 -68 -355 -607 -671 -446 -304 282 180 658 738 470 246 -4 -181 -515 -702 -247 -138 10
471 10 387 317 596 385 237 -117 -142 -487 -243 -656 -341 -114 167 531 431 263 118 34 -93 -120 -44 -264
$$ packed form
335a857K361K558J370J31r75j550k258k318j474j46R29J341K024J751J690K84
351C861p85j321j667j903j412l09O19Q66J695J621J180O66o3j327j343j326j100
368b048q94L77P56J352J181R87Q24l91m10j207j110j021l83l18P98N18J106J151
386A268P50M5m20r14q02j189n15rM38O90O91O53Q23J94k59n85q15p89n98j24K11
407a256O23K85R56K16M45M6k86n54o98q00k27K1L14N97L04N84N80Pk60o77o0q86
429g26j90j0K93K97K75O37J52L71l77j45o67k96k71l67L16K66L71L51K52M0K77
450H49m56l21j40k87k52o4K25J42N86j02M78Q0k68k24k50j77l34j87M55J09J48
471A0L77p0K79k11j48l54k5l45K44m13L15K27K81L64j00j68j45q4j27k7P6k20
$$ plain form
493 -264 -80 91 26 171 292 174 349 176 -27 -302 -236 -147 -7 -177 -51 117 258 159 -63 -87 188 -148
515 -148 54 -365 -84 -63 20 148 354 503 204 -54 1 -160 -322 -9 -65 -214 57 106 32 491 26 -111
537 -111 -413 87 -113 -252 -195 63 102 103 293 72 -2 28 167 -74 3 -154 291 15 63 -85 159 -18 91
560 91 386 101 5 -8 2 -99 42 -123 -247 88 347 100 4 407 -44 -95 -10 59 -189 70 -143 184 114
583 114 291 300 16 2 12 -30 18 -241 164 -73 13 -96 86 197 101 143 77 -201 -55 -9 -94 -64 -193 72 -3
608 -3 55 -70 103 180 -83 35 50 134 -134 -16 -165 55 305 108 109 -139 102 -175 -131 -213 -166 57 74 -12 106
633 106 -40 261 -129 -26 131 -166 123 284 36 -116 174 -168 -49 -24 94 171 270 -107 98 311 242 -240
655 -240 172 97 -68 63 -150 -42 184 0 -186 -136 66 -10 -161 4 187 136 -2 94 -1 143 7 3 -16
$$ packed form
493b64J84J71o5J45J21j18J75j73k03k75O6Q9J40j70J26J68J41r9k22k4K75l36
515a48K02m19K81K1Q3J28K06J49k99k58N5j61j62L13n6j49K71M9p4M59m65j37
537a11l02N00k00j39N7K58L9JJ90k21p4L0J39k41P7j57M45k76M8j48K44j77J09
560I1K95k85r6j3J0j01J41j65j24L35K59k47r6M03m51n1Q5O9k48K59k13L27p0
583A14J77Rk84j4J0m2M8k59M05k37Q6j09J82J11r6M2o6k78J46M6q5L0j29K65p5
608cN8j25J73P7k63J18J5Q4k68J18j49K20K50j97Jk48K41k77M4q2M7K23J7q6J18
633A06j46L01l90J03J57k97K89J61k48j52K90l42J19K5J18P7R9l77K05K13o9m82
655b40M12p5j65J31k13J08K26j84j86N0K02p6j51J65J83n1j38R6r5J44j36mj9
$$ plain form
678 -16 43 -69 -55 207 -63 359 -198 25 -166 100 -152 177 -63 -155 144 -30 51 -79 4 -31 5 39 143
701 143 39 -128 47 -74 379 237 8 1 92 -39 -63 -119 128 184 251 25 202 140 -13 -168 -7 92 -104
724 -104 -185 -60 -72 253 -255 -72 165 -95 145 -35 -134 41 141 236 -155 -5 9 201 -146 -67 162 9
746 9 20 26 114 -71 53 168 215 142 -19 -58 -191 -95 -125 233 454 117 -130 29 -243 -77 186 0 125 19
770 19 74 30 76 -106 170 -65 -102 228 -51 -158 49 100 126 268 2 227 -35 88 -94 -76 -2 109 -261
793 -261 -19 -34 105 113 -159 74 30 -184 -46 -176 80 -143 85 -55 3 71 -25 56 -38 107 -51 34 102 222
817 222 166 63 -111 39 -38 -206 -39 -165 -17 85 144 -28 -123 1 90 -85 -243 -91 -331 206 -56 137
839 137 -27 135 -336 -164 8 -7 47 -68 -172 85 60 159 -234 129 55 61 84 -104 104 73 -184 79 -18 -63
$$ packed form
678a6N9j12J4K62k70M22n57K23j91K66k52L29k40r2K99j74Q1j30Q3l5L6L4J04
701A43j04j67J75j21M53j42k29pR1j31k4n6K47N6O7k26J77o2j53j55J61R9j96
724a04q1J25j2L25n08J83K37k60K40j80r9J75J00R5l91J50J4J92l47P9K29j53
746IJ1OQ8j85J24J15M7p3j61l9j33R6l0L58K21l37k47J59k72J66K63j86J25j06
770A9N5m4M6j82K76k35l7L30k79j07K07N1K6J42k66K25k62J23j82J8P4J11l70
793b61K42j5J39Qk72K33m4k14J38j30K56k23K28j40N8O8r6Q1r4J45j58Q5O8J20
817B22n6j03j74J50p7j68J67j26J48J02N9j72r5J24Q9j75j58J52k40N37k62J93
839A37j64J62m71J72J72j5N4j15j04K57k5R9l93L63p4OK3j88K08l1k57K63r7m5
$$ plain form
863 -63 251 -276 -120 -84 197 -59 210 -35 -89 93 -147 -240 -113 -46 193 -84 53 156 -117 164 172 -96 -392
886 -392 -88 -83 65 -30 74 -137 145 -78 -255 25 1 96 -261 22 4 -103 -266 56 336 -31 -14 -107 -6
909 -6 63 22 56 54 34 -173 -20 -136 84 -135 115 -34 -157 251 161 43 191 -6 54 -37 -32 208 -43 69 153
934 153 -46 95 190 175 -12 147 -94 -20 -208 72 193 238 -143 159 119 -67 -152 -122 10 23 274 -43 -41 32
958 32 -55 -88 -79 -379 160 -145 -28 36 -213 -222 -11 -19 -84 335 -35 -82 163 354 124 -206 79 -141 -171 -179 8
983 8 158 147 156 24 -13 1 182 -25 -172 57 -160 -30 213 135 78 101 26 59 123 29 114 -98 167 189 34 -27
1009 -27 60 77 10 -28 -19 -45 76 58 -89 37 112 -53 0 13 -48 43 -130 39 106 -102 -98 -66 131 -81 50 32
1035 32 165 -46 -106 -54 108 -36 57 81 -125 42 -129 -2 72 51 94 105 27 83 -92 -12 -140 -184 194 -118
$$ packed form
863f3L14n27J56L6K81k56K69k45n4J82k40r3J27O7K39k77J37J03k73K81Qk68k96
886c92L04NJ48r5J04k11K82k23j77K80k4R5l57K83j8j07j63L22K80l67J7r3J01
909fO9m1L4kk0k07J53j16K20k19K50j49j23M08r0j18J48j97O0r1NK40k51J12Q4
934A53j99J41R5j5j87J59k41P4j88K80J21M5l81L02m0j86q5L0J32J3K51l17KP3
958C2q7l3Rl00N39l05J17O4k49rK11qo5M19l70m7K45J91k30l30K85k20l0qJ87
983HJ50j1Rj32l7J4J81k07j47K29k17J30K43p8n7K3p5L3O4r4Q5k12K65K2j55o1
1009b7Q7J7o7l8Rk6J21j8j47J26P5j65N3J3o1R1j73J69O7k08ML2J97k12J31j8
1035C2J33k11o0N2J62j44R3K4k06J67j71J27P4k1M3J1p8N6j75Q0j28m4L78l12
$$ plain form
1059 -118 185 -29 163 -41 83 44 -203 -7 -86 -89 183 189 -69 -9 70 -51 -237 65 -275 196 -9 -101 -98 -138
1083 -138 58 -189 55 -29 -140 -144 -3 -104 222 15 -33 -145 -81 -278 -117 245 -230 -219 -28 -307 -5 -156
1105 -156 63 -18 85 32 288 16 -1 -173 -207 -129 -148 -142 -19 -58 -102 -56 87 -129 34 0 -71 86 -1 -11 10
1130 10 181 -27 -13 -25 154 -113 -54 36 -124 23 100 43 -200 18 172 158 226 -95 -87 -52 -105 223 -114 -49 -321
1155 -321 191 32 -10 -76 -53 -31 25 184 -142 123 -103 139 113 -12 -71 -48 -33 -78 -40 89 -127 -135 75 -86
1179 -86 199 47 -159 97 -6 -121 -226 129 -247 -92 -149 -55 111 76 196 -22 255 92 230 87 -96
1200 -96 -326 -76 42 0 -38 180 -13 63 -24 159 46 100 56 83 -13 280 184 -114 86 -125 238 -221 -70
1223 -70 -74 -57 28 58 -60 -248 121 -71 -227 161 158 160 -7 -192 -15 -69 -187 -62 -74 55 223 134 -72 -220
$$ packed form
1059a18L03k14J92k04J24l9k47J96p9lK72Ok58O0P9j21j86L02l40M71k05r2Lm0
1083a38J96k47K44q4j11mJ41j01L26k07m8j12O4j97J61L62m75J1J91k79L02j51
1105a56K19q1J03n3K56k72j7j72l4P8j9OJ23l9m4M6J43k16J63l4p1J57q7j0K1
1130A0J71k08J4j2J79k67N9R0j60J47P7n7k43K18J54j4O8l21QL5n3L28l37O5k72
1155c21N12j59m2o6K3K2N6J59l26K65k26K42k6j25n9K3J5m5L8J29k16qK10j61
1179h6K85j52k06K56j03j15j05L55l76J55n7R4J66l5J20k18K77j63J38j43j83
1200i6k30K50J18m2l8K18j93P6q7J83j13N4m4K7r6K93r6k98K00k11L63m59J51
1223g0mJ7Q5L0j18j88L69j92j56L88lKj67j85J77n4j18J25j2J29J68q9k06j48
$$ plain form
1247 -220 -199 -34 -154 95 -266 199 107 235 25 21 0 38 108 202 1 67 -68 -21 -124 -269 70 17 -160 49
1271 49 -86 139 109 -35 112 93 36 -109 196 -6 77 -1 245 -39 92 -209 119 201 -15 70 120 27 58 336
1295 336 -123 109 87 -275 -74 4 -19 -44 121 179 -82 48 -208 1 11 16 204 42 129 -8 88 35 233 -134
1319 -134 98 -59 84 17 -230 -285 -84 -94 -65 13 -108 13 118 -38 115 -106 15 -38 -130 -93 75 -30 124
1342 124 -270 -190 -14 -40 -179 -365 -77 -219 -203 -99 -15 92 58 -21 -62 134 -137 -34 -182 271 -275 101
1364 101 -50 -135 228 62 -138 178 143 146 125 -143 -120 -136 61 -83 20 78 -92 299 155 74 -285 54 116
1387 116 -17 203 120 -47 -213 -322 -162 173 16 141 167 136 -161 105 36 47 -108 -238 69 -24 -53 -215
1409 -215 143 110 -202 15 29 58 -269 86 253 211 -41 115 -40 96 139 -78 -11 338 -92 -27 17 -267 -24
$$ packed form
1247b20K1J65j20K49l61M65r2J28k10mk1L8P0R4k01O6j35M7j03j45L39n3j77K09
1271D9j35K25l0j44J47j9n7j45L05k02Q3p8K46k84J31l01L28Q2k16Q5N0r3L1K78
1295C36m59K32k2l62K01P8k3k5J65N8k61J30k56K09J0NJ88j62Q7j37R6n3J98l67
1319a34K32j57J43o7k47n5K01j0K9P8j21J21J05j56J53k21J21n3r2L7J68j05J54
1342A24l94Q0J76k6j39j86K88j42J6J04Q4J07l4p9m1J96k71J03j48M53n46L76
1364A01j51q5L63j66k00L16l5Lk1k68K3j6J97j44J03N8j70L91j44q1l59L39O2
1387A16j33K20q3j67j66j09J60L35j57J25K6l1k97K66o9J1j55j30L07r3k9j62
1409b15L58l3l12K17J4K9l27L55J67m2k52J56j55J36M3k17O7L49m30O5M4k84K43
$$ plain form
1432 -24 -38 0 187 123 172 165 -146 -98 -34 -63 27 3 6 121 96 171 70 -113 -169 -194 188 -171 -13 -230 104 10
1458 10 -296 -134 27 -23 85 -185 204 164 -13 -122 -176 -50 144 12 -51 -4 26 -390 -318 69 -151 126 -13
1481 -13 72 97 88 -172 59 42 27 -35 58 119 -87 134 -70 79 62 -1 -62 136 -146 126 -223 129 20 98 -73
1506 -73 -196 -240 -115 21 72 128 -44 -9 11 -47 0 -243 -22 289 -233 -224 -87 102 -91 143 67 -196 -220 -52
1530 -52 -138 -124 50 21 -8 -66 -13 -61 139 228 -48 -136 39 -137 -189 -21 59 -23 188 195 -9 -3 1 21 66 161 -151
1557 -151 -6 -401 141 -3 154 108 162 -111 11 28 -59 18 -140 -40 -76 318 30 261 163 35 -157 -232 320
1580 320 -93 -161 40 171 -93 104 155 73 217 -292 -138 28 130 -178 -164 -1 21 -147 -139 -174 -68 87 187
1603 187 114 -36 -220 -189 -56 -12 41 137 -216 -30 4 261 219 136 -111 0 -69 33 136 -218 118 153 -261
$$ packed form
1432b4j4L8J87o4M9pl11M8O4k9R0k4LJ15k5P5j01j83n6k5L82l59J58k17L34r4
1458A0l06J62J61n0J08k70L89m0j77j09n4J26J94j32o3M7L0m16P2L87k20K77j39
1481a3Q5K5rk60K31j7j5o2R3O1k06K21k04J49j7o3o1J98k82K72l49L52j09P8j71
1506g3j23m4J25J36N1N6j72L5K0n8M7k43K21L11n22RJ37J89j93K34p6k63k4J68
1530e2q6J4J74k9k9n8N3m8K00Q9k76q8J75j76n2J68Q0q2K11Pk04OMK0M5R5l12
1557a51J45l95N42j44J57m6N4k73J22J7q7P7j58J00l6L94k88K31r8j28j92p5N52
1580C20m13o8K01J31k64J97N1q2J44n09J54J66J02l08J4J63K2j68Ql5J06J55J00
1603A87p3j50j84L1J33M4N3R6l53J86L4K57m2q3k47J11o9J02J03l54L36L5m14
$$ plain form
1626 -261 71 139 31 144 201 11 -126 -209 -122 -278 -9 27 12 -134 -77 -151 158 -154 -34 241 -190 -64 184
1649 184 183 45 162 146 156 -60 362 188 23 -264 -70 349 65 -221 -96 109 112 -55 63 77 -12 -83 -256
1672 -256 48 133 -289 88 89 152 -93 -166 -185 -146 -39 300 -67 -198 -145 -109 212 110 -147 180 4 65 70 71 -74
1697 -74 189 -37 -194 -31 13 -117 6 348 -143 72 -7 175 93 141 -155 -120 59 73 -82 156 161 42 -34
1720 -34 14 116 -88 151 38 -290 229 178 -10 204 -186 -330 51 -27 0 117 -156 -7 -181 -111 71 -71
1742 -71 59 100 -103 -76 91 -319 38 -315 -40 -144 178 112 -277 138 -111 160 261 49 -85 78 96 -305
1764 -305 -17 27 159 -68 45 1 -116 44 35 48 -79 -310 -10 106 55 43 -141 279 27 37 51 -300 -21
1787 -21 155 -65 108 -60 -242 -24 72 -18 113 155 95 90 -46 -318 -120 322 39 107 30 174 -6 58 29 -141
$$ packed form
1626b61L32O8j08J13N7j90j37q3Q7j56K69L6j5j46N7p4L09l12J20K75m31J26K48
1649A84jj38J17j6J0k16M22j74j65k87J94M19k84k86J25K05Lj67J18J4q9p1j73
1672b56L04Q5m22L77JO3k45p3j9L9J07L39l67j31N3L6L21j02k57L27j76O1NJj45
1697g4K63k26j57J63M4j30J23L42m91K15p9J82q2M8k96L5J79J4j55K38Nj19p6
1720c4M8J02k04K39j13l28N19n1j88K14l90j44L81p8K7J17k73J49j74P0J82j42
1742g1J30M1k03K7J67m10L57l53K75j04L22o6l89M15k49K71J01k12j34J63J8m01
1764c05K88M4J32k27J13m4j17J60rJ3j27k31L00J16n1j2j84M20k52J0J4l51K79
1787b1J76k20J73j68j82K18R6r0J31M2o0nj36k72J98M42k83O8p7J44j80O4k9j70
$$ plain form
1811 -141 -77 196 20 167 180 -162 142 21 8 89 -73 -2 -309 2 57 -322 -193 -110 127 -191 -84 -132 37
1834 37 121 118 -97 -120 -209 -114 -184 92 -125 -46 124 -1 -78 36 -142 149 -106 -244 36 -9 -27 23 71 -116 103
1859 103 108 -180 -107 -126 -187 -105 62 37 -54 46 -68 -80 -15 -69 -34 -142 89 -87 -55 -223 -91 42 7 -83 -44
1884 -44 153 -318 -179 184 -175 81 44 150 59 94 -22 76 138 226 157 -28 -216 -145 -137 -57 91 323 -43 204
1908 204 98 -49 -168 -241 -283 -277 -21 -41 -11 160 100 34 -45 51 69 -3 49 -50 -109 -25 44 193 65 87 40 -253
1934 -253 -335 58 -239 -226 348 91 -105 -91 -113 -35 7 -85 97 -6 198 9 -52 -91 -46 -160 -32 107 -84
1957 -84 -14 58 52 108 -115 -226 -107 -67 116 -30 2 266 341 153 -80 23 163 -150 60 22 -64 155 54 -96
1981 -96 144 -2 280 42 -87 -53 90 -48 -205 127 -429 345 -97 -10 -9 -3 -39 -215 -177 -75 -66 0 209 -143
$$ packed form
1811a41O4K73j76J47J3l42L04j21j3Q1j62P1l07L11N5l79J29Q3K37l18J07m8J69
1834C7Q4lk15k3q9R5p0K76k17P9J70j25p7J14j78K91k55j38K80m5j8N0M8j87K19
1859A03Nk88P3j9o1Q2J67k5r1J00j14j2O5n4L5j08K31j76L2j68J32J33l5r0L9
1884d4J97m71J39L63l59K56l7J06r1L5j16R8O2Q8o9j85j88P1QQ0J48K32l66K47
1908B04j06j47j19p3m2OK56k0L0J71o0o6p9R6J8p2N2r9n9Q4O9J49j28K2m7k93
1934b53q2L93k97J3N74k57j96J4k2P8M2r2J82j03K04j89o1l9M5j14J28J39j91
1957h4P0P2oN6k23j11J19M0J83j46L2K64P5j88k33J03J40l13K10l8q6K19j01j50
1981i6K40j46K82k38j29L4J43j38j57L32n56P74m42Q7JOl6j76L8J02RO6K09l52
$$ plain form
2005 -143 -284 -201 -202 161 -201 -96 71 -36 -80 52 115 90 103 2 44 213 -157 -191 -53 342 156 106 -228
2028 -228 -17 0 -146 186 -101 -51 2 109 -175 -26 -32 -138 72 -141 83 0 -201 273 -116 -123 57 19 -223
2051 -223 -172 78 242 91 -148 -160 -60 -158 -3 -85 -121 -273 107 -246 98 -32 153 -4 -40 -38 -102 240 -5
2074 -5 103 -29 -9 -29 14 86 -139 41 91 41 35 48 -183 -26 -113 -8 -260 -187 79 48 97 -131 -167 150 -18
2099 -18 80 4 -107 1 260 27 -148 -264 -31 -118 -10 -21 -98 -4 -13 100 -49 50 -195 34 -231 -160 -24 123
2123 123 -88 150 -77 84 21 -147 253 187 -101 -49 42 -104 81 -154 -417 46 177 120 146 182 -47 -28 2
2146 2 146 40 91 22 75 -12 4 -8 193 8 203 87 -67 35 -138 -1 -66 52 -19 -30 -9 -132 -189 72
2170 72 -325 -63 16 65 161 10 -217 -29 9 46 -1 -84 -114 111 36 -53 -231 38 137 -13 -80 -66 -213 165 -177
$$ packed form
2005a43j41Q3jL63l62J05J67j07m4J32O3k5J3j01M2J69l70l4J38L95j86n0l34
2028b28K11J7j46L32k87N0N3J07k84J49oj06K10k13K24q3k01M74l89pJ80l8k42
2051b23N1K50J64j51k39j2J00r8J55q2l6j52L80l53L44j30J85j57l6Ko4L42k45
2074eJ08j32K0k0M3P2k25J80N0n0oJ3k31J57q7J05k52P3K66l1M9k28l6L17j68
2099a8R8p6j11J08K59k33j75j16K33q7J08j1p7R4rJ13j49R9k45K29k65P1J36J47
2123A23k11K38k27J61o3j68M00o6k88N2R1j46J85k35k63M63J31n7K6L6k29J9L0
2146BJ44j06N1o9N3q7J6j2K01j85J95j16j54J02j73J37o5J18p1j1K1j23n7K61
2170G2l97K62P9M9R6j51k27J88L8L7m7q3l0K25p5q9j78K69R9j50o7J4j47L78l42
$$ plain form
2195 -177 149 99 1 -31 7 153 -64 -15 -29 276 -128 -61 58 -155 -60 165 50 -70 90 36 185 33 28 77
2219 77 -58 272 0 31 7 187 145 42 40 -114 50 137 227 30 52 -136 31 -128 -74 -72 -232 37 339 -254
2243 -254 -87 -59 -69 -30 121 75 -176 42 134 4 196 -1 156 171 -233 -178 -6 147 139 120 -136 -79 -118 57
2267 57 21 -111 10 -148 127 -228 74 -22 249 53 -28 35 17 -106 40 -172 -257 246 24 -172 1 247
2289 247 -86 100 203 117 178 -173 207 41 25 74 -228 -154 45 -115 -122 291 114 169 -29 82 -164 -16 254
2312 254 37 -52 -3 -22 244 -280 -20 184 -81 33 153 -39 240 -28 18 -139 -198 -1 -130 251 -101 -128
2334 -128 -20 146 -209 138 241 -68 -68 -83 298 -87 -9 -117 31 37 139 -25 33 -109 77 158 -164 -158 -10
2357 -10 74 135 -39 -16 99 -116 253 -111 0 82 116 -11 68 65 -288 -71 154 -30 -267 115 300 -2 212
$$ packed form
2195a77L26n0r8l2L8J46k17M9j4L05m04O7J19k13R5K25j15j20J60n4J49j52nM9
2219G7j35L30k72L1k4J80m2j03kj54J64Q7R0j97K2j88J67j59N4Kj60K69L02n93
2243b54J67K8j0L9J51m6k51K18R2j30J92j97J57J5m04N5J72J53qj9k56N7l9J75
2267E7l6j32J21j58K75l55L02r6K71j96q1O3j8j23J46k12q5N03k22j96J73K46
2289B47l33J86J03q6O1l51L80j66j6M9l02P4J99j60pM13j77N5j98J11k46J48K70
2312B54k17q9M9j9K66n24K60K04k65J14J20j92K79k68M6j57n9J97j29L81l52k7
2334a28J08J66l55L47J03l09%j5L81l85P8j08J48OJ02j64N8j42J86Q1l22OJ48
2357a0Q4O1j74K3J15k15L69l64J11Q2L4j27P9ll53K17K25j84k37L82J85l02K14
$$ plain form
2380 212 74 -126 -133 -18 -14 49 -34 -12 -87 -128 267 -147 10 -48 109 -10 56 -67 80 -71 198 55 -46 -101
2404 -101 23 9 -13 0 97 121 54 -36 43 80 67 -189 -52 -21 250 -69 188 250 93 154 327 142 78 1 222
2429 222 44 123 29 128 83 -28 -31 133 -144 3 163 -63 -175 227 47 -242 -19 74 13 -129 -144 188 79
2452 79 -41 43 -163 -56 87 95 53 129 -111 90 -93 108 125 97 -39 -106 61 52 142 -98 -335 132 -128 -28
2476 -28 -314 89 103 1 188 84 -73 229 -84 334 258 136 -36 -183 -16 3 -188 41 51 -33 30 -165
2498 -165 160 334 91 1 78 -55 -47 7 198 27 -49 -63 -1 -180 66 -141 78 -248 4 108 -56 61 -141
2521 -141 -25 -190 110 160 106 35 -326 222 148 -94 33 149 -28 -141 -207 -186 34 170 218 -60 59 -71
2543 -71 -24 25 -99 -320 49 -92 -321 206 -111 -13 -97 -107 196 -1 -280 48 81 -23 -157 121 44 152 -19
$$ packed form
2380B12j38k00pJ15MO3q3K2p5m1L95m14J57n8J57j19O6j23J47j51K69j43j01n5
2404a01J24j4k2J3R7K4o7r0P9L7j3k56J37L1K71l19K57O2j57O1J73j85o4p7K21
2429B22j78P9r4R9m5j11lJ64k77J47J60k26j12M02j80k89K23R3o1j42j5L32j09
2452G9j20Q4k06J07J43Qm2P6k40K01j83K01J7k8j36o7J67rR0k40k37M67k60J00
2476b8k86M03J4j02J87j04j57L02l13M18p6j22j72j47J67J9j91K29J0q4O3j95
2498a65L25J74k43r0P7j33QN4J91j71p6j4O2j79K46k07K19l26K52J04j64J17k02
2521a41J16j65L00N0n4p1l61N48p4k42J27J16j77j13o6K1K20J36M8k78J19j30
2543g1M7M9j24k21L69j41k29N27l17R8q4j0L03j97k79L28L3j04j34K78p7J08j71
$$ plain form
2566 -19 -100 95 140 -78 -109 15 150 -73 -85 -58 111 181 -9 143 -43 -2 104 -132 -46 -136 192 79 26 27
2590 27 60 60 49 152 30 -118 3 152 -379 -80 131 -41 -97 162 -84 -123 225 -129 -13 69 77 45 272 78
2614 78 -13 -90 -73 -65 -185 -24 84 26 -27 -45 -32 -131 32 -13 -166 46 61 141 -49 72 -75 135 104 -89 -95 136
2640 136 -135 -66 97 141 -118 -53 150 -34 -156 -53 -242 102 56 -156 43 -137 211 254 148 283 61 -60
2662 -60 -92 -34 117 48 -177 -41 -14 -172 -233 9 66 20 -51 -4 194 177 -16 -100 -196 -170 -163 24 170 102 -38 -70
2688 -70 108 76 -139 211 44 -60 -137 -80 -152 -226 35 65 99 195 79 133 15 102 -193 -37 230 87 -64 -138
2712 -138 317 -59 -45 52 103 99 -112 -173 41 -59 -60 -191 171 382 163 -50 13 -50 -85 -182 26 -16 -181 -171 42
2737 42 -64 -33 -48 -65 -60 -202 -243 156 25 122 35 230 129 -199 -18 65 -162 -208 -59 -47 126 -39 49 -143
$$ packed form
2566a9q1J95M5k18l1J24J35k23j2K7J69P0j90J52j86M1J06k36Q6r0L28j13n3J
2590B7L3%j1J03j22j48J21J49n31K99K11j72n6K59k46l9L48l54J16Q2Ql2K27j94
2614G8r1p7J7Qj20J61J08n8n3j8J3r9J63m5j53K12J5Q0j90J21j47K10l1j93oK31
2640A36k71O9J63M4k59O5K03j84j22J03j89L44m6k12J99j80L48M3j06J35k22j21
2662f0l2N8J51o9k25J36K7j58o1K42N7m6p1M7J98j7j93q4r6K6PJ87J46o8j40l2
2688g0J78l2k15L50j67j04p7N7p2p4K61L0L4R6j16N4j18Q7k95J56K67j43j51p4
2712a38M55l76J4R7N1mk11o1K14j00jj31L62K11k19k13O3o3l5r7K08m2j65J0K13
2737D2j06L1j5j7Nj42m1L99j31R7q7J95j01l28J81Q3k27m6J49J2J73j65Q8j92
$$ plain form
2761 -143 -151 121 -81 277 -99 -44 24 213 85 189 73 -199 -90 -38 77 -36 155 -227 51 -8 23 143
2783 143 358 253 -29 108 -159 -32 -158 -220 103 -161 88 16 187 60 -210 -128 169 -29 -15 82 -222 34
2805 34 24 154 42 53 20 151 -62 -12 9 330 308 -124 127 211 13 -25 -366 115 87 -22 -21 231 130 85
2829 85 125 -154 64 -168 -246 -194 -123 52 199 -48 257 -169 -30 -46 -83 -92 -110 -99 -144 143 -187 201 -17 94
2853 94 177 38 10 -15 5 17 14 -105 155 244 -191 402 168 66 78 86 -7 -152 59 -83 116 -51 -80 -1 58
2878 58 -11 -118 155 263 -115 108 60 -210 93 250 -49 -51 278 108 55 -116 13 176 62 79 38 196 -280
2901 -280 94 -251 7 -228 -150 -73 -35 -88 -77 -64 -118 -31 -60 -140 -8 205 242 66 10 115 -125 123 174 -115
2925 -115 -38 58 179 -192 -77 -320 23 9 35 210 54 126 -25 -148 106 46 -38 63 200 2 -86 -96 -92 -78
$$ packed form
2761a43qK72k02L58l76N5O8J89j28J04j16k72J09N2J15j13J91l82K78n9L1J20
2783A43K15j05k82J37k67J27j26o2L23k64K49p2J71j27k70Q2K97j98J4R7l04K56
2805C4j0J30j12J1l3J31k13N0K1L21k2m32K51Q4j98l8l41M81k8j09JK52j01m5
2829H5M0k79K18k32p8N2P1J75J47k47L05m26J39j6l7rj8J1m5K87l30L88k18J11
2853I4Q3j39k8k5K0J2lj19K60Q9m35N93k34j02J2Qr3j45K11j42J99j67k9P9N9
2878E8o9j07K73J08l78K23m8k70L03J57k99kL29j70n3j71J29J63j14J7m1J58m76
2901b80L74l45K58k35P8P7L8n3J1J3n4Q7k9q0J32K13L7j76n6J05k40K48N1k89
2925a15P7R6J21l71J15k43L43j4K6J75j56P2j51j23K54o0q4J01J37j98q8j0MJ4
$$ plain form
2949 -78 58 70 48 171 351 -41 -157 58 -119 -10 -171 71 -44 213 -34 -72 -98 44 -21 -272 209 -12
2971 -12 -195 -120 -141 -54 -42 51 -233 -42 -154 20 -263 285 -111 271 -22 138 11 -255 57 -192 20 40
2993 40 143 -83 -81 -17 -208 -31 -108 91 26 284 -82 45 115 205 202 -25 121 -77 123 78 251 80 204 17
3017 17 -41 -240 71 66 123 208 5 47 110 76 -185 154 25 -207 118 0 -30 -6 -36 66 79 5 -56 427 107
3042 107 -339 -265 54 -119 202 -270 -8 165 -146 99 -34 244 95 17 -10 11 -42 167 34 156 65 125
3064 125 59 91 67 133 20 -44 90 122 10 -200 18 -20 -75 -6 230 -97 98 35 -93 -63 -58 -35 62 95 -279
3089 -279 156 150 126 61 98 -88 -301 7 -1 221 -129 57 -77 265 -90 -96 -1 118 -34 -8 32 -84 -204 296
3113 296 -122 158 -206 -383 -128 48 126 238 -22 89 -248 -111 50 210 -85 -40 -74 -78 -130 -69 148 113 143
$$ packed form
2949g8J36J2k2J23J80l92j16K15j77J09j61K42j15K57k47l8k6J42o5k51M81k21
2971a2j83P5k1Q7J2R3k84J91j12J74k83N48l96L82k93J60j27k66L12k49K12K0
2993D0J03k26KO4j91J77p7J99o5K58l66J27P0R0lk27J46j98K00m5J73j71J24j87
3017A7n8j99L11nN7Q5k03M2O3l4k61L39j29k32L25j18l0K4l0J02J3p4o1M83l20
3042A07m46P4L19j73L21m72K62J73l11K45j33K78j49p8k7K1n3K09j33J22r1O0
3064A25o6L2k4O6j13o4J34L2j12k10K18l8n5O9K36l27J95o3j28L0NK3R7L3l74
3089b79M35ok4o5L7j86k13L08qK22l50J86j34L42l55oR5J19j52K6M0j16j20N00
3113B96m18K80l64j77K55J76P8J12k60J11l37J37J61J60k95M5l4mn2O1K17l5L0
$$ plain form
3136 143 -169 -30 144 55 26 173 159 -245 -4 -65 -17 -190 -78 192 -14 -63 275 125 -319 -125 78 -21
3158 -21 -85 131 98 -105 -108 -5 69 -187 -37 -82 -70 -21 -7 85 256 70 -141 -129 168 236 191 -69 -44 -60 212
3183 212 -73 147 54 -15 105 -98 -160 -53 -187 122 5 -65 -210 -130 48 -144 -84 166 11 144 77 -29
3205 -29 245 -61 -66 56 -14 34 -194 0 200 62 126 -134 -9 -61 -153 157 121 -228 -129 -36 150 -119 -75 -87
3229 -87 149 68 33 -24 103 -70 135 185 -138 90 -49 162 -1 10 72 -77 -63 234 -83 75 -129 -214 -205 130
3253 130 -99 226 -22 12 26 -224 33 49 120 -217 106 10 15 -168 309 10 18 -39 78 21 114 144 -117 191
3277 191 -316 86 -120 143 -194 219 113 152 204 98 120 -5 8 9 -39 -250 -42 -228 -127 140 -16 129
3299 129 172 -85 148 11 -59 -170 50 85 12 290 242 -140 -80 -113 -116 20 -55 -186 12 -149 -61 250 -82 14
$$ packed form
3136A43l12J39J74q9k9J47j4m04K41o1M8j73J12K70k06m9L38j50m44J94K03r9
3158b1o4K16l3k03lJ03P4k56J50m5J2M9J4R2J71j86k11J2K97O8m5k60K5j6K72
3183B12k85K20r3o9J20k03o2J07j34L09j17p0j45Q0J78j92O0K50j55J33o7j06
3205b9K74l06nJ22p0M8k28J94K00j38O4k60J25n2r2L10l6l49R9R3J86k69M4j2
3229h7K36q1l5n7J27j73K05N0l23K28j39K11j63J1O2j49J4K97l17J58k04q5RL35
3253A30k29L25k48L4J4k50K57J6P1l37L23r6Nj83M77k99Qn7J17n7R3L0k61L08
3277A91n07M02k06K63l37M13j06L9N2j06K2j25J3Jm8k11K08j86J01K67j56J45
3299A29M3k57K33j37p0j11K20L5p3K78m8l82O0l3lJ36p5j31J98j61Q8L11l32R6
$$ plain form
3323 14 -143 65 -53 -14 -43 -47 99 157 -48 -101 156 72 187 -97 44 -163 62 -15 55 46 204 111 -4 -58 -77
3348 -77 86 48 52 120 137 107 -121 162 -79 -103 -118 102 59 95 94 0 -49 135 109 72 120 -189 69 13 161 206 -236
3375 -236 361 151 127 177 23 -210 123 117 -108 140 -2 82 -257 -134 10 23 147 -35 74 32 -116 101
3397 101 171 18 101 -87 71 52 -2 -33 -140 -85 147 -12 163 187 -49 292 -12 -8 -73 225 -225 37 38 -72
3421 -72 -58 65 -9 83 38 199 47 -149 -101 118 56 -249 -240 -135 75 28 165 263 144 -2 344 -111 81 -149
3445 -149 112 13 122 34 120 30 45 126 28 -69 291 -16 -155 204 -45 -167 -161 -101 -31 61 -94 -269 -19 -159
3469 -159 8 -202 -156 138 -91 312 45 -71 49 117 -142 225 188 -27 -198 7 -76 -235 -53 35 6 -44
3491 -44 43 54 -260 -79 -42 -138 -75 -162 -106 -10 32 -113 72 -272 242 160 -110 24 139 226 -89 119 -38 75
$$ packed form
3323A4j57K08j18L9k9mJ46N8k05n3K57q4J15k84J41k07K25p7P0rJ58r3j15n4j9
3348g7J63l8MO8J7l0k28K83k41k4j5K20m3L6jr4m9J84k6l7M8l09K58n6J48M5m42
3375b36N97k10k4N0j54k33L33ok25K48j42Q4l39J23J44J3J24j82J09m2j48K17
3397A01P0j53Q3j88J58j9n4l1j07N5K32j59J75K4k36L41l04Mo5K98m50K62Jj10
3421g2J4J23p4R2m5J61j52j96M8K19o2l05RJ05K10m7J37R8j19j46L46m55J92k30
3445a49K61r9J09q8Q6r0J5Q1r8r7L60l07j39L59k49j22OO0P0R2j55j75K50j40
3469a59J67k10M6K94k29M03k67j16J20O8k59L67l7k15j71K05q3j59J82Q8k9n0
3491d4Q7J1l14J81L7r6O3q7N6R6M2j45J85l44N14q2k70J34J15Q7l15K08j57J13
$$ plain form
3515 75 -14 258 114 95 -135 -373 -14 -147 -92 39 -313 -96 29 94 132 -18 -5 216 7 37 -50 54 -80
3538 -80 68 48 45 120 -242 268 -36 -98 120 94 -80 210 -44 -123 -160 244 -174 254 21 269 277 -5 129 209
3562 209 -124 -135 118 9 -53 223 95 85 253 -189 -89 45 18 -52 -183 -153 8 234 188 121 166 -5 141
3585 141 10 -10 -60 217 54 250 -123 -75 -290 -166 114 6 135 133 40 23 79 -92 -18 104 -50 -185 52
3608 52 16 -118 -45 275 45 151 -180 -61 -75 78 -59 -73 72 80 114 307 154 -79 142 187 -184 13 -67
3631 -67 220 97 -170 -149 -40 -12 45 -45 -267 101 -54 367 -177 -86 -19 95 -79 133 -74 -238 -93 0 -177
3654 -177 131 -81 166 -37 -89 -64 83 -85 56 94 -209 189 83 3 41 53 -53 221 180 -103 -155 115 204
3677 204 127 -37 129 -113 -32 -226 -45 138 166 201 -78 -49 180 225 -125 -36 140 -112 31 142 185 -13 23
$$ packed form
3515G5q9K72j44j9k30k38L59j33N5J31l52K17J25O5L8j50J3K21k09L0q7J04j34
3538h0J48k0lP5l62N10l04o2K18k6j74K90k54p9l7M04m18M28k33K48Qk82J34Q0
3562B09l33j1K53j09o2K76j28j0J68m42J00J34k7p0j31L0J61K26m6o7M5j71J46
3585A41j31k0n0K77j63J96l73M8k15J24K80j08J29kr3j7N6j71P4J22j54j35K37
3608E2l6j34P3L20k30J06l31J19j4J53j37j4J45QL4J93j53k33K21M5l71J97q0
3631f7K87j23k67K1J09K8N7r0k22L68j55M21n44R1O7J14j74K12k07j64J45R3j77
3654a77L08k12K47k03n2K5J47j68J41L8l03L98j06q0L8J2j06K74m1k83n2K70Q9
3677B04p7j64J66k42Q1j94J81J83K8L5k79K9K29M5l50Q9J76k52J43J11M3j98L6
$$ plain form
3700 23 -36 -110 -72 78 154 69 197 102 -156 162 -111 -150 359 -175 105 60 -293 5 -71 -110 -37 33 -304 -185
3724 -185 -120 0 98 -323 81 -110 -55 -222 -292 -222 -20 111 -24 86 -138 331 -72 119 20 -52 -99 -68 207
3747 207 122 214 -129 -143 40 129 -109 129 43 -83 218 101 47 -7 -62 -76 109 44 -15 76 207 77 -173 300
3771 300 9 140 -75 7 323 177 -100 58 -163 -122 49 121 -157 159 -164 -220 218 184 -287 -53 -38 -28
3793 -28 -76 -83 -164 -189 275 -202 17 -21 -66 -213 88 -153 -92 22 -12 -23 184 -206 163 19 -82 -43 44 7 38
3818 38 -46 115 -81 -47 131 261 147 -61 -100 -250 -56 132 129 -11 27 -52 46 53 114 63 155 -134 -31 -253 -112
3843 -112 30 -6 -215 -238 133 39 -16 -68 93 -55 -201 27 202 -79 32 -18 -72 -94 67 -5 103 95 -230 84
3867 84 -21 -28 -30 25 125 175 76 64 109 -55 -3 53 139 65 86 119 -41 176 161 -235 94 -242 -132 140 192 -185
$$ packed form
3700B3n9p4L8J50P6q5J28r5k58L18k73l9N09n34K80m5l53K98p6l9P3P0l37J19
3724a85O5J20R8m21M04j91N5j67p0P0K02J31j35J10k24M69m03J91r9p2m7L1K75
3747B07q5R2l43j4J83Q9k38K38q6j26L01j17n4n4n5j4J85o5n9R1J31j30k50M73
3771C00k91J31k15Q2L16j46k77J58k21M1J71P2k78L16l23n6M38l4m71K34J5J0
3793b8m8pq1k5M64m77K19l8m5j47L01k41O1J14l4j1K07l90L69j44j01L9Q7l7L1
3818C8q4J61j96L4J78J30j14k08l9j50J94J88lj40L8p9R8PO1n1R2k89J03k22J41
3843a12J42l6k09k3L71r4n5n2J61j48j46K28J75k81J11n0n4k2J61p2J08ql25L14
3867H4j05pkN5J00N0r9j2M5j64N2N6Q6p4K1L3j60K17j5l96L29l36J10K72N2l77
$$ plain form
3893 -185 -81 94 -7 -198 6 -305 -110 -227 -167 144 -96 -131 61 -86 45 -18 -140 17 -183 -212 -78
3914 -78 -200 175 107 -165 -113 30 149 120 102 52 -108 264 118 101 132 -51 -21 4 126 -115 -29 -161 -168 -109 -135
3939 -135 -318 -122 -294 24 -2 -153 101 -245 238 -9 -240 -2 46 -3 154 214 90 -157 -31 -38 238 30
3961 30 127 57 -101 44 -219 99 81 119 -126 -43 234 -202 202 -97 -120 170 49 -91 -37 -45 24 65 108 134 202
3986 202 -282 -45 -50 -22 190 -29 85 72 -7 53 -118 292 108 33 14 11 205 6 24 -15 98 70 -102 55
4010 55 -206 -150 216 174 -47 119 -59 -109 113 -46 223 23 214 -50 -229 -47 255 -166 77 167 6 76
4032 76 22 -311 92 -27 -147 9 27 57 -130 94 73 -78 197 -148 2 126 94 -60 -18 -62 -70 208 -127
4055 -127 94 -9 -115 32 226 81 -62 -9 -113 133 -85 -124 -50 127 -65 101 -163 -109 155 -170 -16
$$ packed form
3893a85J04J75j01j91K04l11J95j17O0L11k40l5J92j47J31o3j22J57k00k9J34
3914g8j22L75o8k72N2J43J19k9j8n0j60L72j46j7L1j83L0K5J22k41Q6j32pN9k6
3939a35j83J96j72L18k6j51K54l46M83k47k31K38M8m9J57O0j24k47J26pK76k08
3961C0R7p0j58J45k63L18j8L8k45Q3K77m36M04k99k3K90j21j40N4qO9M1M3K6O8
3986B02m84K37nK8K12k19J14j3p9O0j71M10j84p5j9lJ94j99J8l9J13k8j72J57
4010E5k61N6L66m2k21J66j78n0K22j59K69k00J91k64j79J82L02m21K43R0j61P0
4032G6n4l33M03j19j20J56J8L0j87K24k1j51K75l45J50J24l2j54M2m4qK78l35
4055a27K21j03j06J47J94j45j43N3j04K46k18l9P4J77j92J66k64N4K64l25J54
$$ plain form
4076 -16 14 -99 -127 63 -50 14 57 153 -266 67 -80 233 -97 -93 -255 -267 30 262 -111 90 120 -57 -150 81
4100 81 86 -82 171 -8 166 9 -27 -30 -134 -199 -34 224 101 -290 -68 152 -74 -15 141 -98 144 61 -108
4123 -108 -128 157 284 100 -77 190 377 83 -86 182 -9 -102 70 111 -8 101 -69 -85 -162 105 -29 4
4145 4 1 -73 385 -53 156 -24 319 -35 -83 -127 -148 16 50 114 -28 -129 -61 -42 -97 -163 -257 -120 -19 279 -58
4170 -58 72 -69 -297 205 15 68 26 -79 -9 28 2 109 195 -41 -368 53 -136 19 -236 88 -184 -75
4192 -75 69 -216 10 114 32 56 114 13 17 -95 -122 -60 -86 109 83 -34 164 149 224 46 16 5 -102 -128 23
4217 23 125 300 -248 -72 50 -10 48 -61 -132 -22 -234 19 -152 -263 -34 -68 6 7 85 384 -29 -82 -78 60
4241 60 276 -25 433 -94 -167 10 -35 178 -36 -244 -99 102 35 -77 -4 45 -176 36 115 -103 70 -146
$$ packed form
4076a6L0j13k8J90j13O4M3R6m19L33j47L13l30Mj62j2K97K32l73K01L0j77r3K31
4100H1Nj68K53j79J74j57l6lj04o5J65K58j23l91K22K20k26N9J56k39K42q3j69
4123a08k0K85J27j84j77K67J87k94j69K68j91r3J72M1j19J09j70j6p7K67j34L3
4145Dlp4M58m38K09j80L43l54m8m4k1J64L4O4j42j01O8J9n5o6r4J37J01K98l37
4170e8J30j41k28N02j90N3m2j05P0L7k6J07Q6k36l27M21j89J55k55L24k72J09
4192g5J44k85K26J04q2K4N8j01Mj12k7O2k6J95k6j17J98j5P5j78l0j1j07k6J51
4217B3J02J75n48J76J22o0N8j09p1J10k12K53j71j11K29l4P4JP8K99m13n3MJ38
4241F0K16l01M58n27p3J77m5K13k14k08J45K01o7j12P3M9k21K12P9k18J73k16
$$ plain form
4263 -146 -9 -71 -121 204 98 137 -49 -69 3 22 119 294 53 -162 69 282 -107 138 70 -75 36 107 -91
4286 -91 76 189 -43 -36 110 1 -98 -214 -169 87 29 -191 346 -53 -19 157 -8 -59 -24 22 -70 46 18 -24
4310 -24 -142 -343 32 -72 -118 -120 158 -14 83 36 134 -174 10 83 -22 -109 -77 30 -32 -38 -32 -1 156 29 -58 292
4336 292 -122 -160 -173 14 62 -11 -87 -24 81 85 18 12 -142 -7 -71 -114 138 -153 46 109 -3 16 174 -23 152
4361 152 -202 182 -223 -5 165 114 -170 -97 1 -162 205 9 -148 -332 63 232 -137 -42 -73 97 -163 178
4383 178 -113 -43 -150 -33 10 129 -2 76 -72 -208 5 -4 125 -95 49 -8 108 192 241 28 -128 -37 115
4406 115 -112 80 18 205 0 -6 -245 16 198 69 -149 -178 101 52 -99 158 16 -64 29 -148 -277 -47
4428 -47 223 -88 47 70 -290 -157 -113 124 50 -331 -66 -332 89 159 142 21 -137 117 -25 5 30 36 -63 -69
$$ packed form
4263a46J37o2n0L25j06L9j86k0P2J9R7J75k41k15K31K13l89K45o8j45J11P1j98
4286i1J67J13k32PJ46j09r9j16M5K56n8k20N37l99L4J76j65n1L5M6r2J16k8m2
4310b4j18k01L75j04m6kK78j72R7m7R8l08J84P3j05q7L2J07o2oOL1J57j27q7L50
4336B92m14l8j3J87M8p3p6O3J05Mo7oj54J35o4m3K52k91J99O3j12J9J58j97J75
4361A52l54L84m05K18J70n1k84P3R8j63L67j96j57j84L95J69l69R5l1J70k60L41
4383A78k91P0j07J17M3J19j31P8j48j36K13rJ29k20J44n7J16Q4M9k13j56R1J52
4406A15k27J92o2J87k05ok39K61J82j29k18k9K79m9j51K57j42q0R3j77j29K30
4428d7K70l11J35K3l60J33M4K37p4l81K65k66M21P0j7j21j58K54j42L0K5Or9o
$$ plain form
4452 -69 -55 189 -116 -156 57 103 -30 38 -32 2 -120 105 164 50 -37 131 -24 -23 96 -11 -52 215 -145 292
4476 292 131 312 14 -28 -78 -268 231 -3 14 -68 66 35 48 240 -14 -140 -12 0 -78 -32 230 75 -57
4499 -57 -69 -103 -70 108 23 33 167 -220 -4 -3 -308 411 -126 132 20 -250 38 -127 -119 -97 -20 78 58 30 55
4524 55 -145 -65 18 75 -34 -149 104 -98 572 218 29 98 -142 -64 94 -59 -31 -120 175 177 30 100 -174 -121
4548 -121 10 16 -16 -82 139 -71 85 104 120 -35 -237 -180 18 34 22 316 -100 -165 1 -6 7 -167 -64 2 -208
4573 -208 -8 246 -210 -65 -121 28 -85 -322 74 -174 -11 -75 -172 183 -73 21 106 -167 205 58 243 22
4595 22 -100 111 -12 211 359 156 78 311 -226 -84 113 105 -377 35 -1 145 172 375 -146 -90 114 -148
4617 -148 -129 -122 -215 -208 19 4 -227 -68 -274 23 346 86 -170 -27 -139 -44 101 284 -147 16 4 -73 16 201
$$ packed form
4452f9J4K44l05m0K13M6j33O8p0L4j22K25N9j14q7J68j55JJ19j07m1K67l60M37
4476B92j61J81k98m2n0j90M99k34J7q2J34l1J3J92k54j26J28J2p8M6K62j55j32
4499e7j2l4L3J78q5J0J34l87K16Jl05P19n37K58j12k70K88j65QK2P7R8k0k8K5
4524E5k00Q0Q3N7j09j15K53k02O70l54j89O9k40P8J58j53K8q9K95Kj47P0k74N3
4548a21J31Ol2o6K21k10J56J9J6j55k02N7J98J6j2K94m16o5J66pJ3j74J03O6k10
4573b08K00K54m56J45n6J49j13k37L96k48J63o4r7L55k56R4Q5k73L72j47J85k21
4595B2j22K11j23K23J48k03p8K33n37J42J97qm82M12l6J46K7K03n21N6K04k62
4617a48J9Pr3PK27j5k31J59k06K97L23k60k56J43j12R5J45J83m31J63j2p7Q9J85
$$ plain form
4641 201 -52 88 49 -95 287 -176 192 -27 87 199 -95 -204 -130 -179 18 -242 -89 243 2 -65 -112 -119
4663 -119 -154 68 -14 283 -50 -93 -243 44 -85 -146 -96 79 69 207 -13 58 -103 173 -155 -29 -212 195
4685 195 -118 -114 250 -52 -65 67 -17 18 -44 -124 111 44 -42 -74 149 -49 6 -104 -182 141 245 13 -30 -79 -24
4710 -24 61 60 -30 -142 -198 -3 -6 112 379 -58 26 91 -29 -28 130 29 -87 31 -9 -224 -91 133 -197 14
4734 14 84 6 126 13 21 152 -239 56 135 142 -37 63 136 -118 -42 36 82 -46 73 91 97 104 55 72 -35 -32 162
4761 162 65 -234 137 -165 -180 -197 73 -52 -248 58 9 -40 -46 65 263 62 87 179 307 -160 -32 224 -14
4784 -14 47 201 11 150 81 -64 -46 171 -95 -40 38 32 -11 39 96 -88 -107 -195 -288 -120 -95 -13 61 -170 5 -93
4810 -93 109 98 9 63 -276 -242 113 31 -71 64 123 -406 30 -156 -115 -45 160 -101 63 85 134 1 -7 -271
$$ packed form
4641B01k53J40l9j44L82m63L68k19J14J12k94j09P4m9J97k60J53L32k41o7m7p
4663a19l5K22q2K97l33m3j50K87j29o1N0J75j0J38k20P1j61K76l28J26j83M07
4685A95l13ML64l02j3J32q4L5o2q0K35o7q6l2K23j98N5j10p8L23J04k32m3m9N5
4710b4Q5jr0j12n6J95lJ18K67m37Q4O5j20JJ58j01j16J18m0k15J33K24l30K11
4734A4P0p8J20j13QJ31l91K95P9Pj79J00P3k54P6P8M6j28J19J8OPm9J7j07LJ94
4761A62r7k99L71l02j5j7K70j25j96L06m9m9oJ11J98k01K5R2J28m67J28K56k38
4784a4O1J54j90J39o9j45J8K17k66N5P8om3N0N7j84j9q8r3J68K5Q2P4k31J75r8
4810i3K02j1q9N4l39L4L55q2j02J35N9n29M36j86M1P0K05k61J64K2M9j33qk64
$$ plain form
4834 -271 -128 -36 -49 -203 -111 80 -108 25 -20 -4 3 -18 44 29 -41 81 105 191 -117 237 92 91 -190 -39 1
4859 1 175 69 -101 -72 -144 -145 37 -104 18 -233 -166 53 -79 5 61 191 196 -80 102 1 -162 -248 -280 -153
4883 -153 -11 -9 -156 34 -125 -78 38 114 -81 -85 -141 87 103 -147 274 156 -23 68 -73 175 262 136 88 147
4907 147 42 -45 71 17 184 152 70 303 114 5 20 24 97 169 -164 -106 214 -24 -89 -36 -142 256 -53 95
4931 95 -166 10 28 31 -101 -21 -49 -75 59 129 151 95 313 58 184 37 -17 155 -157 -48 -2 -30 118 160 -8
4956 -8 172 -161 -196 142 37 91 -181 -67 90 -238 -39 242 -92 152 -3 -11 -33 -203 136 76 71 17 27 -21
4980 -21 48 179 -32 -235 -258 26 -92 -122 77 110 -170 140 72 3 78 98 76 6 146 -300 360 150 122 169
5004 169 262 194 -41 301 63 -232 7 -11 -2 -23 -144 -162 97 -119 88 64 -118 201 7 -65 -72 87 -178 -108
$$ packed form
4834b71J43R2j3j54R2J91j88J33m5J6Pk1O2j5p0J22K4Q6l08L54j45jk81J51M0
4859AJ74j06j70K9p2jJ82j41J22k51O7K19j32Q4N6J30Nk76J82j01j63q6l2J27
4883a53J42Kj47J90j59M7J16P6j95mn6K28J6k50M21j18j79R1j41K48Q7j26m8N9
4907A47j05q7J16n4J67l2q2K33j89j09J5MP3P2l33N8L20k38o5N3j06L98l09J48
4931I5k61J76J8Lj32Q0k8k6J34P0K2n6K18k55J26j47n4J72l12J09M6k8J48M2j68
4956hJ80l33l5L38j05N4k72J14J57l28J99K81l34K44j55qk2j70L39o0nn4J0m8
4980b1O9J31k11k03k3K84j18l0J99L3k80L10o8o9P5K0k2p0J40m46O60k10k8M7
5004A69R3o8k35L42k38k95K39j8Rk1j21j8K59k16K07k4j82L19j94p2pJ59k65P0
$$ plain form
5028 -108 -103 -132 -253 -159 64 -281 211 120 -67 164 70 27 23 9 -67 -19 267 181 -46 103 2 -16 -4 -81 72
5053 72 -156 -203 -83 22 275 -24 -89 -26 -35 -69 -142 -121 -87 131 -144 -29 -65 198 113 -187 93 -119 42 -261
5077 -261 188 105 -47 -113 88 -210 -143 46 -20 -119 309 26 -70 134 2 -143 161 6 129 278 -110 -78
5099 -78 123 -122 75 -7 -95 4 -52 -56 57 114 -45 -173 -58 -79 -235 -30 -78 -141 71 20 152 105 -260 67
5123 67 221 136 361 -30 -126 -135 -23 -211 -22 116 18 124 -40 -79 114 87 62 349 -106 -26 190 7 51 -182
5147 -182 -25 -20 26 -37 -21 -199 -61 86 86 -161 -96 -140 130 -248 -196 -321 -301 75 -240 -134 164 9 -242 212
5171 212 213 135 122 175 -251 -45 -102 65 141 89 25 113 250 -23 92 47 69 -145 -50 -51 -1 -289 -53 0 195 -154
5197 -154 -35 -102 -143 35 30 251 -467 -50 -135 -143 106 16 78 -218 -19 -236 120 51 251 110 -174 77 59 120
$$ packed form
5028a08Nk9j21R4K23l45M92r1j87K31r4m3mj4p6M8K86q6k27J49j01j8J2p7J53
5053G2k28m7J20J05K53k99o5O3rl4p3K1L4K18k75J15l6K63q5l00K80k12J61l03
5077b61M49q3j52o6K01k98O7J89o6r9M28k83r6K04j32j45L04j55J23J49l88L2
5099g8K01k45J97q2q8R9n6mJ13N7j59j28J15k1j56K05m8o3K12n1J32m7l65L27
5123F7J54q5K25l91r6rJ12j88J89J38r8J06j64l9J93k7k5K87m55Q0K16j83M4k33
5147a82J57NM6o3J6j78J38J47%k47O5m4K70l78N2j25K0L76l15J06K98j55k51M54
5171B12Jp8j3N3m26K06n7J67P6n2o4Q8J37k73J15m5K2k14R5jN0k88K36N3J95l49
5197a54J19o7m1J78nK21p18M17q5qK49r0O2k96J99k17L56o9K00j41k84K51j8O1
$$ plain form
5221 120 -21 142 -276 90 -379 24 49 -127 -191 87 99 49 -130 -162 20 -82 228 -4 -14 -213 -105 26
5243 26 25 -60 41 -2 -55 -20 -111 -129 -72 -16 -37 -149 66 -32 116 -156 52 0 -150 -144 80 -1 -2 -103 -260 -24
5269 -24 8 70 -93 -36 140 -214 -147 -127 64 86 -117 -40 153 -134 311 197 148 50 379 368 -325 -113 -257 27
5293 27 -202 -13 165 -96 135 -4 20 0 -2 25 89 7 -168 72 177 -25 70 19 25 -97 -110 -92 67 51 -32
5318 -32 -85 -192 104 -49 -16 -127 -119 19 -86 -77 -162 60 -71 36 -158 6 164 -239 3 -210 -177 256 7
5341 7 -86 36 53 -220 198 127 -140 24 49 -192 41 -172 -73 120 -236 155 209 130 57 108 -68 -69 129 33 -17
5366 -17 -104 29 34 85 208 215 22 -112 -224 209 169 -37 -296 -266 -91 -45 241 -76 88 -59 125 -178 -203 203
5390 203 38 3 224 -121 -56 -36 48 -311 -6 19 -140 228 280 190 -350 199 8 -109 96 147 31 78 38
$$ packed form
5221A20j41J63m18L66m69M03K5j76o4K78J2n0j79l2J82j02L10k32j0j99J08J31
5243B6jq5J01m3n3L5r1j8N7N6k1j12K15r8J48k72K08n2j50OK24q1jj01j57K36
5269b4L2O2j63N7J76l54O7K0J91K2k03P7J93k87M45j14m9r8L29j1o93K12j44K84
5293B7k29J89J78k61K31j39K4k0kK7O4q2j75K40J05k02R5n1Oj22j3J8J59j6q3
5318c2n3j07K96j53L3j11QJ38j05Rq5K22j31J07j94J64J58m03K42k13L3M33k49
5341Gr3J22J7k73M18p1k67J64K5k41K33k13R9J93l56L91N4p9p3N1j76jJ98r6n0
5366a7q7J33NN1J23Pj93j34j12M33m0k06k59L0J75M6K86l17J64j47J84l03k5M06
5390B03j65l5K21l45O5K0Q4l59L05K5j59L68N2r0n40N49j91j17K05N1j16M7m0
$$ plain form
5413 38 -26 152 -217 -131 110 96 133 22 -69 79 -7 -66 -198 26 108 -27 -5 -49 -15 281 110 54 150 54 -46
5438 -46 25 288 343 55 33 -37 0 -79 -78 -39 13 -155 -67 -31 -104 90 -95 -151 -262 -29 85 318 109 -37 -199
5463 -199 -391 -219 -102 176 -1 30 -140 -32 187 -104 9 3 96 265 -274 44 89 2 17 49 169 13 -75
5486 -75 -88 -128 126 39 158 -168 -195 -149 165 0 298 220 -7 25 12 207 -58 -72 0 -67 132 8 -27 5 -21
5511 -21 126 19 -183 117 -39 132 -48 -109 69 -227 -59 147 -39 74 123 -69 -79 -3 55 210 206 66 38
5534 38 -214 -71 212 -89 79 49 76 -173 30 95 -86 0 -60 -55 -7 -375 59 94 205 152 90 54 200 232 42
5559 42 119 157 -8 138 -255 212 -188 307 -19 -106 84 37 75 -29 -28 140 -11 143 79 3 133 104 284 -4
5583 -4 -205 -200 -152 -217 -21 -155 123 -87 -100 169 -43 177 -72 -109 96 60 243 198 -188 262 -72 -21 -35 -215
$$ packed form
5413C8o4J78l69Q6K41j4L7j11r1J48q6n9j32K24Q2j35K2m4L4K96j71n6R6r6j00
5438d6P1K63N5k88k2p0L7p9JL9N2j68Q8L6p3J94j85n6j11K33J14K33k09j46j62
5463a99j92J72J17K78j77L1j70J08K19k91J13oR3J69n39L18M5q7J5L2J20j56q8
5486g5j3m0K54q7J19l26k7M6L14j65K98p8k27L2j3J95k65j4P2o7J99j24l5L2k6
5511b1J47j07k02L00j56J71j80o1J78k96J68K06j86J13M9j92j0P6N8J55mj40k8
5534C8k52J43K83l01J68l0K7k49K03O5j81Q6o0NM8l68M34L5J11n3o2l6J46L2j90
5559D2P7L8j65J46l93M67m00M95l26q7J90m7L8j04JJ68j51J54o4p6J30k9J80k88
5583dk01NM8o5J96j34K78k10j3K69k12K20k49l7K05l6J83m5l86M50l34N1j4j80
$$ plain form
5607 -215 -182 -5 -84 -47 -187 -104 -311 -60 -85 -93 -59 38 -128 60 -113 -151 85 41 31 64 86 -54 1 8 163 -177
5633 -177 221 7 138 41 -84 -131 82 -30 -102 34 -13 4 119 -135 242 172 -142 124 1 -5 18 108 -62
5656 -62 -11 -243 244 13 -114 96 -323 -68 180 297 291 -9 -106 -28 -21 -123 -131 63 -46 18 -14 -216 -54 -103
5680 -103 33 180 -1 84 213 40 83 -110 144 -1 -126 35 -133 -44 81 44 9 -223 203 -9 -10 87 -287
5703 -287 -157 39 91 211 119 47 102 -162 169 -2 -63 86 -82 -130 -62 -90 -30 -24 -105 178 -129 -108 365 151
5727 151 -172 -80 247 -196 22 -23 268 -129 -30 4 -321 -97 178 29 -87 -66 -5 11 19 62 -44 11 -80 140
5751 140 -115 -51 8 -39 100 -15 36 59 -159 -15 93 -40 -233 68 -114 100 83 173 -135 34 28 98 132 -160
5775 -160 112 22 105 146 14 124 -127 -17 71 -256 66 23 1 -151 38 45 -87 12 -86 103 -189 -156 170 -41
$$ packed form
5607b15L3J77p9L7j40Q3k07K51k5qL4R7j66J88j73l8K36m4j0L3K2j40N5PJ55l40
5633a77L98k14J31r7j25m7K13j12p2J36m7J7J15k54L77p0l14K66j23oK3R0j70
5656f2N1k32M87k31j27K10m19K55K48J17ol00r7P8Pj02qJ94j09O4l2k02J62m9
5680a03J36J47j81Q5J29j73M3j93K54j45j25J61j68Q9J25l7l5k32M26k12jR7l74
5703b87J30J96N2J20r2p2N5k64L31j71o1J49j68m8O8k8O0Oq1K83l07K1M73k14
5727A51l23R2L27m43K18m5K91l97R9L4l25K24K75j49j16K1O1J6QM3j06N5r1K20
5751A40k55O4N9m7J39j15N1K3k18J44J08j33j93L01j82K14j7R0l08J69oP0L4k92
5775a60K72r0Q3M1j32J10k51J10Q8l27L22m3k2j52J89Pj32R9r8J89k92L3L26k11
$$ plain form
5799 -41 -91 223 130 -94 97 -204 14 -58 -365 -179 25 -123 -168 -106 -122 31 14 -11 -18 92 32 -91 170 -87
5823 -87 68 -13 -134 221 -141 -141 150 -215 -166 -107 -24 8 -91 32 146 -182 -120 142 -162 93 75 -115 81 -78
5847 -78 -299 -145 -84 66 72 118 145 -72 71 202 -259 -233 -46 -17 -155 -13 98 178 -50 18 -15 115 -128 -131
5871 -131 2 122 46 -109 -47 -27 32 -177 24 62 -208 42 -143 79 -68 4 4 36 -1 12 -62 -8 -33 73 164
5896 164 8 183 139 99 124 -106 -215 301 -163 206 9 -363 -18 -104 -46 155 50 -125 148 49 38 186
5918 186 99 -159 -161 -30 -237 -89 235 -19 139 185 347 114 -41 -56 130 -232 144 -97 -182 -3 21 88 38
5941 38 198 42 332 -52 -57 25 -49 123 -145 107 299 -119 -74 -195 -142 -17 105 -46 135 66 247 2 172
5964 172 -153 140 -111 241 -214 -36 131 -37 -191 -49 -128 81 31 -4 0 -85 -91 -91 -86 29 7 176 277 227 -16
$$ packed form
5799d1n0L14r3k24J91l01K18p2l07J86K04j48m5O2j6J53j7k5pJ10o0j23K61k57
5823h7J55q1j21L55l62%K91l65M9N9Q3L2r9J23J14l28O2K62l04K55j8j90J96j59
5847g8k21J54O1J50OM6K7k17J43J31m61K6J87K9j38J42J11Q0k28O8l3J30k43l
5871a31J33J20p6j55O2K0N9k09K01L8k70K50j85K22j47P2%L2l7J3p4N4k5J06R1
5896A64j56J75m4m0K5k30j09N16m64L69j97l72L45q6N8K01j05j75K73r9j1J48
5918A86q7k58kJ31k07J48L24k54J58M6J62k33j55j5J86l62L76k41q5J79K4O7n0
5941C8J60j56K90l84nQ2p4J72k68K52J92m18M5j21N3J25J22j51J81o9J81k45J70
5964A72l25K93k51L52m55J78J67j68j54J42p9K09n0l5Mq5o%NJ15k2J69J01n0k43
$$ plain form
5989 -16 130 -85 239 83 -73 -167 -101 -110 -168 -87 -99 146 42 -41 -15 -228 -87 184 231 -248 -79 107 118 256
6013 256 -71 -169 85 201 44 23 -147 242 85 259 167 20 58 -7 78 15 -193 298 33 -45 34 121 -30
6036 -30 -128 -56 -119 -50 5 -158 -83 124 -212 67 35 143 -11 -222 -260 -30 165 -173 126 98 193 225 26 -15
6060 -15 -83 339 -43 -155 55 -229 -267 -42 76 -53 28 13 -43 112 23 106 -63 6 -96 -41 4 -26 -69 44
6084 44 55 -12 -146 14 66 92 383 91 42 -40 244 -168 64 35 44 50 89 -10 81 -110 130 -100 -36 -145 95
6109 95 97 47 160 -14 53 38 -36 67 146 178 169 -167 68 59 195 -132 -196 144 51 198 -108 31 38 5 -170 -83
6135 -83 -46 63 -60 253 163 156 75 80 148 125 35 82 -182 -10 184 -60 94 -39 54 28 -80 65 -193 -76 259
6160 259 -234 -198 -38 -72 0 -58 37 61 -177 160 -43 -125 74 -128 -97 129 47 163 -119 69 -111 -115 -148 110
$$ packed form
5989a6J46k15L24j56j56r4O6rn8Q1j2K45j04q3K6k13J41K71M7m79J69J86J1J38
6013B56l27r8K54J16j57k1j70L89j57J74r2j47L8o5Q5o3k08M91k65p8P9Q7j51
6036c0r8P2o3O9N5j63P5K07l36K79l2J08j54k11l8K30J95l38K99k8R5L2j99m1
6060a5o8M22l82j12K10k84l8K25J18j29Q1j5n6J55q9Q3j69O9j02N5M5l0m3J13
6084D4J1o7j34J60N2K6K91k92m9q2K84m12K32k9ROL9r9R1j91K40k30O4j09K40
6109I5Kn0J13j74O7j5p4J03P9L2rl36K35rJ36l27o4L40r3J47l06J39Pl3j75Q7
6135h3L7J09j23L13r0pq1NO8k3r0M7k64J72J94k44J54j33R3k6j08J45k58J17L35
6160B59m93L6J60l4P2n8R5K4k38L37k03q2J99k02L1K26q2J16k82J88j80ml3K58
$$ plain form
6184 110 0 -106 -187 -152 -235 -108 -60 105 -12 103 57 163 -136 5 38 -59 -201 -162 -2 -14 113 -69 -95
6207 -95 72 45 -54 18 -110 -62 -314 28 -302 100 186 -57 -318 -50 -8 94 104 -206 8 64 -47 81 119
6230 119 -67 38 369 -72 -80 -221 233 152 -158 34 -48 -19 -80 -100 -250 -77 -131 -347 169 -24 36 -2 -31 58
6254 58 -31 -186 29 262 -89 9 -224 18 -156 -9 378 20 59 -26 164 139 132 72 91 162 274 145 -70 -266
6278 -266 -151 -222 -72 -105 22 21 -1 62 -16 -22 -102 209 -85 114 24 123 3 225 -137 50 -189 -71 21 8 -98
6303 -98 62 12 -127 -129 -72 -15 -35 30 -186 228 -40 -243 95 -41 96 -85 -97 124 -20 64 -349 -134 288
6326 288 -41 -236 118 93 1 -73 -155 88 26 222 -12 -28 124 -121 -335 -15 -200 -18 -221 175 -64 128
6348 128 -170 329 252 -136 94 -68 79 46 57 31 67 -320 209 -17 -47 141 121 27 165 77 -17 102 17 173
$$ packed form
6184A10j10j06q1L5q3J27M8J65j17J15m6J06k99J41L3r7j42L9J60j2J27j82k6
6207i5J67k7r9P2j28M8k52L42l30M02Q6k43k61K68M2J02J0l10K14N6j11J28L8
6230A19j86J05L31m41qj41M54q1l10J92q2K9o1k0j50J73n4k16N16j93O0l8k9Q9
6254E8q9j55K15K33l51R8k33K42j74J47L87l58L9q5J90k5po0J9P1J12j29k15j96
6278b66J15p1J50l3J27jk2O3p8oq0L11k94J99r0R9j20K22l62J87k39J18R2j3j06
6303i8J60n0j39kN7N7k0O5k16M14k68k03L38j36J37j81j2K21j44Q4m13K15M22
6326B88l29j95L54k5r2p4q2K43o2J96k34j6J52k45k14L20j85J82k03L96k39J92
6348A28k98M99p7l88K30j62J47l3J1k6L6l87N29k26l0J88k0r4J38q8r4J19q5J56
$$ plain form
6372 173 -212 17 -187 109 82 -112 -194 -171 39 -57 -101 154 45 -68 -56 -36 -168 -174 15 -78 0 -34 50 -12 166
6397 166 -77 -216 6 -143 -247 -158 -76 -154 -158 16 183 -39 -6 -49 340 80 78 44 61 140 -155 86 -251 178
6421 178 201 -95 280 -223 -363 -73 -75 17 113 -178 2 -152 -77 -52 -207 85 108 273 -236 -94 -24 114 34
6444 34 56 128 28 135 233 63 123 -103 149 96 -33 -47 41 266 -39 -184 121 2 -133 28 -142 140 -304
6467 -304 -26 -166 -158 113 63 -109 -153 -144 77 -195 -140 56 -85 143 -180 -69 -9 -94 75 -4 76 72 -143 -142 -154
6492 -154 83 -145 29 118 36 -218 -10 6 262 -44 -8 39 107 88 306 128 -21 -60 116 -42 -77 136 22
6515 22 311 250 -115 -36 -41 144 -170 -139 203 28 -33 -28 -300 36 -153 -64 -95 -20 -60 21 146 -76 -83 -76 45 -63
6541 -63 126 -5 -154 276 -134 147 171 -37 154 35 33 -301 -118 75 82 68 156 13 187 84 -64 -114 16
$$ packed form
6372A73l85K29k04K96k7j94q2K3K10r6m4K55j09j13J2K0j32oJ89r3P8l4Q4o2J78
6397A66k43j39K22j49j04Q9Q2p8mJ74J67k22L3m3L89k60kl4J7P9k95K41l37M29
6421A78K3k96L75n03j40K90kR2R6k91J80j54P5K5j55K92K3J65n09J42P0J38q0
6444C4K2P2j00J07R8j70O0k26K52n3j29j4Q8K25l05j45L05j19j35J61j70K82m44
6467c04K78j40QK71n0j72m4RK21k72N5J96j41K28l23J11O0q5J69p9Q0mk15Jj2
6492a54K37k28J74Q9q2k54K08J6K56l06L6M7O8j9K18j78j49l9J76j58l5K13j14
6515B2K89o1l65P9nJ85l14L1L42j75o1Nk72L36j89Q9l1P5m0Q1J25k22pPJ21j08
6541f3J89j31j49M30m10K81K4k08J91j19kl34J83J93Pj4Q8j43J74j03j48n0J30
$$ plain form
6564 16 244 -4 19 39 92 -204 60 47 -18 -72 67 48 -83 208 202 -37 151 -69 -129 -146 2 -19 -133 -165 -222
6589 -222 99 129 118 -162 -6 132 20 -86 -70 -7 -202 63 219 130 -21 -45 -54 54 -23 -20 -125 86 -165 -150
6613 -150 -95 -151 99 167 74 6 169 -80 -32 177 11 11 -71 1 -84 -71 -20 -137 166 -23 277 68 -107 -103 -2
6638 -2 3 -101 42 237 74 -16 155 -1 -167 -73 130 -57 59 -9 97 83 72 -89 155 -110 94 2 56 136
6662 136 -17 184 -88 88 -102 8 70 0 -95 -190 213 30 297 -179 126 49 124 -114 130 -117 43 -3
6684 -3 175 -116 -40 152 24 90 206 69 -116 -53 105 61 -105 -154 72 110 75 -31 -34 99 -137 -264 -76 113
6708 113 3 -102 -234 -57 124 173 6 179 130 14 199 -53 -253 63 -53 -80 -46 87 -67 66 -127
6729 -127 -124 -47 -10 -156 -108 -23 61 -287 236 -290 -194 43 -11 18 -74 57 88 -5 -292 138 -99 82 26 -104 -39
$$ packed form
6564A6K28k48K3K0N3k96K64j3o5n4J39j9j31K91ok39J88k20o0j7J48k1j14l2n7
6589b22L21L0j1k80J56J38j12j06J6O3j95K65J56q9j51k4rJ08p7Lj05K11k51J5
6613a50N5n6K50O8r3o8J63k49M8K09j66%q2P2q5J3N1j17L03j89L00k09j75MJ01
6638bNj04J43J95j63r0J71j56j66R4K03j87J16o8J06j4j1j61K44k65K04r2N4Q0
6662A36j53K01k72J76j90J10O2p0r5r5M03j83K67m76L05p7P5k38K44k47J60m6
6684cJ78k91P6J92j28O6J16j37j85O3J58m4j66m9K26L8l5j06lJ33k36j27J88J89
6708A13j10j05j32J77J81M9j67J73m9j16J85k52k00L16j16k7L4J33j54J33j93
6729a27LP7L7j46M8Q5Q4l48N23n26R6K37n4K9r2J31L1r3k87M30k37J81n6j30O5
$$ plain form
6754 -39 -41 -110 214 -104 -193 -181 1 195 58 288 72 56 -81 25 134 -123 -166 146 -63 -85 258 -146 -3
6777 -3 -180 -130 218 281 40 -124 66 -170 99 -5 72 -152 81 -263 242 9 134 98 54 -24 -102 -7 34 -147
6801 -147 -162 1 -83 77 77 164 -139 -168 -212 -126 -54 -61 -120 -57 88 321 65 -221 -260 -241 -123 2 -159 -87 119
6826 119 254 -33 245 -56 -173 133 -72 12 88 -208 123 84 77 41 -122 -167 -257 86 -87 -163 -13 -80 -23 -73
6850 -73 -119 31 -23 -326 -90 -36 235 41 -94 141 -17 -68 -98 -23 -119 67 53 110 314 -6 -126 116 -58
6873 -58 5 9 -19 173 -8 83 339 -28 233 -248 -101 -105 105 146 -176 -14 47 -70 64 -144 -34 157 5
6896 5 -171 -47 -4 78 63 97 -160 -87 79 172 167 -57 69 -97 -141 239 104 133 145 244 -71 102 -10 187 69
6921 69 79 131 61 4 -162 -211 -120 145 41 -135 4 -67 -161 -22 -132 42 -337 -15 -339 -52 185 -77 176
$$ packed form
6754c9ko9L24l18q9J2J82J94j37K30k16j6j37J06J09k57m3L12k09k2L43m04J43
6777cj77N0L48O3k41j64J90k36K69j04P7k24K33l44N05k33J25l6m4p8p8R5M1j81
6801a47j5J63q4J60%Q7l03k9m4Q6P2pn9O3J45K33k56k86l9J9J18J25j61P2K06
6826A19J35k87K78l01j17L06k05Q4P6k96L31l9pl6j63m5r0L43j73p6J50o7N7n0
6850g3m6J50n4l03K36N4K71j94j35K35j58n1l0P5r6J86j4N7K04l20j20K42j74
6873e8O3Mk8J92j81R1K56l67K61m81J47mK10M1l22J62O1j17J34k08J10J91j52
6896Ej76J24M3Q2j5L4k57P3J66R3nk24J26j66m4L80j35K9J2R9l15J73j12J97j18
6921F9J0N2p0n7j66m9R1K65j04j76J39p1r4J39j10J74l79L22l24K87K37k62K53
$$ plain form
6944 176 -51 -150 144 -39 -36 206 104 -7 -243 153 80 -75 -45 -157 -58 -28 205 -36 115 46 141 22 -86
6967 -86 113 182 184 -5 -11 -36 192 -279 5 0 183 -158 106 -94 -178 87 29 228 -130 -49 83 3 -56 -79 -85 91
6993 91 204 22 -328 15 -99 -5 -6 36 -215 -91 -37 -11 71 -133 -52 -9 -125 -6 38 -87 -131 -145 -72 -50 241
7018 241 -115 150 -122 300 133 258 -73 -98 -69 -209 -77 -217 163 -116 -62 -72 -141 -25 -245 89 115 -102
7040 -102 26 -61 -100 -38 -316 -87 -139 -190 36 -183 137 -109 -314 -44 74 -238 252 207 -96 -13 76 -7 2 173
7064 173 10 223 51 -50 -92 37 101 108 -65 -188 -33 -92 -88 -49 32 224 -101 -10 -97 -2 216 -181 -36 164
7088 164 -49 46 -115 -86 -71 15 198 -160 -116 122 -222 -26 35 66 -26 47 -141 40 22 -77 -207 142 -203 -94
7112 -94 -144 -74 -57 -70 356 -230 36 -40 220 109 -142 184 273 -60 -186 -126 274 94 -34 -12 -109 2 80 10
$$ packed form
6944A76k27r9K94j83LK42j02j11k36L96p3j55L0j12R9L0K33k41J51o9R5j19j08
6967h6J99O9Kj89ok5K28m71K84nJ83l41K64k00q4K65n8J99l58Q1J32q0n9k3oJ76
6993I1J13j82l50L43j14R4jM2k51J24N4K6Q2k04Q1M3j16J19M4j25m4j4P3K2K91
7018B41l56K65k72M22j67J25l31k5K9j40J32j40L80k79N4j0o9J16k20L34K6k17
7040a02J28q7l9O2k78K29n2n1K26k19L20k46k05K70J18l12M90m5l03Q3Q9q3RJ71
7064A73j63K13j72j01m2J29O4Pj73j23J55n9ML9Q1J92l25R1q7R5K18l97J45K00
7088A64k13R5j61K9J5Q6J83l58M4K38l44J96O1L1r2P3j88J81j8r9j30L49l45J09
7112i4n0P0J7j3M26n86K66p6K60j11k51L26Q9l33j26O0M00j80j28K2r7J11P8p0
$$ plain form
7136 10 62 -131 -6 82 -15 64 35 112 376 -88 -23 -225 166 -186 -164 -137 -50 106 39 -42 119 33 -257 125 215
7161 215 156 -24 -131 -182 204 47 -18 228 -73 -83 -126 173 383 -92 -118 11 -22 -45 91 46 83 -33 -179
7184 -179 -137 -130 78 140 -86 100 -172 -66 -8 -4 -256 -127 39 40 -3 -122 -16 -36 -23 241 -76 135 114 -263
7208 -263 -169 139 -53 82 237 -81 278 483 -30 6 -60 129 30 80 306 -411 -38 205 152 -48 -368 171
7230 171 58 51 -127 -48 25 79 -210 -104 20 -7 355 -134 137 -147 161 98 10 77 -109 -31 178 53 -321
7253 -321 60 139 76 20 -288 173 -220 60 122 80 107 -49 138 15 364 -96 112 -118 24 -134 100 -76
7275 -76 -55 15 125 46 99 -143 -192 20 -118 -96 -37 112 -116 182 173 -71 -120 -135 36 61 -100 -15 121 29 36 118
7301 118 -282 195 -112 -31 25 152 -69 150 -193 69 -229 7 305 -62 93 -191 -45 -89 30 59 248
$$ packed form
7136A0N2j93J25Q8r7P9k9P7K64m64O5k02L91l52K2K7Q7J56o7q1J61q6k90L82R0
7161B15n9j80j07n1L86j57o5K46l01j0m3K99K10m75k6J29l3k3J36m5L7j16j46
7184a79M2PK08O2k26J86k72J06N8Mk52J29J66Jm3j19J06k0J3K64l17K11k1l77
7208b63R4L08j92J35J55l18L59K05n13L6o6J89r9N0K26p17L73K43n3k00l20N39
7230A71j13pj78P9P3N4k89J06J24k7L62m89K71k84L08o3q8O7j86P8K09j25l74
7253c21L81P9o3n6l08M61l93K80O2m2K7j56J87j23L49m60K08k30J42j58K34j76
7275g6K1P0J10p9N3k42m9K12j38K2N9J49k28K98rk44m9j5J71K5j61Q5J36r2PQ2
7301A18m00M77l07Q1N6J27k21K19l43K62k98K36K98l67J55k84J46m4J19K9J89
$$ plain form
7322 248 177 15 -67 29 -127 97 77 -84 17 174 16 -83 92 192 -4 37 -33 189 46 -26 155 -57 169
7345 169 136 365 -72 -211 133 -133 36 26 18 85 -2 21 125 140 -22 83 21 -284 -157 41 33 69 -181 91
7369 91 -54 -9 236 73 0 96 79 -11 -67 -9 -77 197 38 61 -223 65 153 16 129 -81 -42 144 44 176
7393 176 -50 197 -312 196 104 -12 -99 -83 21 93 -305 -120 142 -74 2 -149 194 -148 -199 126 109 155 113
7416 113 -168 -231 -86 -35 28 198 11 165 -35 -281 -35 -47 259 21 144 -83 67 172 -50 52 -96
7437 -96 97 -28 204 -219 -208 79 80 150 194 109 -1 -35 105 -175 -29 -229 14 108 -99 -298 32 12 59 231
7461 231 149 255 154 -7 -325 25 46 242 -184 -107 -48 -3 41 91 49 96 50 -210 -131 -17 197 7 109 -88
7485 -88 -127 -78 -57 -179 87 26 4 -33 224 -30 17 -79 -48 -144 -19 -43 67 -137 -36 115 5 -130 -75 -192
$$ packed form
7322B48p1j62q2R6j56K24k0j61J01J57j58r9J75J00j96M1p0K22j43p2J81k12K26
7345A69l3K29m37j39L44k66J69j0qO7q7K3J04J5j62J05o2l05J27J98qL6k50K72
7369I1j45M5K45j63p3R6j7r0n6N8o8K74j59K3k84K88Q8j37J13k10L9J86j00J32
7393A76k26K47n09N08r2j16q7J6J04P2l98J85K62k16P6j51L43l42n1L25j7M6m2
7416A13k81o3J45N1O3J70j87J54k00k46K46j2L06k38J23k27J50J05k22J02j48
7437i6J93j25K32m23J1K87JP0M4q5j10l4J40k80J46k00K43R4k07j99L30k0M7J72
7461B31q2J06j01j61l18L50K1J96m26P7N9M5M4N0m2M7m6k60P9J14K14j90J02j97
7485h8l9M9K1j22K66o1k2l7K57k54M7r6L1r6J25k4J10k04J01J51j10j35N5j17
$$ plain form
7509 -192 -8 -131 310 148 -34 10 -230 -207 32 -77 -163 -94 69 -88 241 -298 92 -123 -146 139 -91 -45
7531 -45 -77 162 -49 159 40 -169 -120 -194 -39 -28 -18 -20 19 12 -54 -55 -168 97 -33 182 73 137 -36 52 -294
7556 -294 147 58 -48 -89 89 -12 201 34 -19 225 152 -151 -26 -28 158 -47 16 124 81 174 -72 -19 9 62
7580 62 85 42 163 -22 -48 193 -191 -140 0 53 133 296 -21 -268 56 -201 86 53 10 212 104 53 67 174
7604 174 120 42 10 -76 110 10 -119 -305 16 145 -85 80 177 -109 -396 -97 136 23 -38 -163 191 21
7626 21 -11 57 -247 -23 -162 15 -107 172 -214 -13 -11 -48 -124 242 72 -94 -17 24 180 -40 -16 14 -222 -175
7650 -175 -45 -140 92 -182 -49 99 238 67 -195 95 211 67 55 -7 -259 112 -80 -49 -20 156 88 149
7672 149 38 409 186 -136 -251 145 -38 -53 7 29 -18 32 91 -48 -27 -72 -38 114 -138 84 155 -104 -194 -114
$$ packed form
7509a92J84j23M41j62j82M4k40K3K39j09q6O9J63j57L29n39L90k15k3K85k30M6
7531d5l2K39k11K08j19k09M9p4J55J1J0kL9po6jj13K65j30K15j09O4j73Q8l46
7556b94M41q9j06m1J78j01K13j67n3K44p3l03J25kJ86k05O3J08m3R3k46N3K8N3
7580F2K3m3J21j85k6K41l84N1J40N3Q0J63l17k47L24k57K87l3m3K02j08n1J4J07
7604A74n4p8l2q6J86j00j29j86L21J29k30J65R7k86k87K99K33j13o1j25L54j70
7626B1l2O8l04K24j39J77j22K79l86K01Kl7p6L66j70j66P7M1J56k20K4L0k36M7
7650a75J30r5K32k74J33J48J39j71k62K90J16j44j2o2k52L71j92L1K9J76o8O1
7672A49j11L71k23l22j15L96j83j5O0K2m7N0N9j39K1m5L4J52k52K22P1k59r0Q0
$$ plain form
7696 -114 73 -72 142 -39 -149 -250 66 -96 -29 -71 411 153 -52 -159 19 89 -79 228 204 29 127 201
7718 201 -81 -38 193 -194 -254 177 -187 51 202 1 -13 -109 18 -2 -72 -138 95 106 -111 253 126 -78 -82
7741 -82 -30 -211 9 -102 26 205 -67 -72 199 99 235 -146 -54 -8 -75 -23 -158 -214 -16 -18 -71 -32 115 306
7765 306 103 -122 185 -191 126 -43 -23 -108 -186 -140 135 13 -254 105 69 -78 -134 -132 -248 18 -201 -118 -20
7788 -20 247 7 324 63 -17 -81 17 84 -105 -97 288 28 -47 -133 -151 -179 -58 -125 41 -1 -183 -72 -64 -120 -151 25
7814 25 -2 -18 -136 -82 8 49 -104 -9 -194 29 -182 -13 -58 -75 129 185 -69 -67 -135 -189 -10 220 -113 -147 -165
7839 -165 -38 71 161 -42 154 172 3 41 -51 399 -125 42 -88 -39 72 107 33 76 -156 -29 -107 -56 22 98
7863 98 -93 129 -171 -61 98 132 -17 69 23 -11 -214 -83 -20 -18 -101 -278 19 -102 82 -154 103 54 19 -269
$$ packed form
7696a14J87j45K14j81j10j01L16j62O7m2M82k58k05j07J78P0j68L07k4j75R8P4
7718B01k82M3K31l87o0M31l64K38J51k01j4r6J27k0p0o6K33J1k17L64j27k04m
7741h2N2j81K20j11J28J79k72nK71j00J36l81R2M6o7N2j35n6J98kn3L9J47J91
7765C06k03k25L07l76L17j69K0q5p8M6K75j22k67L59l6j47n6Kj16K66k19Q3R8
7788b0K67k40L17k61q0o4R8O7j89QL85k60p5q6j8k8J21o7J66m2j82J11Qn6l1J76
7814B5k7j6j18N4R0M1j53R5j85K23k11J69m5j7K04N6k54Ko8n4J79K30l33l4j8
7839a65J27J09R0k03J96J8j69L8r2M50n24J67j30M9J11L5p4M3k32J27p8N1P8P6
7863I8j91K22l00J10J59L4j49Q6m6l4k03J31O3Kq3j77K97j21J84k36K57m9l5k88
$$ plain form
7887 -269 -162 -208 -107 127 32 56 152 149 -31 1 227 92 -283 158 123 -21 32 -38 127 -7 22 114 127 271
7911 271 54 21 -181 181 10 -99 -41 -239 -26 143 -139 262 -199 -142 -367 95 -153 38 199 36 -77
7932 -77 -52 -10 -74 -197 214 198 150 99 -163 -61 301 -34 -263 161 54 126 -87 -53 126 -121 -1 -131 -152
7955 -152 -45 -56 -213 -257 -179 35 -127 -140 65 189 -56 158 -9 182 17 121 -250 -229 31 -148 189 -173
7977 -173 33 13 -131 91 207 96 53 -24 -25 2 -49 -282 -2 -63 185 15 320 158 46 -122 161 18 -28
8000 -28 7 7 -106 52 -27 108 13 -208 17 99 -8 23 146 64 -41 -116 -158 -94 54 -186 264 -25 132 17
8024 17 -174 -139 5 -23 120 -108 -37 61 -147 -38 -302 82 270 42 -135 -27 -171 -228 56 178 -26 -17 -54
8047 -54 227 90 16 241 -19 -176 264 78 -220 31 0 442 53 -12 -124 -99 198 -81 141 45 115 82 46
$$ packed form
7887b69J07m6J01K34r5K4R6lj80L2K26j35l75M41l5j44N3p0J65j34K9R2J3J44
7911B71k17l3k02L62j71j09N8j98K13J69k82M01m61N7k25M62k48J91J61j63j13
7932g7K5M2o4j23M11j6m8n1k62J02L62l35k29M24j07P2k13L4J79k47J20j30k1
7955a52J07j1j57m4P8K14j62j3K05J24k45K14j67J91j65J04l71K1K60j79L37l62
7977a73K06k0j44K22J16j11m3p7jK7n1k33K80o1K48j70L05j62j12j68K83j43m6
8000b8L5%j13J58p9J35r5k21K25Q2j07L1J23q2j05p5m2O4J48k40M50k89J57j15
8024A7j91L5J44k8J43k28P1R8k08J09k64L84J88k28j77J08j44n7K84J22k04Rl7
8047e4K81j37p4K25k60j57M40j86k98K51l1M42l89o5j12K5K97k79K22r6P0l3l6
$$ plain form
8070 46 -204 -5 -124 48 -258 14 -172 184 31 -27 22 -56 -394 -164 18 -164 266 28 -109 -142 3 -92
8092 -92 -73 139 -115 63 -12 -100 73 -70 3 123 46 -86 82 121 202 -17 16 56 -69 85 47 127 60 39 -80
8117 -80 84 -247 4 -297 -63 202 108 64 36 4 83 7 -126 83 8 117 -72 142 -65 149 -327 -8 -170
8140 -170 8 -249 -44 -42 -91 -56 78 -39 -134 -127 10 118 -106 -99 95 205 -152 64 47 15 136 -189 -59 60
8164 60 -52 -65 -88 192 156 -148 166 -17 38 -123 -329 86 -210 138 89 -298 -81 336 -94 118 -142 80
8186 80 44 74 -93 -163 -103
$$ packed form
8070D6k50J99j19J72l06K72j86L56j53n8M9p8l38K30J82j82M30k38j37l3J45r5
8092i2J9K12k54J78p5q8J73j43P3J20p7j32J68L9Q1k19L3M0j25J54l8Q0o7k1j19
8117h0J64l31K51l01K34K65r4m4k8l2P9p6j33K09p5J09j89K14k07K14m76L19j62
8140a70J78k57K05Km9L5J34j17r5PJ37J08k24PJ94J10l57K16j7l2J21l25J30J19
8164F0j12j3k3K80l6l04L14j83N5j61k06M15k96L48m9l87K17M17m30K12k60K22
8186H0l6L0j67p0O0
8191a03
$$ Imaginary data points
##PAGE= N=2
##DATA TABLE= (X++(I..I)), XYDATA
$$ plain form
0 0 0 0 0 0 0 0 0 0 0 0 0 0 0 0 0 -32 32 -32 32 -32 32 -64 64 -64 90 -96 104 -128 159 -163 192 -224 256 -288
34 -288 320 -358 405 -454 504 -565 625 -696 773 -856 945 -1043 1151 -1268 1400 -1537 1694
51 1694 -1873 2059 -2277 2514 -2791 3099 -3457 3879 -4375 4974 -5720 6665 -7926 9674
65 9674 -12287 16626 -25103 48048 -239737 -783926 -510087 -248318 -181638 -128547 214622
76 214622 482415 437807 238601 194337 142976 -83911 -354170 -398592 -311161 -250728 -159228
87 -159228 106434 369125 396417 241696 155217 130449 -5828 -247786 -366178 -291589 -171379
98 -171379 -104174 5054 195370 335131 301050 165815 52411 -32297 -145268 -248440 -252109
109 -252109 -158017 -58446 6284 82720 189644 248795 196487 78405 -17334 -81233 -154757
$$ packed form
0@%%%%%%%%%%%%%%%l2O4o4O4o4O4r6J28j28J54j86K00k32K87l22L55m16M80n44
34b88O08o78P63q59R58j069J190j321J469j629J801j988K194k419K668k937L231
51A694l567L932m336M791n305N890o556P336q254R349j0694J2385j4591J7600
65I674k1961K8913m1729P3151k87785n44189K73839K61769O6680N3091L43169
76B14622K67793m4608j99206m4264n1361k26887k70259m4422Q7431O0433R1500
87a59228K65662K62691K7292j54721q6479k4768j36277k41958j18392P4589J20210
98a71379O7205J09228J90316J39761l4081j35235j13404q4708j12971j03172l669
109b52109R4092R9571O4730P6436J06924N9151n2308j18082r5739o3899p3524
$$ plain form
120 -154757 -216739 -197129 -94355 12449 79109 136887 191930 183641 89500 -16301 -71451
131 -71451 -107825 -156721 -166601 -89457 13296 58571 69928 112717 157178 120364 17979 -56036
143 -56036 -78740 -103754 -137154 -115162 -27356 50165 75836 88520 111107 101378 37453 -30620
155 -30620 -60311 -76773 -103102 -103214 -46795 26025 63299 72351 83959 84483 45856 -12276 -48909
168 -48909 -59102 -68695 -75452 -54054 -6828 35420 58197 70960 73482 51872 7984 -33493 -55900
181 -55900 -62772 -59953 -42893 -11580 21415 43666 53986 54516 43215 18896 -11491 -37151 -52141
194 -52141 -52949 -40263 -18053 8247 31693 46325 47594 36064 18087 -3012 -23781 -39466 -43979
207 -43979 -35035 -19057 -633 19190 35167 40808 33255 18647 2084 -15125 -30068 -36210 -30807
$$ packed form
120a54757o1982J9610J02774J06804O6660N7778N5043q289r4141j05801n5150
131g1451l6374m8896r880P7144J02753M5275J1357M2789M4461l6814j02385p4015
143e6036k2704k5014l3400K1992Q7806P7521K5671J2684K2587r729o3925o8073
155c0620k9691j6462k6329j12N6419P2820L7274R052J1608N24l8627n8132l6633
168d8909j0193r593o757K1398M7226M2248K2777J2763K522k1610m3888m1477k2407
181e5900o872K819J7060L1313L2995K2251J0320N30j1301k4319l0387k5660j4990
194e2141q08J2686K2210K6300K3446J4632J269j1530j7977k1099k0769j5685m513
207d3979Q944J5978J8424J9823J5977N641p553j4608j6563j7209j4943o142N403
$$ plain form
220 -30807 -18266 -4136 11130 24878 32051 28732 18622 5848 -8022 -21237 -28651 -27527 -18683
233 -18683 -6966 6251 18364 25180 24609 17761 7931 -3738 -15365 -21728 -21800 -17135 -9097 1781
247 1781 12757 19745 20305 16330 9275 -492 -10845 -17264 -18416 -14755 -9056 -1199 8662 15068 16358
262 16358 13952 9720 2747 -6274 -13283 -15419 -13018 -9090 -3413 4948 11723 14080 12066 8205 3525
277 3525 -3349 -9322 -12449 -11559 -8308 -3750 1888 8007 11276 10452 7825 4046 -1019 -6429 -9978 -10125
293 -10125 -7415 -3605 502 4891 8735 9435 7233 3832 37 -3990 -7257 -8481 -6788 -3999 -117
308 -117 3240 6174 7593 6673 3922 414 -2580 -5033 -6950 -6452 -4094 -905 1865 4408 5801 5899
324 5899 3964 870 -1683 -3872 -5225 -5334 -3716 -1585 1395 3139 4578 4964 3689 1886 -1085 -2644
$$ packed form
220c0807J2541J4130J5266J3748P173l319j0110j2774j3870j3215p414J124Q844
233a8683J1717J3217J2113O816n71o848r830j1669j1627o363p2M665Q038J0878
247A781J0976O988N60l975p055r767j0353o419j152L661N699P857R861O406J290
262A6358k406m232o973r021p009k136K401L928N677Q361O775K357k014l861m680
277C525o874n973l127Q90L251M558N638O119L269q24k627l779n065n410l549j47
293a0125K710L810M107M389L844P00k202l401l795m027l267j224J693K789L882
308a17L357K934J419r20k751l508k994k453j917M98K358L189K770K543J393R8
324E899j935l094k553k189j353j09J618K131K980J744J439L86j275j803k971j559
$$ plain form
340 -2644 -3924 -4460 -4017 -1751 445 2198 3646 3885 3661 1866 -112 -1866 -3209 -3484 -3320 -1771 -231
357 -231 1387 2838 3160 3023 1769 434 -1108 -2396 -2695 -2665 -1748 -662 1051 2317 2826 2186 1586 597
375 597 -548 -1935 -2536 -2553 -1532 -829 396 1533 1955 2137 1707 866 -130 -977 -1863 -1867 -1531 -669 -92 831
395 831 1701 2037 1633 799 254 -696 -1257 -1528 -1708 -754 -54 911 1177 1520 1335 1018 154 -518 -801 -1487
415 -1487 -1423 -933 -341 466 843 993 970 939 308 -134 -725 -1106 -1064 -840 -412 299 500 966 939 1068 491 120
437 120 -659 -751 -782 -804 -479 37 382 899 555 638 599 -55 -287 -791 -673 -864 -320 124 586 672 646 360 664
460 664 372 -22 -501 -685 -296 -418 -445 309 397 532 529 339 394 4 -175 -530 -481 -339 -226 -70 67 740
482 740 382 243 311 267 -312 -389 -334 -455 -266 -335 152 292 503 349 142 -11 -496 -237 -86 -254 -144 -304
$$ packed form
340b644j280n36M43K266K196J753J448K39k24j795j978j754j343k75J64J549J540
357b31J618J451L22j37j254j335j542j288k99L0R17J086J713J266N09o40o00r89
375E97j145j387o01j7J021P03J225J137M22J82m30q41r96q47q86mL36Q62N77R23
395H31Q70L36m04q34n45r50n61k71j80R54P00R65K66L43j85l17q64o72k83o86
415a487O4M90N92Q07L77J50k3l1o31m42n91l81M2K24M28P11K01M66k7J29n77l71
437A20p79r2l1k2L25N16L45N17l44Q3l9o54k32n04J18j91N44M44M62Q6k6k86L04
460F64k92l94m79j84L89j22k7P54Q8J35lj90N5l90j79l55M9J42J13J56J37O73
482G40l58j39O8m4n79p7N5j21J89o9M87J40K11j54k07j53m85K59J51j68J10j60
$$ plain form
504 -304 60 339 186 400 375 204 334 -33 -355 -154 23 -29 346 204 155 403 51 -96 41 -99 138
525 138 -258 -70 20 -2 57 150 -82 144 150 8 -90 -147 29 147 -155 -313 -47 222 14 75 -150 297 -196
548 -196 14 -263 -207 -110 -30 214 -45 248 96 94 -87 108 -223 47 13 60 82 257 127 137 263 -71 45
571 45 -115 23 -169 64 67 -52 -82 196 -80 172 -114 382 -133 19 -61 132 -182 155 -57 -22 109 -210
593 -210 -53 -97 34 157 -96 -118 -13 -11 87 5 -148 -179 81 18 190 105 -142 -219 -73 13 232 -79 -77 -144 -20
618 -20 261 -199 204 -168 -31 -141 227 103 -30 -191 -138 -114 -33 91 102 78 -4 -259 -167 -56 362 63 75
641 75 -123 147 316 -232 -225 -21 210 113 -33 -153 462 5 -314 -54 89 44 102 104 -72 169 -264 237 65
664 65 280 125 40 97 217 111 219 -108 -189 125 69 -232 -124 -156 210 48 -212 212 -101 53 -155 -123 -20
$$ packed form
504c04L64K79j53K14k5j71J30l67l22K01J77n2L75j42m9K48l52j47J37j40K37
525A38l96J88R0k2N9R3k32K26Oj42r8n7J76J18l02j58K66K69k08O1k25M47m93
548a96K10k77N6R7Q0K44k59K93j52kj81J95l31K70l4M7K2J75j30J0J26l34J16
571D5j60J38j92K33Lj19l0K78k76K52k86M96n15J52q0J93l14L37k12L5J31l19
593b10J57m4J31J23k53k2J05KR8q2j53l1K60o3J72q5k47p7J46Q6K19l11Ko7J24
618b0K81m60M03l72J37j10L68j24j33j61N3K4Q1J24J1k4q2k55R2J11M18k99J2
641G5j98K70J69n48PK04K31r7j46j20O15m57l19K60J43m5N8Kj76K41m33N01j72
664F5K15j55q5N7J20j06J08l27q1L14n6l01J08l2L66j62k60M24l13J54k08L2J03
$$ plain form
687 -20 185 219 241 -127 -29 172 -7 -128 -186 -140 -65 111 340 -106 -91 -105 57 -178 -101 -23 -36 -21 240 227 -202
712 -202 72 196 2 -158 180 50 -16 -123 18 -220 -71 144 26 7 -46 -133 21 -60 -195 -21 -51 104
734 104 114 -104 -75 -8 -22 -26 -83 -244 -72 261 -177 47 -185 -55 191 245 -50 -25 -140 -36 -163 25 -219
757 -219 44 63 188 231 77 94 -242 -147 132 -37 136 -24 -118 78 247 3 -125 108 79 245 -115 348
779 348 -191 71 -322 172 25 -201 -122 -85 -39 -160 203 46 38 34 105 -14 -145 5 -96 39 121 -76 207
802 207 86 -287 27 80 46 -5 -57 129 -50 -58 -89 -209 20 49 13 272 -87 -35 -10 -47 56 27 -210 -86 99
827 99 18 27 -108 38 -136 166 -145 111 -68 21 284 -1 -146 -141 -264 104 73 28 -29 131 -151 74 91 -16
851 -16 -76 -336 -72 52 8 127 199 144 31 -205 -24 -63 -116 -130 59 -121 49 -286 -79 -180 -62 79 64
$$ packed form
687b0K05L4K2l68R8K01j79j21n8M6P5J76K29m46J5j4J62k35P7P8j3J5K61j3m29
712b02K74J24j94j60L38j30o6j07J41k38J49K15j18j9n3q7J54q1j35J74l0J55
734A04J0k18K9O7j4mn7j61J72L33m38K24k32J30K46N4k95K5j15J04j27J88k44
757b19K63J9J25M3j54J7l36R5K79j69J73j60r4J96J69k44j28K33k9J66l60M63
779C48n39K62l93M94j47k26P9L7M6j21L63j57qmP1j19j31J50j01J35Q2j97K83
802B07j21l73L14N3l4n1n2J86j79ql1j20K29K9l6K59l59N2K5l7J03k9k37J24J85
827I9q1Rj35J46j74L02l11K56j79Q9K63k85j45Nj23L68l1m5n7J60k82K25J7j07
851a6o0k60K64J24m4J19P2n5j13k36J81l9n3j4J89j80J70l35K07j01J18J41j5
$$ plain form
874 64 -109 -104 69 -333 24 71 -174 106 150 -98 -123 228 42 213 -154 169 53 177 -163 -62 -192 -116 271
897 271 141 161 187 15 147 143 232 58 157 36 -226 -113 143 313 45 -101 -62 -141 -6 73 -20 103 -142 169
921 169 -35 -95 -79 23 -51 17 -165 13 342 345 181 64 60 -37 -216 95 -22 -203 31 -112 276 85 -36
944 -36 -5 -78 143 14 -34 -89 -134 232 121 -397 21 168 -150 -9 166 -105 -40 -117 -248 66 -109 148 78
967 78 -261 87 -7 32 -87 2 266 -112 188 75 46 35 -113 -209 -26 0 61 286 -90 55 165 120 22 112
991 112 -71 -195 -186 -184 11 27 181 -165 41 -84 80 174 -56 -20 80 -195 59 141 114 28 118 38 7 173 -39
1016 -39 96 14 -39 -193 110 148 131 -14 153 -9 151 18 -156 -166 35 -97 -157 97 111 112 76 164 57 -149
1040 -149 -79 -28 -8 -171 145 -221 112 263 296 -119 -132 -113 -64 -191 14 -41 53 255 -61 -93 20 94 111 146
$$ packed form
874F4j73NJ73m02L57M7k45K80M4k48k5L51j86J71l67L23j16J24l40J01j30P6L87
897B71j30K0K6j72J32mQ9j74R9j21k62J13K56J70k68j46L9p9J35P9r3J23k45L11
921A69k04o0J6J02p4O8j82J78L29Lj64j17mr7j79L11j17j81K34j43L88j91j21
944c6L1p3K21j29m8n5m5L66j11n18M18J47l18J41J75k71O5p7j31L14j75K57p0
967G8l39L48r4L9j19Q9K64l78L00j13k9j1j48r6J83K6O1K25l76J45J10m5r8R0
991A12j83j24RKJ95J6J54l46K06j25J64R4k30L6J00k75K54Q2k7q6R0q0l1J66k12
1016c9J35q2n3j54L03L8j7j45J67j62J60j33j74j0K01j32o0K54J4Jl6Q8j07k06
1040a49P0N1K0j63L16l66L33J51L3m15j3J9M9j27K05n5R4K02l16l2J13P4J7L5
$$ plain form
1064 146 -4 220 -38 -6 1 160 193 86 78 -103 4 -73 -94 -25 -117 39 136 75 -158 103 27 87 91 51 41 212
1090 212 312 -209 -148 -108 -102 -67 -151 -117 30 -231 7 102 48 -190 -35 -128 153 -58 -35 13 -182 -10 103 -272
1114 -272 -47 -222 -48 38 -121 -5 -83 -142 28 -171 63 112 37 36 125 -207 101 43 -70 18 183 168 194 -70
1138 -70 228 -55 -1 113 -43 -22 -153 144 96 7 169 444 -82 79 74 88 1 -302 31 113 66 -44 -25 17
1162 17 -45 77 -261 -54 -222 135 -118 -129 -37 11 28 107 39 -155 -215 7 82 180 137 -221 -24 17 142 -12
1186 -12 -34 -63 -303 -152 137 27 -47 91 -19 155 -13 -31 -137 -71 -280 30 315 -21 141 18 92 65 122
1209 122 -204 23 72 43 -114 96 -100 -171 15 86 -48 -42 -203 139 -79 -65 -118 -141 230 216 94 -155 -16
1232 -16 62 141 -251 -95 -63 72 -68 -64 43 -261 -38 156 -112 189 -44 -109 167 -109 -42 -102 -38 2 5 -227
$$ packed form
1064A46j50K24k58L2PJ59L3j07qj81J07p7k1O9r2J56R7o1k33K61p6O0Mm0j0J71
1090B12J00n21O1M0OL5q4L4J47k61K38R5n4k38J55r3K81k11K3M8j95J72J13l75
1114b72K25j75J74Q6j59J16p8n9J70j99K34M9p5jQ9l32L08n8j13Q8J65j5K6k64
1138g0K98k83N4J14j56K1j31K97m8q9J62K75n26J61nJ4q7l03L33Q2m7j10J9M2
1162A7o2J22l38K07j68L57k53j1R2M8J7P9o8j94o0K22P5R8m3l58J97M1J25j54
1186a2k2k9k40J51K89j10p4J38j10J74j68j8j06O6k09L10K85l36J62j23P4k7N7
1209A22l26K27M9k9j57K10j96p1J86P1j34Oj61L42k18J4n3k3L71j4j22k49J39
1232a6P8P9l92J56L2J35j40MJ07l04K23J94k68L01k33o5K76k76O7o0O4M0Lk32
$$ plain form
1256 -227 72 103 146 -201 36 -7 81 70 -5 -165 168 63 26 -59 1 166 201 -218 117 102 -166 -45 190 129
1280 129 -91 83 -91 -76 -164 14 51 105 14 159 -49 -59 160 45 -43 264 -8 89 34 -46 21 -136 -322 -145
1304 -145 -83 -83 -173 93 209 -295 -123 29 -223 -173 139 -41 -255 82 -120 157 -172 -113 -67 -75 -32 -212 -194 -5
1328 -5 356 172 -154 256 -200 14 77 -14 -97 293 19 32 -5 77 108 -130 177 58 -179 20 -4 -234 415
1351 415 -133 189 273 -65 -193 -111 -322 12 89 214 67 -122 -67 -22 -101 -106 113 148 -27 19 131 -34 -60 -26
1375 -26 342 -192 -177 -196 -63 62 -52 -51 -246 -191 -47 231 -5 130 -84 224 214 127 -74 56 202 260 214
1398 214 -47 149 147 -384 -83 -206 121 244 1 176 1 -27 198 -130 102 -76 332 80 71 -12 -133 76
1420 76 325 203 -166 -340 -75 -55 59 252 -78 -78 -81 -314 -150 8 -167 141 -3 215 49 199 207 31 -160
$$ packed form
1256b27K99L1M3l47K37m3Q8j1p5j60L33j05l7q5O0J65L5m19L35j5k68J21K35o1
1280A29k20J74j74J5q8J78L7N4r1J45k08j0K19j15q8L07k72R7n5q0O7j57j86J77
1304a45O2%r0K66J16n04J72J52k52N0L12j80k14L37k02K77l29N9M6qM3j80J8J89
1328eL61j84l26M10m56K14O3r1q3L90k74J3l7Q2L1k38L07j19k37J99k4k30O49
1351D15n48L22Q4l38j28Q2k11L34P7J25j47j89N5M5p9nK19L5j75M6J12j65k6L4
1375b6L68n34J5j9J33J25j14Jj95N5J44K78k36J35k14L08j0q7k01J30J46N8m6
1398B14k61J96kn31L01j23L27J23k43J75j75k8K25l28K32j78M08k52rq3j21K09
1420G6K49j22l69j74K65K0J14J93l30%lk33J64J58j75L08j44K18j66J50Qj76j91
$$ plain form
1443 -160 -90 72 -33 97 65 429 128 129 -73 79 -47 25 17 -115 129 -322 -37 1 -208 -135 -215 141 -61
1466 -61 -70 -188 72 -219 80 117 97 -104 -12 10 0 -32 155 227 282 -156 24 163 215 78 80 162 2 154 84
1491 84 69 136 -32 -284 -206 4 -100 -183 -1 -43 -109 -61 -61 -108 -75 -3 165 -105 -106 -166 51 -143 -37 178 271 -23
1517 -23 -144 -15 -170 99 -85 1 90 223 -149 -72 -201 54 -76 -132 70 25 152 90 132 -63 -30 47 -43 -47
1541 -47 -142 70 -241 -187 -17 -28 79 -22 -46 1 85 142 -36 90 6 -132 71 -41 54 30 170 264 -6 122
1565 122 224 -320 239 28 -81 94 -26 -25 -68 12 -127 -196 17 -150 -168 285 99 39 133 -62 189 -84 131
1588 131 67 -35 242 -4 -248 -192 35 221 -272 -192 108 -42 -170 -49 81 -14 218 -135 154 173 165 -86
1610 -86 -206 24 8 -188 180 110 146 -90 -93 324 36 127 -107 -31 -204 -118 -103 7 -58 -208 87 261 -104 189
$$ packed form
1443a60P0J62j05J30l2L64l01Jk02J52j26P2qj32K44m51K85L8k09P3q0L56k02
1466f1rj18K60k91K99L7k0k01R2K2j0l2J87P2N5m38J80J39N2j37KQ2j60J52p0
1491H4j5O7j68k52P8K10j04q3J82m2o6M8%m7L3P2J68k70jo0K17j94J06K15R3k94
1517b3j21J29j55K69j84Q6Q9J33l72P7j29K55j30n6K02m5J27o2M2j95L3P7r0m
1541d7r5K12l11N4J70j1J07j01k4M7Q4N7j78J26q4j38K03j12R5k4J40R4k70J28
1565A22J02n44N59k11j09J75j20Jm3Q0j39o9K13j67j8M53j86o0R4j95K51k73K15
1588A31o4j02K77k46k44N6K27J86m93Q0L00j50j28J21J30r5K32l53K89J9qk51
1610h6j20K30j6j96L68p0L6k36lM17k88R1k34P6j73Q6J5J10o5j50K95J74l65K93
$$ plain form
1634 189 -2 -7 49 -46 83 -194 156 275 140 -107 -89 -91 -144 -51 -159 -63 -232 -11 196 -20 107 134 76 44
1658 44 57 -26 193 -164 204 54 169 -50 -12 21 -116 103 -60 278 -67 -9 25 39 3 112 -56 -26 157
1681 157 -95 46 -84 -28 39 98 -42 5 181 76 334 52 -145 -83 99 59 -201 -143 134 -173 -98 79 205
1704 205 -125 -209 117 492 157 118 94 -56 -152 37 0 -13 175 -162 -63 200 74 -60 193 109 -150 120 -116
1727 -116 33 4 -9 -137 -114 142 -134 -109 21 -311 -5 -65 -238 -45 2 -54 232 46 -52 20 -5 -19 -52 -146
1751 -146 21 -168 14 64 -151 -124 -412 -18 58 196 -25 33 118 362 -76 161 11 -137 -123 38 0 -105
1773 -105 -122 -115 45 -223 -99 113 -59 -61 -117 -28 157 132 -47 172 21 2 -106 61 164 83 93 34 -129 -38
1797 -38 201 -106 209 74 -37 91 -117 7 -183 -116 -27 143 38 -153 84 18 -140 90 107 217 150 39
$$ packed form
1634A89j91nN6r5J29k77L50J19j35k47J8kn3R3j08R6j69K21K07k16J27K7n8l2
1658D4J3q3K19l57L68j50J15k19L8L3j37K19j63L38l45N8L4J4l6J09j68L0J83
1681A57k52J41j30N6O7N9j40M7J76j05K58k82j97O2J82m0k60N8K77l07P5J77J26
1704B05l30q4L26L75l35l9k4j50r6J89l7j3J88l37R9K63j26j34K53q4k59K70k36
1727a16J49k9j3j28K3K56k76K5J30l32L06o0j73J93M7n6K86j86r8P2k5j4l3r4
1751a46J67j89J82N0k15K7k88L94P6J38k21N8Q5K44m38K37j50j48J4J61l8j05
1773a05j7PJ60k68J24K12j72kn6Q9J85k5j79K19j51j9j08J67J03q1J0n9j63R1
1797c8K39l07L15j35j11J28k08J24j90O7Q9J70j05j91K37o6j58K30J7J10o7j11
$$ plain form
1819 39 221 161 54 -151 -183 7 -53 84 -273 65 95 -167 -32 -284 -283 31 183 -262 75 93 -338 -268 160
1842 160 140 173 -189 -84 -28 -27 -15 15 -32 -42 265 -155 14 173 105 136 69 -115 54 48 -201 90 -54 -39 146
1867 146 -151 -96 23 -36 -80 251 115 172 -128 -36 72 -63 259 89 85 195 230 26 -160 72 47 63 -131
1890 -131 -71 -11 -222 87 -11 74 -211 -148 -54 -149 -96 -164 76 -166 202 -149 -145 -12 -4 -6 -5 162 70 -86 201 -159
1916 -159 72 -80 -85 15 5 61 23 -124 39 106 -107 -110 -103 160 -118 184 22 -51 -53 121 9 22 -361 -65 -69
1941 -69 110 -96 -117 23 94 -86 167 109 -189 126 -5 294 -31 99 -32 -4 -152 59 92 94 -2 -149 -180
1964 -180 -3 239 -91 -148 70 -18 -27 -228 -76 149 -25 -144 -167 174 98 -109 132 72 32 165 -95 41 92
1987 92 147 -193 -209 81 -183 -73 -261 349 200 224 19 75 -20 -110 32 1 -185 -256 -48 47 -217 82 224
$$ packed form
1819C9J82o0j07k05l2J90o0J37l57L38L0k62J35k52JL14J52m45L37J8m31P0M28
1842A60k0L3l62J05N6JJ2L0m7j0L07m20J69J59o8L1o7j84J69ok49K91j44J5J85
1867A46k97N5J19n9m4L31j36N7l00R2J08j35L22j70mJ10L5k04j86K32k5J6j94
1890a31O0O0k11L09r8Q5k85O3R4r5N3o8K40k42L68l51MJ33QkJJ67r2j56K87l60
1916a59K31j52nJ00j0N6l8j47J63O7k13lPK63k78L02j62p3kJ74j12J3l83K96m
1941f9J79k06k1J40P1j80K53n8k98L15j31K99l25J30j31K8j48K11L3Kr6j47l1
1964a80J77K42l30n7K18q8rk01J52K25j74j19k3L41p6k07K41o0m0J33k60J36N1
1987I2N5l40j6K90k64J10j88O10j49K4k05N6r5r0J42l1j86p1K08R5k64K99J42
$$ plain form
2010 224 243 1 -148 326 18 115 -373 -49 -28 -27 -122 -145 -173 -7 -7 -6 -192 -49 -59 -79 88 -84 -195 102 -25
2035 -25 -84 -19 49 -101 -154 -1 109 156 -62 168 -114 89 175 -71 70 -60 -255 64 34 -55 -35 -55 -128 -87
2059 -87 -67 379 -96 -6 49 182 -164 -124 -211 -115 -387 -182 -132 61 252 -26 386 292 -144 103 0 68 -32
2082 -32 97 -22 -172 90 -65 -59 -44 34 -90 -165 0 82 104 -82 -39 -212 -169 -225 -58 120 171 105 -143 -278
2106 -278 -305 -127 -157 85 0 -7 -12 23 337 -190 53 5 82 -5 -78 207 0 -13 13 48 -108 29 -390 217 132
2131 132 254 -103 2 121 -11 -84 -137 0 -157 -302 78 -37 187 -51 102 167 -136 94 215 220 26 -100
2153 -100 -15 -84 -59 158 -191 -60 33 -1 -369 -95 -82 244 -84 118 204 -96 90 57 19 -84 174 -193 202
2176 202 109 -16 277 -18 17 -58 130 79 243 114 166 79 109 29 3 102 -80 25 -150 -103 -82 -216 104 -113
$$ packed form
2010B24J9k42j49M74l08R7m88L24K1Jr5k3k8J66%Jj86J43j0k0J67j72j11K97j27
2035b5n9O5O8j50n3J53J10M7k18K30k82K03Q6k46J41j30j95L19l0q9K0k0p3M1
2059h7K0M46m75R0N5J33l46M0q7R6k72K05N0J93J91k78M12r4m36K47j03O8j00
2082c2J29j19j50K62j55OJ5P8j24p5J65Q2K2j86M3j73M3n6J67J78N1o6k48j35
2106b78k7J78l0K42q5pnL5L14n27K43m8P7q7p3K85k07j3K6L5j56J37m19O07q5
2131A32J22l57J05J19j32p3n3J37j57j45L80j15K24k38J53O5l03K30J21Nj94j26
2153a00Q5o9K5K17l49J31R3l4l68K74J3L26l28K02Q6l00J86l3l8j03K58l67L95
2176B02r3j25K93k95L5p5J88n1J64j29N2q7L0q0k6R9j82J05j75M7K1j34L20k17
$$ plain form
2200 -113 169 -107 -151 -210 84 149 -245 -31 63 -15 58 -186 -63 -8 -226 -249 103 -108 -96 87 19 -79 -79 -162 -185
2225 -185 180 37 25 -1 256 -154 -291 -200 -14 110 261 31 -122 80 93 36 163 -31 -86 -160 -66 -71 5 -39
2249 -39 250 239 -142 104 58 -51 -26 -71 15 -193 -139 37 -8 180 165 15 -27 141 179 -231 39 -163 -27 -73
2273 -73 49 -16 -66 -195 91 -99 5 115 -47 -63 14 143 16 41 -29 -222 -152 135 60 206 -309 69 -216
2296 -216 -208 21 -171 -248 71 -120 -59 -48 221 -5 -134 169 58 -184 -268 199 -133 202 24 -209 -109 -52
2318 -52 186 -161 -473 84 -152 178 104 -83 36 -93 14 -299 -15 63 117 -11 147 213 -214 362 135 168
2340 168 -3 104 36 28 34 114 164 112 4 -20 -109 -11 43 -235 -278 55 -136 -85 -42 -408 120 107 -3 -38 -173 205
2366 205 161 193 -202 -186 -21 121 139 -99 -45 37 -177 201 23 -65 95 -188 12 -41 -269 162 202 281 -152
$$ packed form
2200a13K82k76m4n9K94O5l94K14R4p8P3k44J23N5k18k3L52k11J2J83o8r8%q3k3
2225a85L65j43j2k6K57m10j37R1J86J24J51k30j53K02J3n7J27j94n5p4R4nP6m4
2249c9K89j1l81K46m6j09K5m5Q6k08N4J76m5J88j5j50m2J68L8m10K70k02J36m6
2273g3J22o5n0j29K86j90J04J10j62j6P7J29j27K5p0j93P0K87p5J46n15L78k85
2296b16QK29j92p7L19j91O1J1K69k26j29L03j11k42q4M67l32L35j78k33J00N7
2318e2K38l47l12N57k36L30p4j87J19j29J07l13K84P8N4j28J58O6m27N76k27L3
2340A68j71J07o8qOQ0N0n2j08k4q9R8N4k78m3L33j91N1M3l66N28j3j10l5j35L78
2366B05m4L2l95J6J65J42J8k38N4Q2k14L78j78q8J60k83K00n3k28M31M0P9m33
$$ plain form
2389 -152 7 140 -36 246 3 -230 -30 188 58 -182 -87 -38 -11 0 -246 -45 25 4 -258 28 -56 195
2411 195 59 -129 210 -94 366 174 42 137 -15 61 -12 -95 -266 -158 26 -29 46 214 -67 -25 -15 144 101
2434 101 162 60 -65 91 -8 48 -47 16 -130 -19 -300 -327 85 -1 -7 5 -64 99 -306 48 100 -216 -169 27
2458 27 -108 195 127 -76 182 90 150 -21 -195 -46 -1 -83 65 -227 123 -119 -99 -34 45 105 44 -120 12 -4
2482 -4 -27 287 -60 -180 134 37 -72 246 120 136 111 127 86 109 -200 -68 -81 21 36 -33 131 122 -96 -24 1
2507 1 -87 21 -142 114 -86 -126 53 77 183 -66 58 18 -191 101 42 -167 -72 193 -44 137 51 -51 14
2530 14 -321 -25 94 -226 -106 323 12 -246 -122 -79 -161 -75 -30 71 -63 189 207 -209 -37 72 -112 -48
2552 -48 -228 -79 -90 -94 -208 22 25 37 90 151 101 35 -144 136 78 -97 -147 -79 228 121 -61 -57 -20 -19 -55 -115 -198
$$ packed form
2389a52J59J33j76K82k43k33K00K18j30k40R5M9K7J1k46K01P0k1k62K86q4K51
2411A95j36j88L39l04M60j92j32R5j52P6p3q3j71J08J84n5P5J68k81M2J0J59m3
2434A01O1j02j25J56r9N6r5O3j46J11k81k7M12q6oJ2o9J63m05L54N2l16M7J96
2458B7j35L03o8k03K58r2O0j71j74J49M5q2J48k92L50k42K0O5P9O0o1j64J32j6
2482dk3L14l47j20L14r7j09L18j26J6k5J6m1K3l09J32j3J02J5o9J64rk18P2K5
2507Aq8J08j63K56k00m0J79K4J06k49J24m0k09K92n9k09R5K65k37J81q6j02O5
2530A4l35K96J19l20J20M29l11k58J24M3q2Q6M5J01j34K52J8m16J72J09j84O4
2552d8j80J49j1mj14K30LJ2N3O1n0o6j79K80n8j75n0O8L07j07j82ML7Jl6o0q3
$$ plain form
2579 -198 -37 -77 -161 44 -8 -220 -149 -166 104 52 -5 -74 33 -137 43 24 146 -56 -99 110 127 -219 141 50
2603 50 62 248 274 29 112 -3 -6 83 69 4 25 -76 -228 -173 -30 329 -117 80 -5 189 143 -255 -87 80
2627 80 -142 145 -159 29 -16 37 -138 -53 178 -71 99 -32 103 -54 7 232 -90 6 314 52 -61 87
2649 87 96 186 -37 -64 -143 -374 140 125 15 74 -190 -8 65 73 74 -69 -123 -110 -279 5 -322 -35 83 319 255
2674 255 -280 47 -205 128 -111 -25 65 7 -3 13 125 95 -122 -168 -146 124 -9 94 156 -151 -12 27 254
2697 254 47 33 -176 -349 13 -83 47 -102 -80 -119 109 166 25 -144 -4 25 -201 -244 294 -168 0 22 198
2720 198 -78 10 77 -308 -39 56 -91 173 -12 15 -126 50 106 202 -29 -113 222 122 200 3 47 -98 170
2743 170 63 88 178 50 -34 8 93 83 276 -19 35 74 126 -97 -88 -164 -151 -67 55 62 -46 -138 -115 -175 190 -95
$$ packed form
2579a98J61m0q4K05n2k12P1j7K70n2n7o9J07j70J80j9J22k02m3K09J7l46L60r1
2603E0J2J86K6k45Q3j15lQ9j4o5K1j01j52N5J43L59m46J97q5J94m6l98J68J67
2627H0k22K87l04J88m5N3j75Q5K31k49J70j31J35j57O1K25l22R6L08k62j13J48
2649H7RR0k23k7p9k31N14j5j10N9k64J82P3QJj43n4J3j69K84l27K87J18K36o4
2674B55n35L27k52L33k39Q6R0n8j0J6J12l0k17m6K2K70j33J03O2l07J39L9K27
2697B54k07j4k09j73L62r6J30j49K2l9K28N7j41j69J40K9k26m3N38m62J68K2J76
2720A98k76Q8O7l85K69R5j47K64j85K7j41J76N6R6k31q4L35j00P8j97M4j45K68
2743A70j07K5R0j28q4M2Q5j0J93k95N4L9N2k23Rp6J3Q4J22Pj08r2K3o0L65k85
$$ plain form
2769 -95 37 -203 -136 450 200 11 12 114 170 189 206 18 -20 213 175 -134 -361 -171 -51 152 -93 -48 151
2792 151 -208 -126 25 64 15 219 239 -25 -104 -31 110 -67 -112 -518 -71 129 -223 36 125 -352 325 66 240
2815 240 477 -30 131 102 40 -81 -50 -113 -226 166 -76 12 -22 106 508 -30 -40 74 -57 139 160 111 -6
2838 -6 35 306 -5 36 -1 -142 -3 191 -116 39 96 -238 -16 76 -4 23 -112 -137 59 -18 -9 75 29 -12 -173
2863 -173 23 -24 128 12 10 -41 -50 -155 259 -32 -203 79 -234 257 -241 32 3 -169 -42 -280 -156 112
2885 112 5 -364 122 218 77 121 109 193 -48 299 -188 -28 -28 186 -65 192 78 36 169 6 55 239 143
2908 143 -153 70 -123 251 9 36 -71 95 149 40 -21 23 -93 204 -83 264 -53 36 41 -109 8 -17 30
2931 30 -25 170 -79 -191 106 168 14 -37 186 -98 -354 147 -240 80 85 87 -11 115 -35 0 78 215 -69 51
$$ packed form
2769i5J32k40O7N86k50j89JJ02N6J9J7j88l8K33l8l09k27J90J20K03k45M5J99
2792A51l59Q2J51L9m9K04K0k64p9P3J41j77m5m06M47K00l52K59Q9m77O77k59J74
2815B40K37n07J61k9o2j21L1o3j13L92k42Q8l4J28M02n38j0J14j31J96K1m9j17
2838fM1K71l11M1l7j41J39J94l07J55N7l34K22R2q0K7j35k5J96p7RQ4m6m1j61
2863a73J96m7J52j16kn1rj05M14k91j71K82l13M91m98K73k9j72J27k38J24K68
2885A12j07l69M86R6j41M4j2Q4k41L47m87J60%K14k51K57j14m2J33j63M9J84r6
2908A43k96K23j93L74k42K7j07J66N4j09o1M4j16K97k87L47l17Q9Nj50J17k5M7
2931C0n5J95k49j12K97O2j54n1K23k84k56N01l87L20NKr8J26j50L5P8J37k84J20
$$ plain form
2955 51 -140 60 126 -193 -116 4 84 30 -26 -76 -46 28 284 3 -2 -54 54 147 -241 -144 242 -11 -84 105 -177
2980 -177 -52 -32 -224 -9 -279 -252 -268 88 125 -41 38 184 165 -47 36 -129 166 79 -13 22 60 44 42 -22 -89
3005 -89 39 80 -109 155 64 82 -81 176 118 139 -143 70 -75 -37 -1 118 42 15 -98 -46 -149 -158 169 107 -44
3030 -44 -72 -82 33 23 -138 -33 155 329 -22 124 103 6 153 -275 81 76 27 -4 42 78 69 62 172 42 23 6
3056 6 80 -176 -133 53 128 -100 14 -158 14 33 -161 115 -81 282 24 -132 19 -110 -173 4 -58 -61 157
3079 157 -249 -91 -26 127 15 135 -92 -63 -44 162 -133 -18 -194 -138 17 -150 401 -116 219 -166 -8
3100 -8 -116 21 164 134 153 197 -73 -28 259 222 127 351 31 -54 -80 -49 110 -82 28 47 193 -136 -25 138
3124 138 4 -182 34 -99 -173 -92 117 -198 155 -48 34 103 153 81 -140 153 -67 68 87 65 25 244 -49
$$ packed form
2955E1j91K00O6l19P7J20Q0n4n6n0L0P4K56k81nn2J08R3l88R7L86k53p3J89k82
2980a77J25K0j92K15k70K7j6L56L7j66P9J46j9k12Q3j65K95q7r2L5L8j6ko4o7
3005h9J28M1j89K64r1J8j63K57n8K1k82K13j45L8L6J19p6k7j13N2j03rL27o2j51
3030d4k8j0J15j0j61J05J88J74l51J46k1r7J47m28L56nm9l1M6L6rpJ10j30j9j7
3056FP4k56M3J86P5k28J14j72J72J9j94K76j96L63k58j56J51j29o3J77o2lK18
3079A57m06J58O5J53j12J20k27K9J9K06k95J15j76N6J55j67N51n17L35l85J58
3100hj08J37J43l0J9M4k70M5K87l7r5K24l20q5k6L1J59j92J10J9J46l29J11J63
3124A38j34j86K16j33p4Q1K09l15L53k03Q2O9N0p2k21K93k20J35J9k2m0K19k93
$$ plain form
3147 -49 127 23 -3 -66 2 68 -84 61 -50 -206 -305 106 -191 -142 115 159 -177 -139 152 58 75 -87 25 -83
3171 -83 158 425 -150 -7 -184 9 -15 -25 -16 -121 -146 -77 -121 142 -54 34 -17 256 -76 248 42 122 140 -162
3195 -162 31 -248 52 167 -160 -267 88 97 -95 -86 -132 -23 -36 -42 -157 -86 139 -25 -66 -309 72 -31 -217
3218 -217 193 80 272 13 -39 -92 92 -89 -82 294 144 98 -128 148 -35 57 -165 29 -284 -17 -9 -118 207
3241 207 -44 -226 -4 -30 -154 156 -214 20 -27 141 -194 355 -35 -112 -121 182 -85 169 74 -146 190 -105
3263 -105 11 128 21 18 246 24 -115 217 170 116 -63 -83 -21 81 19 -393 26 -91 220 69 52 11 3 136
3287 136 -190 -47 -68 -100 193 -74 -162 -32 76 -88 191 -174 -92 -106 121 50 -219 -134 421 -142 -136 210 41
3310 41 -328 -139 161 -349 140 129 54 -83 14 139 63 197 4 89 -116 41 -123 291 34 -64 -31 -144 -92
$$ packed form
3147d9J76j04k6o3O8O6j52J45j11j56r9M11k97M9K57M4l36L8K91r4J7j62J12j08
3171h3K41K67n75J43j77J93k4j0Rj05k5O9m4K63j96Q8n1K73l32L24k06Q0J8l02
3195a62J93k79L00J15l27j07L55Rj92Rm6J09j3oj15P1K25j64m1k43L81j03j86
3218b17M10j13J92k59n2n3J84j81PL76j50m6k26K76j83R2k22J94l13K67Qj09L25
3241B07k51j82K22k6j24L10l70K34m7J68l35N49l90p7rL03k67K54r5k20L36k95
3263a05J16J17j07lK28k22j39L32m7n4j79k0O2J02o2m12M19j17L11j51j7m1qJ33
3287A36l26J43k1l2K93k67q8J30J08j64K79l65Q2j4K27p1k69Q5N55n63OL46j69
3310D1l69J89L00n10M89j1p5j37R7J25p6J34j93Q5k05J57j64M14k57r8L3j13N2
$$ plain form
3333 -92 13 95 -189 238 370 -63 30 28 -74 103 96 73 146 23 40 80 161 -191 -17 -243 -117 22 -1 201
3357 201 -211 -56 109 106 29 -46 44 6 111 -14 90 14 -250 172 120 -81 74 98 29 -75 6 45 -1 -44 -86
3382 -86 57 79 158 -164 -61 183 34 -2 -56 204 -166 74 160 185 218 119 -336 -21 -54 180 -60 26 -146 7
3406 7 -17 60 13 209 -36 -21 -39 -341 391 -13 145 -50 352 95 -274 -230 129 59 -171 102 250 -156 -111
3429 -111 98 -239 90 -61 -19 -20 -5 38 42 43 -142 -28 94 12 -179 284 36 -168 120 -29 -28 -49 62 114 -130
3454 -130 3 -69 -133 -2 18 -137 -158 -120 82 4 125 109 -54 26 -153 -83 -32 1 -13 271 -40 -140 -195 -67
3478 -67 -15 83 61 222 -66 -59 -40 164 -206 -46 -37 -26 220 7 153 27 34 148 443 -188 -154 119 55 127 196
3503 196 -45 42 -14 -152 63 22 208 11 -3 11 -40 -110 19 143 248 -135 -220 39 137 269 33 -151 -75
$$ packed form
3333i2J05Q2k84M27J32m33R3kj02J77pk3P3j23J7M0Q1l52J74k26J26J39k3K02
3357B01m12J55J65lp7p5R0l8J05j25J04p6k64M22n2k01J55K4o9j04Q1L9m6m3m2
3382h6J43K2P9l22J03K44j49l6n4K60l70K40Q6K5L3r9m55L15l3K34k40Q6j72J53
3406Gk4P7m7J96k45J5j8l02P32m04J58j95M02k57l69M4L59p0k30K73J48m06M5
3429a11K09l37L29j51M2jJ5M3MJj85J14J22q2j91M63k48k04K88j49Jk1J11N2k44
3454a30J33p2o4J31K0j55k1L8K02p8J21j6j63Q0j79P0N1L3j4K84l11j00n5J28
3478f7N2R8k2J61k88PJ9K04l70J60RJ1K46k13J46j26PJ14K95o31L4K73o4P2O9
3503A96k41Q7n6j38K15m1J86j97j4J4n1p0J29J24J05l83q5K59R8J32k36j84P6
$$ plain form
3526 -75 121 -256 -151 87 -18 -34 69 3 33 -14 159 -102 -31 23 -40 -60 -248 -116 37 120 -120 81 -129
3549 -129 -113 -140 -132 -11 6 -37 -103 -54 157 -131 -122 -25 129 -20 277 79 47 183 -72 -7 -132 106 -104 313
3573 313 273 -16 55 -90 120 -60 131 -14 145 -66 -55 -49 47 106 53 61 -100 4 4 -116 -81 214 -142 53
3597 53 65 130 -119 -183 -111 -51 167 85 90 -35 261 171 -139 -188 -71 -114 -307 -189 44 -144 99 -101 -12 -88 26
3622 26 -25 -2 94 -129 335 -37 -22 235 -133 -175 23 -126 21 8 -203 -133 -90 12 82 171 -80 -86 208 42
3646 42 -44 150 -81 -181 -27 143 137 -306 -65 -170 -257 164 -101 1 -184 -132 -13 169 -231 -98 67 -21
3668 -21 81 113 156 94 -234 5 -222 64 -37 -23 -180 279 -138 30 33 97 379 70 -1 -45 136 -55 -25 37
3692 37 -26 17 -125 -68 -111 -81 -100 168 -117 108 -95 -106 181 116 -26 -168 -16 138 10 126 85 93 -64 30
$$ packed form
3526g5J96l77J05K38j05j6J03o6L0m7J73k61P1N4o3k0j88J32J53Q3k40K01k10
3549a29J6k7QJ21J7m3o6M9K11k88RR7J54j49K97j98l2J36k55O5j25K38k10M17
3573C13m0k89P1j45K10j80J91j45J59k11J1OR6N9n3Qj61J04%j20L5K95l56J95
3597E3J2O5k49o4P2O0K18q2Nj25K96r0l10m9J17m3j93J18K33j88K43k00Q9p6J14
3622B6n1K3R6k23M64l72J5K57l68m2J98j49J47j3k11P0M3J02P0Q9k51oK94j66
3646D2q6J94k31j00J54J70om43K41j05q7M21k65J02j85N2J19J82m00J33J65q8
3668b1J02L2M3o2l28K39k27K86j01J4j57M59m17J68LO4K82l09p1m4J81j91L0O2
3692C7o3M3j42N7m3L0j9K68k85K25k03j1K87o5j42j42J52J54j28J16m1Qj57R4
$$ plain form
3716 30 -61 40 -110 230 92 -45 133 -62 41 -54 338 -35 -165 -73 -44 -161 -109 74 43 -41 -157 92 -289
3739 -289 79 2 -136 56 28 -49 54 -35 5 -22 21 -62 -36 -70 -349 -35 -115 52 -157 84 16 109 150 -49 -110
3764 -110 82 -3 -2 157 64 201 52 180 -164 213 -144 70 -56 -106 -101 -40 -92 234 -97 -40 28 198 -38 5
3788 5 -2 -23 196 -7 248 170 -103 79 -112 -114 283 -96 -41 -37 -161 -112 -7 185 -2 53 -105 -211 50 -100
3812 -100 -174 -161 120 -293 156 114 128 10 -190 191 5 124 11 -24 67 22 -19 72 -152 -8 -113 -102 17
3835 17 124 -37 -174 109 96 -180 178 -39 78 234 62 -52 -169 83 -119 216 -77 131 50 111 -211
3856 -211 -126 113 -178 -52 158 -49 -122 24 -198 -249 -117 24 372 -280 1 260 276 85 -73 -39 -86 173
3878 173 -221 110 -101 107 195 -49 75 33 121 -49 9 33 27 140 -116 -95 263 137 -111 178 -55 -153 285
$$ packed form
3716C0r1J01j50L40j38j37J78j95J03r5L92l73j30R2K9j17N2J83l1q4j16K49l81
3739b89L68p7j38J92k8p7J03q9M0k7M3q3K6l4k79L14q0J67k09K41o8R3M1j99o1
3764a10J92q5JJ59r3J37j49J28l44L77l57K14j26n0NO1n2L26l31N7O8J70k36M3
3788Epk1K19k03K55p8k73J82j91kL97l79N5Mj24M9J05J92j87N5j58j06K61j50
3812a00p4J3K81m13M49m2J4j18k00L81j86J19j13l5R1m5m1R1k24J44j05J1J19
3835A7J07j61j37K83j3k76L58k17J17J56j72j14j17K52k02L35k93K08q1O1l22
3856b11Q5K39k91J26K10k07p3J46k22n1J32J41L48o52K81K59J6j91j58L4m7K59
3878A73l94L31k11K08Q8k44J24m2Q8j70N8K4oJ13k56K1L58j26k48K89k33r8M38
$$ plain form
3901 285 133 33 166 -149 -40 -146 -359 -133 -138 0 -39 -204 260 -197 31 28 -76 17 6 23 21 147 -173
3924 -173 3 152 41 176 -11 -15 -47 59 -122 -129 114 -16 144 160 42 -20 49 28 54 123 50 -100 77 -206
3948 -206 356 6 -193 -220 157 -69 139 -102 149 127 -205 -22 -130 1 12 170 200 -93 -171 -98 -142 -69 158
3971 158 -174 16 114 109 47 -255 167 -103 52 308 -179 -98 -137 20 -83 -120 -39 -96 38 -86 -90 121 -118 183
3995 183 -121 78 39 -37 148 -205 -150 93 102 10 -124 89 -197 -197 -54 174 21 -144 -103 -149 31 -173 -263 130
4019 130 -4 -213 -83 88 12 -11 -224 -132 159 -154 -247 2 90 -6 -121 -196 22 -117 10 135 -168 74
4041 74 152 175 -205 165 85 -63 -108 17 -126 68 19 190 185 112 109 -152 223 -164 -24 -135 114 -195 -109 1
4065 1 -285 45 -20 29 -113 -52 -152 29 -72 -42 -36 -202 183 93 -211 -93 -39 -226 -40 -69 188 171 107 -101
$$ packed form
3901B85j52j00J33l15J09j06k13K26nJ38l9j65M64m57K28lj04R3j1J7kJ26l20
3924a73J76J49j11J35j87ml2J06j81pK43j30J60J6j18o2O9k1K6O9p3j50J77k83
3948b06N62l50j99k7L77k26K08k41K51k2l32J83j08J31J1J58L0k93p8P3m4P3K27
3971A58l32J90R8no2l02M22k70J55K56m87Q1l9J57j03l7Q1n7J34j24mK11k39L01
3995A83l04J99l9p6J85l53N5K43Rr2j34K13k86%J43K28j53j65M1m6J80k04r0L93
4019A30j34k09J30J71p6k3k13R2K91l13r3K49Q8r6j15p5K18j39J27J25l03K42
4041G4P8K3l80L70q0j48m5J25j43J94m9J71np3lk61L75l87J40j11K49l09Q6J10
4065Ak86L30o5M9j42O1j00J81j01L0Oj66L85r0l04J18N4j87J86k9K57j7o4k08
$$ plain form
4089 -101 355 147 -40 52 -90 113 -81 -55 -88 -113 224 265 213 71 239 145 2 173 -11 8 -97 37 -199
4112 -199 18 -412 146 -114 -60 61 187 14 -264 209 127 25 -94 -71 55 164 152 29 -67 -12 203 -89
4134 -89 144 -38 0 117 -130 87 -117 155 6 -168 43 -192 119 -162 -128 -5 154 19 -202 96 -182
4155 -182 57 -56 -106 103 154 40 -154 263 34 -56 -50 29 18 126 82 -130 -214 -114 -88 -202 -142 -161 109 -82
4179 -82 -35 13 -55 92 -103 49 59 -7 -20 -55 -137 -64 -204 -75 10 224 19 -169 -67 158 77 -108 -73 149
4203 149 -47 78 96 195 123 -97 -72 19 -38 -63 191 -77 -68 -28 -133 -58 52 -52 19 19 -176 -100 -24 -96 4 47
4229 47 59 -239 119 129 -28 84 -304 -79 -121 48 185 -88 292 232 223 -12 -23 -114 185 -136 -217 -221 36 186
4253 186 13 -65 292 -82 -104 195 218 -83 114 -152 -40 -37 240 -27 -362 28 -78 -56 -4 31 -228 71 -30
$$ packed form
4089a01M56k08j87R2j42K03j94K6l3k5L37M1n2j42J68r4j43J71j84J9j05J34k36
4112a99K17m30N58k60N4J21J26j73k78M73q2j02j19K3J26J09j2j23r6N5K15k92
4134h9K33j82L8J17k47K17k04K72j49j74K11k35L11k81L4J23J59j35k21K98k78
4155a82K39j13n0K09N1j14j94M17k29r0OP9j1J08m4k12q4J00K6j14O0j9K70j91
4179h2M7M8o8J47j95J52J0o6j3l5q2P3j40J29Q5K14k05j88J02K25q1j85L5K22
4203A49j96J25J8R9p2k20K5R1n7k5K54k68RM0j05P5J10j04P1%j95P6P6p2J00M3
4229D7J2k98L58J0j57J12l88K25m2J69J37k73L80o0rk35j1r1K99l21q1mK57J50
4253A86j73p8L57l74k2K99K3l01J97k66J12LK77k67l35L90j06K2N2L5k59K99j01
$$ plain form
4276 -30 -121 89 41 -15 -26 -199 -220 49 -98 205 -48 6 47 48 204 -62 -99 -136 -75 99 -173 -340 107 24 -68
4301 -68 -242 -82 170 101 120 -16 37 226 85 23 6 -19 152 127 -161 48 -50 63 -62 71 156 18 -77 -198
4325 -198 118 29 166 218 90 11 94 101 -94 -291 -94 -16 -245 38 70 68 47 -119 18 -66 32 -29 -180 9 -162
4350 -162 73 136 6 16 -58 47 -96 -40 106 -101 24 -50 -201 18 98 28 132 130 -17 195 -110 215 -217
4373 -217 -91 43 -208 10 -153 17 74 -35 180 49 -143 -75 -90 10 2 104 155 67 -235 169 59 31 -195
4396 -195 -30 70 134 267 -189 23 34 96 -33 173 116 9 -40 68 -48 -131 21 23 -86 207 -43 100 -75
4419 -75 60 61 -98 -31 72 -108 152 26 -83 207 -31 -161 173 -52 -35 -1 24 146 -19 -312 16 -130
4441 -130 -165 78 34 -33 1 -22 44 -237 -22 -55 -138 -84 -176 92 15 112 254 -128 -49 38 -139 -88 -43 68 -95
$$ packed form
4276c0r1K10m8n6j1j73k1K69j47L03k53N4M1JJ56k66l7l7O1J74k72j67M47q3r2
4301f8j74J60K52o9J9j36N3J89j41o2j7k5J71k5k88K09r8J13j25J33Q5j38r5j21
4325a98L16q9J37N2j28p9Q3Pj95j97J97P8k29K83L2kk1j66J37q4R8o1j51J89j71
4350a62K35O3j30J0p4J05j43N6J46k07J25p4j51K19Q0p0J04kj47K12l05L25m32
4373b17J26J34k51K18j63J70N7j09K15j31j92O8j5J00qJ02N1q8l02M04j10k8k26
4396a95J65J00O4J33m56K12J1O2j29K06n7j07m9J08j16q3J52Kj09K93k50J43j75
4419g5J35Jj59O7J03j80K60j26j09K90k38j30L34k25J7L4K5J22j65k93L28j46
4441a30l5K43m4o7L4k3O6k81K15l3q3N4r2K68p7R7J42l82P9Q7j77N1M5J11j63
$$ [...]
8191d8
##END NTUPLES=NMR FID
##END=
