##TITLE=1H ikalashn
DE-76
13.11.2024
##JCAMPDX= 6.0         $$ Bruker NMR JCAMP-DX V2.0
##DATA TYPE= NMR FID
##DATA CLASS= NTUPLES
##ORIGIN= UXNMR, Bruker Analytische Messtechnik GmbH
##OWNER= root
$$ TOPSPIN		Version 1.3
$$ 2024-11-13 13:39:34.546 +0400  Irina@DPX200
$$ Compression mode = diff/dup
##.OBSERVE FREQUENCY= 200.131300845
##.OBSERVE NUCLEUS= ^1H
##.DELAY= (6, 6)
##.ACQUISITION MODE= SIMULTANEOUS
##.ACQUISITION SCHEME= undefined
##.AVERAGES= 32
##.DIGITISER RES= 18
##SPECTROMETER/DATA SYSTEM= spect
##.PULSE SEQUENCE= zg
##.SOLVENT NAME= CDCl3
##.SHIFT REFERENCE= INTERNAL, CDCl3, 1, 17.49637
##AUDIT TRAIL= $$ (NUMBER, WHEN, WHO, WHERE, WHAT)
$$ ##TITLE= Audit trail, TOPSPIN		Version 1.3
$$ ##JCAMPDX= 5.01
$$ ##ORIGIN= Bruker BioSpin GmbH
$$ ##OWNER= Irina
$$ $$ F:/spectra/data/iren/nmr/1H/4/audita.txt
$$ ##AUDIT TRAIL=  $$ (NUMBER, WHEN, WHO, WHERE, VERSION, WHAT)
(   1,<2024-11-13 13:39:17.781 +0400>,<Irina>,<DPX200>,<TOPSPIN 1.3>,
      <created by zg
	started at 2024-11-13 13:37:05.328 +0400,
	POWCHK disabled, PULCHK disabled
       configuration hash MD5:
       BE 6D 3F 07 2A EA 11 49 91 17 2B D3 AF B3 58 0D
       data hash MD5: 16K
       3A 0A FC 7C 3A 8F E8 6D BD 42 AE 01 77 0B 2E 82>)
$$ ##END=
$$ 
$$ $$ hash MD5
$$ $$ 76 CE 7B 3F C6 A9 9B C9 27 6B C4 0B 19 C4 6C B2
##$RELAX= 
##$RELAX= 
##$RELAX= 
##$RELAX= 
##$RELAX= 
##$RELAX= 
##$RELAX= 
##$RELAX= 
##$RELAX= 
$$ Bruker specific parameters
$$ --------------------------
##$DU= <F:/spectra>
##$EXPNO= 4
##$NAME= <1H>
##$PROCNO= 1
##$TYPE= <nmr>
##$USER= <iren>
##$AMP= (0..31)
100 100 100 100 100 100 100 100 100 100 100 100 100 100 100 100 100 100 
100 100 100 100 100 100 100 100 100 100 100 100 100 100 
##$ANAVPT= -1
##$AQSEQ= 0
##$AQ_mod= 1
##$AUNM= <au_zg>
##$AUTOPOS= <>
##$BF1= 200.13
##$BF2= 200.13
##$BF3= 200.13
##$BF4= 200.13
##$BF5= 200.13
##$BF6= 200.13
##$BF7= 200.13
##$BF8= 200.13
##$BYTORDA= 1
##$CFDGTYP= 0
##$CFRGTYP= 5
##$CHEMSTR= <none>
##$CNST= (0..63)
1 1 145 1 1 1 1 1 1 1 1 1 1 1 1 1 1 1 1 1 1 1 1 1 1 1 1 1 1 1 1 1 1 1 
1 1 1 1 1 1 1 1 1 1 1 1 1 1 1 1 1 1 1 1 1 1 1 1 1 1 1 1 1 1 
##$CPDPRG= <>
##$CPDPRG1= <>
##$CPDPRG2= <>
##$CPDPRG3= <>
##$CPDPRG4= <mlev>
##$CPDPRG5= <mlev>
##$CPDPRG6= <mlev>
##$CPDPRG7= <mlev>
##$CPDPRG8= <mlev>
##$CPDPRGB= <>
##$CPDPRGT= <>
##$D= (0..63)
0 2 0 0 0 0 0 0 0 0.06 0 0.03 0 0 0 0 0.0002 0 0 0 0 0 0 0 0 0 0 0 0 0 
0 0 0 0 0 0 0 0 0 0 0 0 0 0 0 0 0 0 0 0 0 0 0 0 0 0 0 0 0 0 0 0 0 0 
##$DATE= 1731490752
##$DBL= (0..7)
120 120 120 120 120 120 120 120 
##$DBP= (0..7)
150 150 150 150 150 150 150 150 
##$DBP07= 0
##$DBPNAM0= <>
##$DBPNAM1= <>
##$DBPNAM2= <>
##$DBPNAM3= <>
##$DBPNAM4= <>
##$DBPNAM5= <>
##$DBPNAM6= <>
##$DBPNAM7= <>
##$DBPOAL= (0..7)
0.5 0.5 0.5 0.5 0.5 0.5 0.5 0.5 
##$DBPOFFS= (0..7)
0 0 0 0 0 0 0 0 
##$DE= 6
##$DECBNUC= <off>
##$DECIM= 32
##$DECNUC= <off>
##$DECSTAT= 4
##$DIGMOD= 1
##$DIGTYP= 9
##$DL= (0..7)
0 120 120 120 120 120 120 120 
##$DP= (0..7)
150 150 150 150 150 150 150 150 
##$DP07= 0
##$DPNAME0= <>
$$ [...]
##$SW= 21.9926040160658
##$SWIBOX= (0..15)
0 0 2 0 0 0 0 0 0 0 0 0 0 0 0 0 
##$SW_h= 4401.40845070422
##$TD= 16384
##$TD0= 1
##$TE= 300
##$TE2= 300
##$TE3= 300
##$TEG= 300
##$TL= (0..7)
0 120 120 120 120 120 120 120 
##$TP= (0..7)
150 150 150 150 150 150 150 150 
##$TP07= 0
##$TPNAME0= <>
##$TPNAME1= <>
##$TPNAME2= <>
##$TPNAME3= <>
##$TPNAME4= <>
##$TPNAME5= <>
##$TPNAME6= <>
##$TPNAME7= <>
##$TPOAL= (0..7)
0.5 0.5 0.5 0.5 0.5 0.5 0.5 0.5 
##$TPOFFS= (0..7)
0 0 0 0 0 0 0 0 
##$TUNHIN= 0
##$TUNHOUT= 0
##$TUNXOUT= 0
##$USERA1= <user>
##$USERA2= <user>
##$USERA3= <user>
##$USERA4= <user>
##$USERA5= <user>
##$V9= 5
##$VALIST= <valist>
##$VCLIST= <CCCCCCCCCCCCCCC>
##$VD= 0
##$VDLIST= <DDDDDDDDDDDDDDD>
##$VPLIST= <PPPPPPPPPPPPPPP>
##$VTLIST= <TTTTTTTTTTTTTTT>
##$WBST= 1024
##$WBSW= 25
##$XGAIN= (0..3)
0 0 0 0 
##$XL= 0
##$YL= 0
##$YMAX_a= 598021
##$YMIN_a= -361264
##$ZGOPTNS= <>
##$ZL1= 120
##$ZL2= 120
##$ZL3= 120
##$ZL4= 120
##$ABSF1= 10
##$ABSF2= 0
##$ABSG= 5
##$ABSL= 3
##$ALPHA= 0
##$AQORDER= 0
##$ASSFAC= 0
##$ASSFACI= 0
##$ASSFACX= 0
##$ASSWID= 0
##$AUNMP= <proc_1d>
##$AXLEFT= 0
##$AXRIGHT= 0
##$AXTYPE= 0
##$AXUNIT= <>
##$AZFE= 0.1
##$AZFW= 0.1
##$BCFW= 1
##$BC_mod= 2
##$BYTORDP= 1
##$COROFFS= 0
##$CY= 7568.61572265625
##$DATMOD= 1
##$DC= 2
##$DFILT= <>
##$DTYPP= 0
##$F1P= 17.9538593292236
##$F2P= -4.03888763876832
##$FCOR= 0.5
##$FTSIZE= 32768
##$FT_mod= 4
##$GAMMA= 1
##$GB= 1
##$INTBC= 1
##$INTSCL= 1
##$ISEN= 128
##$LB= 0.02
##$LEV0= 0
##$LPBIN= 0
##$MAXI= 945.577
##$MC2= 0
##$MEAN= 0
##$ME_mod= 0
##$MI= -402.1523
##$NCOEF= 0
##$NC_proc= 0
##$NLEV= 6
##$NOISF1= 8.587773
##$NOISF2= 6.764455
##$NSP= 1
##$NTH_PI= 0
##$NZP= 0
##$OFFSET= 17.49637
##$PC= 1
##$PHC0= 102.5602
##$PHC1= 32.48086
##$PH_mod= 0
##$PKNL= yes
##$PPARMOD= 0
##$PPDIAG= 0
##$PPIPTYP= 0
##$PPMPNUM= 100
##$PPRESOL= 1
##$PSCAL= 0
##$PSIGN= 0
##$REVERSE= no
##$SF= 200.13
##$SI= 32768
##$SIGF1= 18.5376
##$SIGF2= -6.396296
##$SINO= 400
##$SIOLD= 32768
##$SREGLST= <1H.CDCl3>
##$SSB= 3
##$STSI= 0
##$STSR= 0
##$SW_p= 4401.40845070422
##$SYMM= 0
##$S_DEV= 0
##$TDeff= 0
##$TDoff= 0
##$TI= <>
##$TILT= no
##$TM1= 0
##$TM2= 0
##$TOPLEV= 0
##$USERP1= <user>
##$USERP2= <user>
##$USERP3= <user>
##$USERP4= <user>
##$USERP5= <user>
##$WDW= 1
##$XDIM= 8192
##$YMAX_p= 0
##$YMIN_p= 0
$$ End of Bruker specific parameters
$$ ---------------------------------
##NTUPLES= NMR FID
##VAR_NAME=  TIME,          FID/REAL,        FID/IMAG
##SYMBOL=    X,             R,               I
##VAR_TYPE=  INDEPENDENT,   DEPENDENT,       DEPENDENT
##VAR_FORM=  AFFN,          ASDF,            ASDF
##VAR_DIM=   8192,          8192,            8192
##UNITS=     SECONDS,       ARBITRARY UNITS, ARBITRARY UNITS
##FACTOR=    0.0002272,     1,               1
##FIRST=     0,             0,               0
##LAST=      1.8609952,     -96,             250
##MIN=       0,             -361264,         -361264
##MAX=       1.8609952,     598021,          598021
$$ Real data points
##PAGE= N=1
##DATA TABLE= (X++(R..R)), XYDATA
0 0 0 0 0 0 0 0 0 0 0 0 0 0 0 0 0 -1 32 -32 32 -32 32 -50 64 -64 66 -96 97 -128 142 -161 192 -224 252 -281
34 -281 321 -353 396 -448 499 -554 618 -689 760 -847 934 -1036 1140 -1256 1385 -1530 1682
51 1682 -1850 2041 -2255 2489 -2755 3057 -3405 3805 -4278 4844 -5538 6404 -7531 9062
65 9062 -11270 14775 -21170 36796 -164910 -112644 36647 -275923 -361264 -162152 49877
76 49877 -12953 -77618 -28969 46261 18413 44302 143157 181638 64074 6108 123795 263873
88 263873 200614 44596 7661 91842 98389 -11069 -116339 -137898 -140584 -161376 -169039 -133498
100 -133498 -111444 -135558 -142849 -50282 79110 105591 33599 29550 145994 234511 174809 66389
112 66389 43403 79998 73733 19480 -26198 -58867 -99114 -109571 -61650 -27809 -83260 -149830
124 -149830 -98667 27773 59305 -27595 -73684 -874 79463 69786 22030 17483 40414 50774
136 50774 55623 67237 57146 15146 -11614 13194 43778 14634 -54673 -85269 -53658 -24591
148 -24591 -42354 -76463 -78285 -48994 -17553 5937 20754 24229 21276 31960 67835 95418 71569
161 71569 16029 -2323 31806 49033 2210 -58605 -66308 -35061 -21535 -35244 -47866 -46429
173 -46429 -34717 -9510 23661 34339 11140 -4398 23650 64452 57624 8361 -17705 3568
185 3568 24667 9881 -18360 -29478 -26062 -19736 -8630 634 -7013 -23055 -18638 10083 29084
198 29084 14693 -11398 -13596 9756 25148 14653 -5873 -12434 -2069 11027 15686 9332 -4601
211 -4601 -12088 -3733 13120 14517 -7433 -28381 -23780 485 9127 -10129 -29201 -20124 5690
224 5690 18033 12031 5138 6408 13837 24691 30923 22462 1380 -9946 -293 10403 -1910 -28117
238 -28117 -38708 -24475 -8864 -10256 -20015 -19530 -7449 6140 17011 21467 16977 10797 14175 26492
252 26492 29511 12974 -6796 -9901 1056 5129 -7612 -22457 -23705 -13541 -5285 -4104 -8703
265 -8703 -12201 -9971 270 10662 10689 -868 -7332 2559 17077 18053 5031 -3918 3453 15008
279 15008 16490 6921 -1908 -4026 -1561 1022 -1738 -10358 -20263 -21355 -11301 -3622 -7748 -16374 -13137
294 -13137 2024 14347 13974 8616 8713 14760 20009 19228 13460 3906 -2726 -3154 476 -2650 -13239
309 -13239 -21421 -17845 -6809 -2564 -7814 -12356 -7188 3294 9401 7984 3924 2212 4822 9911
323 9911 11592 7054 -838 -3013 2672 8826 5544 -3724 -7496 -2765 3627 1709 -6215 -11247 -9596
338 -9596 -5269 -3354 -3899 -7667 -8515 -4090 5007 9598 6844 2921 5410 13341 16552 10849 2642 -425
354 -425 979 1210 -2238 -8810 -13600 -13688 -9341 -5135 -4886 -8036 -7517 -258 8428 9987 5547 2778 5948
371 5948 10599 10140 5196 -548 -1988 -843 552 -248 -4085 -7622 -6628 -1359 2050 -988 -5641 -5692
387 -5692 -401 3355 1523 -2663 -3843 -1153 2922 4766 3135 825 686 4254 8132 7890 2668 -1281
403 -1281 -318 2731 1467 -4022 -8684 -9132 -5379 -3364 -4237 -5954 -5268 -1841 3192 6394 5756 3196
419 3196 3231 7121 9420 6838 751 -1995 -735 1082 -1107 -4732 -7145 -6635 -3762 -1625 -1353 -2527
435 -2527 -3152 -670 2916 4823 2010 -1373 265 3537 5301 2029 -444 -790 1251 3092 2134 184
451 184 -1985 -1279 -385 1203 -98 -3576 -5041 -2857 -27 -403 -2686 -3968 -1466 2046 3426 2250
467 2250 1552 1803 3678 4677 4686 1984 -265 -1202 262 631 -1945 -5167 -5524 -2829 -1095 -1062 -2980 -2715
485 -2715 -535 2118 3069 2424 1082 1187 2276 3847 3336 825 -2029 -888 782 1142 -1291 -2825
501 -2825 -2519 -405 510 118 -1444 -1888 -678 520 1351 142 -1179 -1372 702 2074 1421 80 -802
518 -802 1190 2446 2004 801 -384 -489 309 577 -226 -1804 -3412 -2282 -491 194 -1398 -2636 -1259
535 -1259 1445 2392 1923 901 1030 1833 2750 2421 1214 -781 -1359 -321 176 -893 -2552 -3119 -1543
552 -1543 103 -59 -1256 -1334 21 1564 1875 1055 379 318 720 1755 1134 94 -1350 -987 601 743
570 743 -176 -1537 -1143 179 913 -55 -1025 -1201 -645 238 111 -92 -954 -1224 432 1383 1504 365 101
589 101 887 2125 2152 846 -478 -226 20 -30 -991 -1919 -2248 -2002 -648 -172 -670 -1293 -961 964 2082
608 2082 1653 435 531 1614 1907 1205 -87 -576 -914 -460 -168 -195 -1581 -1611 -1113 44 710 -690 -1263
627 -1263 -230 627 1035 363 -243 -524 288 832 602 213 -449 -57 526 1135 870 -189 -1068 -269 325
646 325 -243 -1185 -1646 -1206 -142 -239 -377 -1165 -607 324 782 1426 758 723 950 1694 1441 959 -538 -498 -271
667 -271 1 -592 -1205 -1107 -1346 -206 -105 -357 -167 -332 124 966 745 161 17 324 942 770 210 -338
687 -338 -180 284 54 161 -224 -314 -285 52 306 -101 -607 -693 -34 435 25 -600 -990 101 362 715 242
708 242 193 256 878 742 552 -59 -501 -13 198 247 -642 -1056 -951 -230 213 -241 -410 -449 334 551 827 512
730 512 373 423 581 642 406 -553 -530 -282 -59 -252 -201 -274 -167 194 338 45 -256 -116 -63 457 444 -175 72
753 72 85 526 858 37 -452 -565 586 301 165 126 -137 -179 32 -135 -202 -379 -403 236 396 63 136 -323
775 -323 55 392 453 -107 -220 382 -4 532 138 -118 -305 -252 -137 144 -159 -330 -525 -225 291 245 34
796 34 -13 493 521 299 268 223 -226 109 106 283 -173 -52 10 -144 -259 53 -357 -205 268 136 190 -282 -450
819 -450 77 145 415 326 -74 -95 49 338 58 -55 -122 -266 275 493 -259 153 -89 204 -83 -328 -437 -227
841 -227 -147 3 56 189 -138 -35 294 351 387 157 145 46 104 27 -156 -6 -83 56 -247 75 -377 -371 62 24
865 24 -116 102 -177 -159 -155 -90 -114 206 128 -133 -91 -128 -56 -32 132 118 3 -74 42 69 47 -67 -439 39 -427
890 -427 -160 203 -33 -172 -201 -99 -277 223 53 -74 -156 -52 148 -361 243 -68 -208 97 -140 149 -225
911 -225 -86 178 -7 43 91 109 330 -35 -28 -25 -279 -78 -72 216 12 130 -53 -337 39 57 -116 -227 172 -70
935 -70 -131 353 -149 -128 -243 -165 91 25 -271 -77 328 -20 203 -63 149 47 405 4 -65 -27 -18 -152 -182 198
959 198 269 62 -123 32 73 -109 -120 -274 -122 -573 -322 170 -29 296 -51 104 281 139 -59 52 -129
980 -129 -52 80 158 -25 -18 -148 -107 20 -174 155 56 -271 71 -203 -75 66 142 9 -60 218 58 202 -23
1003 -23 -232 -44 -53 99 110 -139 -231 -181 164 -12 24 -142 -103 -112 69 60 67 44 7 153 217 141 -44 101 -273 54
1029 54 -17 -43 44 -193 -470 -44 -139 -128 -42 81 79 112 -178 -248 108 -345 -130 -179 101 -237 -92 216 -131 -32
1053 -32 48 -11 -202 -151 34 -242 250 111 446 239 106 -120 47 156 -336 -11 -155 190 35 71 -234 -80
1075 -80 -58 181 11 -11 156 62 205 -172 -10 -394 -73 -86 -165 -173 -84 -328 295 -73 -305 172 189 20 40 228
1099 228 -95 188 -272 -32 150 -156 -22 67 74 15 -313 -47 95 -199 -69 33 207 149 -5 37 62 -127
1121 -127 -8 414 316 -245 -187 272 94 -80 -474 0 -353 -216 -5 -83 -253 -143 26 -62 -393 -426 134 84
1143 84 103 -111 -337 -1 198 -41 144 0 -124 95 218 -40 -31 48 -165 -224 -86 -194 174 -66 -76 290
1165 290 59 -172 -321 86 36 179 17 127 115 270 30 -355 -208 17 229 78 -127 -130 95 -59 307
1186 307 9 -226 197 -235 226 220 130 52 101 -256 162 46 221 -51 5 -66 -424 -264 -56 206 22 -8 -252
1209 -252 -55 -176 148 -242 -190 187 43 200 -202 196 194 177 -160 94 54 -30 -23 228 -207 47 20 -232 84
1232 84 -263 -294 -119 147 67 389 9 170 -290 -83 -104 3 130 77 198 32 -123 21 -351 4 282 97
1254 97 -301 208 20 -51 259 -95 153 72 58 -54 -121 -27 -17 30 -112 90 -25 -287 -71 168 154 85 -37
1277 -37 -277 -50 -112 309 49 -90 -87 -209 57 78 -44 398 80 202 -37 77 115 68 -198 -83 209 -218
1299 -218 133 -160 97 212 -176 -15 65 -234 253 119 -302 -247 -120 111 50 114 301 -225 176 -188 130
1320 130 -319 -273 -149 158 -184 -138 200 -114 -73 362 416 78 237 -22 -197 -90 -3 -317 116 20 36 68 11
1343 11 -174 202 -39 -222 -66 89 -57 -90 -426 -392 -24 318 120 40 149 136 -94 178 173 -2 10 -250 187
1366 187 -96 84 -146 -102 104 -100 28 49 -54 42 -38 17 51 -267 -104 -139 389 -8 -48 79 131 146 -137
1389 -137 143 38 32 415 57 27 -100 -94 57 98 376 -297 288 -210 -132 278 60 23 -61 -282 79 357 111
1412 111 34 -13 -245 -4 -45 26 5 -40 -434 -154 -295 -230 -317 83 85 113 -90 -42 -299 419 178 -317 -61 80
1436 80 -20 -108 123 -268 34 144 196 171 241 -160 -453 146 192 -102 -172 112 -105 -73 -146 121 82 113 39 -151
1460 -151 -272 -267 -236 37 -99 102 -116 -63 114 -142 -42 1 74 -201 -40 -171 174 -191 -121 303 171 18
1482 18 -15 266 -82 -24 281 93 -325 -242 0 151 384 -90 -84 46 137 24 -34 -58 -74 4 179 -172 -52 212
1506 212 162 85 73 -254 -185 -78 268 -35 -10 -416 -115 65 -15 -197 78 189 77 111 294 72 197 127 -232
1529 -232 7 -393 112 296 -82 -78 -174 186 60 -183 211 -149 134 233 -317 176 308 97 -299 -140 185
1550 185 43 -42 -57 294 -63 193 -51 42 -102 -164 396 151 -46 -129 186 20 6 -64 -245 88 95 -64 -60 -121
1574 -121 101 -8 -302 265 -58 190 -68 51 2 70 205 32 96 -61 -120 -65 -239 54 89 -263 247 159
1596 159 150 106 -215 28 218 -239 331 -88 -227 -90 413 -258 150 -403 414 1 179 -132 -152 24 -247
1617 -247 -100 -469 -83 -153 130 -16 153 -190 191 59 -109 149 -43 -89 228 105 -91 416 -275 55 -20
1638 -20 4 275 -53 97 -87 -238 31 -37 221 247 -108 82 248 226 53 -383 437 34 288 -486 -391 -250
1660 -250 120 -216 -57 -342 293 -14 62 137 -22 -405 39 161 -57 -94 -203 75 -202 93 -81 181 17
1681 17 -208 -240 -176 211 -44 -80 -37 -233 99 169 -205 209 10 -74 200 85 267 -11 177 -121 -129 299 -35
1704 -35 -143 -309 -179 -21 -66 -19 28 191 45 -125 97 73 144 -131 -67 275 147 -51 -282 -183 -313 159 -61
1727 -61 -204 163 186 -119 -191 -80 112 44 194 -94 240 181 -245 -59 1 374 -24 -101 12 33 277 10 28
1750 28 -31 -5 -110 42 -347 281 -219 95 -22 -32 209 -173 -1 -431 272 77 -17 76 146 180 -77 -457 155
1773 155 -315 -98 273 150 231 126 -72 36 109 265 -77 -7 -111 166 -56 115 247 269 94 264 115
1794 115 -350 -26 86 205 -22 -239 -87 -85 48 -322 119 213 238 195 -96 141 -248 -124 281 -345 -72 -91
1816 -91 90 275 -111 377 105 135 284 -3 166 8 3 174 11 -23 -389 165 23 227 53 20 264 38
1838 38 -105 167 104 -195 352 17 128 -153 202 70 383 83 167 146 -8 132 -90 113 -215 -312 -211 305
1860 305 139 376 312 -101 -117 -117 65 -16 129 84 -71 24 72 45 -67 -105 -183 163 186 -326 -25 -59 -121 -26 8
1885 8 103 25 -99 27 98 -87 -87 -189 -46 35 -216 60 92 -279 448 -91 219 -240 -366 -54 -200 -197 -36 -159
1909 -159 -124 -137 84 199 144 -180 298 56 -87 -51 -139 -88 291 150 -130 -125 -101 -400 234 -154 56 381 48
1932 48 34 32 -22 -253 -123 283 45 -45 -260 100 49 -220 -48 -49 146 99 117 370 -69 23 -532 -43 142 -231
1956 -231 259 323 -5 37 -73 -98 41 -73 -184 72 64 80 -94 19 191 197 -347 -123 38 103 -305 74 -105
1979 -105 -55 -148 -226 220 -141 214 105 64 -146 316 81 -408 97 55 -209 72 -97 259 294 -389 221 55
2001 55 67 -195 -29 -11 -292 -82 250 0 -38 -412 258 -130 199 73 123 196 -16 -271 -55 -59 82 -158 -47
2024 -47 40 -461 142 147 -176 -86 367 -127 158 -63 166 73 -216 -3 203 -180 392 -327 3 110 -212 210
2046 210 20 176 -49 -116 -424 125 78 -313 -50 195 55 -327 106 -144 -263 88 120 141 -212 64 -312
2067 -312 -311 -132 -25 151 192 -186 126 -152 -210 -79 -197 -201 -37 25 484 282 -252 -212 -144 132 51 -107 -143 42
2091 42 18 92 -251 122 -17 388 -42 -62 176 201 -159 95 8 -450 -141 164 31 -235 -123 47 -10 93
2113 93 119 -87 -171 -225 -175 187 57 32 -96 -151 -133 136 282 -52 209 -46 -4 -1 216 -367 273 -245 338 175
2137 175 225 35 -165 115 67 -37 -52 -118 -174 254 545 -28 40 144 -128 18 -365 -411 92 -150 -129 7 82
2160 82 74 -126 -54 -32 21 -182 -90 47 219 80 -20 -212 146 -45 273 -45 -42 -112 169 -140 104 130 46 -260
2184 -260 -154 -48 116 -212 -95 48 7 -58 -23 170 -54 201 201 146 32 17 -257 -186 201 -46 -189 -68 -196
2207 -196 -184 150 -74 336 -342 182 -117 -246 -234 166 -150 -41 -289 -207 161 -130 -250 -98 -148 -49 95 49
2229 49 228 -22 69 -178 -283 24 0 -203 61 188 -195 141 367 -68 22 106 136 169 133 -180 -107 -181 180
2252 180 24 144 67 147 -9 221 -195 -98 83 -115 327 24 -134 63 -250 -148 116 109 -5 277 344 -163
2274 -163 178 129 163 -92 -27 -215 -53 -24 -124 158 -248 57 105 -118 -126 -553 122 260 177 -49 164 127 -195
2297 -195 -61 -84 190 67 321 332 -325 -228 -150 105 190 -58 189 213 99 12 75 -154 -63 -225 -161 72 216
2320 216 75 -142 276 92 -354 92 308 -143 191 -141 133 246 107 266 -31 49 -131 -105 234 45 -218
2341 -218 200 -28 55 238 36 -50 -165 -160 304 -136 -122 240 124 -192 -84 -253 -59 -193 -164 -1 186 -100
2363 -100 -276 -3 -33 -90 172 72 52 -145 -40 191 55 -153 -224 231 -146 196 -93 -107 55 -107 -194 177
2385 177 -207 154 -149 -286 -26 171 231 4 -26 29 307 312 -34 -52 172 -117 149 144 -109 171 -108 -88 -31
2408 -31 9 -177 -240 20 -232 16 -12 62 -314 152 -139 -314 -179 -514 -510 -138 222 13 90 87 -49 348 28
2431 28 77 193 -195 245 -382 37 120 -47 83 34 75 0 -58 180 233 -41 174 -200 -24 -54 37 224 -149
2454 -149 -128 51 107 -87 -291 145 72 34 -314 60 -70 -219 214 33 47 -29 27 221 -236 -31 91 324
2476 324 184 40 -172 -20 35 -271 121 36 -3 -69 229 -36 -51 -198 -149 -148 -7 385 -426 275 -74 71 22
2499 22 101 -131 -16 -233 -196 93 -47 88 118 193 -357 25 -90 -38 163 139 -92 -150 -50 221 -121 170 201
2522 201 -119 150 28 128 196 304 -232 35 225 103 -73 -6 -137 192 97 -33 -153 300 -214 64 137
2543 137 -83 157 -115 403 -383 -261 270 -2 -142 50 -319 213 -82 187 15 28 264 54 78 356 100
2564 100 -201 -153 -107 -44 224 -49 121 9 -147 27 -89 126 216 168 132 -78 22 156 -51 -137 -79 167 -82
2587 -82 4 171 -222 -240 4 103 -217 51 47 304 361 -360 267 46 238 -189 183 37 41 125 -12 7 -40 -161
2611 -161 262 -217 131 60 -303 142 -272 244 439 -38 -132 -192 -127 186 -287 50 233 17 -70 174 -11 -178
2633 -178 2 102 -67 77 78 -166 -126 -50 26 -56 127 -28 -35 173 264 -142 171 -84 -208 -70 -18 -140 115
2656 115 293 -155 -361 0 296 -398 0 161 85 9 -271 244 102 -90 -17 43 -212 354 376 150 71 -211
2678 -211 48 38 -213 -33 -118 367 264 -204 -391 99 -174 -107 288 -75 99 131 -357 -25 -50 138 -35 296
2700 296 5 -328 -44 -212 -105 86 291 60 -130 51 -73 103 -42 -137 -296 94 -302 131 -176 325
2720 325 110 145 -69 -59 -121 26 3 99 34 -98 296 -94 -15 -152 -25 327 -171 -155 -55 -360 -13 -20 -75 -245
2744 -245 -246 -228 -25 -366 -11 -36 -93 26 -5 -343 -112 -60 -7 71 -40 258 187 148 -222 -140 -108 -161 -187 240 128
2769 128 -20 -311 226 187 135 178 221 230 -32 -6 -91 -283 -10 170 45 10 -8 -7 -159 23 -173 -45 231 128
2793 128 126 -121 -30 -173 25 203 -117 -270 105 -280 220 -347 10 220 -83 110 86 -185 25 -175 43
2814 43 47 -71 -41 -120 238 -107 -126 -41 -169 -40 -26 88 30 -216 107 -54 455 72 325 7 212 -45 -367
2837 -367 355 75 48 -274 114 283 24 -185 96 41 231 -130 522 -123 -32 -80 41 345 -98 303 12
2858 12 47 -4 -17 -137 -122 167 -367 -124 206 -333 -323 30 38 -103 182 159 -39 -108 -20 350 153 -41 284 -275
2882 -275 -49 -65 5 -199 -110 -243 -30 177 216 -50 7 45 240 200 -99 -129 -60 -97 -3 265 5 192 26 293
2906 293 -104 75 65 52 -30 140 -37 -143 -495 -282 -53 389 -70 -4 -141 16 499 202 131 -191 8 -171
2928 -171 -29 -156 145 103 -11 82 -290 -241 224 -203 -114 57 126 259 513 -160 20 -231 -67 -66 242 -90
2950 -90 -136 68 -86 123 -62 101 144 -352 199 380 -263 -89 127 4 -104 236 18 -16 160 -233 164
2971 164 175 -198 -174 147 -114 210 -53 -61 27 -361 257 148 -87 -15 -120 -220 173 20 93 55 308 -155 -385
2994 -385 -330 -95 195 105 -135 -53 -58 -31 167 181 125 -208 109 -307 225 -156 142 221 -190 555 167 172 407 335
3018 335 180 9 -64 -158 2 -151 -218 151 -170 -122 190 -164 -58 -119 -133 -161 60 21 59 -89 -210 -24 129
3041 129 -75 64 58 -56 193 181 -150 -10 201 -90 102 140 211 -147 181 336 -277 26 -181 60 -95 122
3063 122 -165 65 29 -99 50 -322 220 -243 -91 139 97 -118 -96 -70 89 176 160 123 43 -156 243 7 -94
3086 -94 -69 -80 330 91 298 18 -105 -170 57 -50 321 244 -279 -71 -98 88 -31 -325 -68 172 234 -78
3108 -78 -290 -151 -90 -311 -89 -194 -560 7 -20 111 296 -83 105 -232 88 61 -41 10 -304 268 57 203
3130 203 -320 178 -68 103 109 -70 152 201 -319 -67 288 -8 -32 -257 44 87 -57 297 -237 65 163 434
3152 434 305 -58 -112 76 322 174 163 -149 8 64 -304 349 -53 -13 177 28 8 2 222 -75 65 -25 108
3175 108 10 4 338 -182 87 240 -93 122 -65 -170 -13 -153 -91 -40 560 -38 -194 -47 -363 113 -174 -122
3197 -122 -31 73 295 46 -140 -243 129 83 268 65 -106 -57 45 -9 29 -219 77 75 -104 -385 23 21 69
3220 69 -109 -85 -320 84 -133 -260 -90 350 93 88 -16 -34 20 189 13 180 261 300 152 57 -17 391 -2
3243 -2 198 -490 41 -349 0 -130 13 105 -90 130 -180 80 -246 -7 -76 192 -307 278 -48 -56 -101 -168 -20
3266 -20 -213 106 173 222 76 -121 25 34 394 192 54 68 -140 178 -17 -74 -117 -99 -237 157 -281 -46 -228
3289 -228 56 86 43 160 14 165 -12 -128 -18 -214 3 -169 -155 -155 117 -213 14 247 -505 11 158 -21
3311 -21 -42 -77 -107 -209 -159 -7 151 179 -66 2 73 -19 -253 -232 141 -18 230 217 -243 178 -1 -235 306 4
3335 4 -168 -222 12 139 -123 111 -164 36 -131 72 223 -146 134 -132 116 38 -23 196 59 -181 104 320
3357 320 368 268 -157 197 -230 80 -143 -179 -47 147 53 234 56 -148 228 195 237 -75 -367 -173 -275 177
3379 177 -148 382 116 79 15 63 -209 225 140 -269 -68 199 97 -347 179 132 54 38 0 81 -150 -146 383 204
3403 204 18 307 -113 32 286 31 -447 -24 -24 -145 -217 347 -272 -29 371 -136 -124 128 -152 61 191
3424 191 474 151 -67 210 66 13 -177 42 75 33 -44 292 -68 -120 -280 -114 201 -260 -93 105 -276 -142
3446 -142 159 306 -105 59 418 -172 -284 -203 30 -49 64 288 -67 123 -175 13 203 208 130 80 117 -62
3468 -62 171 80 94 66 -8 -216 -274 187 -46 -78 -144 10 53 -119 -51 -256 -177 274 186 101 -69 -203 -251 21 139
3493 139 342 89 -172 -196 68 -144 -149 -159 -155 -285 -369 172 -35 102 -140 124 -37 -81 108 -101 123 -196 11
3516 11 105 10 28 -57 -228 -341 -309 228 126 260 -258 125 58 -90 -358 149 11 0 55 -206 114 -117 259
3539 259 -93 -168 253 -58 -88 -87 -116 -69 -114 23 39 59 120 -2 -18 -2 -125 17 -249 -143 128 -90 -39 173
3563 173 83 99 203 -101 -182 -56 -15 -57 -45 -161 -136 -217 -127 -200 -70 116 -53 74 -227 -185 -48 175 -276 -52
3587 -52 372 -124 59 142 23 -2 -109 53 -124 -87 45 53 177 -148 173 -87 -190 -321 -549 42 131 49 234
3610 234 -252 64 234 104 -87 34 -78 115 269 -72 197 -74 -106 -299 -30 62 370 266 -355 73 -148
3631 -148 318 125 99 -90 -83 -518 265 159 -233 -224 110 150 -71 5 -213 194 204 -163 282 108 170 102 -412
3654 -412 -125 -169 56 455 -106 75 -69 43 -478 89 -111 -254 -227 -59 -39 81 210 -204 -179 -23 -182
3675 -182 114 -108 -10 51 -21 -160 -39 49 183 -42 61 66 85 -12 -163 46 98 -17 -223 12 -95 25 54
3698 54 45 -57 -9 165 299 244 -70 191 -44 271 56 75 -213 147 44 88 -17 -127 65 201 -70 42
3720 42 -22 62 -191 -151 137 -92 -90 -152 11 -200 -201 305 48 107 42 -269 -78 39 90 -299 80 125 56 -14 -25
3745 -25 36 -137 148 234 -21 -5 -262 24 169 -75 -191 217 -195 -124 159 40 -354 181 276 -87 -201 -361
3767 -361 -97 -235 158 -85 -284 -367 136 -140 -200 -163 -55 -69 -454 2 -141 365 65 300 -78 97 -93
3788 -93 136 17 181 201 10 -3 -18 148 -98 -211 246 -270 -39 -89 139 47 197 299 -244 -188 -386 13
3810 13 -52 218 115 -50 -12 55 265 289 117 -290 -196 -123 -127 -189 48 260 385 -37 25 172 177 142 -159 -215 -356
3835 -356 296 -5 -336 5 -137 64 113 -128 72 -107 -95 -85 20 99 -123 216 -277 -6 -128 -58 -148 62
3857 62 54 -502 30 -296 223 201 348 100 -116 43 -155 82 -80 -78 97 -2 190 -166 -182 51 -148 -115 162
3880 162 104 -184 -270 -364 -47 -5 -28 227 201 186 -321 -124 51 121 -111 129 -164 419 -241 150 203 310 -94
3903 -94 -86 -12 7 120 -88 -356 48 180 75 -233 -34 -465 33 -48 -160 136 200 -142 -97 16 -48 1 -127
3926 -127 144 86 305 -28 -193 51 -278 -49 -216 -57 -82 -453 99 82 78 92 -312 -11 -115 116 -108 -103 41
3949 41 393 167 -211 108 -165 -111 -103 -272 -21 -194 -79 546 12 -149 114 170 1 -387 -306 101 10 -35 -135
3972 -135 -70 -128 -23 567 -62 -105 -151 -265 224 -312 123 -69 -14 -41 -96 2 137 -119 121 -26 -277 241 -324
3995 -324 265 68 -172 -372 -191 96 61 -96 -366 -97 155 -299 -55 46 74 346 -91 -110 197 188 -145 199
4017 199 16 244 171 -77 -214 138 86 -37 286 -249 121 -213 -144 -139 -51 -184 20 154 231 -104 -52 56 140
4040 140 -6 -189 -60 -166 165 73 121 155 183 -184 -18 -48 -259 239 -99 -33 -35 -98 -9 58 47 -99 -100 -91 239
4065 239 -114 -5 132 131 98 -354 -194 -377 126 -139 -104 -266 -156 -57 65 -291 135 67 -253 -37 54 243
4087 243 55 -63 -4 -315 87 44 180 6 -94 -41 207 -328 -45 11 242 198 -171 -153 125 -24 -216 -148
4109 -148 225 157 174 180 90 188 -183 602 -110 354 407 153 -80 173 -78 147 -210 -54 -14 -33 -221 -61 146
4132 146 83 -180 91 72 -39 22 -135 114 -272 247 33 -172 -286 -73 236 -159 261 5 -54 63 -92
4153 -92 78 -52 104 -162 142 168 231 24 -261 -219 -125 214 186 -196 203 63 186 116 -50 -221 95 -186
4175 -186 35 142 -54 3 -23 -296 27 151 -167 64 -135 174 -143 -406 -235 72 1 7 144 380 368 258
4197 258 -15 234 -46 99 183 -237 167 -236 66 53 -381 -97 234 300 113 -182 -352 -190 59 344 317
4218 317 104 -1 -220 383 322 -74 -11 146 228 -223 -77 275 -84 -184 185 55 -32 -219 -280 46 414 53
4240 53 -404 -197 -75 -62 -47 -88 -445 192 -250 -149 -27 181 114 -173 -87 53 18 -137 -165 69 -167 -200 -24
4263 -24 350 79 -136 -259 -100 298 -181 -14 -197 -37 -105 -208 404 203 57 147 19 141 328 -191 -43
4284 -43 -33 126 73 -134 -363 -209 -3 -188 54 -149 -133 107 -12 26 158 24 -60 69 19 -358 187 -72
4306 -72 -115 234 59 99 183 37 -235 -222 214 -80 90 62 -32 -86 187 0 -454 -62 -105 377 -72 25 -171
4329 -171 321 -35 46 -219 -274 2 -141 189 41 -161 271 -136 164 -356 -176 71 -427 21 -68 -130 0
4350 0 -187 -106 91 215 -376 49 137 -220 -121 57 -73 151 121 12 -12 -288 152 -153 48 -169 24 -174
4372 -174 -91 -241 251 -8 262 31 126 -148 -45 102 -17 -345 -59 -131 -193 90 -292 -160 126 -86 -218
4393 -218 163 -124 74 -34 183 151 311 183 44 93 193 -67 277 -82 -31 -76 -21 65 125 84 -289 -245 289
4416 289 173 420 -112 -1 100 139 148 -63 -279 38 -27 -190 -67 -131 173 -126 56 65 -114 406 118 199 180
4439 180 -153 46 -95 -135 -309 -217 227 205 27 5 23 69 -383 136 194 160 177 -249 84 45 -78 -104 -218 -279
4463 -279 -146 344 37 244 38 345 229 594 -441 -345 233 -229 65 65 -285 154 35 -123 4 184 250
4484 250 -190 291 80 34 -240 -27 187 -199 6 71 193 -335 -24 -110 -90 135 240 189 -144 30 238 195
4506 195 235 -458 -19 152 197 321 101 -160 102 -16 -46 -24 65 248 17 36 272 -98 164 -112 -231 75
4528 75 286 -121 23 -155 -104 -144 -39 -17 256 -92 139 380 -65 28 -86 23 -93 328 26 157 376 16
4550 16 10 19 -446 -117 179 169 -181 -70 109 29 -305 -398 -228 -187 143 -54 111 -157 -70 91 41 201 142 -170
4574 -170 -60 26 180 318 526 -76 -168 -11 107 -94 -197 -85 22 94 -168 -165 -187 23 -87 12 -137 202
4596 202 -203 154 -238 -167 113 75 -112 -68 70 -40 -96 11 -221 -15 384 -280 -90 199 -46 77 -126
4617 -126 176 -75 -104 -9 551 18 -173 13 211 -112 -141 229 -306 182 0 14 -88 -21 -64 257 -126 -69
4639 -69 131 97 11 182 -194 45 247 181 -217 133 5 41 163 12 -186 -60 -221 26 383 102 -167 -251
4661 -251 148 -146 -129 -16 137 212 -204 147 -172 -244 78 177 66 -70 -18 -239 72 62 323 -48 82 -172
4683 -172 -126 15 105 5 253 196 16 292 101 -173 -59 30 -152 26 -226 210 254 -105 -383 -136 31 209
4705 209 165 -41 396 77 219 -182 139 -20 -301 164 -264 103 -108 298 85 -34 13 -59 -59 -90 48 132
4727 132 -334 -141 287 -34 -90 295 -74 -225 6 -165 102 196 -102 146 138 -119 -126 -270 -8 -1 29 -40 231
4750 231 81 -56 96 -182 40 44 -75 -299 244 54 -103 -107 270 -119 223 139 115 -43 -146 -85 -43 -93 30
4773 30 99 -120 -190 53 129 340 118 -3 -28 151 81 72 -58 -338 11 20 -101 -177 -24 -213 -81 -56 -160 -182
4797 -182 78 -155 -70 -13 103 -247 132 -144 177 23 461 -146 -208 -2 -101 4 -21 24 6 165 205 150 5
4820 5 205 75 -397 242 -7 97 -31 -179 40 73 -204 527 249 -266 60 185 321 128 -129 253 325
4841 325 200 26 -267 -47 -159 86 -19 314 -39 -7 -164 84 -336 90 -256 -168 303 -392 217 3 -251
4862 -251 -81 222 213 -165 82 175 266 -126 128 -79 29 -78 -344 -23 104 52 72 25 177 -4 85 31 -235
4885 -235 -1 -384 124 -32 -280 -150 -120 29 -417 41 -277 163 -269 -361 17 62 73 364 -213 -41 301
4906 301 -216 2 -91 -157 -71 -111 101 -171 387 73 151 -5 -228 -28 -442 167 -103 73 -276 4 80 46
4928 46 -113 21 -271 231 -21 76 120 -226 -216 -4 -39 50 -90 10 2 146 -235 77 119 -73 -315 -174 88
4951 88 -93 170 377 -12 -85 -184 280 50 -116 -72 111 205 -258 35 185 -13 -27 -92 -163 28 24 171 30
4974 30 269 51 -137 -133 235 96 -31 -86 165 -344 -159 -14 113 175 -325 391 24 66 262 -126 45 102
4996 102 275 22 -232 -227 -51 10 -91 54 29 -168 -250 331 247 -9 32 62 1 -446 -221 255 27 -351 17
5019 17 255 25 227 316 331 233 -156 -202 225 446 -101 22 -79 -100 -103 244 254 -6 30 35 -17 -90 -202 66 326
5044 326 -98 -164 56 -194 17 113 209 236 -262 34 120 46 63 -83 147 -3 -178 -149 -111 18 83 38 -193 91
5068 91 34 126 -381 -188 50 -247 -143 -256 -6 55 -24 -131 76 224 -72 87 136 -247 142 87 65 -217 96
5091 96 284 169 -239 -54 -39 -17 -383 237 -264 -337 187 -251 150 86 -52 99 199 186 251 -153 108 45 -17
5114 -17 348 -77 -192 -61 -71 -393 -202 -23 146 -153 45 -131 -460 127 230 91 145 -7 327 214 384
5135 384 -264 360 46 -134 -19 -33 49 99 -183 -85 83 -246 -360 56 -45 20 -293 105 128 133 152 196 -93
5158 -93 -79 80 123 46 -271 30 106 -122 43 -118 -58 -74 -75 -8 -3 174 -445 -312 -156 -193 200 104 128 -98 -133
5183 -133 -215 -90 223 144 -339 37 -491 51 -128 -51 -228 40 35 -52 -81 193 -79 104 -369 -35 63 -51 -82
5206 -82 81 -199 196 -28 -309 258 -208 255 41 150 -143 49 90 75 158 -34 26 -81 54 17 16 166 199
5229 199 -66 -280 116 356 -167 335 380 144 80 -179 114 2 31 21 -309 183 -128 -77 387 -191 104 42
5251 42 -146 -393 -159 140 349 72 319 -374 -114 -124 77 -189 -53 -48 181 -201 -294 -147 52 364 -14 -210
5273 -210 -152 0 143 83 8 -25 -26 -221 31 -226 365 -191 -154 -76 116 -109 107 -170 37 182 -93 -71 -133
5296 -133 -79 19 66 116 224 -118 90 -31 -62 -263 -237 -28 -3 41 37 145 3 -218 -241 -50 113 24 81 -70
5320 -70 112 85 125 -25 148 -254 105 -142 -33 260 -15 12 -30 -9 91 -102 -313 307 322 99 -135 -50 -298
5343 -298 -136 230 -49 41 -223 -275 166 47 218 -12 74 295 203 -97 -95 -179 -50 39 370 -68 -66 256 120
5366 120 -51 143 293 -63 128 -42 -115 -98 251 101 264 24 -154 22 118 176 304 -97 -98 332 -125 205
5388 205 -67 278 -101 -157 -274 -105 267 114 15 33 20 -33 -31 -80 127 -62 -323 125 193 -92 156 -152 -454
5411 -454 251 -123 -37 -5 -329 -132 -208 18 -230 -64 196 65 -141 -98 -247 324 11 32 96 -44 102 -338
5433 -338 28 6 49 -21 182 -91 111 -295 -252 -234 -140 -221 211 -207 53 -132 -145 155 -274 -161 222 476 -290
5456 -290 -149 -270 -164 375 74 -38 141 110 -263 137 -349 125 -202 84 -44 218 126 -264 70 -5 100
5477 100 26 -105 -179 -91 -136 -80 174 216 149 198 34 -441 -104 87 84 -334 15 -373 -22 -184 3 296 27
5500 27 -72 297 -86 -124 -200 -168 55 -267 271 237 -107 -83 -170 -64 -135 -226 194 -68 -283 284 -10 -155 -134 105
5524 105 -249 -46 -133 -143 282 74 40 509 95 303 169 -74 -253 -44 -20 -133 -59 -173 178 39 215 -201
5546 -201 173 -241 114 211 -153 176 176 -255 -175 -184 -289 292 21 -164 -102 2 -134 126 38 518 -21 -21 250
5569 250 83 118 -188 202 55 245 166 205 -274 60 -70 164 119 28 9 -162 357 168 -36 6 -74 107 -262
5592 -262 -309 -64 3 -113 -194 -320 -197 125 -45 -131 27 -199 -64 -262 95 41 -313 47 -42 105 38 272
5614 272 389 237 -258 -339 -133 -8 -258 -265 128 -153 207 -102 44 -303 348 -210 -6 150 312 78 58
5635 58 -55 -181 -70 -68 212 -62 -130 -190 279 200 -86 -21 -175 295 116 -338 175 -70 -241 -103 125 -164
5657 -164 -371 -1 109 -518 87 298 -132 -353 -183 -98 -66 48 -100 -171 176 105 -202 84 150 62 -39 -134
5679 -134 -2 -530 283 217 -88 171 282 -71 -32 85 318 -110 15 435 -13 -98 -86 -99 460 -24 -63 35
5701 35 -167 400 56 189 11 217 161 171 307 -155 -394 -233 10 -137 -323 -331 -176 -247 37 40 52 225 -180
5724 -180 193 42 119 -11 224 307 -74 -74 -83 -214 123 -123 204 -50 -168 57 33 -204 -37 32 -49 217 -314
5747 -314 41 -51 52 -104 -28 -266 240 -153 241 -53 -136 112 -1 77 149 -181 -46 -10 -43 -94 99 83 -161
5770 -161 -153 -51 181 10 -87 216 -81 11 103 -251 164 236 20 -285 -247 353 289 120 -314 277 -214 70 37
5793 37 -257 -150 309 -251 -152 81 -245 -141 -77 -128 209 -78 -113 -86 -214 -250 -209 29 -5 433 -130 -335 264
5816 264 16 -30 -562 216 -42 14 -58 -24 -340 -133 144 -155 -215 90 -50 132 64 41 -14 -17 197 -152 162
5839 162 176 -23 -224 208 -259 41 -93 -218 239 -323 158 -125 253 -248 -266 -48 -217 53 97 69 9 62
5861 62 -384 -53 83 85 -175 310 73 62 210 -294 -382 -182 251 -11 -180 -197 -129 -7 -26 49 0 -123 -200 -195
5885 -195 140 347 341 80 -215 201 40 317 -288 -88 194 163 157 83 -112 -24 -141 -285 251 39 174 -146
5907 -146 100 102 184 -6 -129 70 268 89 -186 117 -148 -287 173 -27 225 -240 222 -107 178 -236 160
5928 160 29 331 56 183 153 135 -262 192 99 -68 -77 -204 313 286 48 -4 432 -175 29 -84 186 34
5950 34 52 -19 -127 -218 210 -355 -422 135 -116 46 108 79 359 208 244 -250 83 -309 -35 9 -4 87 -367 -105
5974 -105 -22 -205 -159 -114 94 -242 -237 -109 -88 -29 24 141 14 111 387 -296 325 141 28 344 14 -286 -79
5997 -79 -25 77 58 -280 -50 -134 -37 186 355 39 18 -207 -53 -196 196 -49 198 -187 -334 464 -52 73
6019 73 66 -132 188 160 140 -42 -157 93 121 -148 190 -33 -5 -298 -356 94 -54 -21 253 -142 41 -218 -110
6042 -110 -178 137 69 -60 81 139 153 14 -59 174 279 -258 14 -99 -1 -53 -122 -213 -25 -126 -112 162 40
6065 40 360 -16 -167 69 26 -138 -563 83 119 191 59 90 365 -275 -289 -71 -362 -243 -110 -188 69 69 95
6088 95 -18 -242 183 2 101 -183 -163 23 -75 203 178 -5 -141 -529 157 80 291 -106 360 28 314 203
6110 203 -382 -63 -192 66 20 -264 -266 -60 -216 -110 -161 -392 244 117 -382 39 240 -63 -100 -175 -135 -110 99
6133 99 90 -43 -189 -258 -195 -57 19 245 -139 -242 209 -99 150 55 17 -64 106 -113 78 273 80 138 14
6156 14 -88 77 69 -35 -140 88 303 -108 223 -91 -286 44 293 158 -93 -255 60 32 -170 10 -325
6177 -325 296 -380 -238 26 4 231 71 344 -118 -256 159 -136 35 79 -64 -168 -252 -190 -163 5 238 -118
6199 -118 241 -44 51 -99 -128 183 -105 -86 52 -149 236 -83 -52 131 347 -151 -66 281 -276 -113 -169 -240
6221 -240 -153 -128 115 146 358 -185 128 -85 300 65 265 289 -290 364 49 -11 -77 -76 -72 100 192 -176 -439 178
6245 178 -315 295 51 -154 21 -114 110 -31 138 299 83 194 127 -205 139 8 39 -34 -86 105 -254
6266 -254 -94 189 -178 33 -198 -114 -253 -274 277 -40 189 -273 -42 253 -34 82 -126 69 -165 79 -76
6287 -76 -9 -20 71 -60 -436 -41 119 74 157 55 191 207 52 60 -197 -90 64 82 67 -63 -218 49 160 -194
6311 -194 -186 142 23 179 -9 282 132 34 40 75 -114 -117 -8 0 -152 -182 -34 105 234 -71 -139 236 -47 -193
6335 -193 -258 286 -18 50 229 11 -42 163 -291 58 71 110 -38 10 -22 205 222 144 75 4 165 -162 -58 -189
6359 -189 41 132 -118 -423 -174 208 -365 -56 105 225 -241 -211 314 -189 -152 56 7 106 124 -285 193 156
6381 156 261 13 58 -43 128 -147 180 72 -200 -202 -114 -89 204 -13 234 -334 -116 240 29 -227 232 163
6403 163 55 21 194 -43 58 -409 -321 -60 197 -264 -155 155 -280 118 -101 -193 28 -46 142 -220 -215 -122
6425 -122 325 76 79 -211 193 -19 -12 151 -66 -174 270 -283 -164 -97 -91 -14 20 45 -175 65 -78 288 27
6448 27 -105 240 -223 139 28 58 -124 95 -195 -35 -15 -29 -76 5 -30 227 -12 130 -21 126 92 -130 206
6471 206 -53 95 -440 -229 -177 114 -229 -186 219 124 43 -179 -82 -56 -188 -123 167 -61 -336 -29 -152 -304
6493 -304 -302 -417 0 78 195 71 -325 81 146 116 270 129 198 -216 -98 -250 -360 27 -70 -1 -105 33 66
6516 66 -16 -236 -8 -195 -22 -132 165 -203 344 -200 -249 -203 74 -240 -106 -100 126 4 -260 -66 -74 -139 16
6539 16 -183 53 -16 -6 31 -7 -175 -339 345 -174 187 -18 -466 -268 62 500 100 283 50 -107 16 81
6561 81 -237 114 157 -1 -99 -201 413 -140 -184 100 -193 -115 -162 -228 -36 217 14 205 289 93 -5 -269 -1
6584 -1 352 -60 -225 -114 123 -97 -35 19 -165 -477 -39 -106 -43 -191 -357 227 128 -405 -134 15 -87 326
6606 326 -125 -232 110 -54 -12 55 478 169 -206 27 -236 201 74 220 74 -23 59 188 34 145 315
6627 315 169 61 -44 9 -176 19 -98 110 -105 -156 -179 135 401 36 -324 215 145 -97 -181 -266 170 -81
6649 -81 -90 73 -216 -74 -119 -8 -440 -259 117 273 129 178 143 -14 199 -117 -145 -27 -103 -47 287 -462 340
6672 340 101 -78 -137 -146 55 -19 37 -86 20 39 52 -71 -181 -100 333 70 516 -27 235 246 -126 -64 340
6695 340 100 299 126 137 -44 -9 -58 4 53 99 266 373 129 -130 -73 -204 -134 -28 131 25 -116 -45 108
6718 108 185 -126 265 61 -136 -197 18 115 338 223 31 48 -303 -81 80 144 -137 -24 -47 -59 427 13
6740 13 87 -5 -184 -418 3 214 106 217 -112 70 36 212 116 -347 -216 -76 -1 35 -202 29 -168 221
6762 221 84 156 -51 -21 -21 -6 82 -50 -13 -166 192 143 126 100 128 114 376 42 -184 248 196 -23 -61 -105 466
6787 466 175 192 279 -54 -157 212 127 41 -127 5 199 166 -347 -78 -29 159 97 14 472 232 3 78 235
6810 235 118 478 -158 -62 -82 41 -147 -127 -216 337 281 18 81 128 -286 91 20 -97 99 -176 85 -50 127
6833 127 24 142 -49 247 -100 65 194 107 167 151 -116 -122 42 273 307 -40 -92 617 20 -164 -73 238 -262
6856 -262 -231 84 -165 23 -204 -219 78 -380 -5 67 -424 -53 27 284 -174 149 -62 -191 -353 -38 -55 -395
6878 -395 -65 -158 -173 -354 -242 445 30 -125 141 213 217 -267 40 -344 -14 -2 -92 213 -231 177 -141 35
6900 35 -246 170 -226 -256 -50 -119 266 45 48 -98 89 247 10 -80 112 47 -131 -83 80 -172 30 221 260
6923 260 353 -209 337 228 231 -113 -44 -101 224 300 -82 204 -223 7 -78 346 175 -305 -138 138 113 43 294
6946 294 -219 -39 -174 97 -274 -114 9 -16 50 139 -127 124 -337 -215 65 59 -204 -234 -134 -67 404 -115
6968 -115 29 -352 -173 141 130 -137 253 -90 79 4 -64 -57 -20 -163 136 -180 109 -45 46 -141 31 161
6990 161 75 -49 465 25 75 -4 22 -340 -124 -248 -43 -129 -277 22 -18 -139 22 -146 133 11 -158 88
7012 88 76 -98 -97 57 -36 -109 -89 228 -75 193 186 282 38 105 -294 -7 352 -21 -263 -222 -103 139 5 92
7036 92 157 1 18 -52 106 283 -68 273 -164 -38 21 -204 -299 98 63 440 -35 -14 21 -133 0 318 -3
7059 -3 -161 -68 -46 -153 39 48 -7 2 -85 -24 -7 278 69 -117 -396 84 28 -212 207 205 -43 266 24 -6 91 27
7085 27 -227 -72 70 -14 -79 -537 -189 -36 -155 -63 143 34 148 290 14 -7 120 243 -24 -52 -47 168 -265
7108 -265 143 38 -103 264 -267 -39 3 -209 -187 -257 254 -82 -49 -88 -354 252 -47 57 460 -91 218 317
7130 317 103 63 56 -165 -127 263 76 147 -424 293 34 144 -13 -134 105 -36 111 137 80 585 -249 -7
7152 -7 -59 170 -84 158 3 -233 -105 -348 -200 -63 152 -227 41 208 275 66 304 -240 203 -41 -13 211
7174 211 61 -3 146 -409 -21 -144 -24 -13 5 165 52 -15 169 -258 10 331 93 -89 -49 97 -86 -242
7196 -242 20 -135 -103 -7 -25 -177 303 279 -74 159 -90 -148 302 -154 -116 -86 -73 265 129 298 -168 367 267
7219 267 120 324 293 107 135 -102 48 200 -284 -131 250 189 149 -108 355 -425 -234 -67 4 -210 139 59
7241 59 -108 -82 -282 -548 -600 181 167 -112 17 4 38 252 -261 -126 -8 -104 -2 231 61 -166 -15 -225
7263 -225 14 78 -116 -200 -92 -22 -81 138 -46 66 39 241 23 -43 50 -22 -111 48 -424 -52 -73 -186 -72
7286 -72 167 -96 136 -189 179 77 238 -236 233 -163 60 -26 -205 25 17 -84 -211 -47 -115 114 57 97
7308 97 -109 -179 -15 -49 -36 -144 10 -12 -202 138 132 -20 41 376 184 -10 -10 130 81 -1 -157 -121 -215 31 4
7333 4 125 -18 97 -140 -6 -288 -174 -165 177 16 -39 100 15 41 395 298 -111 18 -78 -241 119 246 -15
7356 -15 -515 -102 189 98 -150 -77 232 -155 -100 -301 -14 -170 18 -179 77 12 -225 -28 178 86 -82 -222
7378 -222 -166 -40 40 201 19 -110 108 101 31 -119 -52 74 77 85 -54 -2 203 -331 -139 204 -156 336 -17 237
7402 237 -218 -232 239 25 222 118 40 -134 146 -8 -39 -316 -48 -187 95 93 -422 -228 -535 145 -116 -120
7424 -120 -65 89 -101 -4 358 -132 128 -86 -144 -91 107 -37 -201 -165 32 -48 -179 -314 123 213 -74 -88 -106
7447 -106 -150 82 -2 49 3 208 -562 -16 166 252 -138 -242 261 78 127 94 283 140 -62 -133 79 75 120 -219
7471 -219 82 -151 -206 46 -30 -95 231 178 -83 58 41 58 65 -84 23 191 -140 336 -169 46 14 86 -28
7494 -28 -1 174 135 78 132 -182 84 111 -73 -95 -12 -158 228 41 217 -21 -242 312 -62 144 -126 116 -41
7517 -41 99 54 23 100 -13 -51 212 -148 45 -120 52 -33 -369 14 -113 -283 -42 -145 -107 274 -65 171
7539 171 -192 -11 -49 414 -302 30 18 -247 -338 -391 -424 -3 154 275 20 72 -225 -146 161 135 5 -124 -76
7562 -76 -136 -187 -92 -211 -62 -91 169 388 -234 -75 -44 -138 280 397 -2 -93 -70 -9 -138 -223 -4 41 -64 -207
7586 -207 -252 -213 -209 -161 105 -28 11 31 134 -676 -92 23 -302 -211 -194 -129 160 -59 157 -218 -417 -38 -70 -150
7610 -150 -427 -47 -227 28 267 160 -336 -5 -144 -220 -113 -112 39 23 -84 -297 -24 200 60 -25 -265 343
7632 343 335 -29 69 109 109 -177 -142 11 19 -27 16 4 -150 77 -423 -206 382 149 34 176 -220 -425 113 -30
7656 -30 4 136 79 99 -112 309 99 -149 162 260 23 -126 -115 309 -46 -337 164 -69 -50 80 195 -81
7678 -81 116 -73 -145 84 -25 76 -280 -53 -132 151 -144 -62 99 85 -29 -92 -100 -198 5 -132 -244 -101 -251
7701 -251 -316 -48 158 181 -176 98 34 -124 -5 -25 -252 141 198 -18 262 -256 -374 -252 40 194 -136 47
7723 47 115 -61 -190 42 -234 -585 270 32 184 -323 -244 177 159 -163 227 -187 -190 -43 -103 172 114 -80 -67
7746 -67 -78 64 -79 222 -86 -35 -117 -32 75 84 633 -89 353 -174 -271 -20 -160 66 89 -85 -107 252 127
7769 127 53 -146 14 48 22 -200 -58 -259 -186 225 96 -65 -21 -77 -1 -148 -200 40 335 30 172 -308 -137
7792 -137 -18 -153 195 115 -163 214 170 -102 -15 -53 -71 101 -110 225 -187 168 122 -93 -202 19 -35 81
7814 81 222 -253 142 -24 -238 -303 -111 152 235 89 300 120 -150 -176 172 -97 -80 116 220 49 -127 -208
7836 -208 68 101 -70 88 176 -173 54 75 -5 -108 -111 133 -185 -198 -55 40 51 -227 27 -47 -72 -47 -114 103
7860 103 -71 49 -66 -73 -35 -42 -178 62 -263 110 -41 -10 -346 -273 14 -113 -243 46 -2 -168 -13 -54 295
7883 295 216 122 -116 -135 59 -324 214 -411 -207 -9 -180 157 -242 318 138 -106 -186 -249 136 -122 149 128
7905 128 -124 260 -33 -235 -158 41 22 -219 22 63 -80 18 -192 -278 393 210 146 -390 -246 -324 145 113 -147
7928 -147 200 -195 -65 -79 -12 78 -168 64 191 -65 248 169 129 -59 -205 -58 -63 -9 204 175 80 205 46
7951 46 -283 191 97 -31 -23 -200 -114 2 -125 234 -47 38 66 101 36 187 221 276 -33 183 448 -55 140 239
7975 239 224 -240 84 -17 8 228 47 -297 274 107 287 293 -67 300 -242 39 175 -408 -145 6 -61 -97
7997 -97 6 -16 226 386 -262 -53 201 -227 16 29 -126 -132 -133 46 -147 -5 -8 -155 122 145 187 -110 356 391
8021 391 265 -41 -73 92 -233 -37 261 255 214 66 -308 96 207 -58 297 185 212 241 -30 -151 -136 -70 -63
8044 -63 -136 64 -10 -183 25 -80 20 70 263 -88 -55 107 155 33 405 -196 -120 -72 147 -253 231 12 -7
8067 -7 -109 31 -49 69 -72 215 -12 191 31 -39 87 141 246 12 -44 -6 160 53 206 46 175 -513
8089 -513 8 54 -402 -322 -20 159 261 124 -113 133 38 -18 -32 43 -185 -183 -19 127 -216 -223 264 92 52 -59
8113 -59 150 6 -117 -46 -118 -345 -54 -220 186 -166 214 168 170 10 156 210 22 224 172 98 14 -14 89 -271
8137 -271 316 168 -103 213 30 33 -131 228 -163 -28 58 -252 352 -167 -167 -253 -97 -21 -80 -168 -67 72 139
8160 139 -74 -2 -252 -11 62 -40 -399 -115 228 -288 381 167 -129 -295 119 162 -101 -203 -168 -155 233 -124
8182 -124 147 47 242 -182 -115 -192 171 -256 -96
8191i6
$$ Imaginary data points
##PAGE= N=2
##DATA TABLE= (X++(I..I)), XYDATA
0 0 0 0 0 0 0 0 0 0 0 0 0 0 0 1 -32 32 -32 32 -32 64 -64 64 -96 96 -128 129 -160 192 -218 243 -285 321 -353
33 -353 407 -449 513 -578 643 -722 803 -897 996 -1105 1225 -1355 1492 -1650 1814 -2004
49 -2004 2203 -2428 2676 -2953 3255 -3600 3989 -4428 4932 -5528 6222 -7064 8098 -9408
63 -9408 11133 -13506 17000 -22677 33470 -61476 289107 598021 79729 -81434 17338 109514
75 109514 -128156 -313581 -323778 -251474 -285541 -259552 -158333 -87237 -139530 -104529 82078
86 82078 252221 200292 84066 104870 232616 239144 117901 19992 25423 35660 3515 -35653
98 -35653 -40449 -59019 -108524 -134943 -76806 -8980 -38030 -131784 -130425 -13423 55807 -14195
110 -14195 -93887 -52688 48588 84321 58547 49964 67124 75249 88747 125109 128027 49342
122 49342 -28584 -1664 67418 26156 -112087 -174269 -105129 -41570 -76867 -129926 -108876 -45389
134 -45389 -4806 19754 48410 62951 54164 60434 100962 127195 87103 16330 -4895 24951
146 24951 32774 -14435 -68068 -75540 -52030 -36518 -37227 -41844 -44378 -41198 -20824 16140 38437
159 38437 19328 -13233 -1605 50693 71205 27623 -17745 -4172 36701 40955 8308 -16296
171 -16296 -18158 -11814 -2680 5170 -6737 -36763 -48170 -17018 17674 4445 -36409 -40117 3324
184 3324 35416 22758 -101 2476 19171 28677 30414 26507 9361 -10799 -10044 7801 9699 -17609
198 -17609 -44628 -38622 -10972 2546 -10393 -24538 -15792 7313 24349 26707 18953 10253 9704
211 9704 20818 30436 20829 -5559 -23436 -14783 4254 2351 -23671 -39907 -25055 1171 6461
224 6461 -6372 -13442 -5775 7853 17458 19949 11616 -1056 -1462 15140 25519 11835 -10861 -13044
238 -13044 5143 16039 4125 -13203 -15758 -7075 -957 -2641 -8121 -16097 -20019 -12666 1790 5537
252 5537 -4953 -12002 -489 19830 26612 16101 6072 10482 20666 22887 12087 -1243 -9803
265 -9803 -11465 -9453 -8598 -16379 -28859 -30304 -16312 -337 68 -8874 -8061 8244 24136 24348 14762
280 14762 9239 12372 16172 15644 8607 -2240 -11083 -10628 -2982 -986 -10734 -20050 -16403 -2577 3779
295 3779 -2451 -9604 -7962 985 6682 5369 1109 -2365 -854 6063 12203 11121 2812 -568 6216
310 6216 14718 12795 1228 -7202 -4838 459 -1638 -9963 -17290 -17230 -12568 -6475 -4028 -5947 -6927 -1846
326 -1846 9858 17590 14628 7732 7263 13623 17194 10389 -378 -6053 -4975 -3381 -4887 -10130 -14568
341 -14568 -14555 -8750 -1682 565 -3410 -5701 -119 8708 11073 5068 -124 1427 6663 8687 4735
356 4735 -526 -2416 24 3705 4568 652 -4560 -5398 -1309 2128 -1361 -8451 -10830 -6120 -1074 -990
372 -990 -4341 -5029 -1509 4040 8395 8361 6097 4347 6618 10388 9618 2804 -4241 -4616 -1594 -1387 -6706
389 -6706 -11790 -11073 -6779 -2393 -1395 -2600 -2342 355 5201 8979 7897 3277 1928 4359 7249 5136
405 5136 -752 -4402 -2840 282 372 -2745 -4915 -4801 -2063 691 763 -1677 -4522 -3254 972 2856
421 2856 682 -3335 -2092 2112 5622 4315 1835 1081 3245 5497 5226 2610 -889 -2689 -2056 -194
437 -194 -2054 -5952 -8485 -6009 -1988 -400 -2329 -3465 -547 3780 6399 5167 3490 2902 3806 5002
453 5002 4646 1501 -2345 -3354 -1907 -6 -2061 -5363 -6229 -3007 62 707 -1523 -1735 -84 1734
469 1734 3179 2479 389 -597 1133 2970 2918 560 -1404 -1307 1731 2968 749 -1796 -2164 -179 709
486 709 198 -2272 -3281 -2715 -1337 497 -469 -1874 -1776 309 3333 3496 1591 596 1698 3474 3369
503 3369 1303 -731 -1503 -1247 -217 -1001 -2935 -4136 -3525 -921 797 -365 -1458 -929 1518 3369
519 3369 2740 1506 374 1191 2123 1816 408 -1193 -2033 -962 148 -27 -1561 -2471 -1218 540 1116
536 1116 -706 -1511 -497 701 1146 807 -423 -1186 -65 1812 1883 708 -867 -320 1332 2415 845
553 845 -542 -1162 -573 227 -325 -1165 -2674 -1719 -729 168 -68 -385 -980 599 2313 2655 1603 379
571 379 599 1948 1946 279 -1257 -1588 -732 -536 -1060 -1728 -1690 -1977 -418 806 403 -450 -363 756 2441
590 2441 1695 345 -95 770 995 1204 15 -749 -831 -513 350 106 -436 -1262 -607 351 597 -457 -1733
609 -1733 -1258 299 682 63 -780 -397 220 986 1454 1405 351 536 1146 1520 1376 -372 -1058 -675 -131
628 -131 -422 -1427 -2420 -1320 -752 -124 -178 -275 -264 792 1681 1914 982 225 370 1044 1353 582 -559 -951
648 -951 -813 -230 -355 -1099 -1389 -986 141 41 453 -1 -664 7 893 591 -24 -438 -269 748 827 394
668 394 -146 -69 243 955 570 250 -277 -292 -294 498 -411 -1518 -1364 -923 -22 -101 -469 -372 243 1117 1081 804
690 804 722 379 764 670 453 -428 -992 -746 -604 -123 -368 -1049 -657 -122 268 -77 -75 72 358 590 781 386
712 386 84 -211 -3 552 473 -279 -402 -495 87 664 400 -500 -853 282 -84 -38 -359 -494 19 87 258
733 258 13 -104 -463 201 689 287 -18 -118 467 609 332 -30 -149 -236 -490 -386 -194 -357 -693 -652 268
754 268 10 17 -180 501 337 772 360 143 38 178 105 193 -155 -490 -390 -105 -487 0 -483 -176 156 424
776 424 539 94 40 -37 290 229 164 -118 -55 32 506 32 265 -381 -123 452 110 303 -288 -542 -54 140
798 140 364 -344 -356 -278 -16 194 164 -305 -120 351 753 374 169 37 363 239 209 -213 -608 -186 -126 -53
820 -53 -328 -23 -113 30 91 171 109 274 308 186 463 309 -113 45 -20 280 -156 -272 -459 -128 -164 -18 34
843 34 -349 -72 -363 22 350 -119 47 -295 -438 72 -50 183 -330 135 350 418 -43 220 -67 409 82
864 82 234 9 -171 -237 72 -330 49 -236 124 480 -187 63 -131 -43 42 129 -367 -293 -137 228 280 -72 229
887 229 -170 -247 49 -135 -45 98 191 144 89 -53 -235 -273 141 -30 -207 256 -251 -99 42 172 -200 92
909 92 -12 233 472 53 -123 -240 -99 -6 -194 -175 101 113 -251 -101 -221 -48 -159 -335 31 173 141 -98
931 -98 -13 306 -285 -6 130 -440 -26 260 -127 -117 -12 39 274 107 -54 120 63 93 154 -15 184 15 118
954 118 190 -153 86 -29 -77 -94 -85 43 44 -307 206 222 -28 -200 -65 86 145 231 263 124 178 -22 -153 -124 -63
979 -63 -303 211 -34 265 -120 90 -22 -314 313 -202 -212 132 27 19 -278 -142 12 -341 147 -108 111 -62
1001 -62 -81 -61 -57 -53 185 -131 143 185 -102 85 -186 140 -90 253 -14 113 230 -326 231 150 -24 162 208
1024 208 4 26 3 226 254 107 98 -156 -120 149 -101 25 29 -20 -142 163 57 83 -207 114 223 -42 157
1047 157 75 158 -36 11 -229 -3 258 72 -61 -107 -37 168 -33 128 -344 -38 145 -29 147 -69 -133 40
1069 40 59 -130 -33 -149 -396 -161 -126 30 102 87 43 143 258 -156 -227 -116 -243 210 -19 -175 -128 -91 85
1092 85 163 143 -214 10 -352 2 -505 110 -253 -145 104 30 -3 -67 70 7 274 -325 -170 -380 30 -56 -216
1115 -216 122 -33 140 345 178 48 -144 400 141 -330 40 -427 -305 -37 272 335 -179 -130 115 72 24
1136 24 102 434 -137 324 135 -109 57 -171 -46 318 32 -28 -1 -76 -77 12 419 -214 355 22 77 -115 -46
1159 -46 -62 -237 155 -113 39 -7 180 295 18 -149 247 -72 108 84 -271 24 134 -29 222 -116 24
1180 24 226 89 393 -146 244 384 53 -258 12 -282 38 -285 115 60 -69 -105 -252 -211 134 253 194 502
1202 502 -35 64 209 179 285 402 -111 -154 519 56 66 -33 4 -103 50 149 -33 197 -128 233 -166 -5
1224 -5 123 388 -108 99 -139 240 88 -126 158 -102 116 -77 -24 -89 -143 183 -28 -400 223 -4 -6 451
1246 451 114 259 110 -122 412 -118 185 -35 22 -140 240 270 149 69 -174 111 -306 -165 135 -265 370
1267 370 -85 -62 -276 110 98 -462 -116 397 19 -106 -56 71 30 -98 -186 30 351 -42 226 105 -37 -15
1289 -15 349 266 193 11 13 100 -291 -151 -66 -212 -29 -276 -263 149 -16 -410 419 176 48 -60 242 -17 105
1312 105 -231 -205 -44 -91 255 -200 42 -149 -195 365 -55 83 97 -91 24 -114 -33 189 47 158 29 182
1334 182 -132 -134 -100 -66 153 -42 -141 -212 42 -71 23 62 11 419 286 -166 90 80 -28 253 -26 82 -74
1357 -74 -162 188 92 100 24 -171 -215 281 119 38 6 62 -236 -81 -116 114 -100 158 44 -387 -178 275 153 -185
1381 -185 -256 99 -165 56 -143 -277 177 422 -46 -274 62 202 -93 -109 -10 176 285 -7 -142 -11 298
1402 298 -62 32 21 -117 -8 515 -59 -303 -15 72 256 35 -22 -59 103 -37 -76 172 32 105 -111 -195 100
1425 100 196 -144 53 105 121 -106 -1 129 237 116 -101 115 -104 -158 -165 -90 -151 -122 289 -197 104 -280 -7
1448 -7 40 -22 -219 -70 253 -246 -318 -192 279 -7 -180 344 6 -403 -14 269 169 -12 -114 -73 437 -31
1470 -31 -104 107 -107 -236 -19 -57 -265 159 157 -93 149 -731 -369 28 92 -71 -144 374 51 -141 75 -255
1492 -255 -46 -181 -169 93 7 -234 -129 -48 112 434 101 130 -280 -241 147 -67 27 -347 -69 235 234 40 -1
1515 -1 -262 124 -45 -359 33 -243 -86 79 277 -245 -248 -110 -31 -56 -72 -70 -205 33 152 -532 -271 -21 -32
1538 -32 -145 22 -93 85 383 0 -145 -61 54 -244 -131 -111 -15 -15 15 -254 72 162 82 -29 -6 208 374
1561 374 261 103 -351 180 -10 37 211 -267 151 -160 68 131 -92 -56 101 55 56 17 -197 -12 278 48
1583 48 537 96 45 -41 211 68 355 -1 13 -18 -154 270 265 35 237 -284 -101 146 -213 -315 103 19 -210
1606 -210 120 -96 0 86 155 106 -58 193 -93 220 -226 -45 120 -126 -213 -30 -270 -366 -192 -85 -509 -31
1628 -31 166 55 200 185 13 131 238 -367 342 138 -216 -353 70 -73 -154 172 43 -110 -170 255 102
1649 102 92 -9 173 -168 -26 217 -538 -39 -190 62 -215 173 -170 -64 -46 250 -213 -200 -265 148 252
1670 252 99 114 -83 -159 -283 371 142 -90 251 -102 -293 272 175 13 74 275 -23 136 -174 62 -453
1691 -453 73 40 203 -73 -138 71 126 304 -221 -376 161 -175 27 176 -8 3 17 -56 65 -21 2 -251 216
1714 216 170 -155 3 -74 -116 21 -351 -115 -114 -187 223 35 102 -109 -272 202 83 130 155 -182 226 -163 198
1737 198 228 -4 93 -49 161 60 209 75 -140 95 182 69 98 68 50 -62 13 -115 272 84 5 -251 -101
1760 -101 5 -15 -7 -292 -19 -56 7 -3 73 108 238 -29 30 -224 10 136 231 -22 -149 209 -40 -147 309
1783 309 36 314 43 68 -186 -658 43 -47 44 367 96 -195 485 185 -12 141 61 273 184 142 245 -191
1805 -191 41 -11 28 18 -152 506 -158 -198 -245 346 15 192 -23 191 230 -159 170 -5 77 34 -38 -96 -93 22
1829 22 1 189 104 -561 -263 -209 150 -130 78 -362 -228 91 -59 137 -505 -452 121 267 -112 0 -79 -35
1851 -35 26 292 -87 -36 219 49 33 -315 214 349 -91 72 -82 -12 234 132 -84 220 -8 146 264 -255
1873 -255 102 -2 -156 36 -24 48 -188 71 -234 -20 154 24 -15 73 -112 -3 31 0 -52 -100 238 322 -328
1896 -328 -369 162 163 187 -21 36 196 -47 -154 64 -4 -126 -36 -291 128 1 -113 -150 6 158 -219 231 52
1919 52 471 -65 132 -19 -88 -200 -46 229 -104 -63 26 -41 -32 38 -113 -139 -10 -44 227 90 -251 357 -129
1942 -129 -126 191 -95 -139 -16 60 -209 97 72 169 -138 96 -56 -83 238 23 334 124 111 -56 -57 -119 -2 -32
1966 -32 319 -152 -143 -260 -231 349 322 189 38 119 -105 -253 -322 -345 -61 96 -146 115 -319 165 -131 -216 -43
1989 -43 -124 -299 -19 -183 151 -246 222 -294 -197 51 227 486 40 -85 198 -276 86 -180 -415 -203 123
2010 123 199 132 335 319 6 -154 -115 -122 54 317 -84 374 -34 -151 -8 -128 -56 -398 -43 -105 77 283 62
2033 62 56 -187 -164 133 -87 -192 267 -93 97 -300 -130 354 16 -18 -116 -115 209 134 343 -52 -301 -397 348
2056 348 303 183 -84 -115 52 -70 249 -168 285 16 -94 114 -302 -227 -140 -106 -98 173 71 -395 -278 -205 195
2079 195 -146 -1 -97 369 -79 -155 -61 461 9 278 -125 -66 34 -35 357 167 272 64 63 -138 22 202
2101 202 -56 -215 -67 -295 16 35 -114 -276 -187 -67 -330 -80 -69 -100 -22 -283 237 -18 52 68 308 312 -65
2124 -65 -52 418 73 -193 156 248 142 327 77 -74 -101 151 -43 257 -118 150 85 -86 75 68 -314 -4
2146 -4 1 66 52 410 -154 -48 212 -60 -63 36 -153 163 160 201 126 257 75 337 180 272 36 79 -64 18 -59 34
2172 34 -55 -390 -242 -136 104 -370 169 167 14 140 -7 -353 204 1 115 176 53 -97 -173 -35 146 -153
2194 -153 -54 40 -109 -359 -112 -177 266 14 -125 -115 158 -62 10 -199 -26 -329 145 525 -428 367 -15 -407
2216 -407 -163 219 17 -6 -157 162 65 -88 -20 -156 8 50 -222 -140 354 -229 52 212 -154 239 -133 319
2238 319 231 40 -232 -228 -33 -12 -226 234 -25 -48 -302 -128 242 -41 -135 -68 -111 -64 -87 -123 -36 -59 -8 -378 33
2263 33 362 158 208 -185 -20 8 -305 45 177 -413 144 -74 238 -167 98 164 -120 422 -80 -113 -55 135
2285 135 289 278 -60 63 -73 245 -77 -71 -132 -43 52 57 58 -32 97 -267 -388 -14 -260 340 149 -60 -187 -136
2309 -136 -84 76 164 -63 -121 -41 41 36 413 -99 126 -86 19 -48 244 46 -22 382 149 -43 -214 -33 289
2332 289 276 120 91 -79 103 -10 259 -453 -196 -195 -9 -596 -187 -266 -18 -26 159 -24 -193 -121 -219 356 187
2355 187 77 -32 167 -74 -213 80 82 -76 -63 -243 212 17 233 -319 1 415 56 -113 -106 146 198 80
2377 80 100 156 -97 78 -395 -127 89 300 -75 165 -17 46 -17 -69 38 -65 -95 161 328 -27 176 47
2399 47 39 -274 -396 90 -324 -242 -71 216 -215 84 31 113 -296 -126 199 -129 -267 254 6 -245 -48 31
2421 31 -83 295 -58 -241 179 29 -172 -483 -54 313 184 142 -185 -74 -155 -330 -174 307 -183 8 -118
2442 -118 -195 127 5 322 -189 54 -101 -54 -276 31 -111 70 42 -24 -227 -100 -135 -32 -230 226 185 96
2464 96 247 -56 204 90 -2 31 204 -166 -9 56 -227 -41 183 -4 61 278 -293 -192 -265 243 210 162 161
2487 161 -168 -129 -90 19 167 -150 231 -136 84 87 1 6 -204 147 -259 219 37 -37 191 -130 -10 -21 48
2510 48 -145 10 -426 -216 285 -107 54 -124 -23 -82 -86 -78 -291 -315 -80 301 175 -61 58 50 -263 93 195
2533 195 141 42 302 -167 -239 -40 4 -288 -149 -140 129 -334 9 -120 170 -73 -264 177 -118 203 428 -192
2555 -192 89 -3 428 -198 133 123 41 47 -33 19 -109 -25 -136 -69 70 -250 -50 274 -9 130 94 16 8 -52 -231
2580 -231 -101 1 -69 -361 113 -84 63 143 -297 200 207 316 49 -52 -169 -177 141 -193 67 -150 124 -399
2602 -399 142 145 115 -108 141 21 -114 -371 -186 -83 140 -233 182 182 139 -184 300 123 89 -101 -149 271 -89
2625 -89 -15 -292 144 -237 -96 -421 -131 -142 16 186 169 -392 58 -62 -373 73 -25 -114 -65 161 -87 76
2647 76 81 210 113 27 105 186 37 286 45 -63 -191 134 146 27 -12 38 147 -9 -102 160 -170 -8 -3 134
2671 134 294 13 -311 279 109 -178 161 -162 -174 97 94 211 217 101 -24 -104 159 16 -348 -36 -116 -255
2693 -255 -53 -142 157 75 -124 -140 72 -49 -183 -43 -208 61 146 248 -50 263 -129 246 115 219 -89
2714 -89 -181 121 -213 36 -5 125 -120 299 185 -3 26 68 -121 -128 -97 42 -50 -271 84 70 -115 -75 -233 -103
2738 -103 24 35 1 39 -7 113 33 174 -13 -7 -78 -402 -116 -214 -93 -144 -190 171 15 30 58 -135 23 400
2762 400 118 -225 -231 -193 -307 -261 19 -118 62 5 194 -270 44 140 -131 390 -106 22 -221 -330 165 170 -146
2785 -146 -191 -163 0 -203 -240 72 -177 139 10 112 -35 -195 186 1 -240 -151 37 -89 -277 -190 158 98
2807 98 107 -85 -126 105 126 104 -86 27 43 -88 113 -129 -288 -162 78 90 146 -95 32 -64 239 -55 41 -96
2831 -96 27 161 30 256 -302 -29 62 -176 250 -118 26 230 281 -223 -237 67 9 -104 -153 -1 71 113 -160
2854 -160 -55 -90 33 112 -22 352 -168 99 24 229 -68 85 -447 248 -5 -210 -87 68 -107 75 63
2875 63 -18 -11 -239 117 -5 -349 -27 -269 -38 83 227 162 441 81 -232 -71 -159 70 -228 -22 -66 -49 233
2898 233 155 107 -5 5 -220 -193 -141 45 120 -162 285 55 -112 -188 -185 23 -12 146 53 -124 8 39 222 -240
2922 -240 -61 -93 121 -286 -156 544 21 152 9 -70 61 47 -181 11 92 -44 99 2 100 -495 226 271
2944 271 58 217 -31 62 -46 281 -234 81 14 -334 -85 -73 -136 -60 -266 73 -4 17 63 -265 -20 -73 46
2967 46 -49 124 -45 -9 85 -203 112 113 239 177 62 -17 -29 100 -71 237 -275 43 -1 -336 -127 16 99 108
2991 108 343 -293 81 90 0 42 112 231 -111 -339 96 60 63 -86 227 40 66 -72 349 -153 145 289 -82
3014 -82 38 53 238 -164 -17 -418 21 434 7 90 555 14 -246 123 -312 116 175 -484 172 77 -127 105
3036 105 270 -77 432 -145 -181 -260 -199 347 34 -111 239 121 -152 -251 -42 -84 -27 -223 -132 121 -64 33 -27
3059 -27 278 133 -22 48 118 240 186 -69 208 -42 -429 379 67 -7 134 -39 109 63 -189 -103 203 -26
3081 -26 -49 -76 347 -56 117 183 -189 -194 61 10 114 -135 65 46 150 -57 -96 322 -4 -191 166 -178 -279
3104 -279 10 26 -259 84 -26 119 -254 67 40 338 -161 -72 203 31 206 32 19 -174 -43 -117 289 -64
3126 -64 589 -66 -100 -45 -114 302 -19 -5 -84 -92 -349 321 110 140 -35 15 167 -55 225 174 -261 470 195 -189
3150 -189 376 142 149 -1 -159 149 27 -25 -33 132 100 -318 -164 -47 -221 214 -274 -110 86 -249 193 52
3172 52 -98 -28 -185 -62 -125 153 -384 43 63 -255 96 280 -246 -43 -67 247 -50 -77 19 181 178 63 -30
3195 -30 -131 283 61 -73 -28 -176 -234 2 145 249 169 -138 -13 -70 246 305 25 75 21 -222 22 61 47
3218 47 -26 315 101 332 -182 39 42 97 -69 498 -37 -303 269 -541 -246 166 128 -185 238 -255 52 -10
3240 -10 33 -219 74 30 244 -424 -163 -147 410 14 150 379 148 204 -192 179 352 -79 -368 162 122 -419
3262 -419 -20 -186 4 -2 -66 -105 -145 -195 -91 -115 -116 68 -110 -2 -169 104 122 4 -188 -187 -173 -243 -293 -26 84
3287 84 156 -182 -277 -94 123 -25 -202 -177 69 -60 -123 216 251 -106 -116 -10 -67 213 65 -126 156 -48 67
3310 67 277 72 -149 5 -357 -42 -101 -21 50 -155 -92 63 -17 104 -245 -40 -388 -184 -247 16 -114 -84 107
3333 107 51 -204 -69 63 -97 -266 226 -92 300 395 -349 277 59 -8 416 -71 -2 -265 22 299 -99
3354 -99 -79 -301 -127 -314 -128 -43 -330 -221 161 -80 220 0 -183 284 -100 53 -51 123 -18 -37 99
3375 99 63 5 136 -131 -23 -63 -54 166 -201 -109 22 377 -390 228 49 223 289 -175 390 214 93 -298 -5
3398 -5 -83 -115 119 94 308 -270 -210 -88 -45 27 0 131 -78 -405 79 -222 111 7 85 -101 344 -359 195
3421 195 152 199 60 57 -69 -226 39 136 -100 175 318 -257 -146 -31 -152 180 -92 -443 339 143 14 -93
3443 -93 -333 -207 -4 91 265 224 -203 90 -167 -170 50 -319 -181 -66 -26 69 -253 49 108 153 327 5 -37
3466 -37 -110 -242 -442 -119 106 316 -64 116 157 25 80 84 -371 -117 287 147 -69 152 -121 -124 -92 -117 270
3489 270 -155 127 22 117 2 171 342 -70 191 -379 -31 65 6 -434 -135 -41 -393 -67 257 -186 164
3510 164 79 -377 67 -36 -108 -67 -36 164 -130 331 66 73 451 166 -235 -243 -40 334 185 23 14 28 222 234
3534 234 74 -24 266 288 289 -44 -143 -215 224 274 64 -99 89 134 177 -86 361 -97 -73 141 -46 119 -184
3557 -184 -463 -27 145 -127 99 54 136 -214 138 -109 -123 47 -41 53 21 -500 -68 -242 -145 174 -66 -126 -253
3580 -253 96 180 196 -7 -165 -34 -11 -68 -21 0 -100 -256 81 -74 102 360 348 -46 19 -427 86 65 96
3603 96 43 -110 -178 -358 128 201 -136 239 79 -100 -69 -61 -53 301 187 -46 66 -144 -89 3 114 -99 -109 -226
3627 -226 196 142 210 298 93 -59 -160 -20 -298 -252 84 -172 37 284 51 98 82 218 -272 -252 95 263
3649 263 17 -92 40 -125 -71 -40 -209 -16 -351 36 135 140 -8 -12 -10 -235 131 -101 148 84 6 -138 2 -102
3673 -102 -231 18 53 92 178 -16 -45 108 39 217 293 -110 -73 100 7 14 98 -21 -41 29 -466 -121 -195 272 -183
3698 -183 -356 6 -326 43 118 -147 -39 304 -5 145 72 -8 -8 91 72 99 -38 229 354 -26 309 89 137
3721 137 -144 193 26 346 -203 -67 -309 -111 -80 -44 187 -530 133 -202 162 46 171 -430 395 -58 -111
3742 -111 -349 181 65 43 34 -109 -79 168 217 -49 221 -10 121 -83 -239 254 9 192 -124 -53 -11 -35 -1
3765 -1 -143 -199 -10 -126 -351 235 189 -47 20 -89 116 -229 417 -160 -16 -175 -213 -114 69 217 69 -66
3787 -66 -223 63 -82 -120 -23 -206 -77 -117 -50 -86 -105 -26 135 -99 -155 -165 57 -16 46 -28 -103 -91 -99 128 -12 -175
3813 -175 -133 -10 -151 53 -254 -152 -54 39 204 54 144 -66 283 -155 -175 -17 -117 -24 130 -35 -43 -38 0 -31
3837 -31 125 96 285 388 -280 -22 257 -147 -146 182 134 -155 -67 -228 -185 139 -148 170 -3 -324 -371 -52 -186
3860 -186 -44 -6 275 -103 30 111 -158 -63 -82 -244 -122 -125 26 247 197 -278 -29 -354 39 -157 -240 62 -274
3883 -274 23 -3 -88 6 -361 81 -12 -185 -100 142 61 -174 315 -208 105 -254 16 171 71 -129 -9 153
3905 153 -94 95 116 -44 -244 41 38 82 43 167 62 37 284 182 120 174 137 -48 179 227 56 -151 228
3928 228 -93 -210 326 -359 -68 76 46 39 119 134 93 -144 -37 101 16 249 304 -302 50 64 349 62 -76
3951 -76 -161 105 97 159 42 -22 82 83 359 -250 14 -203 103 -52 -282 110 455 218 131 -128 19 195 15
3974 15 -298 -46 -214 38 267 -11 -216 357 116 -216 -260 -28 -375 -82 20 -84 -302 -24 246 -174 -248
3995 -248 83 -226 421 -140 82 -179 373 92 307 -552 156 13 190 -155 45 -339 -20 -29 -3 -83 246
4016 246 262 -101 81 -34 -242 -89 -240 -96 40 87 164 158 -140 194 230 70 175 48 27 172 49 -162
4038 -162 -98 158 141 241 -222 -20 88 -266 -185 16 105 -217 -109 -93 -43 -160 -252 -267 -29 303 -183 15 -29
4061 -29 10 12 -118 -189 -193 207 131 -19 159 -52 -206 26 62 128 -410 98 153 109 110 -33 229 -65 384 -17 -4
4086 -4 371 283 100 -96 -65 -67 -9 48 123 -280 20 80 120 65 71 -28 -55 1 -346 -26 1 -104 99 179 -95 100
4112 100 113 -6 -187 72 165 46 200 370 7 -81 84 -149 -163 -157 -142 -59 111 246 246 -51 129 -218 -67
4135 -67 36 224 8 -146 65 -69 -279 -171 91 -286 -10 102 -381 -170 104 328 -18 -90 -124 -25 -257
4156 -257 -262 -179 -78 -241 -116 206 -66 13 -77 -97 108 -140 -250 37 223 -170 194 -89 -283 189 96 -127
4178 -127 214 -249 -48 11 264 -20 -223 19 18 -139 -101 0 31 11 176 -60 -57 255 -17 -42 18 -228 122
4201 122 72 88 -123 -28 168 73 -81 -191 187 104 -65 4 -326 -122 47 181 -185 -36 -25 -338 -45 105
4223 105 -119 -6 16 -59 51 -27 -94 155 123 -10 -138 -255 419 71 141 -374 -129 -56 62 16 144 -58 -121
4246 -121 111 -58 26 61 132 -106 33 -39 -124 -71 -153 128 -304 188 347 18 -335 99 12 195 -38 -81 56
4269 56 235 50 178 202 162 57 -72 33 156 -130 -157 38 -270 -304 219 -114 -108 -61 286 -141 9 104 -158
4292 -158 -167 -194 -55 -72 308 -129 170 72 -97 -19 53 57 -90 -171 11 45 5 68 344 28 -22 -26 293 -28 581
4317 581 74 -46 204 40 -109 -73 190 -112 -371 -29 171 106 -123 -69 84 -42 -39 -181 167 246 427 67
4339 67 -178 -7 14 -199 348 237 -284 -130 -170 57 -50 58 91 192 243 -203 189 253 -95 20 364 -106
4361 -106 279 124 -79 107 86 53 69 0 -27 -29 -48 175 66 374 -18 148 -78 170 -233 156 171 7 448
4384 448 329 -10 36 199 46 75 -31 -247 45 286 -26 -133 58 154 -47 34 -49 -234 100 10 -72 156
4406 156 199 50 52 202 89 130 98 129 -106 118 50 144 -215 200 -228 -159 160 -311 -73 -416 -164 -310 15
4429 15 104 -1 107 -105 -93 -243 31 -285 304 -222 -237 -377 133 -56 33 216 -103 85 170 -434 -413 -142
4451 -142 -32 40 137 208 111 31 155 -156 193 27 126 89 66 142 127 78 158 25 79 109 185 -7 166 -149 172
4476 172 196 -394 37 -39 -263 -31 -23 343 16 -269 -134 -154 -1 57 282 77 288 -160 -136 -138 115 -20 46
4499 46 -39 195 176 -282 -77 243 -48 -130 58 240 176 377 -86 -158 232 -13 136 -99 236 112 -165 -123
4521 -123 -72 -59 -110 235 67 21 94 88 -26 17 5 -170 296 65 295 8 61 290 468 -131 289 -94 -118 224
4545 224 -38 -92 33 334 -173 -134 -7 197 -154 282 250 -307 61 258 -182 -34 -159 320 84 -187 -13
4566 -13 110 333 -87 -42 22 -175 -87 150 -26 95 -8 222 74 -27 -7 38 35 357 -65 127 -251 -466 179
4589 179 262 201 -385 313 214 321 7 348 124 -146 -482 205 287 -120 116 -170 180 -189 -61 -169 -89 -190
4611 -190 -41 -24 -286 -86 26 182 172 178 15 34 -215 -266 -78 18 353 115 25 165 -457 -335 -39 -49 60
4634 60 -229 -208 117 -36 100 -461 -30 -177 -196 160 327 151 -333 -182 18 25 64 -23 -100 -78 -276 -80 -89 -55
4658 -55 -39 -491 -161 44 -90 38 -38 195 125 90 -156 -98 -136 168 -71 -98 -166 -60 307 323 206 442 -349
4681 -349 -116 -69 -124 -385 316 1 -358 330 -151 -49 -428 88 -54 -3 153 -115 -113 106 -103 -26 158 21
4703 21 -314 -108 -71 178 249 -55 152 -21 170 -79 -68 -297 29 0 -138 28 137 107 -165 -219 5 86 -113
4726 -113 38 170 -168 -301 -71 276 -5 -117 30 405 -172 2 -110 -25 -38 -71 -80 52 -64 17 0 -246
4748 -246 179 67 -112 98 -19 -363 12 -14 171 143 227 102 -79 -164 -258 205 -155 -151 267 179 -49 -114 138
4771 138 98 -157 -90 19 -16 -61 -130 -120 -139 -50 -69 227 -179 -7 117 351 -54 -47 23 180 -143 -363 -17 154
4795 154 127 167 -293 217 114 -200 155 -4 -78 77 148 111 370 62 -279 60 53 -72 366 125 -235 155
4817 155 213 -185 -69 -56 14 82 -133 6 -65 -338 -124 -111 -349 197 396 -67 -109 -93 182 -60 -101 64 -62
4840 -62 -130 389 -148 -167 -134 357 -314 22 -348 79 -190 -25 90 -63 -224 227 45 256 218 81 -132 119
4862 119 245 133 27 -354 10 -151 107 25 41 14 14 -47 -5 -86 -194 134 45 -127 197 -93 -90 -258 83 -32
4886 -32 20 -2 -13 -243 -67 41 -258 -70 54 70 271 206 295 -148 -142 -15 149 -135 -9 -10 171 -85 -287 -39
4910 -39 214 73 -188 -412 -88 74 86 -32 0 200 300 164 24 22 -138 190 1 127 225 91 63 -72
4932 -72 87 -50 75 13 -198 -205 -34 251 -137 -100 83 -95 -158 -156 -77 -35 -383 -147 -104 25 -184 -43 -127 -155
4956 -155 -472 220 305 -99 110 -174 -61 -146 -252 -111 107 62 232 55 124 118 -147 4 77 287 -121 36
4978 36 -414 -146 141 -30 -7 -98 224 32 263 -145 274 -148 12 -320 369 -80 273 -112 -224 -120 -234
4999 -234 86 -94 199 308 25 104 50 -60 -155 79 -239 -75 157 60 235 73 170 -100 179 -233 44 -100
5021 -100 119 -143 -323 -306 -88 27 90 -126 -279 -351 -210 230 157 -56 158 -237 -246 199 -227 49 -13 7 75
5044 75 110 -80 206 146 -387 -97 -19 -8 28 230 62 -85 -173 84 -94 -173 121 -157 7 107 -67 82 262
5067 262 -145 -9 22 -5 -154 11 -76 500 236 196 214 428 77 -163 99 338 -30 218 -286 308 -28 153
5089 153 5 -30 69 312 258 209 -149 -178 -214 -101 -152 43 68 244 142 155 10 215 319 10 284 -297 -187
5112 -187 36 23 -212 156 -220 -74 167 44 237 -259 14 -5 213 347 -135 93 453 6 -79 157 93
5133 93 -22 -267 86 -294 170 142 -279 -51 -219 -302 82 234 171 351 -161 -181 -307 -64 -221 -204 197 5
5155 5 -66 123 -76 -109 42 -151 -220 318 -209 -192 -93 48 65 24 -244 -396 -79 -125 -71 205 75 -95 61 -89
5179 -89 245 -10 153 -119 -206 -68 212 250 -168 322 -29 -58 288 -102 5 37 -36 -322 -154 -78 -148 145 120
5202 120 -20 288 -238 -246 59 -134 -232 37 -189 -44 -207 230 -360 160 121 98 -89 -321 23 144 -113 156
5224 156 241 -141 129 175 -233 -78 153 103 102 229 -107 -28 35 -261 -102 -117 144 -35 78 7 -140 -212 209
5247 209 162 378 -183 235 -78 -157 -67 -266 40 33 -243 -252 -83 -13 38 95 -99 -152 190 194 -8 303 -91 216
5271 216 134 31 100 -55 -35 -102 -389 -484 180 -217 107 -227 292 -332 -13 117 -75 116 111 -141 -240 50 91
5294 91 94 -43 -76 135 307 60 51 -201 -16 269 -220 -187 -35 -177 117 -15 -63 127 -203 -236 -92 188 -123
5317 -123 145 -230 -4 198 -74 -186 7 -238 97 -26 -187 -132 158 181 -303 190 36 -130 -40 -89 -222
5338 -222 171 64 -307 365 -41 9 191 321 -155 -165 -14 -99 -15 -132 192 221 142 -103 33 -123 155 -76
5360 -76 74 239 -37 -26 188 80 142 -112 83 77 -259 -177 43 101 66 -250 -88 179 -50 -82 62 147 -8
5383 -8 336 63 126 239 30 -151 136 -150 212 -8 -79 153 -155 396 -264 352 -280 10 186 101 -145 -181
5405 -181 230 -140 -40 203 118 -108 163 120 -50 -93 283 137 -52 -428 -11 20 178 -316 42 205 -53
5426 -53 -213 -243 -47 163 107 77 -190 198 -55 6 62 101 -109 87 -336 132 -23 -231 239 26 -18 339 312
5449 312 -95 39 -25 -86 -27 82 83 70 401 -134 -186 36 -25 98 69 17 194 281 81 -3 -1 159 82 47 -99
5474 -99 158 79 -146 251 84 -2 9 -137 124 -117 330 32 -444 122 15 107 -82 186 -253 33 74 -150
5496 -150 37 23 120 57 -285 -63 -244 -70 -164 58 -30 -43 -253 -462 -155 58 85 -276 -88 46 94 17 -46
5519 -46 -54 61 -367 -32 -98 -85 81 -19 150 121 -12 123 -124 -37 -180 -259 19 -124 115 -18 -198 126 -273
5542 -273 30 -3 -61 61 286 132 -348 249 174 -255 196 -127 269 -131 -162 -112 98 -5 -138 271 -59 -192
5564 -192 16 271 107 0 174 -29 -307 150 344 -131 303 -470 73 8 -57 181 -166 9 -204 -77 202
5585 202 53 -129 -98 -98 292 56 133 329 111 -278 180 -131 -43 -226 -326 212 249 -276 378 25 -29 115
5607 115 6 139 -99 -303 -182 199 -266 77 86 -319 -63 62 -65 -49 -235 112 188 -310 57 248 198 -143
5629 -143 -172 6 184 -39 145 173 115 113 296 116 211 192 -162 67 251 -306 118 -3 143 -37 71 -195
5651 -195 71 134 34 -144 80 -228 236 -180 -62 75 59 42 -217 343 -39 -188 -10 -189 320 -181 -99
5672 -99 126 -102 63 -151 -231 315 176 63 -61 45 -343 -135 26 -77 24 261 323 -189 3 246 -67
5693 -67 -29 -230 238 -131 -79 -126 -97 367 107 397 228 48 -142 -387 79 191 208 20 -173 -184 106 276
5715 276 -20 -23 -170 214 -37 -40 -192 -236 -114 -183 -149 -120 181 -40 -101 -30 167 532 124 -24 -326 -76 -19 223
5739 223 -286 172 39 -182 -98 215 30 280 30 111 -89 71 -51 -171 282 -315 -146 -2 298 -89 213
5760 213 123 -37 9 277 89 51 -5 -94 -89 -282 -52 -151 -23 -362 98 248 55 -13 -327 17 -93 -1 202
5783 202 177 -10 -218 -4 -132 -7 -129 187 -138 50 271 142 39 -250 426 46 45 111 -72 376 69
5804 69 171 85 61 84 -190 179 34 317 91 188 -226 -8 -68 -213 -277 -385 -92 542 -4 -50 80 -41 5
5827 5 96 -83 -104 103 7 -45 -196 -110 130 -14 64 -22 -74 332 70 174 100 36 -99 -123 160 455 21 -39 39
5852 39 -199 -51 -180 120 -102 3 -261 -103 277 -155 453 105 367 52 -158 108 -10 103 -36 237
5872 237 215 -304 -69 -207 -223 -156 -7 -12 21 293 -60 206 -99 316 -5 341 -234 191 126 -49 -52 240 102
5895 102 87 34 61 378 -245 -8 -466 242 -234 536 28 -125 127 79 -92 -124 -79 -299 149 89 210 84
5917 84 -281 -283 -103 208 254 -107 -129 75 137 322 164 141 358 188 196 115 189 120 -135 -20 -109 -27 96 -118 355
5942 355 -60 9 56 -36 37 41 326 -89 -91 96 118 -385 285 -137 349 -178 92 147 616 -137 67 51 -278 259
5966 259 106 -178 44 327 71 -212 -146 81 30 -36 -230 -105 -24 164 -156 58 -12 -136 133 98 336 -50
5988 -50 -57 13 220 -214 -80 69 -15 -101 155 -145 -159 -48 -139 -241 -203 14 70 -34 296 -1 -44 -44 395 23
6012 23 -291 -215 341 562 50 -109 -162 -158 137 -89 -20 308 136 -33 -51 -177 -261 559 -60 406 492 -107 5
6035 5 -130 404 -10 -190 -250 227 -194 -245 -50 50 145 -33 -59 179 -57 -257 -231 -62 -209 -328 -297 -132 124
6058 124 153 104 246 -229 -19 -134 258 -26 39 -14 -54 18 68 127 258 15 69 133 -13 -23 -46 227 116 -263
6082 -263 -172 -48 -239 151 287 -169 -81 44 -210 -307 -169 -2 217 -75 -151 221 -32 5 -168 -132 206 -171
6104 -171 -22 -246 -109 148 -121 186 102 319 -66 190 183 -22 16 -18 84 -27 393 86 47 -129 466 -30
6126 -30 71 32 383 -343 -125 -272 7 430 52 -12 -323 26 -219 138 -225 138 276 -329 -22 91 409
6147 409 82 -167 275 207 -139 -53 -107 -69 179 83 -7 23 -60 162 -170 -130 -186 120 -82 -358 107 -308 22
6170 22 -292 47 22 -148 -180 139 -71 -69 163 -44 286 -8 -166 372 -168 122 147 311 80 65 370 -150
6192 -150 -255 15 -336 -524 -315 -225 130 -180 68 -118 -25 -347 -30 -123 80 60 25 -132 75 -181 263 144
6214 144 73 395 -261 -82 -219 35 -57 -51 -90 -124 -266 -393 137 314 70 -119 -43 75 -77 98 210 -218
6236 -218 160 37 14 -195 39 -41 -61 455 -202 -371 -59 136 209 -188 -16 -300 -200 -131 -82 -229 227 -42
6258 -42 234 26 123 -155 345 292 -233 -35 -20 -162 -195 -41 212 -47 -74 348 -24 110 356 482 116 -469
6280 -469 59 297 43 -195 -65 14 -132 -186 -233 -202 -40 -341 -678 18 212 4 233 343 53 327 -74
6301 -74 -46 -126 -98 -261 -21 -10 -301 -148 15 45 193 103 194 -178 -366 253 -34 -195 308 -191 -57 -109 141
6324 141 19 14 71 74 55 -30 -168 -148 -150 -114 27 -50 -85 29 -68 -155 -118 290 -223 197 61 -106 -255 -107 -48 -335
6350 -335 100 -360 9 12 -66 205 -201 -141 -242 200 -85 -82 7 -73 76 273 -32 35 94 222 -187 -102 -275 243
6374 243 167 49 -36 -338 174 -105 -223 83 357 164 96 6 39 -72 18 168 178 -129 -351 378 37 -46 -136
6397 -136 -1 -42 -162 -104 -34 -89 -75 224 102 143 108 53 -156 366 267 22 -17 -55 -10 133 -12 28 -292 -209 -179
6422 -179 158 215 -201 129 72 -334 167 68 -57 -23 4 155 177 86 184 -342 294 183 53 59 203 -237 -91
6445 -91 282 -47 113 370 76 280 175 -236 4 58 -155 147 68 -176 8 -530 67 -81 15 221 -116
6466 -116 -100 -63 94 459 134 -3 -128 -48 169 91 -86 -165 -44 222 183 267 18 278 -114 30 -64 -202 36
6489 36 -93 -216 -314 -121 -316 233 258 -159 18 -75 -27 -249 -192 -185 116 -40 -143 -290 -172 125 -5 -340 1
6512 1 286 -246 171 298 -114 239 179 288 -69 137 -338 -59 23 282 81 180 93 -77 40 -155 -42 148
6534 148 265 254 20 -240 -341 103 -66 -95 -323 21 168 -21 36 -101 -89 -146 43 -482 -112 -160 66 29
6556 29 -14 229 110 276 155 167 -127 -265 -281 313 -157 -163 -134 -100 -180 232 6 11 272 62 30 119 -71 -26 47
6581 47 -195 -125 19 -36 84 -245 103 81 -18 -44 -347 157 204 -48 130 51 8 85 -313 21 -206 -195 162 -132
6605 -132 -24 258 -3 131 368 175 105 183 279 -106 -34 150 -295 -105 51 98 -365 -59 53 168 -76 -349
6627 -349 -69 -4 -45 -12 20 159 203 258 191 -119 197 -103 -25 -176 45 74 81 270 -229 -6 15 160 160 146 -5
6652 -5 70 171 -147 -129 -215 27 143 98 -145 66 182 -227 -181 278 204 -244 117 -1 -159 235 -269 -87 -21
6675 -21 98 231 8 354 -331 219 -82 152 -106 27 504 -254 56 231 360 70 208 -451 75 -110
6695 -110 -217 66 -169 42 90 62 -13 114 18 88 73 12 229 -2 167 69 -202 -102 -142 213 -170 -277 213
6718 213 -109 -151 146 -13 -94 -35 -59 -42 -58 -174 -196 -213 -129 156 -341 -31 -51 -130 260 -242 -25 -229 11 -59
6742 -59 107 231 -28 247 -22 -28 -124 133 52 -67 -238 -40 -99 -153 299 -205 61 -106 16 153 333 58
6764 58 138 -264 138 123 -33 260 62 54 -3 -203 7 216 -15 57 87 83 -68 -186 -333 169 -134 -314 167
6787 167 -31 49 -257 -263 112 -29 -335 -54 72 100 253 -232 -265 -229 26 -186 -225 49 113 -16 -143 159 -68
6810 -68 54 21 -11 -257 52 198 47 -138 -47 98 52 -44 -53 15 11 73 69 -35 320 175 -109 -111 12 18 199 34
6836 34 -161 353 126 137 96 6 -83 132 -117 384 25 126 -26 242 191 -205 -122 136 278 -33 120 -233
6858 -233 2 248 206 91 -43 205 64 -138 119 370 6 152 -1 118 78 1 89 168 121 220 241 31 -184
6881 -184 -80 -50 146 -57 -341 401 -45 19 13 136 -177 -29 -363 -34 376 1 454 392 -86 96 -393 30
6903 30 -130 -144 89 -287 196 -52 21 -28 -302 20 -188 -99 -46 47 -6 -53 63 -120 -89 -203 -98 346 64
6926 64 71 153 273 -207 37 177 56 166 192 54 -24 -265 230 -222 216 -152 24 -123 133 118 -87 99
6948 99 -325 -182 -76 188 -174 39 6 -64 -274 -138 52 -134 -188 60 204 -18 93 116 104 161 -107 261
6970 261 36 70 -135 13 -168 144 -114 87 -13 -36 7 -57 -253 77 180 111 124 -253 83 -117 128 -82
6992 -82 1 39 -195 20 -144 -11 158 -49 -173 36 72 -92 125 109 -40 -384 13 53 48 -403 -262 -25 -140
7015 -140 194 -10 -7 -90 104 -128 387 200 159 -122 -233 -13 116 -67 70 -138 -71 61 104 -315 350 -99
7037 -99 120 -139 -107 -151 94 318 41 147 -224 -16 186 153 -265 -5 19 117 31 -104 55 -441 -144 -284
7059 -284 -270 168 -16 -147 -46 210 -9 -186 80 -70 126 230 -194 -266 -133 -89 -206 325 164 -49 97
7080 97 -52 0 69 60 -544 -199 63 -21 -214 68 197 16 211 416 52 38 -45 39 6 -2 53 32 401 -91 19
7105 19 -131 -201 60 -220 -84 175 -230 -219 47 -97 -73 338 144 84 -92 76 -376 -90 307 -114 18 -18
7127 -18 21 430 -111 -71 -90 353 -57 248 231 24 173 200 -179 208 -245 156 -101 125 108 76 145 -19 166
7150 166 182 180 -38 -74 -365 341 -208 -113 -142 -260 237 120 -104 175 45 332 103 -232 117 -422 28 -93
7172 -93 119 8 395 -54 283 -597 -9 84 -491 -89 151 217 89 -58 43 42 -64 222 122 138 53 134 138
7195 138 141 21 329 -128 -232 105 177 -163 -56 192 -179 -149 135 153 -87 44 165 -145 292 281 -45 197
7217 197 -66 249 -337 209 -102 -92 79 248 -53 -184 107 34 130 180 -6 37 114 -19 -82 -8 -29 148 -34
7240 -34 -58 166 113 180 88 -12 -65 -34 207 -97 -48 -214 10 112 55 129 -133 81 86 -182 -126 -109 -20 69 136 95
7266 95 158 259 -93 -258 -232 -59 414 -90 -157 575 -196 239 -86 -42 -21 -34 240 -142 406 -15 -63 -19 -59
7289 -59 -282 48 -193 147 -218 17 -176 -49 -195 -216 243 -19 315 -5 -220 40 -75 137 154 176 -418
7310 -418 -168 136 89 -212 345 -186 -68 -13 100 -82 133 -114 -260 173 190 -153 304 269 -215 52 -311
7331 -311 -39 -19 290 93 1 -109 323 -340 149 -139 -246 253 482 -43 42 -100 168 -123 -129 -72 -30 76
7353 76 72 -253 200 -269 110 -40 -54 -40 -136 16 -284 98 266 357 -159 57 9 -148 -454 272 -143 -106 -10
7376 -10 52 -339 137 53 -144 46 -80 -181 -95 163 93 -73 58 333 -147 -3 -125 289 205 83 231 187
7398 187 -83 -235 -102 -351 251 118 -175 121 -109 -219 -151 92 -291 76 -91 82 260 -296 -141 -153 147
7419 147 -117 -379 -36 -8 -87 76 -151 -89 -139 137 -91 241 24 -119 -17 303 37 -104 -276 -124 127
7440 127 242 71 1 -95 -142 155 160 149 -101 17 -78 147 -242 354 306 318 -91 -112 241 118 -135 -91 -142 150
7464 150 123 -106 185 -37 260 155 -77 174 -68 -100 -283 -58 -126 255 -172 -209 35 81 -38 151 134 126 -390
7487 -390 -82 159 -64 -117 -109 17 3 -102 150 -225 -236 310 101 57 206 -21 -159 -143 64 -267 56 182
7509 182 96 -219 -104 -16 -77 -215 291 -116 100 50 -49 -136 -148 -53 -12 410 -46 114 228 72 395 -115 -354
7532 -354 16 -99 -121 133 -8 -100 359 276 -170 -35 235 2 -220 121 43 -160 -97 -224 132 335 188 274
7554 274 194 138 223 -112 172 148 110 203 -294 -234 -259 96 207 110 90 117 168 -74 -243 -311 17 551 -48 -102 331
7579 331 -17 -60 256 58 -176 138 165 161 368 198 -59 -186 191 -27 -42 147 -56 -15 -97 371 23 128
7601 128 -107 -193 -247 -90 102 154 -133 -126 137 -171 -124 -74 -32 228 12 305 18 -97 -306 261 74 -178 -193
7624 -193 -246 102 -79 82 -212 192 -235 -182 22 77 -21 -355 260 179 11 98 -92 162 158 -138 -246 29 96
7647 96 -323 2 36 43 132 -77 350 -44 56 414 -20 109 -278 -10 -190 -265 -56 -132 -265 93 341 193
7669 193 -91 -68 20 -300 -74 -5 56 1 -160 15 135 265 -86 -307 -135 -277 -31 196 -208 33 -204 -434
7691 -434 216 271 -48 90 123 -184 -195 145 59 23 -9 -166 229 -109 -264 77 34 242 -47 -31 39 321 143
7714 143 -320 87 -628 154 -198 -101 -445 -116 -24 -102 134 -212 -440 -466 -167 237 387 -177 189 -300 5
7735 5 165 -20 -190 75 -19 -196 240 255 108 -6 194 20 91 120 284 341 135 -87 -25 -19 201 -102 -99 88
7759 88 -197 -93 -57 29 118 83 -90 -154 -44 -37 -265 -314 120 -240 -110 7 -150 -123 -324 -72 48 -158 6
7782 6 -164 22 8 -187 3 -342 -335 -352 -68 10 182 -183 27 -257 411 160 -90 -391 41 235 -195 -257 -313
7805 -313 284 15 -331 189 -135 -51 88 58 197 -234 -65 67 -40 -21 56 -103 -336 299 -118 91 -169
7826 -169 -100 -2 -143 -18 347 274 -157 -101 72 207 183 -65 -29 -35 -9 -214 -91 251 -231 90 86 51 200 344
7850 344 -145 -44 -53 -61 -9 20 -92 -13 167 -68 -9 -1 346 65 29 -136 293 200 -184 -9 259 217 361 -96
7874 -96 -32 -111 -299 -230 -213 94 263 -56 -108 -179 -342 -81 94 -269 10 -12 -348 211 -52 210 -239 -108 71
7897 71 -10 44 44 125 -80 175 42 -140 -129 -135 -54 93 182 -23 90 210 252 -236 62 -114 334 15 -84 -100 -183
7922 -183 213 -216 5 289 50 -141 245 197 -147 -5 -46 290 -274 -185 -144 -42 10 -250 -149 155 228 -115
7944 -115 -25 54 -100 -214 -140 170 98 -512 93 36 -247 322 -4 220 -65 -196 -18 77 162 292 -516 -194
7966 -194 66 21 -59 375 8 161 -77 78 -185 111 32 -292 39 -230 88 -253 216 -242 -34 -309 -48
7987 -48 123 274 -84 89 131 -147 -32 224 -217 -156 -424 176 115 153 260 317 32 84 58 -12 -271 104 -88
8010 -88 158 -110 171 109 21 73 -217 43 98 -135 106 -218 -328 61 -107 206 82 -281 83 290 -69 -58
8032 -58 -14 -51 -100 168 365 52 -193 148 51 273 -170 -131 83 132 -196 -131 334 -155 -207 -43 362 156 58
8055 58 26 -68 252 238 -194 59 433 -151 -217 260 40 77 113 306 9 243 -57 -80 193 87 242 -158 -168
8078 -168 -104 -40 108 59 -463 176 138 -131 -346 -46 -75 83 107 -181 21 343 -86 133 161 88 4 81 2 -185
8102 -185 -250 -138 138 -307 219 318 -86 -11 20 -177 22 143 -258 -241 -34 39 -278 149 221 -34 -278 -154
8124 -154 183 250 -53 -32 246 98 151 -43 495 91 10 38 -83 -29 305 -182 -31 44 272 -164 319 -156
8146 -156 -132 283 -212 119 14 313 -9 57 -273 -134 21 74 91 37 238 -187 -153 156 241 -99 48 202
8168 202 306 270 -42 201 82 447 210 119 257 -139 -228 -145 193 -192 -223 -40 120 -270 18 23 225 -56
8190 -56 250
8191B50
##END NTUPLES=NMR FID
##END=
