##TITLE=1H ikalashn
DE-75k_NaOH
20.11.2024
##JCAMPDX= 6.0         $$ Bruker NMR JCAMP-DX V2.0
##DATA TYPE= NMR FID
##DATA CLASS= NTUPLES
##ORIGIN= UXNMR, Bruker Analytische Messtechnik GmbH
##OWNER= root
$$ TOPSPIN		Version 1.3
$$ 2024-11-20 16:03:28.187 +0400  Irina@DPX200
$$ Compression mode = diff/dup
##.OBSERVE FREQUENCY= 200.131300845
##.OBSERVE NUCLEUS= ^1H
##.DELAY= (6, 6)
##.ACQUISITION MODE= SIMULTANEOUS
##.ACQUISITION SCHEME= undefined
##.AVERAGES= 32
##.DIGITISER RES= 18
##SPECTROMETER/DATA SYSTEM= spect
##.PULSE SEQUENCE= zg
##.SOLVENT NAME= D2O
##.SHIFT REFERENCE= INTERNAL, D2O, 1, 17.49637
##AUDIT TRAIL= $$ (NUMBER, WHEN, WHO, WHERE, WHAT)
$$ ##TITLE= Audit trail, TOPSPIN		Version 1.3
$$ ##JCAMPDX= 5.01
$$ ##ORIGIN= Bruker BioSpin GmbH
$$ ##OWNER= Irina
$$ $$ F:/spectra/data/iren/nmr/1H/4/audita.txt
$$ ##AUDIT TRAIL=  $$ (NUMBER, WHEN, WHO, WHERE, VERSION, WHAT)
(   1,<2024-11-20 16:03:10.906 +0400>,<Irina>,<DPX200>,<TOPSPIN 1.3>,
      <created by zg
	started at 2024-11-20 16:01:00.453 +0400,
	POWCHK disabled, PULCHK disabled
       terminated by command 'halt'
       configuration hash MD5:
       BE 6D 3F 07 2A EA 11 49 91 17 2B D3 AF B3 58 0D
       data hash MD5: 16K
       1F 28 01 06 3D F8 3A A4 49 4A F8 C0 79 6A 67 A6>)
$$ ##END=
$$ 
$$ $$ hash MD5
$$ $$ 4C CC D2 15 75 8E 46 A4 92 07 F2 B6 8F 8E 79 F1
##$RELAX= 
##$RELAX= 
##$RELAX= 
##$RELAX= 
##$RELAX= 
##$RELAX= 
##$RELAX= 
##$RELAX= 
##$RELAX= 
$$ Bruker specific parameters
$$ --------------------------
##$DU= <F:/spectra>
##$EXPNO= 4
##$NAME= <1H>
##$PROCNO= 1
##$TYPE= <nmr>
##$USER= <iren>
##$AMP= (0..31)
100 100 100 100 100 100 100 100 100 100 100 100 100 100 100 100 100 100 
100 100 100 100 100 100 100 100 100 100 100 100 100 100 
##$ANAVPT= -1
##$AQSEQ= 0
##$AQ_mod= 1
##$AUNM= <au_zg>
##$AUTOPOS= <>
##$BF1= 200.13
##$BF2= 200.13
##$BF3= 200.13
##$BF4= 200.13
##$BF5= 200.13
##$BF6= 200.13
##$BF7= 200.13
##$BF8= 200.13
##$BYTORDA= 1
##$CFDGTYP= 0
##$CFRGTYP= 5
##$CHEMSTR= <none>
##$CNST= (0..63)
1 1 145 1 1 1 1 1 1 1 1 1 1 1 1 1 1 1 1 1 1 1 1 1 1 1 1 1 1 1 1 1 1 1 
1 1 1 1 1 1 1 1 1 1 1 1 1 1 1 1 1 1 1 1 1 1 1 1 1 1 1 1 1 1 
##$CPDPRG= <>
##$CPDPRG1= <>
##$CPDPRG2= <>
##$CPDPRG3= <>
##$CPDPRG4= <mlev>
##$CPDPRG5= <mlev>
##$CPDPRG6= <mlev>
##$CPDPRG7= <mlev>
##$CPDPRG8= <mlev>
##$CPDPRGB= <>
##$CPDPRGT= <>
##$D= (0..63)
0 2 0 0 0 0 0 0 0 0.06 0 0.03 0 0 0 0 0.0002 0 0 0 0 0 0 0 0 0 0 0 0 0 
0 0 0 0 0 0 0 0 0 0 0 0 0 0 0 0 0 0 0 0 0 0 0 0 0 0 0 0 0 0 0 0 0 0 
##$DATE= 1732104187
##$DBL= (0..7)
120 120 120 120 120 120 120 120 
##$DBP= (0..7)
150 150 150 150 150 150 150 150 
##$DBP07= 0
##$DBPNAM0= <>
##$DBPNAM1= <>
##$DBPNAM2= <>
##$DBPNAM3= <>
##$DBPNAM4= <>
##$DBPNAM5= <>
##$DBPNAM6= <>
##$DBPNAM7= <>
##$DBPOAL= (0..7)
0.5 0.5 0.5 0.5 0.5 0.5 0.5 0.5 
##$DBPOFFS= (0..7)
0 0 0 0 0 0 0 0 
##$DE= 6
##$DECBNUC= <off>
##$DECIM= 32
##$DECNUC= <off>
##$DECSTAT= 4
##$DIGMOD= 1
##$DIGTYP= 9
##$DL= (0..7)
0 120 120 120 120 120 120 120 
##$DP= (0..7)
$$ [...]
##$SW= 21.9926040160658
##$SWIBOX= (0..15)
0 0 2 0 0 0 0 0 0 0 0 0 0 0 0 0 
##$SW_h= 4401.40845070422
##$TD= 16384
##$TD0= 1
##$TE= 300
##$TE2= 300
##$TE3= 300
##$TEG= 300
##$TL= (0..7)
0 120 120 120 120 120 120 120 
##$TP= (0..7)
150 150 150 150 150 150 150 150 
##$TP07= 0
##$TPNAME0= <>
##$TPNAME1= <>
##$TPNAME2= <>
##$TPNAME3= <>
##$TPNAME4= <>
##$TPNAME5= <>
##$TPNAME6= <>
##$TPNAME7= <>
##$TPOAL= (0..7)
0.5 0.5 0.5 0.5 0.5 0.5 0.5 0.5 
##$TPOFFS= (0..7)
0 0 0 0 0 0 0 0 
##$TUNHIN= 0
##$TUNHOUT= 0
##$TUNXOUT= 0
##$USERA1= <user>
##$USERA2= <user>
##$USERA3= <user>
##$USERA4= <user>
##$USERA5= <user>
##$V9= 5
##$VALIST= <valist>
##$VCLIST= <CCCCCCCCCCCCCCC>
##$VD= 0
##$VDLIST= <DDDDDDDDDDDDDDD>
##$VPLIST= <PPPPPPPPPPPPPPP>
##$VTLIST= <TTTTTTTTTTTTTTT>
##$WBST= 1024
##$WBSW= 25
##$XGAIN= (0..3)
0 0 0 0 
##$XL= 0
##$YL= 0
##$YMAX_a= 438169
##$YMIN_a= -811068
##$ZGOPTNS= <>
##$ZL1= 120
##$ZL2= 120
##$ZL3= 120
##$ZL4= 120
##$ABSF1= 10
##$ABSF2= 0
##$ABSG= 5
##$ABSL= 3
##$ALPHA= 0
##$AQORDER= 0
##$ASSFAC= 0
##$ASSFACI= 0
##$ASSFACX= 0
##$ASSWID= 0
##$AUNMP= <proc_1d>
##$AXLEFT= 0
##$AXRIGHT= 0
##$AXTYPE= 0
##$AXUNIT= <>
##$AZFE= 0.1
##$AZFW= 0.1
##$BCFW= 1
##$BC_mod= 2
##$BYTORDP= 1
##$COROFFS= 0
##$CY= 7568.61572265625
##$DATMOD= 1
##$DC= 2
##$DFILT= <>
##$DTYPP= 0
##$F1P= 17.9538593292236
##$F2P= -4.03888763876832
##$FCOR= 0.5
##$FTSIZE= 32768
##$FT_mod= 4
##$GAMMA= 1
##$GB= 1
##$INTBC= 1
##$INTSCL= 1
##$ISEN= 128
##$LB= 0.02
##$LEV0= 0
##$LPBIN= 0
##$MAXI= 945.577
##$MC2= 0
##$MEAN= 0
##$ME_mod= 0
##$MI= -402.1523
##$NCOEF= 0
##$NC_proc= 0
##$NLEV= 6
##$NOISF1= 8.587773
##$NOISF2= 6.764455
##$NSP= 1
##$NTH_PI= 0
##$NZP= 0
##$OFFSET= 17.49637
##$PC= 1
##$PHC0= 313.9969
##$PHC1= 8.637775
##$PH_mod= 0
##$PKNL= yes
##$PPARMOD= 0
##$PPDIAG= 0
##$PPIPTYP= 0
##$PPMPNUM= 100
##$PPRESOL= 1
##$PSCAL= 0
##$PSIGN= 0
##$REVERSE= no
##$SF= 200.13
##$SI= 32768
##$SIGF1= 18.5376
##$SIGF2= -6.396296
##$SINO= 400
##$SIOLD= 32768
##$SREGLST= <1H.CDCl3>
##$SSB= 3
##$STSI= 0
##$STSR= 0
##$SW_p= 4401.40845070422
##$SYMM= 0
##$S_DEV= 0
##$TDeff= 0
##$TDoff= 0
##$TI= <>
##$TILT= no
##$TM1= 0
##$TM2= 0
##$TOPLEV= 0
##$USERP1= <user>
##$USERP2= <user>
##$USERP3= <user>
##$USERP4= <user>
##$USERP5= <user>
##$WDW= 1
##$XDIM= 8192
##$YMAX_p= 0
##$YMIN_p= 0
$$ End of Bruker specific parameters
$$ ---------------------------------
##NTUPLES= NMR FID
##VAR_NAME=  TIME,          FID/REAL,        FID/IMAG
##SYMBOL=    X,             R,               I
##VAR_TYPE=  INDEPENDENT,   DEPENDENT,       DEPENDENT
##VAR_FORM=  AFFN,          ASDF,            ASDF
##VAR_DIM=   8192,          8192,            8192
##UNITS=     SECONDS,       ARBITRARY UNITS, ARBITRARY UNITS
##FACTOR=    0.0002272,     1,               1
##FIRST=     0,             0,               0
##LAST=      1.8609952,     170,             -98
##MIN=       0,             -811068,         -811068
##MAX=       1.8609952,     438169,          438169
$$ Real data points
##PAGE= N=1
##DATA TABLE= (X++(R..R)), XYDATA
0@%%%%%%%%%%%%%%l2O4o4O4o4R6j28J29j61J93k25K88l21L54m18M82n49O44p37
33c85Q34r50J067j202J341j500J676j866K074k301K552k825L129l452L806m197
49b199M623n093N612o185O819p531Q330r235J0271j1462J2857j4518J6534j9039
63a0216K2251k6550L2631m1975N8313r5240L34790k1334m98483O6051K3335l0337
75a86764j2664K30770J64927N4667J0638Q0291l1761j27746j67747j69805k33541
86c88735j15388J05431J94213O2119N6954K01399K13974l4680j91163j20997m6018
97f2891j39631j67803L220J99086K06840J20674P8632P7210M3551j1008q8694
108B59186j84681k23282j28051J4188P0630P0086J23988J79529J12998l9550j15294
$$ y = [0, 0, 0, 0, 0, 0, 0, 0, 0, 0, 0, 0, 0, 0, 0, -32, 32, -32, 32, -32, 64, -64, 65, -96, 97, -128, 160, -161, 193, -225, 257, -292, 352, -385, 449, -501, 566, -636, 705, -795, 881, -985, 1089, -1212, 1340, -1485, 1644, -1808, 1998, -2199, 2424, -2669, 2943, -3242, 3577, -3954, 4376, -4859, 5412, -6050, 6807, -7711, 8823, -10216, 12035, -14515, 18116, -23859, 34454, -60786, 274004, 252670, -245813, -179762, -156427, -186764, -199428, 31342, 196269, 250936, 261574, 341865, 310104, 182358, 14611, -155194, -388735, -504123, -398692, -204479, -142360, -85406, 115993, 329967, 295287, 104124, -16873, -62891, -202522, -370325, -367105, -168019, 38821, 159495, 238127, 315337, 358888, 347880, 259186, 74505, -148777, -276828, -262640, -192010, -121924, 2064, 181593, 294591, 255041, 139747]
119A39747q7956p3518j23077j43130o6087M4681J08855J23026J20498J14281Q8146
130B45466K2325p3862j41779j29298p1778m3886l5003L0762J44389J90594J21055
141B58985K0760k7918m6460q6713j26957j24914q0682k1956L4247P1698Q5717
152d4193J01717J18585P9211l7077j38334j39491q9265o7422m7008K8296J12457
163a22524J20441P5132N9557O6692L2093m3735j00336j18889j10029n9585K0788
174a80395O9035O9729Q0605J09649Q4652p085p0228o7632p3980j20557j20358
185b26565k7005P2642R8927Q5121P9321O0748J5397k0904m1004p6224j06049q2876
197a68471k6868P456L8619J02422J44379R3977k38l8081k6461m6832r5134r6786
$$ y = [139747, 51791, -21727, -144804, -287934, -354021, -309340, -200485, -77459, 43039, 157320, 245466, 267791, 193929, 52150, -77148, -148926, -192812, -227815, -197053, -52664, 137930, 258985, 279745, 251827, 205367, 118654, -8303, -133217, -213899, -235855, -201608, -129910, -44193, 57524, 176109, 255320, 218243, 79909, -59582, -148847, -216269, -263277, -234981, -122524, -2083, 73049, 132606, 199298, 231391, 187656, 87320, -31569, -141598, -201183, -180395, -111360, -41631, 38974, 148623, 233275, 226190, 155962, 88330, 14350, -106207, -226565, -253570, -180928, -82001, 3120, 82441, 143189, 158586, 137682, 96678, 20454, -85595, -168471, -195339, -187883, -149264, -46842, 97537, 191514, 191276, 153195, 126734, 79902, -15232, -112018]
209a12018m6090Q16K9764O7793R9188Q8208M7528P209l9052q7082r5742n9851
221i9329l4932l8807j3625O2339J17045R5187M3776J7188m844n3732r4627q4686
233h9047m1724j1443Q918L5608O2693P9323Q2792N9645p76o4540q6597o8988n5695
246h9831m9210j2609M6423P5254N8882M2378M6954L5030j7789p5531r3566p4861
258a08476m0258n153K5042M8559O6691P3228N7183J8700j7535l4543m9474p4810
270d0846q0021l5733L1026O5934O1425N2819N0496L5871n18m0307o0326o2595
282b2775n6480m4618j8909K2944O6566Q4268O1942J9328r779j8965l3238n8457
294h173o9646m6163q202J9782L9367O1028P4817O0189J7127k8791n1473n0409
$$ y = [-112018, -158108, -157292, -127528, -59735, 39453, 127661, 175189, 182398, 143346, 56264, -39478, -99329, -134261, -173068, -186693, -124354, -7309, 87878, 131654, 148842, 143998, 90266, -4361, -89047, -130771, -142214, -133296, -97688, -34995, 44328, 127120, 186765, 185989, 121449, 34852, -34136, -89831, -139041, -151650, -105227, -29973, 28909, 71287, 118241, 153271, 135482, 59951, -33615, -108476, -148734, -153887, -128845, -80286, -13595, 59633, 116816, 135516, 117981, 83438, 33964, -40846, -120867, -156600, -125574, -59640, 1785, 54604, 105100, 140971, 140453, 100146, 39820, -22775, -79255, -123873, -142782, -119838, -53272, 30996, 92938, 112266, 102487, 83522, 50284, -8173, -77819, -123982, -132184, -112402, -73035, -12007, 62810, 122999, 140126, 111335, 59862, 9453]
306I453m3223m0254l1928o387L3264O2025O4852M7541K7026J248l5083o6493o8805
319d6764m2659j4511L33R928L1895N8655O7301M5438N364k8080m7520n3957n2206
332f6783l8052o996K6941M4470M3200M0660M2784L3287N50m1729o6051n9751l7115
345h4585j4740O233K9445M9475N1676L6614J5850M80j5010l8562o1681o1989l0372
358a17166R226L4197M0470M2528M4169L4579R208j9808l6812m0399m1704m0564
370h2076k3308J2572M8076O0395M5393K3755P946n690k5538m5385n0462l7167
382g1489j7603l98J9055M2197N7344M8223J6722j5302k9789l2233l5907m0100
394e9280l1435n811K2875L9932M2212M0767L4739J5264j8531m5518m8174l2602
$$ y = [9453, -33770, -74024, -105952, -112339, -79075, -17050, 47802, 95343, 122369, 123617, 88534, 22041, -46764, -89423, -103934, -103601, -93673, -61778, -3123, 64178, 109616, 114980, 86900, 39380, -14577, -66783, -104835, -111831, -84890, -40420, 2780, 43440, 86224, 119511, 120061, 78332, 12281, -47470, -84585, -99325, -93092, -63647, -14172, 37504, 74118, 89968, 90448, 75438, 36876, -24805, -86794, -117166, -107940, -73743, -33273, 9255, 53424, 88003, 97211, 77403, 40591, 192, -41512, -82076, -105384, -92812, -44736, 15659, 61052, 84807, 92753, 87063, 61525, 16140, -34322, -71489, -89092, -89490, -70435, -28238, 29106, 77329, 94051, 78749, 48960, 16727, -19180, -59280, -90715, -96526, -73651, -33719, 8493, 49260, 83999, 99263, 80732, 35214, -12960, -45562]
406d5562j8081j0341J243K3970M5595M8866L2286J0870p410k5921m3586n0665
418c8736l7302r650J4237K3137K5725L2387L9637L0762L520k6007l9642l9781
430b1713l5323k5463k915K4381M0649L7881K7343J9870J2602k734k6445m4263
442C870m5457k9001n735J2823K6987L6516L9229K8142O408j2353k0239k6174l6020
455b1004m0479k4582M708K9407L8269L6199K8349J5917o60j7812k9927l3265k7758
468d2638j8868q525P605K9852M5956M1101J8647k700j3986k2571l1571l4215k4771
481e6684q268O321J8591L0395L6561L2200J4586j0161k9833l5383k8511k0061
493e0247j2974k496J4905L0879L4943K9187J8546M314j4502l1835l7683k8797
$$ y = [-45562, -63643, -73984, -72741, -48771, -3176, 45690, 77976, 88846, 81436, 55515, 11929, -38736, -76038, -85688, -71451, -48314, -22589, 9798, 49435, 80197, 83717, 57710, 18068, -21713, -57036, -82499, -85414, -61033, -20384, 17497, 44840, 64710, 77312, 74578, 48133, 3870, -41587, -70588, -76323, -63500, -36513, 3, 39232, 67374, 73782, 61429, 41190, 15016, -21004, -61483, -86065, -81357, -51950, -13681, 22518, 50867, 66784, 66124, 48312, 18385, -14880, -42638, -61506, -70031, -62426, -32574, 13382, 54483, 73130, 70430, 56444, 33873, 2302, -31913, -56684, -64952, -58631, -40040, -9645, 26916, 59116, 73702, 63541, 33708, -1675, -30186, -50247, -63221, -65717, -50812, -19933, 15010, 44197, 62743, 67057, 52555, 20720, -16963, -45760]
505d5760j1495L361J2034J8582K6464L1832K5716Q654j0712k5121l2627l3633
517c2705k5555p080J2334K3990K6234K3974J9371J2743K495j4227l0901l7165
529b6492k6665j0126M250J6836K9023L3332K4124Q895j922p838j6952k8597l0926
542c3058k1223m127J3386K5706L0077K4973J5361M611p746k1598k7691k4014j8304
555d3647j2866k205J8853L4770L2921J7249M187m164j3990k4406k6993j8536r749
568d8576r84R940K2200K9305K7573J8028J601j7367k7636k4320j7594j4014p950
581d9794P394K2995K5672J9048J5929J1020m160k3774l0619k2896j3358n811K638
594d5716J3938K1799K4383K2500J3575k383j7343k2578k4003k2901j2626P176
$$ y = [-45760, -57255, -53894, -41860, -23278, 3186, 35018, 60734, 69388, 58676, 33555, 928, -32705, -58260, -65340, -53006, -29016, -2782, 21192, 40563, 53306, 55801, 41574, 10673, -26492, -53157, -63283, -59033, -42197, -13174, 20158, 44282, 53177, 51255, 43417, 26465, -2132, -33058, -54281, -58408, -45022, -19316, 10761, 35734, 51095, 55706, 47960, 26362, -1329, -25343, -43647, -56513, -58718, -39865, -5095, 27826, 45075, 49262, 45098, 31108, 6702, -20291, -38827, -48576, -49560, -39620, -17420, 11885, 39458, 57486, 59087, 41720, 14084, -10236, -27830, -41844, -49794, -42400, -19405, 6267, 25315, 41244, 52264, 48104, 24330, -6289, -29185, -42543, -48354, -45716, -31778, -9979, 14404, 36904, 50479, 48096, 30753, 8175, -15828, -38729, -51355, -44179]
606d4179K0244J9017J4515J6981J8203O781j0494k0864k3339k3901j7879m633
618d9548J0979K1019K3830K0174J1346R77m650j0488j8976k6548k1354o208P791
631d1656J4863J9532K3923J9957O726n465j2339j4664j7974j9495j5523l086J1368
644c3833K3289K6081J8917P871j557r978j6921k0540j7292r134l902J166J0014
657b5819K1095K5794J7748L156q471j4643j8876k0311j5300m783N559J2256J6899
670e696J8640J6829J0481N44j2092k1343k0915j2674m937j537M108J4498K1041
683F947J8783J0266K455n706j6196k3438k1180r956J286Q615J2805J5236J4882
696A4799J2603P137k246j1618j7009j7691j4645q947J661J4498K0534J7344R558
$$ y = [-44179, -23935, -4918, 9597, 26578, 44781, 51562, 41068, 20204, -3135, -27036, -44915, -49548, -38569, -17550, 6280, 26454, 37800, 38777, 34127, 23639, 4663, -21885, -43239, -49447, -41656, -26793, -7261, 16662, 36619, 43345, 37880, 25541, 10877, -7097, -26592, -42115, -45201, -33833, -10544, 15537, 34454, 42325, 40768, 30790, 13869, -6671, -23963, -33097, -36999, -35833, -25819, -4724, 21070, 38818, 41974, 33503, 18860, -16, -20327, -35627, -40410, -34851, -22595, -5696, 12944, 29773, 40254, 40798, 28706, 7363, -13552, -26226, -31163, -32700, -28592, -14094, 6947, 25730, 35996, 38451, 32745, 16549, -6889, -28069, -38025, -36739, -28124, -15319, -83, 14799, 27402, 34539, 32293, 20675, 3666, -14025, -28670, -37617, -35956, -21458, -924, 16420, 25978]
709B5978N586K489o002j6398k1035j6343p883P04P689J4762J8000J4850P635L07
723C0339o340j0514j3548j6293j4338p503N320J5830J9397J5730J1058M877n414
736B8601j3939j5816j1146p358o824l815O331J6378J9177J4362P313j959r102
749B2203j4186j6286j3865q148N94P694J0557J3197J4843J3138L079q484j4804
762I532j4217j1513r489l678M777J0404J3289J2679J0986P568jr529j7240j8098
776a4530j1494j750M220P431J0614J3766J2254O470j429o107r819j3822j4969
789a9165j0542n3Q467J2689J2578J0988Q343L462l719j0335j3850j3512r165m020
803b7834L528J0726J5231J3367P252J165k207m964r416j3810j3104o737J309P664
$$ y = [25978, 31564, 34053, 28051, 11653, -9382, -25725, -33608, -32904, -25215, -10453, 7547, 22397, 30032, 30339, 23999, 13485, -63, -16356, -30694, -38197, -32877, -17047, 2350, 18080, 29138, 34015, 28601, 14662, -1154, -12300, -19658, -26482, -30297, -23966, -7588, 11589, 25951, 33264, 31305, 22203, 8017, -8269, -22134, -30282, -29688, -21994, -11437, 1760, 16603, 29741, 32820, 24336, 9532, -4685, -16198, -25687, -29365, -24588, -14184, -895, 11784, 22770, 30338, 30337, 20808, 3568, -14530, -26024, -27774, -23554, -16123, -5509, 8257, 20511, 26981, 25552, 19445, 9626, -4196, -19165, -29707, -29760, -21293, -8604, 3974, 14962, 23305, 26767, 23048, 12713, -1137, -14649, -23814, -27834, -24306, -13580, 1651, 15018, 22270, 23435, 21228, 16264, 6848, -6962, -20066, -26803, -25494, -17830]
817a7830J1478J4358J2253O185k795q240j0375j0036r325p409l298L565R827J3786
831B144J2869P949J526l790r627j2935j1661o514j134J611M807J0996J4354J0860
845B1455L667l078q064j1237j2092q715l480J032N437Q888J0659R385P381K633
859B3871m261j1918j4123r967m638j87L847Q265J1788R631N869K713j426o715
873A2749j1484j2443q529k958L494Q537J0227Q810P157M728n18n703r939j0219
887f091r142o028p49O401J1397J1231P277L632L52l179p461r513r941p095k165
902b1074L567P928J1092J0731O965J184n122p149p488p714p593m959R22O467R852
917b391J0284P994L945j197o568r927r212o280l115p26K722O952J0576R848N700
$$ y = [-17830, -6352, 8006, 20259, 26444, 23649, 15409, 5034, -5002, -14327, -21736, -25034, -21469, -11642, 2144, 15013, 22962, 24488, 20698, 11071, -1864, -13525, -20039, -21173, -19562, -14755, -3759, 10595, 21455, 25122, 22044, 13980, 2743, -9349, -18064, -21544, -20512, -15075, -6187, 4472, 13857, 21238, 23871, 19610, 7692, -6431, -16398, -21036, -21223, -17376, -9111, 2677, 12308, 18177, 20890, 19464, 12749, 1265, -11178, -19707, -22665, -19171, -10634, -407, 8403, 15560, 20288, 19770, 14067, 4128, -6091, -15233, -21261, -22010, -15609, -4212, 7019, 14296, 17928, 18280, 15101, 7640, -1873, -11814, -18909, -21074, -17507, -9579, 1513, 12244, 19209, 20393, 15271, 8122, 634, -7080, -14673, -19632, -18710, -12243, -2391, 7893, 15887, 19832, 18635, 12067, 2140, -7072, -13352, -16467, -17193, -14471, -7519, 3057, 12905, 18605]
932A8605k0m313p949r670q655n034j18L761N647O863Q797P598L870k066p577r885
948a46q913n840k442J782N921Q052P922N524L812R56l404q276j0388q774l536
963a7750J298M908O932P916P546M197N38k923n691p418q548o748k420L340Q102
978f721Q728P015M375J965j460n040p508p544o057l738K69M877Q349R390O592
993A3492K049k054m115n684o992o791m700n17L369O366Q107P582N148L55m128
1008A1487p013p016n524m145j949J322M757P656P923N624K367j941n322q180p430
1023g384m582j455J421L327N324P351O755L602Q9m196o922p710n853l536K80L879
1039i610N755O107N658L889J886j501n337q186p146m947l99K757N372O129N847
$$ y = [18605, 18585, 14272, 6323, -3347, -12002, -17036, -17154, -13393, -7746, -883, 7914, 15512, 19382, 17316, 9739, -146, -9059, -14899, -17341, -15559, -9638, -1586, 6336, 11860, 15672, 16628, 13224, 4948, -5440, -14214, -17750, -16452, -11544, -4612, 3304, 10850, 15047, 15585, 12662, 6971, -447, -8995, -15743, -18163, -14823, -6721, 2007, 9022, 13397, 15362, 13902, 8862, 1354, -6190, -12247, -15985, -15716, -10839, -2490, 6900, 13492, 15541, 13487, 9372, 3688, -3304, -10095, -14795, -15312, -11943, -5577, 2530, 10112, 15260, 15615, 11487, 4474, -2542, -8066, -12211, -14160, -12838, -8081, -425, 7498, 13122, 15489, 13548, 8226, 46, -7384, -11966, -13421, -12000, -8673, -3349, 4002, 10757, 14359, 14448, 10252, 3330, -4380, -10233, -13769, -13489, -9610, -3855, 2252, 7910, 11799, 13685, 12184, 6847, -1339, -8485, -13432, -13831, -11074, -5702, 427, 6274]
1054F274M269J982j303l175o024o853o106l265J525N029O509O159M606K491r5
1069A2023l209n387n791n692m044j207K727O139P190O141L081j97k587m288n416
1084e17n718m740j766J943M129N824O947N368J670k727m394n673m956m242k307
1099a1159K19K904N179O583N201L153m15k856n804p147m612j796K32J902L770
1114d646N451N865L880J237k183m664o096n976l327o78K255M322M626M434L949
1129H449K523K02l992n968n830m134k154Q82L427N244N468L065K381J28k005m076
1145C610n546n905l339K47L032M394N051M825L325M39k458l605l987m411m329
1160h657k496J724M583N263N079L349J108j508k835m247m803l855k100J51K202
$$ y = [6274, 10543, 12525, 11222, 8047, 2023, -4830, -10936, -14201, -12676, -7647, -1138, 5021, 9627, 12118, 12023, 8814, 3427, -2364, -8056, -12100, -13307, -10580, -4441, 2749, 8890, 11971, 11774, 9187, 4899, -517, -6235, -10975, -12741, -10798, -6669, -845, 6102, 11470, 13140, 10413, 6019, 346, -4610, -8852, -11159, -10940, -8036, -2857, 3726, 8927, 12080, 11665, 8809, 3005, -4142, -8754, -10550, -10318, -8416, -4646, 805, 6670, 10550, 11787, 9604, 4940, -1156, -7132, -10459, -11137, -8882, -4560, 66, 4500, 8449, 10972, 11174, 7182, 1214, -4616, -8750, -10904, -10022, -6595, -1351, 4117, 7182, 9563, 9691, 7686, 3610, -1936, -7841, -11180, -10933, -7901, -3507, 1544, 6369, 9694, 10133, 7675, 4070, 83, -4328, -8657, -11153, -9429, -4846, 417, 5496, 8845, 9953, 8445, 5610, 1363, -3440, -7295, -9395, -9244, -7042]
1175g042M318N801N089J796j358k635l443m506m292k244l45J203L047N356N170
1190E915L284R20k061l829n729m081j939l47N05K097M620N082K558J574M22k583
1206F408n377n671k644j242M20K531M003L816K731K594J541k168m532m574l173
1221e337k701j245K234M679M180K759K122J538p36l230m222m090l606j445J676
1236g424L876L827L362K904J807j612k881k833k656m028l214O37K998L827L252
1251A842L689K287o19k282k782l214l714k526j74R74L009M035M579K937m15k481
1267E145j905k767l879k786n35M52J527L581M293L408J340j102k482l915l603
1282c228k179q33k4J160L052L854L045J642N54r16l504m393l272j295L91O89K633
$$ y = [-7042, -2724, 3077, 8166, 9962, 8604, 5969, 2526, -1980, -6272, -8516, -8861, -7658, -4611, 745, 5915, 9199, 10119, 8058, 4229, -1500, -5581, -7520, -7867, -7362, -5265, -645, 4437, 6995, 8569, 8991, 6408, 1031, -4640, -7284, -8526, -8106, -5575, -1572, 2244, 4975, 7569, 9110, 6942, 2410, -2164, -5337, -8038, -9283, -7049, -2370, 1810, 4569, 6691, 8229, 7493, 4263, 41, -4049, -7655, -9100, -7424, -3548, 279, 3641, 6545, 8352, 6740, 3859, 1026, -1630, -5658, -8872, -8235, -5237, -1410, 1842, 5531, 7818, 7199, 4917, 2135, -1079, -4793, -7319, -7493, -6519, -3510, 525, 5104, 8041, 7626, 5145, 3240, 473, -3406, -6192, -6727, -6275, -4748, -1167, 3126, 6534, 7874, 6772, 4290, 375, -3228, -5407, -6240, -6264, -5104, -2052, 1802, 4847, 6489, 7043, 6127, 2623, -1770, -5042, -6337, -5946, -5257, -2624]
1299b624K989L270K036J215p97k878l766k986k612q66J116K870L251K486J391
1314D095J692L04j730l218l302k625j626k62K085L233L404L152N43k48j448j828
1330B221k732k976k350k94J326K513K810K723K454L35j423k127k278k801k723
1345e322q85Q18J635K896L423K830K68r94j277k250l081k441p56L5J042J678L690
1362A309K976J318Rj342k639l298k288o93j81K90J954L239K192J367J105kk419
1379B897l515k532j320k53K71J662K269K532J568J384M58j538l069k779j836j519
1395e320K22K032K711J832J258J406R78j340k053k220k287k102q25J522K492K687
1411I93J725J378Q89j285j708j722j952k712r95J230J808J761K437K102Q88n31
$$ y = [-2624, 365, 3635, 5671, 6886, 6089, 3211, -555, -3541, -6153, -7019, -5903, -3033, 218, 2704, 4095, 5787, 6091, 4361, 1143, -2159, -4784, -6410, -6672, -4587, -1354, 2050, 5202, 5745, 5497, 4049, 2221, -511, -3487, -5837, -6131, -4805, -2292, 518, 3241, 5695, 6030, 4607, 2480, 202, -2599, -5322, -6207, -5389, -3754, -858, 2565, 5395, 5663, 4669, 3392, 1142, -1939, -4380, -5136, -5101, -4059, -2381, 1309, 4285, 5603, 5612, 4270, 1631, -1667, -3955, -4648, -4829, -4539, -2585, 654, 2846, 4213, 5318, 5316, 2897, -618, -3150, -4470, -4723, -4452, -2790, -521, 2011, 3579, 4963, 5421, 3883, 814, -1965, -3801, -5320, -5098, -3066, -355, 1477, 2735, 4141, 5119, 3779, 1726, -494, -2781, -4883, -5708, -4186, -1694, 993, 2718, 4096, 4985, 3700, 1992, 270, -1682, -4394, -5389, -4159, -2351, -590, 1847, 3949, 4837, 4306]
1427D306k011j450k106j764j408j46J185K027K659K397Q88m86r51j865j985k241
1443b951j343K71N08J290K186K645J553L24j151j270k109k072j601n71L34J547
1459b410J911K148J496R73L24j511k441k243j268p50M42J97K010K227J660J182
1475C947R2l97j864k562k067j404K54P84J850J354J848J346J016p14j381j804
1491B98j707j808j002N73J292K154K135J295J70L63j178j642j778j995j076j65
1507d071J081J992J860J715R69k14r53j121j696j445j667j20L80J314K140J808
1523A972J602J32l03j381j903j857r25p07o7Q92J735K078J743O21k32r10j774
1540G16k025j141p45J8O00J409J295J737J741J44o72j715j846j714o88l86M62
$$ y = [4306, 2295, 845, -1261, -3025, -4433, -4579, -3394, -1367, 1292, 3689, 4577, 4091, 3140, 1275, -710, -2951, -4294, -4023, -3515, -2225, -39, 2606, 4159, 4483, 3332, 2062, -47, -2119, -3720, -4291, -3957, -2410, -499, 1649, 3145, 4118, 4442, 2931, 490, -1753, -3021, -3771, -3329, -3132, -1122, 1105, 2765, 3947, 4039, 3642, 1778, -784, -2851, -4255, -4001, -3217, -1367, -13, 1835, 3181, 4197, 3483, 2102, 298, -1409, -3217, -4219, -3646, -2354, -200, 1935, 3230, 3400, 3763, 2585, 943, -835, -2830, -3906, -4071, -2990, -998, 862, 2577, 3546, 3332, 2379, 1258, -438, -1883, -3550, -3670, -3290, -1976, 164, 1972, 3574, 3706, 3403, 2022, 119, -1738, -2663, -3370, -3437, -2545, -810, 1268, 3011, 3632, 3400, 2490, 716, -1309, -2450, -3195, -3177, -2577, -1168, 127, 1864, 3605, 3749, 3077, 1362, -484, -2198, -2886, -3272, -2810]
1557b810J200J444J789R83R30k42j071k087j441j713m46K15J380J384J660J244
1573B419P45m8p06j496j552j867q77n1P81J782J270J314J002N16o94j112j501
1590g5j733j088n75M20J589J397J742J138L25m00r49j117j593j522o74p9R42J527
1608g25J643J292R45j95j080j061j688r49q15j51J42J183K014J203J297J44p19
1625B480r87j819j313o95m63K72R33J147J491J600O29o01o42j876j404j162k36
1642b646mO15J232J306J190Q13K01j70j747j555j343p56R4Q85Q22J302J309O58
1660B206M13M5r81j596j600j194l79M71J461J060R88J065N35j74l66j347j401
1677g94j040p46o4O72J357J246J174O71j57l18j106r12j457q82k95L91J134J173
$$ y = [-2810, -1610, -166, 1623, 2606, 3536, 3294, 2223, 136, -1305, -3018, -3464, -3249, -1869, -485, 1175, 2419, 3164, 3116, 2410, 914, -638, -2505, -3382, -3433, -2652, -870, 400, 1714, 2716, 3232, 2538, 1426, -75, -1808, -2896, -3471, -3051, -1462, -65, 1677, 2815, 3140, 2740, 1791, 674, -919, -2441, -3115, -3194, -2252, -725, 918, 2210, 3155, 2960, 1880, 819, -869, -1818, -2633, -2784, -2642, -1459, 555, 1758, 3055, 3199, 2480, 1493, -326, -1639, -2334, -2797, -2525, -1592, -445, 1046, 2646, 3275, 2674, 2032, 156, -1248, -2410, -2646, -2650, -2035, -803, 503, 1693, 2506, 2707, 2537, 790, -765, -2108, -2864, -2770, -1885, -1063, 239, 1548, 2206, 2619, 2664, 1683, 87, -1513, -2707, -3086, -2615, -1154, -94, 894, 1959, 2494, 2320, 1954, 607, -794, -1834, -2580, -2644, -1972, -615, 631, 1805, 2476, 2319, 2001, 895, -17, -1474, -2356, -2651, -2260, -1126, 47]
1695D7J655N89Nj03j173j247o74r07p04J12Q33J282J071J074Q41l08p49j448q87
1714f91r63n49k23O77R87J244R40P78L54j65j371j536j159m47k14O45M71J191
1732c1R25J074P88k71r69j558j169o58m32K73R91O32J040P57Q61k63P3q92j624
1751d53j155q89L29K99J080J089J035L59M22m11o06q45j308r10k77K44R94Q87
1769a16J306R85J82p14k17r98r58j166n29MP23R37J184J244K84l57n25p23r52
1788d06p31o23l88M19P71J191J217M29K56m41q97p90j033m82l33j8L89J110J173
1807H13O81M96j79n89j081j056q36j24O9L62Q54J047Q99O58q6l90r84p91q34q57
1827a928l24O99R68Q75P90P85K41l41m44j247j017o66j58J4P75R36J177L20J49
$$ y = [47, 1702, 2291, 2296, 2193, 1020, -227, -901, -1808, -2512, -2400, -1567, -285, 786, 1860, 2701, 2393, 1644, 196, -691, -1654, -2203, -2426, -1749, -762, 482, 1422, 2200, 2554, 2389, 1018, -518, -1677, -2124, -2338, -1693, -1222, -31, 894, 1968, 2756, 2485, 1516, -42, -1211, -1869, -2301, -2028, -1037, -405, 635, 1392, 2253, 1990, 2063, 1171, -453, -1608, -2497, -2168, -1869, -789, 300, 1335, 1694, 2116, 1705, 1099, 254, -1054, -1964, -2241, -1997, -1003, -116, 1190, 2175, 2357, 1643, 1426, 428, -530, -1696, -2225, -2221, -1498, -561, 623, 1867, 2151, 1794, 1269, 546, -406, -1137, -1760, -2148, -1729, -958, 233, 1450, 1879, 2135, 1694, 797, 7, -1026, -1508, -1841, -1859, -1470, -360, 813, 1494, 1990, 1811, 1222, 141, -915, -1751, -1875, -1806, -1444, -590, 457, 1356, 2014, 1928, 1538, 554, -237, -1071, -1928, -2252, -1553, -585, 290, 1080, 1865, 2106, 1765, 1321, 74, -943, -1609, -1767, -1753, -978, -42, 1135, 1455, 1604]
1846A604J25n60q43j011o87o02j64O88R97R58Q06M95j55j81p81r05n85q25j40
1865a766JJ028Q32J053M33L91l88o37j203n30o77j80k89O24J029Q60Q85K33R1
1884A790n99j040m16p37p09L37k9P65J151L86P86L28o17o28q12r61o13j20L03
1903a435P08P72P06O40M96k21o21j016r33m10k89J17O87P68L07O12Q47k32m01
1922A102n30o96j023p96M23L83L34Q89R53M54K86k82r98k47j168n91l26L86P78
1941f69M60J152L64l7R7m24n69o64q80o15N2L09R67Q99N06M77j38m85l24q44o62
1962a028j28k10ON86O93J166N09J63k59o45o91p88n60k00J0M20N97J180O21M3
1982A485K23q36p02p65m17j72n05O90N19Q64M52N61J51k49p73q18p68n62K15K20
$$ y = [1604, 1729, 1169, 326, -685, -1372, -1974, -2138, -1450, -453, 505, 1311, 1806, 1651, 1470, 689, -216, -801, -1626, -1766, -1765, -737, 95, 1148, 1581, 1972, 1584, 947, -256, -786, -1463, -1643, -1932, -1308, -279, 581, 1466, 1699, 1790, 1191, 151, -265, -1002, -1711, -1374, -1403, -638, 513, 899, 1685, 2013, 1396, 768, -44, -1005, -1618, -1738, -1435, -727, 45, 751, 1391, 1887, 1666, 1045, 29, -904, -1314, -1603, -1486, -799, -31, 276, 888, 1735, 1503, 1102, 572, -124, -1147, -1943, -1520, -1137, -803, 86, 1039, 1493, 1779, 1497, 499, 252, -916, -1507, -1833, -1447, -669, -209, 943, 1307, 1270, 1367, 943, 374, -290, -1170, -1785, -1733, -1424, -457, 442, 948, 1425, 1287, 802, 478, -366, -1028, -1156, -1366, -1360, -774, -81, 1085, 1594, 1757, 1498, 853, 162, -626, -1186, -1386, -1376, -956, -359, 821, 1442, 1485, 1708, 872, 170, -595, -1012, -1184, -1689, -999, -480, 384, 836, 1397, 1548, 1299, 526, -292, -1060, -1622, -1407, -1187]
2002a187M17R18P40K73L96j99k75j021j024k56n15K97O82N84O07M76L09K39l69
2021A092p13p00p74m61P9K33Q87O17O76L49J80j87p49m57p15p73j35K3O70Q77
2041A9P31M29L76k61m85o97n04n10m09J08N11M91M65Q24J52J42l14q52m24q75
2061a083l68J51K04M68R34M37O73Pj21p39p08l38q05m3K38K16O86P96L04L40M4
2082A293l08q53p48m48m18R6P47N29M74M26M77q1l11m15p60n65m79r6L97O06O57
2103B20M74M43N1n0l36o17q88m59k65L9P34L51O35P63L0J34l12p88l67q08k88
2124a304l6M26N04Q39M15N29J5p40k02o78p98K8k37k64J068K84R81N66J05m95
2144A006n4p54q62m42nL3L0R10N24M46M10o5l77n00m92q36j06j70M68N24M11N78
$$ y = [-1187, -770, 148, 888, 1161, 1557, 1358, 1083, 62, -962, -1218, -1733, -1436, -754, -170, 437, 913, 1222, 1461, 1092, 379, -321, -1095, -1556, -1477, -1244, -357, 260, 936, 1285, 1465, 1278, 529, 72, -643, -1416, -1551, -1528, -858, 19, 750, 1179, 1555, 1294, 809, 112, -392, -902, -1311, -1203, -692, -201, 264, 1088, 1240, 1382, 1068, 216, -208, -1083, -1451, -1300, -1096, -628, 306, 743, 1416, 1423, 1302, 563, -145, -483, -1288, -1331, -1093, -877, -191, 605, 909, 1249, 1293, 985, 132, -616, -1064, -1482, -1386, -639, -110, 364, 790, 1267, 1186, 875, 460, -300, -865, -1344, -1440, -1043, -437, 220, 694, 1137, 1188, 1138, 802, 185, -703, -1162, -1427, -1388, -654, -303, 332, 1095, 1125, 1259, 947, 159, -208, -1016, -1304, -1340, -914, -410, 429, 844, 1373, 1388, 648, 446, -232, -1030, -1002, -1239, -1503, -435, -151, 830, 1396, 1501, 1006, 952, 198, -664, -1106, -1111, -1078, -1048, -138, 386, 832, 1242, 1177, 800, 300, -192, -1028, -1134, -1304, -836, -312, 99, 677]
2166F77M33K15l10m41q59n30k05k96P0O41M62P56M35L61J8p22n34o61n31q0j98
2187a299O11K76Q75M38K83j35J32r45m93n96l82j66M37M73Q07M41L08Jk67r6o89
2208A4o08k65n83K53M44O99N79Q62m09m5j86o32m54n58m04J17J46N09Q49L81O00
2229A309k8l36n20o46n29m01q8J40M86O10O47M40J42j79l22o08p72k06k89%L57
2250g93M03Q91K30L64K42o21m41r27M3o72J37L86L10N81O46L56K17K3q67l39q03
2271f34m12k76M03K74O25N17M91N0L2m77p77j46o67l34J47M30N01N51O73qQn1
2293I20n25m39p29k17j57M4O44R40L01J60J17l3n17p42m41l87k44N6P22N33P18
2314G24P3L80j2p10m47l67o03q6j12L93J77J022N17K34k20n45k20l91m16m15n6
$$ y = [677, 1110, 1325, 1015, 574, -285, -815, -1020, -1316, -1246, -605, -143, 613, 1048, 1409, 1427, 705, 171, -490, -1021, -1101, -1299, -688, -412, 463, 901, 1184, 1049, 1181, 236, -257, -853, -1235, -1401, -964, -491, 316, 757, 1065, 1066, 799, 703, 14, -594, -859, -1442, -1189, -745, -46, 533, 1395, 986, 941, 755, 123, -331, -889, -1293, -1176, -1030, -521, 328, 709, 1309, 1281, 945, 425, -221, -750, -1151, -1239, -1099, -613, -3, 644, 1084, 1226, 1047, 725, 117, -655, -861, -1150, -1150, -793, -390, 501, 731, 1095, 1337, 716, 275, -652, -609, -1281, -1144, -758, -448, 133, 779, 1135, 1352, 1375, 508, 169, -634, -1046, -1322, -919, -645, -20, 497, 988, 1038, 1070, 593, -184, -330, -997, -1331, -1184, -754, -253, 298, 971, 963, 971, 920, 395, -44, -773, -990, -1147, -1103, -459, 481, 782, 942, 1059, 1026, 509, -233, -674, -1061, -1305, -1249, -527, 6, 724, 797, 1177, 1165, 455, 8, -359, -962, -1048, -1160, -767, -590, 432, 949, 1183, 963, 418, 198, -193, -609, -1024, -1080]
2335a080J85M50L80R07R7O34m89n62m83m95m20k44K05M23M95K34P37K28n2l81
2355G69m70p06l87k05j33L84L36Q16K35M84k1j12p02o75j86p04k28O03O25K55
2375b2P07O69j64l44l21k17j034k36m42M06J66J046N20L49J00k32k48n26m01m26
2395f50m58j93P66M41K96P42K19j64j41l13o64o08l06J9J04K07N28R30N68j89
2415A134j01n58n35l71k81m98J60K53M44M51Q82M04j72l08q67m49n11j98J23J08
2435h90N67N22M51M32J73k61n46n86l30p41J56K60M73L87P09P3K02l14K2o08n46
2456c95o89J23L6K37N27N10L44J75J77m69m38m93k09m71p8J91M78K91R18M00k09
2477I56j31j83o52o23k06m48M22K30R57K92M68J67l46k68n68k40o09m3R8rM52
$$ y = [-1080, -895, -445, -65, 842, 939, 1573, 1084, 522, 39, -456, -876, -1120, -915, -492, 3, 237, 974, 1202, 1150, 769, 299, -407, -794, -999, -1132, -748, -412, 404, 639, 1123, 1102, 990, 288, -387, -573, -1277, -1505, -902, -277, -22, 685, 1354, 1190, 846, 525, 308, -726, -962, -1404, -998, -832, 214, 734, 1083, 1183, 951, 703, 177, -224, -650, -1108, -1301, -535, -94, 202, 944, 1163, 999, 858, 545, -119, -727, -1033, -1014, -910, -703, -175, 755, 1323, 1134, 1033, 475, -60, -431, -712, -1210, -1050, -797, -353, 98, 980, 1384, 1212, 904, 37, -412, -923, -1121, -998, -890, -323, 199, 650, 1082, 1255, 994, 448, -138, -468, -1209, -1053, -793, -320, 67, 776, 849, 1051, 737, 759, 151, -395, -1084, -961, -925, -688, -161, 349, 693, 868, 1045, 576, 138, -355, -564, -1035, -1113, -922, -444, -153, 765, 1165, 956, 825, 642, -10, -633, -839, -1287, -865, -635, 322, 614, 1082, 1249, 903, 635, 67, -173, -782, -825, -727, -736, -284]
2498b84K31P26L28M9l17l87o68o61K61k88J1M63P21N17K97P5k03l33m12r92r6
2519i62o6l9K96O98O55L35J93J79n60o20o63j96k45j10L62O45L44L88N42N6n73
2540F59m36m97o08l13L18M5O26L26L62L93r1m7n5m52q43m49m2J70M81M79N69N57
2562A152j46K1l27n43l64p24k53P3L93O99M17K78PM26m22m23m16p07J13j82K2
2583i06O70J82O80j85P12j54m38q84l26j68L1j80L64M96O41L45J45j11k12o00
2603A02o03l55o1j61L09O97N65L10L57j0m09k33o98m84j51o3K39J29O19M12K36
2624G47K78j18o45l27m80l30p9j51M44O82L69P02N5k10k56l98n83m16k64J59L88
2645d33J43O05N14j6J68l50m76q5q04j04k46K66M40K57P06K47J33m16m64Mm45
$$ y = [-284, -53, 673, 1001, 1050, 733, 346, -322, -983, -722, -1010, -999, -536, 185, 702, 999, 1074, 871, 538, 126, -866, -962, -1028, -1067, -771, -73, 582, 917, 1110, 1289, 729, 109, -554, -750, -995, -1105, -743, -98, 246, 634, 1176, 1232, 659, 223, -274, -882, -1195, -877, -832, -206, 120, 482, 875, 784, 737, 682, 230, -613, -1062, -1104, -934, -453, 26, 595, 1152, 1006, 1027, 700, 157, -207, -931, -1184, -1111, -718, -19, 398, 676, 683, 1109, 687, 264, -152, -859, -746, -928, -906, -236, -54, 626, 441, 1153, 999, 561, -323, -649, -817, -786, -966, -602, -106, 535, 880, 1025, 914, 702, 102, -501, -856, -917, -1078, -769, -72, 493, 803, 1160, 1150, 741, 508, -190, -674, -825, -888, -649, -520, 99, 511, 747, 1025, 907, 262, -65, -545, -875, -954, -1105, -661, 21, 390, 1092, 1147, 937, 681, 283, -300, -716, -980, -821, -433, -290, 315, 829, 813, 981, 631, 155, 70, -734, -838, -1084, -818, -378, -121, 585, 832, 965, 549, 85, 89, -356]
2666c56m78j31J35J46N91M34L94L99l26j97p22j10j71k81j48K03N12L31M20J99
2686H44K67k51o38m96k51j94j79J91K54Q06J63L60j86Q6l38n49n2p50J90J54r4
2707f63N42M21L18L90j20k54l64o03m65n4j91K12N33P91PM09j9j44o01k46n89
2728f90m11K79o6O00M67O68N3j37p5j57n11n16k49q5j96N04N66M79J89K69K1o26
2750C76l63k24m53k12k54M91M92L15M19M62j68k00n36n06M9m25j83J67J15M54
2770a84P61J75N4J05n08l38m07l95j90K22L06L42J0P65R1J34m5p78k91p55J12
2791h14J8M80J51O38R0l9K54k80k47l61l14l69J76l4N11J70O91R6j67R9l61l09
2813G9k39n68k05N1N12N31K33R5K76J22l32j84n45l97r2n4K81P3Q31K62L1P4l30
$$ y = [-356, -834, -965, -830, -684, -93, 341, 735, 1134, 808, 611, -111, -221, -392, -673, -821, -618, -106, 225, 645, 844, 1111, 860, 222, -274, -525, -719, -898, -707, -453, 353, 516, 876, 690, 776, 438, -111, -163, -913, -723, -569, -663, -121, 300, 618, 1008, 888, 634, 270, -333, -798, -852, -1043, -831, -298, 493, 500, 909, 890, 746, 145, -101, -690, -1101, -822, -888, -288, 179, 847, 900, 763, 688, 531, 20, -496, -745, -830, -1026, -522, 44, 523, 712, 981, 1002, 376, 13, -211, -664, -876, -1130, -639, -147, 168, 587, 1049, 881, 681, 145, -361, -312, -737, -920, -753, -638, -184, 577, 752, 806, 911, 403, 65, -342, -737, -927, -705, -399, -57, -47, 718, 809, 943, 898, 120, -171, -926, -814, -796, -316, -165, 473, 563, 524, 778, 498, 251, -110, -424, -793, -617, -651, -140, 30, 721, 817, 650, 749, 388, 79, -160, -728, -933, -882, -370, 161, 394, 489, 765, 887, 555, 371, -174, -571, -663, -717, -436, -363, 468, 730, 761, 835, 505]
2836E05l71j58l80n05J76N8J89N54L72K97J43l74j72m36j70l08k90j9J20O18N61
2857D10K08L16k18jp30l58l57k6JL75L75Q4L05K67J44k46m32l17l39l95K40L7
2879f57L81M12K09K28R5J32m00k89m65m39o3L8L23M92M64L25nJ4j71l16l00m93
2901d85j81j15J14L17N85J81K65K5k61j97m9n85k28k97L30K74N17M67l39N60k13
2922F85k09m91k80l02j69J1K72L60M53J04M34r4l43l88n12r5m2J8J16J06N88M09
2944F31J61J5l02l40o61l9k50R6J79J77M84J47L16Q3l0j91m76k09k25k50j43M31
2966c96M34L59JL55j70n2n42m91r9l11l4M45N61L26rJ52j37P1l39q8l40m68J66
2989f06j36L71O37L19L10k19K0m36k30j70l21n03N33m7N22M15L14R6l7l83m34
$$ y = [505, 134, -24, -404, -909, -733, -675, -486, 68, 440, 737, 880, 506, 334, -102, -272, -580, -870, -889, -769, -151, 410, 618, 934, 716, 715, -15, -373, -730, -756, -755, -380, -5, 79, 384, 651, 795, 549, 117, -200, -539, -934, -694, -657, -276, 136, 345, 573, 668, 800, 400, 111, -354, -793, -856, -818, -495, -3, 461, 786, 781, 795, 624, 308, 8, -485, -666, -781, -667, -350, 235, 416, 681, 706, 445, 248, 199, -386, -614, -911, -581, -307, 210, 677, 338, 898, 685, 476, -15, -295, -597, -766, -755, -483, -123, 330, 434, 868, 774, 431, 43, -469, -564, -606, -588, -472, -366, 222, 631, 792, 807, 505, 165, -496, -535, -785, -689, -510, -333, 151, 298, 614, 697, 667, 476, 0, -209, -434, -684, -827, -396, 38, 397, 398, 753, 583, 531, -11, -502, -601, -912, -946, -501, 60, 386, 377, 529, 392, 463, 124, 36, -304, -772, -606, -742, -371, 266, 585, 895, 676, 696, 260, 30, -140, -461, -964, -431, -478, 44, 459, 773, 869, 832, 449, 15]
3010A5m24k24k2k3L56L38K86J35K18r9k83o9l09k06j23j96p6N1O34M24L2K01j46
3033D90M3o56j43j15k30OJ74K60L63M8L56p9n1l97k30k18j22r7K51K54O01j06
3055D02K33J31l20j23l55m84J31l10K90N15j03N22m8R0N2n19k43l35q0j40MK51
3077d39M41L03M05j75J84k45n03l01l06j68J64J08N32K98J79J34k96L96n97k20
3097a06k35j59k17K70L17J62N86J30j38J1l56l63l73Q8j71j11M25J49O16q9j22
3118C14K12k9l90m65mj26j6j55L88N56L2K57J77k04k37p54j3m8q8K36K03K54K22
3141C22R8J29P7l91j58l72m39j03K53K32L73M79k57K99L8j89j07n41j62j98J2
3162f05K18M84J99K01J26j14L4k70j87l69k70j49J62M52K88L27q9N7j4j62n50
$$ y = [15, -409, -633, -655, -678, -322, 16, 302, 437, 655, 556, 273, 204, -105, -311, -434, -630, -706, -655, -21, 403, 435, 636, 490, 533, -123, -266, -381, -611, -605, -431, -171, 192, 240, 596, 517, 466, 69, -161, -379, -501, -598, -347, -93, 508, 402, 635, 766, 446, 323, -32, -516, -385, -695, -405, 110, 7, 529, 481, 571, 623, 104, -139, -474, -554, -694, -690, -439, 2, 305, 710, 535, 719, 474, -29, -330, -636, -804, -640, -532, 0, 298, 477, 611, 315, 711, 114, -106, -341, -500, -717, -447, -130, 32, 618, 748, 610, 621, 265, -98, -471, -383, -554, -665, -240, -91, 525, 436, 314, 526, 497, 107, -358, -362, -488, -504, -659, -271, 285, 317, 574, 751, 547, 310, -444, -457, -505, -593, -357, -154, 100, 322, 420, 549, 626, 235, 77, -295, -734, -837, -584, -352, 21, 500, 243, 542, 580, 391, 284, -257, -419, -617, -605, -387, 97, 296, 497, 623, 509, 543, 273, 86, -283, -553, -702, -540, -88, 200, 527, 438, 495, 481, 319, -231]
3183b31J11m22p5L2M92N2M79R5j14L7j31j04m52l26L74j77QL41J60K91J63J39
3205G42k73k78k09j67k48p0p8K32M13L09K37p6k10j86j40j37m04j03K34j79N22
3226f9K54K73J11k09j50n4m98j37m8j82K14M29M69r3l6P5K47n93k16n59J24J03
3248e45q9M18L63K37L52k62l70K12m45k59r3J32o2r4K83L42K01J87k63Rl61j83
3270b90lj50k01K36L18N22j95J73L98n09j88k46k59r3O3j1J02K14L39K22L4L2
3292E08k21k98m20n9M0l0J5M02M63j5L10j72l32k6n70P0J26k99J32L73ON29k17
3315C15L14k43j71j89m54q1o8K14L65q9O0M43qJ6l22k5l58k10k91K73L02J41K63
3338A97L8K8J58j99k86j51m53R9K25k90M35L81K37R4N7j46n24L15m83j94J2r1
$$ y = [-231, -120, -542, -617, -585, -93, -41, 438, 533, 419, 456, 325, 221, -231, -557, -183, -360, -352, -11, 149, 440, 603, 742, 469, 191, -18, -185, -433, -503, -581, -349, 64, 373, 610, 534, 324, 138, -2, -139, -543, -646, -412, -591, -69, 185, 458, 569, 360, 210, 156, -342, -479, -527, -709, -495, -66, 403, 310, 274, 349, 596, 3, -213, -772, -648, -545, -634, -216, 147, 384, 736, 474, 104, 316, -129, -388, -481, -349, -411, -505, -222, 120, 321, 508, 245, 254, -107, -290, -293, -443, -644, -408, -90, 432, 237, 410, 808, 299, 111, -135, -394, -487, -424, -435, -333, -119, 220, 442, 476, 508, 287, -11, -431, -490, -450, -480, -465, -63, 400, 385, 695, 523, 191, 165, -405, -335, -209, -508, -376, -3, 3, 532, 315, 629, 386, 215, 26, -428, -509, -577, -363, 2, -87, -27, 416, 408, 424, 102, 77, -281, -491, -782, -509, -207, -66, 197, 235, 263, 421, 222, -64, -215, -668, -569, -344, -634, -199, 182, 419, 513, 570, 424, -100, 215, -268, -462, -450, -541]
3360e41K71L23K87M5Q2l43Pl33r4l30jL58m7N54q6K88J23K9k61l73j94k41Lj7
3384d91j11O33q0L56M3j55Mk10q1j84q6k2J86ML95j88M90qj81l95k2q7k94j68
3408f52L87k6M47M1M4J45j75j97k64L9j03R3j78R5L95M5m6L13k63J17j73l44L5
3431b25k93K54k48J34J75M62J51J23q7m71q7j94k51J65J68rJ39K39J47J9Q5l82
3453A4l1m4j13k4N9PJ11J61K59J83l45K60k57k90m51O9j40L82Q9J65J01M1P2M3
3477C21j46l32j55k12K30O2N6J23K09L7J13M1j15k63l90L92k95j64K28K27J77
3498A44K23K27l31O0j26m29kl33n1N31L6J7K39K0J6O5j47l79K40l79k6J58O3N1
3522a13o9K52K55j45j33j07r8k92J42r6j2K83K69O6J18K1j12l18r2j90k2O6m8
$$ y = [-541, -270, 53, 340, 385, 467, 124, 131, -202, -296, -626, -627, -269, -316, 238, 152, 440, 563, 592, 331, -42, -236, -477, -474, -491, -602, 31, -49, 307, 350, 195, 199, -11, -92, -276, -362, -384, -198, -194, 201, 13, 503, 495, 314, -81, -103, -190, -484, -652, -265, -291, 156, 197, 241, 386, 211, 14, -250, -211, -314, -221, -399, -304, 91, 136, 90, 403, 140, 257, 84, -260, -225, -518, -264, -512, -378, -203, 259, 410, 533, 446, -25, -112, -306, -557, -392, -224, -233, -94, 145, 292, 311, 396, 14, -17, -61, -174, -198, -139, -132, -21, 140, 399, 582, 237, 497, 240, -50, -501, -432, -572, -190, -101, 64, 165, 206, 278, 321, 175, -157, -312, -524, -294, -232, -176, -53, 156, 193, 306, 347, 232, -31, -421, -29, -324, -488, -260, -33, 144, 367, 594, 263, 323, 197, -232, -234, -567, -618, -87, -51, -34, 205, 225, 241, 306, 159, -220, 20, -359, -385, -227, -164, -113, -182, 70, 325, 180, 47, -60, -158, -450, -308, -404, -416, -133, 136, 202, 320, 341, 229, -89, -181, -371, -393, -327, -375]
3545c75P4L78J04K57n8j95P2m27J79k47j2j03J72L41P5j39J48m7N9l17j70r8K00
3568a29j46K7l4M07M3K19l3j43k12j85j4m74J84J84M04j81J96K34j45mK97k79
3590B16l76k2l56O3K24N62L6n7Q1j89m6k05k6n6j56jJ84K73n1J06l2J2j83L47
3614C48p40O2J39M4n2J96J76k9K63j16l14L37j55l82lj32L25j70L17K9J78k98
3636B3L08l85K5l54M1k35K72q7O37l17M47j9j45p9j91k14K07k68r1L09JK64l10
3659a61L54Q6j03j35j85K2j13l3J81l6K15j8O7J49P2l15j28m1k09N8p9O6Q4lO46
3684D41k23J3n2j30j98J6R5k77K1J17K99K57k25p2J13n4k20j07j7k65K00J80J84
3707I6J38J3j43q7N6J8l29k7J37p3R5j07L81O6Jj11m9j64k3o8p9J23j8jK91k6
$$ y = [-375, -301, 77, 181, 438, 380, 185, 257, -170, 9, -238, -250, -353, -181, 160, 235, 96, 244, 197, 256, -61, -231, -329, -129, -275, -248, -282, 125, 168, 387, 354, 211, -1, -186, -200, -674, -490, -306, 98, -83, 113, 347, 202, 198, 495, 216, -160, -182, -538, -475, -251, 311, 347, 290, 371, 182, 136, -69, -95, -151, -307, -308, -124, 149, 98, 204, 172, 184, 1, 348, -392, -330, -191, -147, -199, -3, 173, 144, 407, 291, -23, 314, 159, -223, -226, -358, -33, -203, 114, 143, 321, 23, 331, -54, -29, -383, -342, -577, -305, -392, 245, -72, 375, 356, 211, 132, -59, -273, -66, -334, -425, -116, -115, 149, -161, 193, 279, 176, 41, -144, -122, -235, -268, -87, -123, 92, 74, 141, 290, 362, 47, -81, -122, -331, -273, -352, -286, -202, -205, 441, 218, 231, 179, 49, -149, -133, -38, -315, -294, -177, 122, 379, 154, 82, 195, 141, -79, -186, -203, -468, -268, -88, 96, 234, 247, 104, 17, 73, 91, -238, -265, -128, -201, -106, -213, 168, 234, 235, 124, 75, -89, -112, -180, -259, -136, -154, -155, 136, 110]
3733A10P5l5J02l50J32k8j01Kk09P9L74m5K10k7R6k36k91J79j95o7K46M7m30N24
3757A62k69J71M03m33j97M42m28l9Q7n10L53L77j04K20L8j3r1k60j56K4l3L9K41
3780B4N6m9L51l27J75m38K59k08j33L00k27j01K73M29j03r0j29QL2j3k06p8l0
3803b25j94N47o6L4Q6j4q8l7n7P1j24P3k03M18k80j69O09j71K70m49L6m3K8k78
3827b26m7J64j09L61m6j4K46m27J43j41L5j77Q0j64N4K16L31L3j16o7k58N5j95
3850b69J04n2J00n3K63Q5J04k76m5j2J78j41k9l06M51n8k51M78j30K55k48J64
3872C12j95Q8k80j20K21k89Q0K85j02K61j94J90Nm41J04k35k3J07J26R7l7J23
3894H3J63l41K74k31J8j30k90L32M2J09J08R6J4o4p2Jo5j74J49k65L3N1J90n8
$$ y = [110, 185, 150, 252, -98, 34, 6, -95, -93, -302, -223, 151, 106, 316, 289, 385, 149, -142, 37, -158, -225, 21, 68, -362, 162, -107, 64, 467, 34, -163, 279, -149, -188, -101, -611, -258, 119, 15, 235, 273, 260, 169, -91, -247, -223, -256, -217, 24, 80, 31, 382, 55, 230, -208, 51, -157, -290, 10, -217, -318, -45, 384, 281, 191, 62, 70, 102, 89, -117, -195, -225, -419, 128, 62, 96, 182, 168, 80, 43, -14, 57, -67, 6, -197, 221, -59, -228, 381, 210, 480, 31, 67, 24, 52, -226, -273, -109, -218, 143, 97, 83, 329, -98, 45, -96, -61, -238, -158, -322, -268, -52, 279, 312, 196, 129, -129, -74, -269, -165, -217, -117, -170, 93, 178, 282, 6, -39, -51, 127, -14, -43, -349, 102, 44, -207, 271, 141, 396, 148, 312, 117, 205, -75, -195, 26, -263, -183, 102, 0, 261, 67, 257, 262, -179, -75, -310, -333, -226, -100, -3, -40, 83, 246, -95, 179, -52, -34, -164, -454, -122, -80, 29, 137, 233, 247, 183, 111, 112, 47, -127, 22, -243, -210, -159, 31, -27]
3918b7J82j1j48m7K4l9r3N5Q4j3J37k12J20L28k39Pl87Q7J62l18L68j33Pl7Q4
3943e9L82j17j60j74K34l34J7j67K99K02K2j00J9J5L07m47P2j79k2j79R6L66k54
3966a61J42L98l03k6j02j5J77Q5p82N60k5J54L6j38P6L3N7m59K64j87J4k39M71
3989C0k07m39M64R7M72l59m52K79O5P2j58K3j40J63K96j31P6J03m10L06j37q2
4011f9j7k71N22k25J93K7j55J85l05J88p8j77n8r1O9J61L03j80K70k34jm0r1k22
4035b96O3K19J23k42K40j33O1n4J09J94m69L61m39J74j96J97m2L2P4N1R5M7j42
4058B7j68L1n1r1Q4j81K44K4J51j6o7J08j32J5p4Q2J9j39K06J11k0J84k22j9l03
4083a97M6j0K5J31k78L63l44M4J68K16Kj94k58J86o2O2K51j98J47l00J23J48M0
$$ y = [-27, 155, 144, -4, -51, -27, -66, -159, -104, -20, -33, 104, -108, 12, 340, 101, 108, -279, -192, -30, -348, 20, -113, -106, -143, -59, 323, 206, 46, -128, 106, -228, -211, -378, -79, 123, 145, 45, 64, 79, 386, -61, 11, -168, -190, -369, -273, 93, -161, -19, 379, 76, 50, -52, -67, 110, 195, -587, -27, -52, 102, 138, 0, 76, 109, 166, -293, -29, -216, -202, -441, 30, -177, -616, -152, -55, 417, 58, -394, -115, -50, 22, -136, -113, -253, -90, 206, 75, 151, 254, -156, 150, 13, -69, -86, -357, 165, -60, 133, 160, 5, 190, -115, 73, -5, -182, -240, -331, -262, -101, 202, 22, 292, 58, 57, 17, -74, -296, -233, -14, 109, -133, 107, -26, 35, -19, 90, 284, -185, 176, -263, -89, -285, -88, -130, -98, -24, 27, 122, 169, 27, -141, -110, -161, -252, -168, -349, -105, -81, 70, 54, -13, 95, -37, -22, -96, -14, 5, -134, 72, 183, 163, 347, 125, 106, -197, -151, -161, -136, -5, -283, 80, -264, -220, -52, 164, 166, -28, -286, -100, -162, -100, 151, -47, 100, -200, -77, 71, 111]
4106A11j71J60j90N3j17kJ51n8M2M32j42j20j09R9j22k65J08J23k10J72M9J60
4128A54P6n9j40J16k22k2n8j80K86K78m9J24k30j99J10J95k20j63J93J33k00j61
4150b38K57R2J26k08J28l64K29j80l8RJ01L7l16L30K8J91k24J55J2j19k58K06
4172d4K7M9m0J00L6l3J38r6j14k48Q5O2n5J92j95M46m86K70J85p1j27j52ML28
4196B61n42J62M4O7N1k37L40j00L1n6J30l16%j52L19k73J64K5pM18J6l47J08j85
4220g9l8j02l8R4J26M95l97N5n4r9N5j04J7p9N7K6Q1K2kp8K38K5j31m4Q6l05K54
4247H1j80J14j74L05l9l06J98M5m3R8o7r2K19n90M80l9O0J65j10q4K64m84mK28
4271D5k34J25n2P4J46J01j86m2KJ81j88J09k31J89n4k23K02q3M55l48l2qJ04m8
$$ y = [111, -60, 100, -90, -37, -154, -156, -5, -63, -21, 411, 269, 149, 40, 139, 17, -248, -140, -17, -227, -55, -6, 154, 230, 171, 31, 147, -75, -97, -155, -335, -49, 229, 180, 304, 74, -125, -15, 180, -40, -203, -10, 123, -77, -238, 19, 111, 237, 29, 157, -207, 22, -158, -196, -187, -86, -49, -365, -35, -7, 184, -40, 115, 127, 8, -250, -44, -17, 32, -8, 92, 128, 95, 233, 137, 23, -225, -140, -78, -133, 59, -136, 310, -176, 94, 279, 208, 81, -71, -67, 261, -281, -119, -75, -8, 43, -194, 146, 46, 77, 21, 151, -165, -165, -317, 2, -271, -107, -82, -89, 329, 345, -2, 106, -79, -117, -219, -257, -163, -37, 458, 61, 116, 62, -37, 18, -86, -69, -148, -91, -65, 16, 38, 36, -42, 196, 221, 90, 46, 132, -173, 81, -99, 15, -159, 146, 107, -199, -1, 44, 1, 99, 32, -60, 159, -431, 49, 10, 70, 235, 125, 41, 305, -179, -183, 45, -189, -64, -116, -42, 104, 205, 19, -23, -21, 160, -28, 81, -150, 39, -15, -238, -36, -119, 336, -12, -44, -52, 52, 4]
4295Dk65M6N8nJ87j5P2k64K43j73P5J88p9Q7m10J08M10m66K03L2j90J98KJ1l9
4320A8p3J92m0k41L11j53j20K51j9n7k10J42r6m1j03J66o3J57k4R7L9R2l56o4
4344a95P2r8R1N7l7P6J19J9Lj59m3O9j10j8J44o7R6J77j86P6j96J11j17N8M6k18
4370b30K25N3J4J18j3k9R3j27k81L31l24JO7j21k5L39j58K61k60L5J51m03M49
4393A66m21K19q6K39l86L31K5J5j88k3J5P5o3j67J91J3O3q8J86J96k73K7q3M4
4417B7j68J69j71J62J32k8l4l80K16M6q1P3mJo1m4K06l0m7K21j11L0k69J94k7
4442B2m8Kj75N25o2j41J19k24k3L0J46l82J90k44J35K14m2J38k05r0J45j59O3
4465f6o4M44n35j2L48j12o9J74m0k33J33J7P6k36L1J70j59j44L0J85K93j07j89
$$ y = [4, -261, -215, -157, -162, 25, 10, 82, -182, 61, -112, -37, 151, 72, 159, -251, -143, 267, -199, 4, 36, -154, 44, 46, 57, 18, -55, 137, 97, -144, 167, 14, -106, 145, 126, 69, -141, 1, -95, -136, -239, -73, -136, 21, -3, 94, 133, 225, -131, -195, -123, -221, -130, -73, -110, -34, 85, 104, 107, -52, -95, -26, -136, -154, -10, -77, 19, 196, 10, 86, -110, 1, -116, -58, -12, -230, -5, 48, 62, 180, 167, 138, 231, 104, -177, 154, -170, -169, -102, -223, -248, 91, -67, 194, -66, -31, 120, -283, 166, -255, -36, -122, 117, -269, 62, 87, 102, -86, -109, -94, -19, -82, -249, -58, -45, 18, -70, 116, 312, 39, 66, -17, 27, -141, 28, -143, 19, 151, 123, 89, -291, -75, -29, -110, -37, -41, -40, -101, -145, 61, 31, -16, 205, 94, 124, -145, 49, 22, -26, -24, -199, 326, 264, 123, 242, 18, -5, 25, 171, -211, -21, -265, -130, 84, 42, 180, -25, -115, 30, -129, -66, -130, 314, -221, -233, 115, 3, -66, 108, 68, -165, -32, -15, 61, -175, -144, 26, -133, -277, -247, -62, 231, 124, -65]
4488f5j20L52Q1l73J11o4L5l4R7k22j13M49k05p6J04k8j58J65j00K28J8r7L9K12
4512B36m2j04k30J64J62j87J21l8l14J59J9K74j08j32J67q5l5J47l23K29j26n
4534e1L70j83q9O8m28L81j40p2L1oj8k1J63J35j96J9j72J52k36O2P5q5K74j41
4558a08m3K95p7k93K96j32J55J01k22pN4OM1o0O5j32m7J48P7l16J79q8K19r3J9
4583C7r8L44l38m3R6P8l2Ll24K64j70Q5n0K6J33j94J31m5o8L23l99K34lj17K25
4608I8k63N00m55p9J40P3K24l28j38K32r3k6N4L80j99k43J13j13q1M47k23q4J07
4631D3j12j38L7P4J02j7OK5l6j76K93j42L14m16R7K9r6j3J15O2j47p1J12J46m8
4656D3n5k43L63j47j27P2K93l55J48K60k29om6k2Q1m0Q5k04J03l3J10J01j02j99
$$ y = [-65, -185, 167, 248, -125, -14, -78, -43, -77, 20, -202, -315, 134, -71, -147, -43, -71, -229, -64, -164, 64, 82, -15, 24, 236, 194, 90, -140, 24, 186, -1, 120, 82, -232, -73, -54, 220, 112, -20, 147, 62, 27, 174, -149, 80, -46, -51, 319, 136, 47, 115, -313, 68, -72, -144, -113, -119, -137, -158, 5, 140, -56, -37, -209, -57, -293, -231, -156, -241, 33, -108, -151, 144, 67, -226, 70, -62, 93, 194, -28, -35, 19, 25, 66, 6, 71, -61, -108, 40, 117, -199, -20, -108, 111, 18, 37, -61, 283, -55, -98, -2, 76, 44, 47, -277, -13, -183, -98, -148, -122, 11, -183, -52, -97, -165, 158, -241, -7, -10, -127, 98, -165, 335, -120, -199, -59, 14, 238, -90, -228, 4, -89, -115, -61, 319, 120, -123, -10, -123, -204, 243, 20, -64, 43, -69, -207, -170, -96, 6, -11, -5, 20, -16, -192, 101, -41, 273, -143, -46, -17, -113, -126, -11, 51, -96, -167, -55, 91, 43, -12, -255, 108, -39, -166, -94, 199, -156, -8, 252, 23, 17, -29, -51, 30, -10, 75, -129, -26, -59, 51, 152, 50, -149]
4680a49Q2O8j46L07R5l7j06l23K70j26j23j10L13n6nJ8P0J73j51j22k00K33j63
4703a88K51j90J64o0J48p3l33L16K7k99K10j28lK9J83j73m1J95k23K54j32R0J12
4726A36j40N4J03p3J54j18k9Lk84J44p9K7J55j91L00j5l48N0O3J63J5j61K03j
4750A31k24%J10M0j70N3J71j85L24k79p8N0R1k07J14M5j1M1n2J55M6J3k88l3J53
4775A0j2j36L7K9J69j50r0J07J69j41q3L98m60J45R9k92K97J07p3l3q3j66j08
4798b60N8J81J61r5J32j55k5j73K34p7k60K62M4l36M63N4k37JQ7k40P5L2K29l5
4822A20J67l26K15j39J88k50J07K10m23J28K8p0l3k15K46o9q1N6N8Q5j18J67k5
4845B6j18K7K84M8m77M27k29J8q3M8j74O7m2K25J02k53lj10J70J32Q5j00j85K0
$$ y = [-149, -67, 1, -145, 162, 257, 220, 114, -209, 61, -65, -188, -298, 15, -41, -46, -28, 42, 215, 64, -58, -258, -25, -188, 63, -127, 37, -23, 125, 52, -281, 35, 62, -237, -27, -155, -158, -129, 54, -119, -160, 35, -188, 66, -66, 24, 136, -4, 50, 153, 80, 234, 116, 87, 90, -194, -50, -129, -102, 53, -138, 162, 147, -201, -151, -88, 75, 90, -71, 132, 131, -93, -93, 17, 57, -113, -60, 111, -74, 250, -29, -107, -57, 34, -173, -59, -14, -25, 16, -36, 119, 165, 178, -110, -143, 10, -2, -138, -101, -72, 97, -53, -143, -36, 133, -8, -91, 307, -153, -8, 91, -201, 96, 203, 130, 97, 14, -152, -260, -202, -21, 140, 45, 177, 22, -3, -176, 58, -19, -279, -17, 27, -309, 154, 208, -29, -28, 59, -181, -106, -74, 155, 120, 287, -39, 176, 37, 225, -25, 82, 292, -131, -3, 25, -45, -78, -293, -47, -116, -197, -141, -83, 2, -116, 51, 26, -92, -65, 219, 267, -210, 217, -12, 6, -77, -29, -203, -136, -178, 47, 149, -104, -107, -217, -47, 85, 170, 70, -115, -95]
4869i5K52K7j09j09j38L8N2J16q8%Q1m4n9O2R7J5j33J48P7m24J71j77J92M1k6
4894c3k46J21j71L22j62QQ8J19n5k26L04l47M32NJ89l21P6k38K89l53L13r4j18
4917i8J59o5L33k61k9K89l01j66L71n2j79pPq5l3J52l9J17l31K48J91m51L10l51
4941b71K17m46M60K2J05mk07Q1j3k28K61j49J55K53k98L78j90N7j08j60j65L4
4963b16M36l9j73J48l4Lj58l5j53P4J09L8k00J5J33K24k32O8K84k55q3J48q7k7
4987a2J04j37j3k2M7j09K54j98J06M8l7k30L77k57J70j20k06L59K70m29q7j36
5009b58N05k15L4j18K2J96k49j69L09O9r4J9k59L92l35J36K61K9q5j90j4j09J43
5032B0L0j4R7j00J47l15o1K36N7J7j86O5K49k12r3L0o0L66l51Rk5J89j44J87k81
$$ y = [-95, 157, 184, 75, -34, -172, -134, -82, 34, -54, -54, 27, -17, -76, -14, 83, 98, -35, 113, 190, -234, -63, -240, -48, -7, -33, -279, -158, -329, -7, -169, -161, -73, 46, -9, -235, 69, -278, 154, 159, 348, 27, 103, -135, 154, -199, 114, 20, -98, 61, -4, 329, 68, 39, 328, 27, -139, 232, 180, 1, -6, 1, -84, -117, 35, -4, 113, -218, 30, 221, -230, 80, -271, -54, -500, -40, -18, 87, 83, -124, -43, -56, -284, -23, -172, -17, 236, -62, 316, 126, 183, 75, -85, -250, -216, 220, 181, 8, 156, 122, 125, -33, -68, -221, -147, -38, 0, -200, -185, -52, 172, -60, 8, 292, 37, -46, 102, 15, -12, 92, -45, -58, -80, -33, -142, 112, -86, 20, 68, 31, -199, 178, -79, 91, -29, -235, 124, 394, -35, -122, -258, 247, 32, 66, -52, -30, 166, -83, -252, 57, 126, 32, 51, -208, 184, -151, -15, 246, 275, 190, 0, -14, -123, 20, 50, 36, 133, 33, 180, -135, -196, 40, 97, 114, -72, -7, 242, 30, -63, -33, -93, 273, -78, -69, -94, 95, -49, 138, -143]
5057a43L6K6L5n3Q7R3r2k16J45M93m36l3M05o36L75j37rm1R6oJ51j16L08k82J28
5082A78J08j66j00J2p8q2P5J71l50K60j40J14k6K14k6J9l22L14J47m11K15M2p1
5105I7%Nk01J78K9n7j63K39k46J63o7L9q4m9Ql5K37J36l33J15j50J4K88p2l1j15
5131e5J25J66k48l0O3r5p8k10L97j35Q9p6J07r3L88k01j30j55R4R3no9k5K83q7
5156A13J05m6k24J5P9j62K08mJ7p1J87m77J55l0J23j31L35k91J78qj34J8J06K06
5180B67k35m3j33K93q5N3j18J00k64j71O00l57J74j26K18m27K50%q9LL9J97k05
5203e9R5j24J38O1l21j30K72j05K81j33m3N47l98j11M4J51l85L9L73J38n92K11
5225e1J10j38K29j2k09J8Rl5K38l88L81j38n3O3L8k82K60n8p3L45k87N6J34j21
$$ y = [-143, -107, -81, -46, -99, -12, 81, -11, -227, -82, 411, -25, -58, 347, -289, 86, -51, -60, -101, -5, -11, 140, 24, 332, 50, 178, 286, 120, 20, 32, -46, -128, -53, 118, -232, 28, -112, 2, -24, 190, 164, 183, -139, 175, 322, -89, 126, 168, 97, 97, 102, -99, 79, 108, 51, -112, 127, -119, 44, -23, 16, -68, -117, -109, -144, 93, 229, -104, 11, -139, -125, 163, 91, 60, -55, 70, 236, -12, -42, 21, -74, -152, -362, 35, -100, -11, -87, 20, -73, 315, 114, -16, -171, -77, 16, 11, -58, -83, 200, 113, 218, 172, -52, -37, 42, -120, 88, 84, 101, 30, 217, -260, -105, -135, -12, -143, 192, -99, 79, 71, -63, -45, 61, 267, 32, -11, -144, 149, 64, 117, -1, 99, -165, -336, 264, -93, 81, -45, 173, -254, -4, -4, -93, -90, -51, 146, -59, 36, -88, 50, 111, -210, -340, -68, -173, 108, -25, -68, 479, 81, -30, 14, 165, -220, -181, 192, 330, -262, -51, 59, -79, 150, 138, -71, -53, -44, -79, 159, -229, 152, 14, -39, 24, 62, -220, 40, -18, -91, 254, -33, 23, 157, 36]
5249C6k76J32K70k64J8K19j62m9k03M53l98K80l23K55j38k89N21k35N4r1J18k2
5271i4M81j63l40K41k13L31k57J14M4j40Q0l07J29M8k54L48k38q2K4K90J0n3k0
5294b1J05o0l2o9P6o5K7J20k47J17K02j60K18l85L51j61NM5q9J76l2m0k57J78
5318Bj42J72J34K9k43j48K37j92L01R5j22J85l94L02j90J77j19j7K9j76k1N0J75
5341A24N0l11J69J08J12m03K11l8K2j80J22j48K55j48J8n0n2L16r7N3j49j19K72
5364A37k95J23J6J8j19J81J02l34q0K17k8k25J96Q4K05j06o5J81k31Q4K24l17
5386c2K39m08J96k30K92j3lr2r0R2K76l06rK99j95j42R5jm1J66k77L29k22Q4q8
5411h1K42q3q1p4O6J39j54j05MM56k62J62k74mJ89m37L5M6J01R1m4O6j0Q8N3J84
$$ y = [36, -240, -108, 162, -102, -84, 135, -27, -76, -279, 174, -224, 56, -267, -12, -150, -439, 82, -153, -99, -190, -72, -94, 387, 224, -116, 125, -88, 243, -14, 100, 144, 4, 84, -223, -94, -46, -300, 48, -190, -272, -248, 42, 52, -1, -21, 84, 24, -8, -77, -1, -66, -39, 81, -166, -49, 153, -7, 211, -174, 177, 16, 21, 66, -23, 153, 121, 81, -176, 2, -140, 32, 166, 195, -48, -196, 41, -151, 150, 245, 123, 308, -86, 216, 26, 203, 84, 67, 96, -80, -101, -51, 124, 174, -137, 32, 140, 252, -151, 60, 22, 44, -136, -14, -162, 93, -55, -37, -87, -139, 177, 80, 133, -16, -135, 137, -158, -35, -19, -1, -120, 61, 163, -171, -251, -34, -62, -287, -91, -7, 198, 92, 27, 208, -23, 61, 285, -32, 207, -201, -5, -235, 57, 44, 41, -51, -141, -49, 227, -79, -88, 211, 16, -126, -31, -32, -73, 93, -184, 145, -77, 7, -81, 161, 78, -3, -77, -11, 128, -26, -131, -127, 329, 67, 229, -45, -49, 140, -297, -262, -216, -115, -24, -68, -2, -12, 76, 129, 313]
5437C13j12j00k94K20j6k22L98k15Q4j30R7R4n0mq0J37P1m03J8J62j88n7K29R2
5461D4l42L53j85K38j26j0Q8k86L59k36L00n8n2K7l40J71J39j86p5P7K60j57J17
5484A20nk03K53L1p9j67K21o6P6j94L09l70j80k7L81k24K02L77m25K65m22K46
5506A19j53J72k17L01k98J45P8R2m4l92J73k73M54j72p4P2K47k41p9K84k96L28
5528B26l01N2J7lr1J58J37k43J09K15l56m2kOK74k26Q7K10m18N4J17K81l54J12
5552A9j5o2J15q0L0k65K26L42j80j43J52k74M38l33j41K14o6n4M3m3J16j13n8
5575a32K83l19J71o9l2m6K66k76L12j87J68j55J34r3M2J29j46j50P7L16n62M87
5597B18k29K08j41o2K17k54j14l1J09O6J66p3l5l1k61L05j40R6k56j08K81o1J36
$$ y = [313, 201, 101, -193, 27, 11, -211, 187, -28, 56, -74, 23, 117, 67, 63, -17, 120, 191, -212, -194, -32, -220, -277, -48, 44, -298, 55, -130, 108, -18, -28, 60, -226, 133, -103, 197, 139, 87, 114, -226, -55, 84, -102, -177, -100, 160, 3, 120, 115, -88, 165, 196, 117, -50, 171, 105, 181, -13, 296, -74, -254, -281, 100, -124, 78, 455, 30, 295, -127, 119, -34, 138, -79, 222, -76, 69, 147, 239, 195, -197, -24, -297, 157, -15, -89, -17, 230, -11, -90, 194, -102, 226, -75, -23, -6, -9, -100, 58, 195, -48, 61, 276, -80, -122, -124, -118, 156, -70, 17, 227, -191, -137, -20, 261, -93, 19, 4, -58, 57, -23, 7, -258, -32, 310, 130, -13, 139, -135, 303, -30, -171, 43, -23, -77, -34, -77, 39, -74, -132, 151, -168, 3, -66, -98, -144, 122, -154, 158, -29, 139, -16, 118, 25, 67, 196, 50, -100, -23, 293, -269, 218, -11, 197, 56, -6, 211, -43, -157, -188, -79, -13, 153, 80, 45, 14, -247, 58, -82, 14, -242, -350, -69, -130, 6]
5620FK4R1M9j74J54k71L25j9j23J60k65J10r6J19k85J87o8Q5k80J29J74J30r7
5643F5N0l15K45L2j71r2K95j3M4p5j62M0J97k88K98j1m3k2j26N9j86K99k06J16
5667C0P6l6j53l19O78m14kQ7M6j47L48q0j58J46M1k22P9q9J25n0Q6j33J7n2KK71
5693A77l16jK62j50J98m24M52l58J83r8j38M42m7m62J92K81j56n5M1j04J35K0
5715G4l34K67j23j18pK35j71L84nq3k51M19k31k73K79q8o4K91k72J61J84j22k01
5738d9jJ60K8k3p3N3j51j42L60q0j45J5j10J88j10j43J78J33l63K83k1J38k03
5761g8J15j16k39K66m0j48j3K10M5R9K0jl12N7J14J04q7p7J22k48L54l22L44r7
5785G2L8k5J20k72J52o7n2k30L21N1l6j21J40K00m20K39k01L0J70l2j63J35K5
$$ y = [6, 30, 121, 170, -4, 150, -121, 204, 185, 62, 222, -43, 67, -29, 90, -195, -8, -76, 9, -271, -142, 32, 162, 65, 115, -200, 45, 77, -94, -186, 109, 96, 140, 65, -97, -57, 140, -148, 150, 139, 96, 74, -52, 7, -179, 120, -86, 30, 106, 70, -83, -402, 276, -138, -140, -53, -7, -154, 194, 114, -44, 102, 143, -79, 0, -89, 36, -14, 72, -61, -44, -96, -94, 177, -139, -140, 122, -28, 170, -254, 198, -160, 23, -75, -213, 229, 182, -280, -88, 193, 37, -18, 23, -81, 54, 74, -260, 7, -116, -234, -241, -6, -177, 207, 202, 119, -132, 287, 56, -217, 62, -26, -90, 201, -71, 90, 274, 152, -49, -50, 110, 138, 115, 42, 95, -56, -198, 162, 82, -63, -48, -158, 30, -80, -223, -45, 88, -275, 8, -13, 125, -78, 37, -79, -318, -52, -92, -240, -253, -43, 2, 101, 121, 120, -192, -135, -21, 83, -4, -81, 41, -207, 147, -175, 169, 72, 110, 85, 205, -67, 85, 18, -34, -264, 57, 108, 72, -49, 91, 291, -129, 110, -91, -61, 109, 77, -86, 49, 74]
5808G4J07k32J45M6j04j69O0P3P0R0l6j42j73J15J68k61K84l12P1J53k16Q6j2
5831a15J42o5l7K34N1k66J73k8o0j45N9m9%L1K3O3p5N00n67K58k74P2J28k1J0
5856D2P2j02j09J66M6j9j59J07l37J39R8l0Q7q9J7Q7q3Qoj53K96J81l00n8j08
5881b07K99o1k23J62q6J26l6q3J88q7l9K03O3k09p1J34k08K1R1m6L9j5Qjj24J84
5907B2p7J8R2Q7j35j89M42j95r6rj48Q5L6j46j08M63l80P0K22J25k83oj94J92
5931a12L39l34J76j55L39p1k19J9pK34l39J77n6P2j6j81M9j03L80k1j80J71j65
5954cj90qM22Q9l53J25k15J77%j01J54K42o7k91j3P5k0l5K50l61L03J19n21J86
5978c6k54K45N8j36N1m0J31o5k21L66J06j92J3o8P4q4J95J20j85k65K10k99J18
$$ y = [74, 181, -51, 94, 140, 36, -133, -73, 0, 70, 160, 124, -18, -191, -76, 92, -169, 115, -197, -126, 27, -189, -103, -115, 27, -38, -75, 159, 210, -56, 117, 89, 29, -116, -57, -106, -106, -75, -52, 11, -64, 436, -131, 127, -147, -75, 53, 32, 42, 114, 12, -97, 69, 115, 96, -63, 44, -293, -154, -56, -86, 1, -88, -71, 16, -67, -59, -65, -218, 78, 259, -41, -99, -207, 92, 31, -192, -30, -116, 10, -26, -109, 79, -8, -47, 156, 219, 10, -61, 73, -135, -114, -23, -69, -30, -45, -37, -38, -162, 22, -55, -37, 55, 142, 7, -182, 260, 65, -31, -40, -188, -103, -67, -213, -321, 142, -238, -168, 54, 179, -104, -110, -304, -112, 227, -107, 69, -86, 253, 182, -37, -18, -25, 209, -130, 47, -9, 63, 47, -134, -85, -188, 192, 171, -9, 162, -3, -193, -201, 221, 310, -43, 82, -133, 44, 44, -57, 97, 339, 272, -19, -32, 43, 23, -12, 238, -123, 180, 299, -222, -36, -290, -45, 13, -123, -72, -112, 19, -46, -267, 99, 205, 13, 26, -42, 32, -52, 143, 263, 78, -187, 23, -276, -158]
6001a58L47l02j11O7J37j37K41m2k60L38l04m3K37j11R1L66l23k29J1M2L25m29
6023b47K24J9j08m0R4j9R6J8j04O4n1k56M86j78q8R4P1M1j23L0j54L03k07j5j6
6048f6J42l2M3L1P1K17l62j58N4K0k80N28k93J33k10J16k2K38l00O7kJ3K33j90
6072iL1j27K20j72j05K77k6J9m63N68k33J78m2j49K49j33l70K17J8K02K8m5k89
6095a56J15k01J54KL57j90j39K34j70j61M11J36l72j73K03J1P9q9Pl6J7p1P6J0
6119E4j39o2K30m23Q4M58m57K29k96K14J93j3P9j41r9J59j95J5J95L7r7p9k20
6142b74R1M23O2l24l5L24m14J05J22p3K73m44J33j0Q1m8l7l8j50J89N5k75J38
6165a26J34j2M9j00O5o4j98P6J11k0NJ05QJ05m9n5j15j9O4j48L22j45l1j04K46
$$ y = [-158, 189, -113, -224, -157, -20, -157, 84, 42, -218, 120, -184, -227, 10, -101, -10, 356, 33, -196, -185, -143, 182, -247, -23, -4, -112, -152, -58, -77, 19, 37, -67, -3, -54, -310, 176, -2, -90, 4, 75, 116, -7, 23, -131, 172, -35, -50, -66, 76, 44, 87, 118, 189, 406, 44, -114, -60, -40, -320, 208, -85, 48, -162, -46, -68, 170, -130, -63, -65, -52, 181, -9, 22, -105, 115, -57, -162, 115, 89, 108, -355, 213, -20, 158, 116, -33, 216, 83, -287, -70, -52, 150, 178, 133, -156, -41, -242, -88, -86, 271, 81, -58, 176, 6, -155, 256, 392, 20, -153, 50, 61, 140, 51, 58, 22, 39, -32, 44, 54, -85, -147, 83, -340, -256, 202, -255, -26, -322, -108, 85, 72, 151, 10, -89, 70, -125, -110, 85, 122, 25, -54, -274, -183, 240, 302, -22, -57, 267, -147, -42, 80, 7, 280, -164, -31, -41, 40, -8, -45, -83, -233, -44, 11, -264, -126, 8, -4, 45, -55, 10, -54, -252, -176, -65, -85, -80, 25, 33, 138, 89, 34, -81, -100, -36, -184, 138, -7, -38, -142, 104]
6190A04k68J24k07K54j94K15j39M6K4p5M3J74J12j60K73l43N6j82J44q9O8J05
6212H5k98J97p3O3R3lN3j71q9J3K27j07J0o9P9r2Q8o4J46j01j74K16p9K83j13
6237A20l3o5O7j91j51L51rj56N0Rj8J07J45q6o3k81K07ok51L65l8l2j98K56j76
6262g7J66j90J17R6k66n7J99Q7l91N13k83j86K28k01p2K30l1J04K04l22J09J91
6284A68k72L1L9qp3L22j30k0R4j75j37o7K75j0q9J94o2n0o3M3K6rK5l57K77l7
6310f5m0R4r3n1K24k50J21j69P2J05K3J7k84L08k2o6o9K21n8q5n7J69j94K94j33
6335A2l8k14L24P0j53k06L83j15L5J59k08k3j54N8j42K68K40l02j7l4j0o8K7L03
6359A95l93J30RR3P0R9j69J5J31j5l43R3j67K76J7j95jJ05o1K54q3m0L7l7J39
$$ y = [104, -164, -40, -247, 7, -187, 28, -111, -65, -41, -116, -73, 101, 213, 53, 326, -17, 39, -143, 1, -88, -20, 85, -213, -16, -89, -26, 67, 64, 117, -54, -143, -130, 97, -10, 0, -69, 10, -82, 6, -58, 88, -13, -187, 29, -50, 233, 120, 87, 22, 89, -102, -253, 98, 89, -67, -17, -8, -26, 81, 226, 140, 77, -204, 3, -3, -254, 111, 73, 41, -157, 99, -77, 89, -101, 16, 112, -154, -211, -12, 75, -316, 197, -86, -272, -44, -245, -317, -87, -118, -14, 190, -132, -23, 168, -104, -73, -34, -42, -115, 207, 77, 57, 151, -24, -161, -228, 47, 37, -52, 142, 80, 30, -33, 10, 36, 27, 52, -305, -28, -65, -105, -11, -104, -155, 69, -181, -60, -229, -157, -52, -29, -12, -296, 12, -10, -76, -145, 76, 18, -67, -124, 45, -149, 145, 12, -26, -240, 84, 154, 1, -205, 178, 63, 98, 257, 49, 26, -128, -70, -212, 56, 296, -6, -23, -57, -67, -135, -108, 195, -198, -68, -59, 34, 104, 203, 34, 49, 180, 165, -178, -85, -252, 24, 41, -154, -155, -50, -111, 143, 60, 20, 57, 20, 159]
6384A59k52j9L17k37j19J04K46m07J76J15j68N3LR1l7J10R1o9l53K52N4k59K8
6407a21K95j32q7J6j95K93J39k81K49j94j4J19j43J15p4J05l48K16j10K29O5j35
6429GJ31o2p1k62P4J21j35L63l63K97M6j77J06j45Q8k8J48l41J09j3J89L0j80
6452f8K33l82o2KK88K0O4J18m17K10k36K92k83K40J39m57J73K10j33J18o3j8j02
6475a14OK60j50m7J42m52M86j59J0p7K14l54K84P9j95J20j2R4k42J03J42k6Q4
6498A96j41q9J37m9n5j06J74O9P5r9k30O1J75p3q3L56l34j13J70k5n2J0J0j0l1
6523e7L9q5J78l2p2J25j89p6J46j00J52j91K6L79j99M6K93l46k43L67o2j69j31
6546b01N8L63k82o3J69m9j36r1P7J75m0R1k86L50j29l8j28J57r0J18J1k64J97
$$ y = [159, -93, -112, 205, -32, -151, -47, 199, -208, -32, 83, -85, -32, -29, 62, 25, 135, 226, 157, -196, 56, 110, -149, -121, 174, 42, -45, -29, -224, 69, 208, -73, 176, -18, -32, 87, -56, 59, -15, 90, -258, -42, -152, 77, 142, 7, 138, 76, 5, -257, -183, -62, -197, 166, -197, 100, 146, -31, 75, -70, 18, -10, 138, -203, -94, -107, 82, 112, -68, 165, -217, -279, -277, 11, 31, 95, 213, -204, 6, -230, 62, -221, 19, 158, -299, -126, 84, -49, 69, 6, -12, -114, -108, 152, 2, -45, 97, -355, 131, -28, -18, -95, 119, -235, 49, 128, -67, 53, 41, 135, -107, -4, 138, 112, 196, 55, -34, 103, 54, -1, -107, 67, 136, 211, 112, -118, -57, 118, 45, -38, 318, -16, -129, 41, 16, -36, -26, -16, -26, -57, -18, -103, 75, 43, -29, 96, -93, -169, -23, -123, 29, -162, -136, 243, 44, 90, 383, 37, -206, 161, 99, -70, -201, -143, 220, -62, -125, 44, -5, -141, -232, -155, 20, -20, 71, -215, 135, 6, -32, -160, -3, -93, 25, 36, -228, -31]
6569c1K5no7J64J4p4P0j58J58k1p0J54j04O6l57M56l66K29q5n0J57m09L27k00
6593a77J61J38R1j25j18K49j62q8K15l54K80%k19K11k00J68O6J08j87j0J6j37
6615g4N1K02j69J00j21j90K70k5j38J1j78K73k16K03O7k39L23k16j01J45r6r4
6637b12k8L31n3j37JJ60k7m7q9K39L0l86L87l0pm52L44l6J01L6j50k0j92J56N7
6662b4P2j0k05p8K09K03j30r4Q1Or3j57K97j13J0j57R2k1J61P5j96J21j27J17
6686C9j48K35m93J49K47n4r4M8K84j55j08L26j51j50J82l44K25L18m62K17r2k07
6708a88K3L26l42J30K02k9k54L4J92n8k1p1J24M8j81L38l19j20K70PL96m60j32
6731h5j8Q2J32j40l6J73Q9l28K17j37J32mj16J07j65p8M4K83m5j63j56K2j25M07
$$ y = [-31, -6, -11, -78, 86, 100, 26, 96, -62, 96, 75, 5, 159, 55, 121, -236, 220, -146, 83, -2, -52, 105, -304, 23, -177, -16, 122, 213, 88, -30, 219, 57, -31, 184, -170, 110, 110, -109, 102, -98, 70, 136, 244, 57, 47, 63, -74, -23, 179, 10, 110, -11, -201, 69, 44, -94, -83, -261, 12, -204, -1, 66, -173, 150, -66, -167, -22, -118, -212, -240, 91, 38, -99, -98, 62, 35, -12, -101, 138, 168, -218, 169, 139, 132, -320, 24, -12, 89, 125, -25, -45, -237, -81, -24, 48, 38, -167, -245, -36, 167, 37, -57, 24, 30, -63, -220, 77, -36, -26, -183, -91, -112, 49, 124, -72, 49, -78, 39, -109, 126, -367, -218, 29, -25, -119, -71, 213, 58, -50, 276, 125, -25, 157, -187, 38, 356, -106, 111, 19, -188, -165, 161, -181, -51, 151, 122, -132, -98, 94, 36, 15, -56, 68, 116, -65, 273, -46, -166, 104, 111, 507, 47, -85, -103, -21, 111, -29, -65, 108, 197, -131, 86, -51, 81, 77, -39, 68, -97, -175, -131, 152, 107, -56, -212, -190, -315, 92]
6755I2n5j18Q5k4J92j21P7n6k23J29r6K17k01P8J02j7j6K00k27j21K34r4p3j45
6779a81L74j58j4o0j67N14m63K43L0j70J06o8N9Jq9KK94j90k10J65k9q3n2K04
6803E8j66Q0J55j81J77j35K3J41n1o9J12j98J28r3P3m4o1L01n28L75k03L05k09
6826a0J02j19q3j69L10r9j48j12M48k54J3n5r3L40O3r9k24o2kL95j48q5L25j8
6850B16j46o3J44Q8l70J65r1L72k97J3j11L47j41j49m1K09j66j33J82j78K18j55
6872h7L4K23rl1k46j63J71L23j36j8J78j92j30J86r0j37J43k40J40J10J17j8k71
6895a43R1K16R2n14j02N10j53j88J82P4K0r6k16L45P0o7o5n5J04j25j96K08p3
6918h1j63M27J15k07R7L9k02k89J37m9K07j33L44j06j68J98k12J6J96l97%K31
$$ y = [92, 37, -81, 4, -20, 172, 51, 128, 72, -151, -22, -118, 99, -102, -24, 78, 61, 45, 245, 18, -103, 131, 37, -36, -181, 193, 35, 21, -39, -206, 308, -155, 88, 118, -52, 54, -14, 45, 46, -43, -41, 253, 63, -147, 18, -11, -94, -146, 58, -108, -28, 127, -54, 123, -12, 11, 152, 101, 32, 144, -54, 74, -19, 54, 10, -51, 250, -278, 97, -106, 199, -10, 92, -27, -110, -279, 31, -68, -216, -328, 120, -134, -121, -176, -269, 71, 134, 35, -189, -251, -253, 142, -6, -91, 234, 216, 70, 7, 151, 239, -131, 34, -57, 315, 18, 31, -80, 267, 126, -23, -64, 145, -21, -154, 28, -150, 68, -87, -53, 170, 161, 130, -116, -279, -108, 215, 79, 61, 239, 47, -83, 103, 13, -124, 19, -221, -81, 29, 146, 128, -143, -52, 164, 256, -258, -360, 150, -3, -191, -9, 65, 85, -11, -227, 118, 188, 121, 56, 1, 105, -20, -216, -8, -81, -244, 183, 298, 91, 188, 227, 25, -264, -127, -176, 31, -102, 242, 136, -32, 166, -46, -30, 166, -231, -231, 0]
6940@J32q0L0j39OJ26M4l37M49l51R2P7k03L17j44J26o6k0l6K9o9J49n8k94K26
6965FL1j65L90l25K52k20n5L2K59j51Ml0n7j34L42j82k5J6J3j11K17J89l45J13
6989F4PK09l86K73k44K16J25l77R5j15J68l33J95O8M3o4K8M2k73K05n5N4J18J8
7013H1R9j13oJ34k20k00K95K47k74k51M06q8l5J45p6j64J81m1k19K25r5n0q0j53
7037b52M80m55M04k28m1J87M5k40K9PJ04j86L10j11J9J99k17K8n6J77m59J97J81
7060A22j6q9n9k9k86L93q8n4N1j31K80k14k1j75J67K05RJ6k55K48p1J07k13q5
7084a88j2J24J60j84J65N2q8k8j60m6L67l79J80K20j67j35j62L60j75J6K50k30
7106f0j06K66k42M7J34j61l8R0N5j56J50M7j62L83m06J27l89N39mr5P4n6j96l
$$ y = [0, 132, 52, 82, -57, -51, 75, 119, -218, 231, -120, -28, 49, -154, 163, 19, 145, 79, 59, 23, 52, -17, 132, 74, -220, 6, 37, -128, 262, -63, 189, -31, -86, -54, 205, 54, 58, 28, -29, -163, 179, -3, -28, -12, 1, -110, 107, 296, -49, 64, 71, 280, -106, 167, -77, 139, 264, -113, -18, -133, 35, -298, -103, -35, 8, -56, -28, 14, -259, -54, -109, -55, 63, 81, 180, 67, 61, 195, -25, -225, 70, 317, 43, -208, 198, 110, 75, 220, 144, -20, 161, 120, -99, 126, 31, -19, -99, -252, 228, -227, 177, -51, -92, 95, 140, -100, -71, -64, 40, -146, 164, 53, 72, 271, 54, 82, 26, 203, -256, -59, 122, 106, 17, -42, -71, -357, 36, -52, -106, -55, -186, 94, -120, -141, -316, -149, 56, 65, 81, -174, 74, 3, 110, -103, -188, -200, -76, 84, -100, 65, 117, 29, 1, -159, -205, 162, -217, -37, 183, 16, -119, -281, 79, -96, -80, 170, -60, -166, 100, -142, -95, 39, -122, -160, -70, -15, -171, -21, 26, -136, 247, -159, -32, -421, 118, 114, 19, 93, 37, -159, -162]
7130a62K27k67O1J66K65n34K57K32j60o6R0K2q9p7J09J15j25j22L0j02K4J82j42
7153f6p4O3m7K38l13J94J57j33j16R0j09p8M41j08r3j28K08l79K25K52m38M14
7175B00l9o0l42J30L8M8M0N7l05L53j15p0K77j41j26L03k45M2p8k72K08J81j81
7198i7K37o4l2K7j56K12j02J04l38l7K91j29M4l21M47j51K52l77M09k04j19L4
7220g0O5J91k39o9q1M11q4q4r4J85j16J10L3j96l75L85j03O1p1L85m27J53%K02
7244A72j97K98j04j65J12j63K02J26k15L9j6k22J74j35R6j69L26n1j16R3n9j78
7266a52j0K39M4k50J70m3R4q9j10k5L08l4j77k08L92k77k03J90K34J8j90m9J46
7289A8O4l83J85k5K26j52o5j56K03K20j71j90L71l58K94q4k35J05O9J38J26k84
$$ y = [-162, 65, -202, -141, 25, 290, -244, 13, 245, 85, 19, 109, 131, 42, -35, 74, 189, 64, -58, -28, -130, -106, 76, -66, -140, -77, -124, 114, -199, -5, 152, 19, -97, -7, -116, -194, 247, 139, 46, -82, 126, -253, -28, 224, -214, 200, 161, 101, -241, -111, -73, -25, 15, 72, -233, 120, 5, -65, 212, 71, -55, 248, 3, 45, -33, -305, -97, 84, -97, 140, 76, 44, 71, -85, 127, 25, 129, -209, -246, 45, -84, -40, -361, 86, -65, 187, -190, 219, 15, -104, -70, -5, 186, -53, -122, -203, 208, 124, 40, -54, 131, 15, 125, 158, -38, -413, -28, -131, -70, -141, 244, -183, -30, -30, 172, -25, 273, 169, 4, 116, -47, 155, 281, 66, 105, 89, -133, 41, -94, 2, -167, 159, 108, -8, 85, 26, -152, -162, 77, 121, -129, 41, -2, 92, 3, -107, -132, 176, 142, -35, -243, 149, -128, -331, -141, 93, 111, -79, -128, 18, 82, -301, -116, -141, 85, -67, -132, -288, -85, 135, -36, -226, 145, -213, 81, -3, -238, -133, -64, 74, 200, -84]
7311h4j57O51n63K05Lr1K18j92J68l86L46k27K63m5r3j10oK15k11k2J85j57j01
7334a91K00k8K31k63J36J39j02k14K84m01J23R8j13J21J21l8j14LR7J95j86o9
7356B9J3j80J93j7k60R6R8M2p1Q7J0K4k41J09J99k17L5P8n7N1l5lr1o3oJ15K41
7383A79m46J13l4L17l69J86K4j0j8J75j98o1J18Lj35L64j5j18K7J27l04r6P8J4
7407g9J50j1n3J32n49L41J81k11K17j61J41j8j20p1L3J55j75j2N8K92k72k84M91
7430A75k53J30K00m03J34p7N8l2K61k06k5K90j51P1o2k70M6j38L50k18K53j45
7452a2q2O6Rk35K71%Qq9m1J47Qr5M9lK1J14L0l86M01j10J34p3q4N7m78K92n7p4
7480b12L57o8j93J75L9l94L36K6k01J35K01k54qq3M32n47K37p3K02k64l6J25J17
$$ y = [-84, -241, 410, -153, 52, 55, -36, 182, -10, 158, -228, 118, -109, 154, 109, 16, -94, -100, 115, -96, -118, 67, -90, -191, 9, -19, 212, -51, 85, 224, 122, -92, 192, -209, -86, 12, -101, 20, 141, 103, -11, -8, 89, 284, 98, 29, 42, -138, 55, 38, -222, -126, -28, 14, -57, 30, 40, 64, -177, -68, 131, -86, -51, 27, -30, 21, -14, -17, -108, -171, -177, -62, 179, -267, -154, -188, 129, -240, -54, -30, -40, -58, 117, -81, -142, -24, -21, -156, 208, 193, 75, 102, 229, -75, -171, -93, -79, 71, 60, 7, 139, -410, -69, 112, -99, 118, -43, 98, 80, -40, -111, -78, 77, -98, -110, -52, 240, -32, -316, 175, -78, 52, 252, -151, -17, -94, -36, -68, 193, -13, -38, 252, 101, 172, 110, -160, -114, -252, 98, -120, 133, -12, -94, -28, -19, -254, 17, 17, 25, -64, -105, 42, 50, -45, 4, 1, 22, 136, 166, -220, 181, 71, 205, 132, 48, 105, -373, -81, -138, -212, 145, 77, -116, 59, 98, -296, 40, 66, -135, 0, 201, -53, -61, -144, 288, -259, -22, -95, 107, -157, -193, -68, 49]
7503D9q6k6K45n6j34j38J15L34m22M4L73l92R7n0K69j74k00K97m5j42j61J51R4
7526D2J7R4j40K3K21n26J93j00Q7J31J2q4m9J37k51N9J91l34K78Rrl0RK16k15
7551a9j73L24k18K28q6K03k17j18O0J35k89K01rl8P8k40M54l45J26J51j98qq8
7574h6K56J4k08k35K26J64j70K74m44K54P2j68o6k8J69m6L4K13l04J76j69k9M
7597i7k0J86q9j78L95n4j67J32m3P2J10k00K66l34J08j77J50k2M3j3k01l5K2R5
7621e1n2q8L38k05J2J30k10K66j56M6j20K0J59j66K12Rk48J26O6K9j59J40l61
7644b63L46j31J17l86L17j68J16k7j18L05n8J11k32O9p9K27l11K59r7j10N4j92
7666b51J77K68k41J40M7J11J2l88J85m5o5l6J7K6O1L9M6j66k1j98J57n5K93k37
$$ y = [49, -37, -63, 182, 126, -8, -146, -31, 303, -119, -75, 298, -94, 3, -47, 222, 48, -152, 145, 100, -42, -203, -52, 42, 59, 153, 13, 36, 257, -269, -76, -176, -89, 42, 54, -30, -79, 58, -193, -134, 57, -277, 1, 10, 1, -29, -20, 196, -19, -192, 132, -86, 142, 56, 259, 42, -76, -16, 119, -170, 31, 22, -16, 62, -178, 276, -69, 57, 208, 10, 2, -86, 170, 184, -24, -259, -33, 131, -39, 235, -209, 45, 117, -51, -117, -145, 24, -22, 12, 225, -79, 97, -72, -101, -97, -117, 69, -20, -198, 197, 143, -24, 108, 65, 137, 247, 47, 313, -21, 87, -90, 60, 38, 81, 68, -133, -168, -146, -51, -103, -191, 147, -58, -46, 84, -126, 140, -16, 30, -90, -70, 89, -77, 135, 144, -104, 22, 88, 117, -42, 98, -263, 83, -48, 69, -317, 0, -168, -52, -79, -197, 108, 50, 161, -71, -2, -81, 146, -165, 94, -3, -113, -59, -251, -74, 194, -47, 93, 140, 251, 263, -125, 60, 15, -50, -86, -69, -43, 18, 57, 103, -63, -84, -282, -125, -180, 113, -124]
7690a24j54K75p0P4j83K58pk17J34r2J34n2Q2n6K37l27L74m19J66LL1J67k83k9
7714g8P7P8n9n0O1J70j71N0j35J45J67l58J59m8j46M33m47J81j01N8O3j46j33
7737b30L72k93L11k06J46J41l26J12n7r3NN7L3P3M5j55p2P5J08Q8r0pK7j58J94
7762A00Mq3O5k41J56J19p9Kq1J73k27J37m8o6M7J11J04j96J15m37K79J02K14k00
7786G0j17j7L37k94J57n5m4j81r3K73r2o1j48P4J85k2M2P4j10M6O0pj37o4m06
7811e30P82k63l2L28k08J73k39mo7n2K10k07j0M26l27j24K20jk41J76O2l6J65
7834B01pk07j91L2M08k22j00PJ96N7j11q1l0J2N7l1k11J85j42J42Q6q1P3j79M20
7859B83k63L5M6j14j50M79l78J80j1n6j50J20J01j82L10j66k0j68K04l7j25L9
$$ y = [-124, -278, -3, -73, 1, -182, 76, 69, -148, -14, -106, 28, -24, 58, 2, 239, -88, 286, -133, 33, 36, 67, 234, -49, -78, -1, 77, 18, -32, 29, 199, 28, 78, -57, 88, 255, -103, 56, 8, -138, 295, -152, 29, -72, -14, 49, -97, -230, 142, -151, 160, -46, 100, 241, -85, 27, -30, -123, -118, -61, -28, 45, 90, -65, -137, -62, 46, 134, 44, 37, 64, -94, 100, 104, 21, 86, -155, 1, 120, 41, 43, -38, 135, -92, 45, -3, -69, -22, 89, 193, -3, 112, -325, -46, 56, 270, 70, -47, -64, 273, -21, 136, 81, 37, -144, -237, 36, -56, -117, -265, -191, -6, -28, 14, 88, -22, 24, 84, 77, -60, -124, -530, 252, -11, -43, 285, 77, 250, 11, 7, -60, -112, 98, -109, -119, 307, -20, -144, 76, 75, -166, 10, 72, 36, 201, 194, -13, -204, -172, 236, 14, -86, -79, 117, 174, 63, -18, -48, -36, 21, -10, -221, -36, -178, -36, 50, -31, 42, -137, 283, 20, 55, 101, -13, -163, 316, -62, 118, 107, 51, -99, 21, 122, -60, 250, 84, 64, -104, 100, 63, -62, -23]
7881b3J53k77k8R4J44j62J00j04J63K2p4r9L01l97Q3M18m48m4J64j62J65K1l01
7904b91J76l5lK60k00m7J43L8N2p3P9q1p0j82rK64r4N7nj43J97j20P6L11k54K4
7930G0p4K0J7l8J53k10J92p4K5k11n0L56k93K96j73K10l01J09J36l17J23j16n5
7953b05L88m42K02J1K17k13k35J13J04j6O6J23l2K9m5K0j62m5J05j45N5M1J04
7976C8o9j81J73M6L5j36N6L4Q4J12j87k53J11L47k26o4j5K96k33kL4rj98J60J41
8001I4mn3J37j41k56K11M3K1n3K3r9r8M3P3Q3K22j54j15j53K80j11k1r2J86j15
8026d9K17k89J07kK6J31l01R2K70j46K44k26p3J50q6J21j62p8q6K02j25q1K01
8049E7r4R2RQ6j73k20J43LN7Q1j1qk72kJ84M0j15J02M9M6o9L0P1j3K05k77j9m6
$$ y = [-23, 130, -147, -175, -81, 63, -99, 1, -103, 60, 82, 8, -91, 210, -187, -104, 314, -134, -178, -14, -176, -11, 10, -291, -115, -150, -153, 107, -93, -140, 3, 41, 93, 20, 99, 18, -52, -234, -243, 21, -73, -16, -21, -164, 33, -87, -11, 300, 46, 70, -4, 16, 33, -5, 148, -62, 130, 56, 81, -130, -180, 176, -117, 179, 6, 216, -85, 24, 160, -157, -34, -150, -205, 183, -259, -57, -46, 171, -42, -277, -164, -60, -76, -10, 113, 81, 110, 65, 85, -77, -122, -17, -162, -107, -66, 38, -31, -212, -39, 7, 42, -94, -38, -4, 80, 192, 5, -248, -137, 210, -16, -80, -95, 201, -32, -34, 0, -9, -207, -47, 94, 90, 37, 174, 33, -223, -12, 31, 52, -1, 22, -77, -175, -132, -59, 24, 246, 92, -23, -176, 104, -7, -28, -120, 66, -49, 168, -121, -14, -16, 10, 141, -160, -68, 202, 56, 300, 74, 1, 151, 65, 186, 24, -54, -140, 62, -63, -144, 57, -37, 55, 64, 150, -23, -243, -100, -97, -40, 41, 30, 22, -250, -252, -68, -28, -143, -41, 8, 54, -15, 15, 86, 73, 278, 1, -18, -64]
8077f4o9K92k29p7r6J41Q5j3j77L18m0l0L8J2J2k12R2j41K25j73K24k53p8L34
8101A21j48K74j54q0j03JR3L1k3j05j38K66j38N9j7r6P2J33j83K09JJ6jJ27k81
8126f4K59j5j59J45p4j2k4q1j97L63k55L18j58P3q5j06k5J84N8m5k09K79n02N71
8150B39l08M13q9p7k32N9J65l62K67R0l03K79R5j7k40j50J57K16j36l3J0k07J84
8173B0j05J59r6K64j88Q4j73K13l76J26J09L4j14j70Q5M21l08J85
$$ y = [-64, -133, 159, -70, -147, -243, -102, -17, -30, -207, 111, 71, 41, 79, 91, 103, -109, -17, -158, 67, -106, 118, -135, -213, 121, -27, 247, 93, 13, -90, -89, 4, 35, 12, -93, -231, 35, -103, -44, -61, -157, -85, 48, -135, 74, 75, 91, 90, 217, -64, 195, 180, 21, 166, 92, 80, 56, -25, -222, 141, -114, 204, 46, 119, 34, -72, -97, 87, 145, 100, -109, 170, -332, 239, -69, 344, 255, 178, -54, 5, 170, -192, 75, 165, -138, 141, 236, 219, -21, -171, -14, 202, 66, 33, 43, -164, 20, -85, 74, -22, 242, 54, 138, -35, 178, -198, -72, 37, 71, -43, -213, -128, 293, -15, 170]
8191A70
$$ Imaginary data points
##PAGE= N=2
##DATA TABLE= (X++(I..I)), XYDATA
0@%%%%%%%%%%%%%%Kl4O4o4O4o5R7j28J30j62J93k25K71l04L53m16M81n46O11o93
34c71P89q98J007j118J255j404J562j732J919k129K361k608K878l177L499l853
50b020M245m680N158n688O288o960P719q589R603j0794J2215j3957J6141j8975
64a0294K2819k8356L7096n3021R1420l52945n17787L70195K80515J31259P4510
75D5411K59807J32951m4724j07638k1350j03094j71284j46434n4642m0338P6070
86a75265K30040K26370J7042n5399L5007J2876k19496l05607j35711K2470j7347
97c65020j6586J47024K77775J81163J2027n4304m1827o1468r8007j20836j22626
108b62685o9117P1418J96660J93143J13149Q2908O8220l6251j75052j95728j00803
$$ y = [0, 0, 0, 0, 0, 0, 0, 0, 0, 0, 0, 0, 0, 0, 0, 2, -32, 32, -32, 32, -33, 64, -64, 66, -96, 97, -128, 143, -161, 192, -224, 257, -289, 322, -371, 418, -480, 527, -591, 664, -740, 822, -910, 1009, -1120, 1241, -1367, 1511, -1666, 1833, -2020, 2225, -2455, 2703, -2985, 3303, -3657, 4062, -4527, 5076, -5718, 6497, -7460, 8681, -10294, 12525, -15831, 21265, -31756, 59664, -293281, -811068, -440873, -160358, -29099, 45411, 305218, 438169, 393445, 285807, 264457, 161363, -9921, -156355, -210997, -251335, -175265, 54775, 281145, 298187, 242788, 277795, 290671, 71175, -234432, -370143, -347673, -365020, -381606, -234582, 43193, 224356, 236383, 182079, 140252, 78784, -19223, -140059, -262685, -331802, -260384, -63724, 129419, 242568, 325476, 393696, 357445, 182393, -13335, -114138]
119a14138l6923m7661l3525N8375J44303J43242Q2217K2745j9956o2760j12799
130B3120j52753j41397n7905M1579Q4200Q4877J16079J61917J28172k06j09834
141A77849j24534r0111p7497o9024k1623M8224R8434J15679J01329O5315K8436
152B52477k040o1451j49159j82141j07348l21M6958N9791J01007J32252Q4538
163A74563k527l9492l4362n9326j06588j11468o3714q48O3646J21244J26706P9100
175A46934M0913K8900j6962r8540j28233p8451l6633l7310o452Q7712J49982J12386
187A64246L7225n449l3779p2468r0924p8591o8334n4043n81O6429Q9518Q3638
199C6887R0310P5138r133j02011j09203n7420l9234n2231k2209M9540R1239Q7978
$$ y = [-114138, -151061, -198722, -232247, -173872, -29569, 113673, 195890, 218635, 198679, 135919, 23120, -129633, -271030, -328935, -287356, -203156, -118279, -2200, 159717, 287889, 287683, 177849, 53315, -36796, -114293, -183317, -204940, -156716, -58282, 57397, 158726, 224041, 252477, 250437, 188986, 39827, -142314, -249662, -249983, -203025, -143234, -42227, 90025, 174563, 172036, 132544, 98182, 38856, -67732, -179200, -242914, -243762, -180116, -58872, 67834, 146934, 187847, 216747, 199785, 101245, -26988, -105439, -142072, -179382, -185834, -98122, 51860, 164246, 201471, 196022, 162243, 89775, -1149, -79740, -148074, -202117, -202698, -136269, -46751, 36887, 127197, 202335, 193202, 91191, -18012, -75432, -114666, -166897, -189106, -139566, -48327, 39651]
211C9651P9239O5279J7249m3879p7660q9555q9181n6157O597M2791L9749N0071
223a5806R0327R5000K6893n1092p4311p0484q0718p9239k9553L4324O3080O3125
235b8454O3200O0992M2321J1561k8854p7039j02979p6545j8844J9577L4146N8616
247d2302Q8773P9911K7701j2953k1133l4049p1432r4542o6572r208L8568O2286
259e4952O7435N9932M3064J8907j5517n4401p2213o2540m5262l4047r670M4096
271a15168R3408R0832M6542Q806p865k6157n4068o9710n6728k7116J378K5175
283i0671M8083O9377P5344M9917j553n0168o6478n4187m2775m2587k6080J3731
295a18047N2499O3364N4522M4352K6762q513n2489p6384o4401l2123l937J2711
$$ y = [39651, 118890, 184169, 201418, 157539, 79879, -9676, -98857, -155014, -148417, -105626, -65877, -15806, 74521, 169521, 196414, 145322, 71011, 527, -80191, -159430, -188983, -154659, -91579, -28454, 34746, 95738, 138059, 149620, 120766, 43727, -59252, -135797, -154641, -135064, -100918, -42302, 46471, 126382, 154083, 141130, 119997, 85948, 14516, -80026, -146598, -155806, -117238, -54952, 12483, 72415, 115479, 134386, 118869, 64468, -7745, -70285, -115547, -149594, -159264, -115168, -21760, 69072, 115614, 124420, 116555, 90398, 36330, -33380, -90108, -117224, -115846, -90671, -42588, 26789, 102133, 152050, 150497, 100329, 33851, -20336, -63111, -105698, -131778, -118047, -65548, -2184, 52338, 96690, 123452, 114939, 62450, -13934, -78335, -110458, -114395, -101684]
307a01684K6201M6529O4971O2500L2181p357l5053n1418o2499o0549l1434J3052
319a04560M2206M4613L9355L9587M0407K0752j9098n6450o9168n6359l2952q067
331a19734J8135M5348O0371N2435K7463O229m940j9955m5516o4921n4842j7834
343a17761K0813M2489M9498N0105M3892K1967r224l2318m0960m2395m3889l9216
355i6999j4351K6901N8500N8012L8199J6790K369j5433l8454n2457m6528k6689
367i0140q589P156K8446N2960O2938M3291O560k4785l5549l6705l9025l7214k0597
380i1253Q337L1017M0492M2864M2015L0400R59l5593n4896m8148k9346j5441n275
393h3868J1811L5067M9395M3361K3447L702j2817l1915n0017n1705k9582L750
$$ y = [-101684, -75483, -28954, 36017, 98517, 130698, 123341, 88288, 36870, -25629, -86178, -117612, -104560, -62354, -17741, 21614, 61201, 101608, 122360, 103262, 46812, -22356, -78715, -111667, -119734, -101599, -56251, 4120, 56555, 84018, 90247, 85307, 65352, 19836, -45085, -99927, -117761, -96948, -54459, -4961, 45144, 89036, 111003, 101779, 69461, 28501, -13894, -57783, -96999, -111350, -84449, -25949, 32063, 70262, 87052, 89421, 73988, 35534, -16923, -63451, -90140, -98729, -91573, -63127, -10167, 52771, 96062, 102622, 77837, 42288, 5583, -33442, -70656, -91253, -82916, -51899, -11407, 31457, 73472, 103872, 104831, 69238, 14342, -33806, -63152, -78593, -83868, -72057, -36990, 12405, 55766, 79213, 82915, 70098, 38183, -11834, -63539, -93121, -89371]
405h9371K3807K8216L1726L9251L9335K0647j0006l2769m1226m0390l5173k0677
417h6630P006L4831M5975L6520K1694J3191N880j2159l7574n0406m2292j9499
429h3463R58J6537L4489M5573M0313J8113m608j6472k1988k9796l8145l4331j4474
442h7294J4334L6316M2290L6959K6702J1722q534k9703l7895l2026k2535j5897
454f5561o075J6511L9826M6518L2625J1808p828k2114l1601l5897l0736j7660
466g0184k86J4594K4515L2211L6858L1563R166k0182l6264l4057k5960j9633q853
479f6512R449K5913L2444L1061K5891J5157k402k2843l9153m0954k6967n743R616
492e5043J7441K3014K9492L0658J7562j034j7045k7432l4218l3830k0717J555
$$ y = [-89371, -65564, -37348, -5622, 33629, 72964, 93611, 83605, 50836, 9610, -30780, -65953, -86630, -79624, -44793, 1182, 37702, 59396, 72587, 78467, 66308, 28734, -21672, -63964, -83463, -82505, -65968, -31479, 14094, 54407, 72520, 67912, 51440, 29452, -344, -38489, -72820, -87294, -72960, -36644, 5646, 42605, 69307, 81029, 72495, 42792, 4897, -27129, -49664, -65561, -71636, -55125, -15299, 31219, 63844, 75652, 67824, 45710, 14109, -21788, -52524, -70184, -70470, -55876, -31361, 850, 37708, 69271, 78437, 58255, 21991, -12066, -38026, -57659, -66512, -57063, -31150, 1294, 32355, 58246, 73403, 71001, 48158, 9005, -31949, -58916, -64659, -55043, -37602, -14588, 14904, 45562, 63124, 62090, 45045, 17613, -16605, -50435, -71152, -69597]
504f9597K1493L0474K8263K2406J7830J0170m384k2403l4344l2680k2240p899
516f2911Q541K5737L4803L0629J7959L749o900j5163k2800k9567l0725j9402K529
529f3521K2297K9745K9309K4861J4790l131k0795k5147k2590j9860j8470q235
541f0747R936K6142L2955K9700J8587K156j2399k1047k5561k6333j9503n234P668
554d3680J4731K1543K9963K9955J1396j2275k4699k5071k3310k1224j1954L352
566e1273J6105K0748K2781K3580J7568L868j1849k4737l1809k6314j0314M755
578d6891J1708J5802K4063K8330J7312O70q569j3429k3019l0609k3103l188J1791
591c9132J7264J9388K1405J8846R451j733j2983k4787k8995k1253r138J383J3514
$$ y = [-69597, -48104, -17630, 10633, 33039, 50869, 61039, 56655, 34252, -92, -32772, -55012, -62911, -54370, -28633, 6170, 36799, 54758, 58507, 51607, 36444, 13644, -15923, -46648, -66050, -63521, -41224, -11479, 17830, 42691, 57481, 54350, 33555, 8408, -14182, -34042, -52512, -60747, -50811, -24669, 8286, 37986, 56573, 58729, 46330, 25283, -278, -26611, -46114, -51348, -43680, -28949, -7406, 22557, 52512, 63908, 51633, 26934, 1863, -21447, -42671, -54625, -51273, -35168, -14420, 8361, 31941, 49509, 53377, 41528, 16791, -15018, -41332, -51646, -46891, -35183, -19381, 4682, 33012, 50324, 50994, 42425, 28996, 5977, -24632, -47735, -50923, -39132, -21868, -2480, 18925, 37771, 47222, 45489, 32506, 7719, -21276, -42529, -51667, -50284, -36770]
604c6770K6682K8883J6449K893m67l045j4210k5490k4366j3840l153P750J9951
617a8733K7299K4492J3813J588j1113j8687j8810j6760j6078j2347K97J7850K5585
630a604K1546J4480Q571k760j5177k3369k0395j3054q190k243P367J7895K5579
643H646K4034J3980j489j4849j9833j9472j6826j0703l38R096J4197J5077J6504
656A8024J7337J1054n154j9488k3835k0138j3431n842M361J4492J9785J8246J3346
669B8757P321j195r993j6776k1588j9317q706N477J3332J4134J4989J6678J4256
682C7369L258r233j5796j8308j8835j5316m202J1069J9038J8652J4123Q431K663
695C2913m193j0223j5938j8494j5346o369L124J0242J7095K1140J7190N153o632
$$ y = [-36770, -10088, 18795, 35244, 38137, 37670, 34625, 20415, -5075, -29441, -43281, -46434, -38684, -18733, 8566, 33058, 46871, 48459, 37346, 18659, -151, -16911, -32989, -45336, -45039, -27189, -1604, 19942, 34422, 42993, 40233, 25056, 1687, -18708, -31762, -39952, -42195, -34828, -16933, 8646, 32680, 46660, 45171, 30322, 10489, -8983, -25809, -36512, -36850, -27754, -13557, 1520, 18024, 35361, 46415, 41261, 21773, -2062, -22200, -35631, -41473, -37112, -22620, -2835, 15411, 28757, 36078, 34883, 24890, 8114, -13474, -32791, -41497, -36020, -22688, -8554, 6435, 23113, 37369, 40627, 31394, 15598, -2710, -21545, -36861, -41063, -29994, -10956, 7696, 21819, 30250, 32913, 28720, 18497, 2559, -15935, -31281, -37650, -34526, -24284, -7189, 13951, 31141, 36294, 29662]
708B9662j1237j0763j4565j6848j1802j47J1332J6527J7423J5223R432M33r241
721B5429j4222j5561j3198r589m447J464J0119J8658K0580J3172J832o521j2254
734A5462j6543j7375j1201m62N708O920R100J4771J6856J0736o24j0679j5580
747G089j6653j3187p193j69Q342J4369J5599J1604P043L061k769j2556j9093j6992
761b1505p553M89M884R685J4087J4642R164L061k235p034j2590j6331j4963p163
775c3362M497J3460J5501J1955Q468O027N64p357j2664j3504j0832p818l277M792
789b3550J3645J7043J2962N911m88n300r046j2795j3736r764l021M196R561J3534
803h48J4683J0608L021n665j0150j1131r298q469o860j696P106J3748J4058J1440
$$ y = [29662, 18425, 7662, -6903, -23751, -35553, -35700, -24368, -7841, 9582, 24805, 34237, 34670, 25429, 11207, -4354, -17552, -27141, -31588, -30124, -20005, -1347, 19233, 32405, 34237, 27716, 15462, -1081, -18456, -29657, -30119, -24411, -17491, -8391, 6380, 23236, 33972, 33348, 22669, 7089, -9564, -22751, -29944, -30113, -21771, -7402, 8197, 19801, 26844, 29905, 27136, 14580, -4513, -21505, -29058, -28569, -23685, -14000, 87, 14729, 23893, 26954, 24719, 17685, 5095, -11236, -26199, -33362, -28865, -15405, 96, 12051, 20519, 26546, 27110, 19753, 7089, -6415, -17247, -25065, -28342, -23550, -9905, 7138, 20100, 26011, 25523, 20223, 11177, -1618, -15354, -25118, -28139, -23943, -14382, -848, 13835, 24443, 27464, 21799, 11649, 518, -8780, -17249, -24109, -25805, -18699, -4951, 9107, 20547]
817B0547O108P6p771j3599j4363q974l506j75L587P971J1846J2426R107K615n289
832B0606j0832j2379j1595q252k721N261R493R887Q922R472O928q73r013j2900
846B004j2485r056l507K039P691J0207J0069Q762N711K3m156q471j1622j3019
860a5810q569L52P539R940R923R777O815J074m465p375q750j0350r011m348K509
875b0749Q726J1953J1500P365J605k428n467q549j0562r377m251N17M729R065
889e923J2129J0572M775k009o231q132r149q028n980k165L406P402J0492J0289
903A1448P305K009l028q988j1364q816n017r68J248M397Q754J0949Q323L726j338
918A8640o128r341j0606q194l193K034N354P216P503Q356O091K123m663r194j0064
$$ y = [20547, 26655, 26731, 18960, 5361, -9002, -17976, -21482, -21657, -18070, -10099, 1747, 14173, 23280, 25895, 20606, 9774, -2605, -14200, -22452, -25173, -19912, -10419, -532, 8390, 17862, 24790, 23917, 14904, 2004, -10481, -19537, -23044, -21005, -13314, -3107, 6962, 15724, 21435, 21458, 17302, 8831, -2791, -15810, -24379, -24027, -16488, -6548, 3375, 13152, 19967, 21041, 16576, 9201, 451, -9899, -18910, -23258, -20749, -12023, -70, 11430, 18795, 20400, 17972, 12505, 3956, -6606, -15983, -20234, -19717, -14988, -5923, 6206, 16778, 21553, 19544, 13313, 5181, -3968, -11996, -17976, -20141, -16735, -9333, 1159, 11448, 18753, 20762, 17734, 8746, -2618, -11434, -16451, -17419, -16171, -11774, -3020, 7929, 16252, 19978, 18640, 12512, 3171, -7435, -15629, -18822, -16788, -11434, -4218, 3285, 11641, 17732, 19855, 15192, 5998, -4066]
933d066q365n444q20M047Q124R324O974M640K257o64n325r376j0903p188j827
948a8612L356O158Q303Q323P069K152j609m442o457q166q333n926j74N911R132
963c315Q718O612L584K36l342o800q168o934n083k094J861O065R682R821N070
978A5913J33l278n504p260o989o057k592J400M604P013Q375P740L708j622o093
993I491q008p197n041k969o31L119O386P796P172M653Q92l212o851r186o810l739
1009a4135p9K971M992O131O770N956K705j554n522p509q062n943j996K377N723
1024g175O650N758M964K939O82l436o809q013o573l319L56M092O525P343N468
1039I452L149l7k248m337o432p213n730j659L208O280P009O442M181Q39k114m081
$$ y = [-4066, -12431, -17875, -18695, -14648, -6524, 2800, 9774, 14414, 16671, 16007, 10682, 1306, -9597, -16785, -18612, -15256, -9098, -795, 7528, 14597, 16749, 15140, 10698, 4241, -3925, -12258, -18184, -18358, -12447, -3315, 5403, 12015, 15599, 15835, 12493, 5693, -2475, -9409, -14492, -16586, -14725, -8660, 1022, 10843, 15913, 16046, 12768, 7264, 4, -6985, -13042, -15634, -14234, -9630, -2617, 5758, 13498, 17206, 15584, 9491, 1483, -5714, -10755, -13724, -14355, -11236, -4850, 2946, 10118, 14771, 15663, 12451, 5600, -3586, -10396, -14135, -14214, -11243, -6251, -120, 6650, 12606, 15311, 13757, 8235, 726, -7336, -13279, -15275, -12898, -7175, -525, 5233, 10197, 13136, 13818, 10382, 3573, -4440, -11013, -14332, -13976, -9884, -3359, 3984, 9452, 12601, 12564, 10316, 5979, -453, -7666, -13396, -15055, -11847, -5567, 1442, 7884, 12065, 12904, 10790, 6709]
1055F709o054n699n113l074K36L910P277P637N480J514j342l619n125o259n209
1070h731k960k87K452M482P148O652M301L51l840n901o035m911l187j290J162
1085a0594M369O233O092M502K084j251m725o963o190l975p13J078L224M446N808
1100C425N012L409K7l352n452o077n922l280O45M161N058M835L946L679J565k023
1116I656m349o206n950m018j162K369M730N955M847L681O66j272k457m709o192
1131d411m949k373J339M134M749N670M548K222j334l046m032m364m688l490j184
1146a1209K479N195O119M876K313O8k150l778n629m221k519j189N32K799N696
1161f18O152L994Q89j664l681n102m287l237j663M94K770M430M451M227L124K54
$$ y = [6709, 655, -5044, -10157, -13231, -12995, -9085, -1808, 5829, 11309, 12823, 11481, 7862, 2737, -3522, -8731, -11691, -11978, -9526, -5044, 2104, 8756, 13057, 13408, 9568, 3667, -2368, -7279, -10466, -11756, -10594, -6225, 8, 6100, 10602, 12686, 11435, 6710, -253, -6443, -10418, -11131, -10053, -6829, -2383, 3425, 8437, 11846, 11873, 8521, 3069, -3008, -8930, -12210, -11565, -7404, -2346, 2489, 6435, 10114, 11679, 9656, 5307, -899, -6849, -10867, -12029, -9660, -4930, 1025, 5872, 9553, 10219, 8947, 6490, 1781, -4411, -9360, -11733, -10394, -6260, -1511, 4159, 8707, 10929, 9595, 6549, 2517, -1847, -6535, -10025, -11209, -8730, -3535, 2584, 7460, 9773, 9841, 7691, 3913, -1716, -5937, -8456, -9645, -9113, -6314, -618, 5534, 9528, 10417, 8753, 5072, -30, -4317, -7554, -9217, -8723, -5953, -1523, 2928, 7155, 10279, 10533]
1177A0533l437n595n041k799k219o50K002M280L972L779L402J792j858m210m967
1192a016m661l861k43K711L831L209L535L845K201j449l176l691m293m316k257
1207i631J284L894L358L960L822J764q14j844l048m119m827k891O08J904L261
1222c319M283M970K417q31j716k151l450m639l214p25R04K922M380N292K616K66
1238H005q76k452m102l999k652n26n24J244L620N217L690R05j85j601m055m039
1254b330k809j535q01J047L651L865L434K265J481j416m183m324k341j955j100
1269g051M71K980L619L065K529K007R7l001m150l861k723j493J048K928K640K804
1285A909K410K440K26k076k959k930l495k880p5K410L312K668K758K076O46q46
$$ y = [10533, 7096, 1501, -3540, -6339, -8558, -9208, -7206, -2926, 1046, 4825, 8227, 10019, 8161, 3951, -1016, -5677, -9538, -9781, -7070, -3239, -30, 3505, 7350, 9551, 8102, 4926, 1235, -3058, -7374, -9631, -8347, -4453, -1095, 2865, 6687, 8451, 7637, 5793, 2745, -1374, -6201, -9092, -8484, -6580, -3319, 964, 5934, 8351, 7520, 5804, 3653, 203, -4436, -7650, -8375, -7471, -4549, -169, 5123, 7739, 8005, 7129, 4677, 575, -3424, -6076, -6602, -7126, -5882, -2262, 2955, 6645, 7550, 7365, 5764, 1709, -2330, -5139, -6674, -7475, -6428, -2777, 1088, 4522, 6787, 8268, 6852, 2669, -1655, -3996, -5951, -7051, -6580, -3600, 19, 3084, 5613, 7620, 7717, 4716, 566, -3295, -6018, -7511, -6463, -3535, -895, 1909, 4319, 6759, 6985, 4909, 1950, -980, -4475, -7355, -7430, -5020, -1708, 960, 3718, 5794, 6440, 5594]
1301E594k397l309l269k823o67J070K829L082L690J963K41j076j257k039l357
1316a725l254j206K1J689K923L569L203J304l48k035k549l245k194j382o42P95
1332e076K356L963K673J430P05r30k486l096k812j571r29Q97J488L110K629K631
1348D982J458r16k455k884k464j899j375J90K141K317K231J861K241O66j877k673
1364A544k798k608j485l16J859K352K118K386K158L76j633j363k107l228k612
1379e357o31J793J892K042K396K347P28q25p02k471k635k942r17K78J393K402
1395a209L098K553l0k17p90j677k494k517j144n81J017J365L304K924J304j08
1411D798j028j753k671j773j428o52n6J537K906K820J381K25L5j044l072k591
$$ y = [5594, 3197, -112, -3381, -6204, -6871, -5801, -2972, 110, 3800, 5763, 6004, 4928, 3671, 1632, -1725, -4979, -6185, -6164, -4475, -1552, 2017, 5220, 6524, 6176, 4141, 1592, -1653, -3847, -5229, -5871, -5076, -2720, 1243, 3916, 5346, 6051, 5121, 2635, -461, -3273, -4844, -5773, -4876, -3388, -278, 2351, 4982, 6440, 5524, 3069, 185, -2279, -4178, -5553, -5363, -3222, -905, 1326, 3187, 5428, 6094, 4217, 1544, -1254, -3862, -5347, -5663, -3804, -1452, 666, 3052, 5210, 5586, 3953, 2590, 483, -2745, -5357, -5988, -4195, -2303, -261, 2135, 4482, 5210, 4385, 3683, 1212, -1423, -4365, -5282, -5004, -3611, -1209, 1889, 4442, 4412, 4195, 3405, 1728, -766, -3283, -4427, -5008, -3991, -2626, 678, 3602, 4906, 4798, 3770, 2017, -654, -2427, -3855, -4507, -4563, -3026, -120, 2700, 4081, 4306, 4341, 3297, 225, -2366]
1427b366j224n37j36R00J715K991K075J437j32j233k251k482j764j008k32Q78
1443c369J947J736J706J677J005n87k150k561k082j255p59O27J955J991J894J728
1459C503P42l43j127j804k309k349r84N66J622J894J483K078J007J19r70j737
1475A391j796k044j771q3P66K088K458J536J165k77q3j629j460k118j534m23r5
1492c909J204K163K464J755J27o49j008j444j920j559j019R8J009J759K125J680
1508B876J079L47j527j736k099j296q27m13L77J173K121J707J671O85p19j442
1524A977k165j997j087l85M91J068J773J474J578Q77K30j640j436k086j266r70
1540c564K8J205J463J606J432J130L10n81j702j782j837j405J21Q80J405J679
$$ y = [-2366, -3590, -4127, -4263, -3363, -1648, 1343, 3418, 4855, 4723, 3490, 1239, -1243, -3007, -4015, -4247, -3369, -1422, 314, 2020, 3697, 4702, 4115, 1965, -596, -2678, -3933, -4692, -4065, -2110, -119, 1775, 3503, 4245, 3902, 2775, 971, -1338, -3687, -4671, -4105, -2483, -589, 894, 2972, 3979, 4098, 3128, 1391, -405, -2449, -4220, -4303, -3537, -1449, 1009, 2545, 3710, 3433, 3350, 1721, 261, -1857, -3391, -3814, -3909, -2705, -542, 1922, 3677, 3804, 3155, 2147, 703, -1217, -2776, -3795, -3697, -2688, -929, 1196, 2876, 3955, 4302, 2775, 1039, -1060, -2356, -3183, -3596, -3219, -2046, 75, 1782, 3453, 4138, 3419, 1977, -188, -2185, -3272, -3657, -3166, -2098, -325, 1149, 2727, 3604, 3834, 2194, 758, -1328, -2594, -3564, -3536, -2331, -868, 738, 2170, 3300, 3610, 3029, 1327, -455, -2292, -3697, -3576, -2696, -1291, 388]
1556C88J330J106L56o77p20j244j739j689r50O30J406J830J287J216Q22l01p11
1573B340j367j715j583o47l16P26J640J780J482Q57k64m57j348j739r79j247l49
1590c186K59R97J782J783J560K49o12j435j371j338j148m68J87N31J406J771J440
1607B407O17K22q17j702j711j427l35M8L99J006J547J593J074L46r09j007j827
1624d76j307r40n19Q67J084J273J148R16P60j11o44j515j964r49l35j63J177J299
1642c99J537R33Q43m49m24j115j557j476q77k84J166J062J620J032J051K1l05
1659B379j245j026j167j256m59J80J231J426J478P97L89k34p98j167j554j013
1675b039n60j1L73J261J787J279P49r4p84j387j075r25j005k32N91Q79J291J323
$$ y = [388, 1718, 2824, 3180, 2503, 1783, 539, -1200, -2889, -3839, -3209, -1803, 27, 1314, 2530, 3352, 3051, 2340, 973, -742, -2325, -2972, -3288, -2562, -922, 858, 2340, 3197, 2933, 2476, 1128, -611, -1590, -2837, -3186, -2927, -1930, -148, 1635, 3195, 3444, 2832, 1397, 26, -1312, -2460, -2928, -2741, -2210, -804, 967, 2407, 3024, 3246, 2429, 727, -984, -2411, -2746, -2698, -2299, -1293, 254, 1847, 2921, 3267, 2358, 1351, -476, -1783, -2723, -3242, -2375, -1291, -18, 1130, 2046, 2806, 2695, 2051, 536, -1428, -2377, -2712, -2875, -1698, -399, 1138, 2071, 2914, 2465, 2041, 926, -631, -2107, -2984, -3268, -2102, -1040, 580, 1612, 2663, 2684, 2379, 1134, 108, -1059, -2315, -2774, -2594, -1363, 63, 1541, 2338, 2727, 2493, 1695, 528, -1026, -2039, -2599, -2610, -2237, -976, 811, 2090, 2839, 2745, 1961, 574, -501, -1426, -2431, -2663, -2072, -1193, 98, 1421]
1693A421J013L29m23j145j524j026o98k98K62P23R40J217R14R31j03q80j116j264
1711g27j144n11J72N82Q51J543P83P49P5o52o17j234j405r34K34J86J057J107
1729A15J148O90M01l14p25r48j348r91n25L68R28J061J230N82L36J22o75q82r49
1748c76j062n35l53L15J367J238Q78L85L19m79q64j284r09l20m62p9J050R58J349
1767A136O46M84m27o59j063r38r03l36j01R39R02J149Q56N10m14j11j541o90j061
1786a622k29Q6K25N99R40J066R98K6l76q30r77j036j063J18L19Q04R84N93J149
1805A774M39k00p82r96q35j368k08J94Q17R20P71Q01N73n0j47j110p85j212o28
1824b032K2M51J058Q90O67P17j48r7n14r51q24q94n36N31O66O36J222O27M25r8
$$ y = [1421, 2434, 2763, 2340, 1195, -329, -1355, -2053, -2351, -2089, -1366, -426, 791, 1705, 2636, 2533, 1653, 537, -727, -1871, -2382, -2210, -1628, -777, 766, 1549, 2298, 2373, 1721, 1104, -130, -1535, -2469, -2235, -2049, -992, 115, 1263, 1953, 2354, 2040, 1315, 367, -981, -1972, -2497, -2129, -1201, -140, 1090, 1672, 2008, 2130, 1455, 573, -376, -1438, -1973, -2326, -2011, -644, 594, 1472, 1857, 2176, 1697, 833, -451, -1360, -1680, -2142, -2221, -1171, -213, 1136, 1782, 2266, 1839, 1180, 117, -821, -1724, -2060, -2161, -1222, -320, 829, 1685, 2195, 1781, 1670, 129, -561, -1622, -1851, -1765, -1540, -941, -1, 1065, 2063, 2089, 1713, 883, -94, -1130, -2193, -2075, -1756, -952, 32, 625, 1774, 2213, 2013, 1231, 235, -600, -1968, -2176, -1982, -1165, -245, 526, 1327, 1900, 1850, 1703, 593, -192, -1404, -2032, -2010, -1559, -501, 389, 1056, 1773, 1625, 1528, 1014, 63, -761, -1655, -2191, -1660, -994, -358, 864, 1491, 1916, 1818]
1844A818q30o42o22j031o68JM11R71J067Q72L56K70n30r71q94p27m98k8L15M70
1864h90J056J127L60M91m52p37j074j016m75j04J89L38P76Q43Q31O67k25m50n25
1883G30j346q61j44M8K51R44O75Q17N86L7m26o42r02j111l20j29N82M92Q72P40
1903H93P01j8J1o78n88r34p62l36j13O41J263Q28L66J68P3l12p90p15r36k76k04
1924a718M71N62J015O13N29K98k58p84j028m44p62j96q8R80Q06R16O16j40Mo27
1944G65o40r55k75o41J39N18P09Q69N72M20K40p80q11o29o73l14k21M42O80L97
1964a88J148M26J50l4q87n43q74n57j38J09O54N10O99J052L60l09p42m56r15r22
1984a457j71p6O82P33N26O06N92K38n83n20n68j094l01l68M17N38J109N88M05
$$ y = [1818, 988, 346, -276, -1307, -1975, -1974, -1563, -592, 475, 1347, 1703, 1973, 1443, 472, -422, -1149, -1647, -1675, -1360, -890, 166, 1293, 1653, 2144, 1692, 955, -119, -1135, -1610, -1714, -1525, -1187, -411, 432, 1263, 1930, 1705, 1255, 730, -616, -1477, -1621, -1573, -1322, -378, 297, 1114, 1700, 1737, 1311, 669, -233, -1344, -1664, -1793, -1211, -719, 153, 893, 1594, 1576, 1587, 909, 321, -613, -1375, -1711, -1824, -1183, 80, 908, 1274, 1442, 1515, 1203, 413, -302, -1238, -1514, -1718, -1247, -685, 330, 943, 1472, 1770, 1512, 728, -300, -744, -1506, -1702, -1790, -810, -4, 912, 1528, 1388, 1392, 765, 125, -830, -1105, -1746, -1607, -1089, -380, 489, 1061, 1481, 1721, 941, 130, -499, -1172, -1486, -1707, -1265, -585, -188, 960, 1386, 1536, 1502, 615, 72, -802, -1359, -1497, -1388, -734, -224, 475, 1527, 1887, 1578, 836, 380, -535, -1457, -1628, -1704, -1022, -289, 237, 843, 1435, 1673, 1090, 570, 2, -1092, -1393, -1761, -1344, -806, 303, 891, 1296]
2003A296J38l80r6o89r60l98l83J73N04M67R01O58J33j91k76o22o01n01n05j86
2023a518O12P99L92P22J78K15k93r58j91r72l10kJ28M15R47L87Q76J38l06m03
2043H56q08n31n53k00o1J64P21P26N96Q00j62o65n69p27o98l66L64j0P19M62R16
2064I74J03M85k59n70p52p85o71m4K83P96O59L57N34L48j42k86q08o61m20m35
2084a294j06M10O37Q72M93L58j29k85n22p45o60k15q3M7Q02Q83M94K01n6j7l79
2105G06o20j017k79N2J43L08N32R23L00L78l24l68q91l65m58o6j37R2O56Q22N35
2126I22O56k18m56o13n30n30l02j58K02L24Q22P07N52k04n5m38o25q31k58k21
2146a254M0L35P49N13O18L34l8l07p82q74k35l05k8L67M29O10R64j65q8N9m41
$$ y = [1296, 1434, 1054, 958, 269, -691, -1089, -1472, -1299, -795, -328, 573, 1231, 1364, 1173, 897, 275, -326, -827, -1332, -1518, -906, -107, 285, 1007, 1185, 1400, 1107, 149, -42, -1014, -1324, -1326, -1198, -783, 164, 551, 1427, 1565, 1259, 856, 48, -483, -1036, -1236, -1297, -1133, -412, 314, 910, 1710, 1548, 883, 314, -413, -1111, -1477, -1113, -1123, -404, 58, 974, 1077, 1562, 1303, 733, -19, -804, -1475, -1519, -1236, -440, 219, 576, 1110, 1458, 1316, 1030, 222, -439, -859, -1294, -1400, -990, -353, 519, 1012, 1370, 1241, 956, 434, -311, -971, -1186, -1269, -1222, -420, 463, 957, 1158, 1102, 1085, 706, 86, -931, -1210, -1158, -1015, -707, -175, 748, 1048, 1426, 1102, 734, -157, -522, -980, -1046, -1183, -1091, -435, 387, 922, 1578, 1360, 904, 291, -239, -769, -1071, -1229, -1027, -703, 119, 826, 1378, 1174, 1119, 681, 56, -775, -1033, -1254, -1214, -879, -130, 383, 1001, 1335, 1297, 990, 208, -666, -901, -1206, -1234, -867, -438, 172, 1136, 971, 883, 942, 501]
2167E01n30p36l30j65L21M80O22M52K39M64m6p41n42m85n61j54k48L10J115N81
2187E47K98K49J62n47k8p87n66n96j4L55M42P41P64K03L2k81p05n28l68n63j23
2208a313J59L46Q58N22P00O3j48o58l37j015J48m75N0O1P75N91N25L19J13j67
2228A117o59p03m56m88R5J98L80P66M12M97L17n30l27p30n12o58N8J98M71M59
2248i5O96L35J2K60l30o57l24p94k66L7J35O28O54N13J17O2k15j34p48l29o75
2269a118l19M76L59P05N86L35j53K98m99n58m13o71j50Q8mR77L27R82Qj90m48
2290F18l67p49k42j49l28K4O06R01N41J36K45m62n8j055m51k40k07K66L98L88
2310a85N70Q44m9j63n21l75p01l89j72K27L62K96O90N66O0J49l52o33n66n44l92
$$ y = [501, -29, -765, -1095, -1260, -939, -459, 163, 615, 854, 1318, 1272, 531, -11, -496, -1057, -1211, -1459, -1149, -34, 547, 845, 1094, 1256, 709, 681, -106, -672, -1268, -1282, -927, -485, 256, 1020, 1223, 1255, 974, 269, -259, -627, -1190, -1313, -1154, -808, 50, 572, 1272, 1335, 1187, 529, 192, -823, -675, -1150, -1100, -1039, -264, 327, 852, 1171, 1284, 1117, 458, -245, -701, -1189, -1094, -896, -516, 250, 662, 1159, 1476, 946, 619, -111, -623, -1281, -1223, -1025, -554, -95, 601, 936, 948, 1208, 878, 221, -103, -897, -1163, -1126, -991, -363, 291, 804, 921, 983, 768, 634, -114, -443, -1118, -1437, -961, -602, 103, 689, 1024, 871, 1169, 670, 112, -301, -972, -1122, -1034, -1038, -61, 266, 1248, 1256, 1066, 618, 251, -498, -740, -889, -1217, -1193, -587, 314, 855, 991, 1236, 774, 716, -339, -790, -1030, -1237, -971, -573, -185, 385, 1229, 1180, 1017, 496, 121, -580, -969, -1141, -914, -552, -256, 434, 1000, 1060, 1209, 857, 224, -342, -886, -1278]
$$ [...]
8191i8
##END NTUPLES=NMR FID
##END=
