##TITLE=1H ikalashn
DE-75k3 TFA
20.12.2024
##JCAMPDX= 6.0         $$ Bruker NMR JCAMP-DX V2.0
##DATA TYPE= NMR FID
##DATA CLASS= NTUPLES
##ORIGIN= UXNMR, Bruker Analytische Messtechnik GmbH
##OWNER= root
$$ TOPSPIN		Version 1.3
$$ 2024-12-20 14:05:23.093 +0400  Irina@DPX200
$$ Compression mode = diff/dup
##.OBSERVE FREQUENCY= 200.131300845
##.OBSERVE NUCLEUS= ^1H
##.DELAY= (6, 6)
##.ACQUISITION MODE= SIMULTANEOUS
##.ACQUISITION SCHEME= undefined
##.AVERAGES= 64
##.DIGITISER RES= 18
##SPECTROMETER/DATA SYSTEM= spect
##.PULSE SEQUENCE= zg
##.SOLVENT NAME= CDCl3
##.SHIFT REFERENCE= INTERNAL, CDCl3, 1, 17.49637
##AUDIT TRAIL= $$ (NUMBER, WHEN, WHO, WHERE, WHAT)
$$ ##TITLE= Audit trail, TOPSPIN		Version 1.3
$$ ##JCAMPDX= 5.01
$$ ##ORIGIN= Bruker BioSpin GmbH
$$ ##OWNER= Irina
$$ $$ F:/spectra/data/iren/nmr/1H/4/audita.txt
$$ ##AUDIT TRAIL=  $$ (NUMBER, WHEN, WHO, WHERE, VERSION, WHAT)
(   1,<2024-12-20 14:04:49.312 +0400>,<Irina>,<DPX200>,<TOPSPIN 1.3>,
      <created by zg
	started at 2024-12-20 14:00:36.390 +0400,
	POWCHK disabled, PULCHK disabled
       configuration hash MD5:
       BE 6D 3F 07 2A EA 11 49 91 17 2B D3 AF B3 58 0D
       data hash MD5: 16K
       BA 51 79 C9 7C 92 7A BC ED 05 6C FA 47 3F 8D 50>)
$$ ##END=
$$ 
$$ $$ hash MD5
$$ $$ 7B 85 BD 31 2E 40 9A 7B 66 14 82 64 FD C3 62 D7
##$RELAX= 
##$RELAX= 
##$RELAX= 
##$RELAX= 
##$RELAX= 
##$RELAX= 
##$RELAX= 
##$RELAX= 
##$RELAX= 
$$ Bruker specific parameters
$$ --------------------------
##$DU= <F:/spectra>
##$EXPNO= 4
##$NAME= <1H>
##$PROCNO= 1
##$TYPE= <nmr>
##$USER= <iren>
##$AMP= (0..31)
100 100 100 100 100 100 100 100 100 100 100 100 100 100 100 100 100 100 
100 100 100 100 100 100 100 100 100 100 100 100 100 100 
##$ANAVPT= -1
##$AQSEQ= 0
##$AQ_mod= 1
##$AUNM= <au_zg>
##$AUTOPOS= <>
##$BF1= 200.13
##$BF2= 200.13
##$BF3= 200.13
##$BF4= 200.13
##$BF5= 200.13
##$BF6= 200.13
##$BF7= 200.13
##$BF8= 200.13
##$BYTORDA= 1
##$CFDGTYP= 0
##$CFRGTYP= 5
##$CHEMSTR= <none>
##$CNST= (0..63)
1 1 145 1 1 1 1 1 1 1 1 1 1 1 1 1 1 1 1 1 1 1 1 1 1 1 1 1 1 1 1 1 1 1 
1 1 1 1 1 1 1 1 1 1 1 1 1 1 1 1 1 1 1 1 1 1 1 1 1 1 1 1 1 1 
##$CPDPRG= <>
##$CPDPRG1= <>
##$CPDPRG2= <>
##$CPDPRG3= <>
##$CPDPRG4= <mlev>
##$CPDPRG5= <mlev>
##$CPDPRG6= <mlev>
##$CPDPRG7= <mlev>
##$CPDPRG8= <mlev>
##$CPDPRGB= <>
##$CPDPRGT= <>
##$D= (0..63)
0 2 0 0 0 0 0 0 0 0.06 0 0.03 0 0 0 0 0.0002 0 0 0 0 0 0 0 0 0 0 0 0 0 
0 0 0 0 0 0 0 0 0 0 0 0 0 0 0 0 0 0 0 0 0 0 0 0 0 0 0 0 0 0 0 0 0 0 
##$DATE= 1734689088
##$DBL= (0..7)
120 120 120 120 120 120 120 120 
##$DBP= (0..7)
150 150 150 150 150 150 150 150 
##$DBP07= 0
##$DBPNAM0= <>
##$DBPNAM1= <>
##$DBPNAM2= <>
##$DBPNAM3= <>
##$DBPNAM4= <>
##$DBPNAM5= <>
##$DBPNAM6= <>
##$DBPNAM7= <>
##$DBPOAL= (0..7)
0.5 0.5 0.5 0.5 0.5 0.5 0.5 0.5 
##$DBPOFFS= (0..7)
0 0 0 0 0 0 0 0 
##$DE= 6
##$DECBNUC= <off>
##$DECIM= 32
##$DECNUC= <off>
##$DECSTAT= 4
##$DIGMOD= 1
##$DIGTYP= 9
##$DL= (0..7)
0 120 120 120 120 120 120 120 
##$DP= (0..7)
150 150 150 150 150 150 150 150 
##$DP07= 0
##$DPNAME0= <>
$$ [...]
##$SW= 21.9926040160658
##$SWIBOX= (0..15)
0 0 2 0 0 0 0 0 0 0 0 0 0 0 0 0 
##$SW_h= 4401.40845070422
##$TD= 16384
##$TD0= 1
##$TE= 300
##$TE2= 300
##$TE3= 300
##$TEG= 300
##$TL= (0..7)
0 120 120 120 120 120 120 120 
##$TP= (0..7)
150 150 150 150 150 150 150 150 
##$TP07= 0
##$TPNAME0= <>
##$TPNAME1= <>
##$TPNAME2= <>
##$TPNAME3= <>
##$TPNAME4= <>
##$TPNAME5= <>
##$TPNAME6= <>
##$TPNAME7= <>
##$TPOAL= (0..7)
0.5 0.5 0.5 0.5 0.5 0.5 0.5 0.5 
##$TPOFFS= (0..7)
0 0 0 0 0 0 0 0 
##$TUNHIN= 0
##$TUNHOUT= 0
##$TUNXOUT= 0
##$USERA1= <user>
##$USERA2= <user>
##$USERA3= <user>
##$USERA4= <user>
##$USERA5= <user>
##$V9= 5
##$VALIST= <valist>
##$VCLIST= <CCCCCCCCCCCCCCC>
##$VD= 0
##$VDLIST= <DDDDDDDDDDDDDDD>
##$VPLIST= <PPPPPPPPPPPPPPP>
##$VTLIST= <TTTTTTTTTTTTTTT>
##$WBST= 1024
##$WBSW= 25
##$XGAIN= (0..3)
0 0 0 0 
##$XL= 0
##$YL= 0
##$YMAX_a= 2483910
##$YMIN_a= -3776729
##$ZGOPTNS= <>
##$ZL1= 120
##$ZL2= 120
##$ZL3= 120
##$ZL4= 120
##$ABSF1= 10
##$ABSF2= 0
##$ABSG= 5
##$ABSL= 3
##$ALPHA= 0
##$AQORDER= 0
##$ASSFAC= 0
##$ASSFACI= 0
##$ASSFACX= 0
##$ASSWID= 0
##$AUNMP= <proc_1d>
##$AXLEFT= 0
##$AXRIGHT= 0
##$AXTYPE= 0
##$AXUNIT= <>
##$AZFE= 0.1
##$AZFW= 0.1
##$BCFW= 1
##$BC_mod= 2
##$BYTORDP= 1
##$COROFFS= 0
##$CY= 7568.61572265625
##$DATMOD= 1
##$DC= 2
##$DFILT= <>
##$DTYPP= 0
##$F1P= 17.9538593292236
##$F2P= -4.03888763876832
##$FCOR= 0.5
##$FTSIZE= 32768
##$FT_mod= 4
##$GAMMA= 1
##$GB= 1
##$INTBC= 1
##$INTSCL= 1
##$ISEN= 128
##$LB= 0.02
##$LEV0= 0
##$LPBIN= 0
##$MAXI= 945.577
##$MC2= 0
##$MEAN= 0
##$ME_mod= 0
##$MI= -402.1523
##$NCOEF= 0
##$NC_proc= 0
##$NLEV= 6
##$NOISF1= 8.587773
##$NOISF2= 6.764455
##$NSP= 1
##$NTH_PI= 0
##$NZP= 0
##$OFFSET= 17.49637
##$PC= 1
##$PHC0= 254.3757
##$PHC1= -1.979401
##$PH_mod= 0
##$PKNL= yes
##$PPARMOD= 0
##$PPDIAG= 0
##$PPIPTYP= 0
##$PPMPNUM= 100
##$PPRESOL= 1
##$PSCAL= 0
##$PSIGN= 0
##$REVERSE= no
##$SF= 200.13
##$SI= 32768
##$SIGF1= 18.5376
##$SIGF2= -6.396296
##$SINO= 400
##$SIOLD= 32768
##$SREGLST= <1H.CDCl3>
##$SSB= 3
##$STSI= 0
##$STSR= 0
##$SW_p= 4401.40845070422
##$SYMM= 0
##$S_DEV= 0
##$TDeff= 0
##$TDoff= 0
##$TI= <>
##$TILT= no
##$TM1= 0
##$TM2= 0
##$TOPLEV= 0
##$USERP1= <user>
##$USERP2= <user>
##$USERP3= <user>
##$USERP4= <user>
##$USERP5= <user>
##$WDW= 1
##$XDIM= 8192
##$YMAX_p= 0
##$YMIN_p= 0
$$ End of Bruker specific parameters
$$ ---------------------------------
##NTUPLES= NMR FID
##VAR_NAME=  TIME,          FID/REAL,        FID/IMAG
##SYMBOL=    X,             R,               I
##VAR_TYPE=  INDEPENDENT,   DEPENDENT,       DEPENDENT
##VAR_FORM=  AFFN,          ASDF,            ASDF
##VAR_DIM=   8192,          8192,            8192
##UNITS=     SECONDS,       ARBITRARY UNITS, ARBITRARY UNITS
##FACTOR=    0.0002272,     1,               1
##FIRST=     0,             0,               0
##LAST=      1.8609952,     -129,            294
##MIN=       0,             -3776729,        -3776729
##MAX=       1.8609952,     2483910,         2483910
$$ Real data points
##PAGE= N=1
##DATA TABLE= (X++(R..R)), XYDATA
$$ [...]
2794c68k23M6P77N55l12j253J098J15k65O07j182O82j22k78K70K36J09j524J68
$$ -368 -591 -545 232 787 475 -778 320 435 170 777 -405 277 155 -123 147 383 492 -1032 -864
2813h64J579m91j065J745p64P82l94l1j18L50M00k296Q32o16J107j16K4O03p47
$$ -864 715 224 -841 904 140 922 528 497 379 729 1129 -1167 -335 -951 156 40 64 667 -80
2832h0M91p53N62P70q38N00j045O04J011o05j285J72k50o65J593j262R19P7k47
$$ -80 411 -342 220 990 152 652 -393 211 1222 617 -668 -496 -746 -1411 182 -1080 -161 -84 -331
2851c31M92J41m17j67l55O0J329j097N71Rn67J224j271K22O94k30K50R6k58m78
$$ -331 161 302 -115 -282 -637 -577 752 -345 226 235 -332 892 -379 -157 537 307 557 653 395 -83
2871h3N54M06j184j159Q03P03q52N1J127k47p37m0J982j019j10p56L61J33P0r28
$$ -83 471 877 -307 -1466 -663 40 -812 -761 366 119 -618 -658 1324 305 195 -561 -200 -67 3 -925
2891i25J450J06k70m32o98J968j368L57o10J672j884J213j431J227k86L1p63k98
$$ -925 525 631 361 -71 -769 1199 -169 188 -422 1250 -634 579 -852 375 89 120 -643 -941
2909i41K068k39o3q25M71M41j492J24n54J408p11J1K15n99J615j241P17j090N94
$$ -941 1127 888 825 0 471 912 -580 -456 -1010 398 -313 -302 -87 -686 929 -312 405 -685 -91
2928i1O94r4l0j235O99O6K57K30J3N91j120L34p06r07J438j014N77O24j717J171
$$ -91 603 509 479 -756 -57 9 266 496 509 1100 -20 314 -392 -1299 139 -875 -298 326 -1391 -220
2948b20K83O3j173O06J063r51n50q76K615j95l78p57J028l34j131J823j516M47
$$ -220 63 126 -1047 -441 622 -329 -879 -1755 860 665 287 -470 558 224 -907 916 -600 -153
2966a53L99P46j024K27l36l62Q02R53j620l00Q80M88r56P24n43l12J233q43N99
$$ -153 246 992 -32 195 -141 -503 299 1252 -368 -668 212 700 -256 468 -75 -387 846 3 602
2985F02j204J307o24k58K11j73J12N66o04K18K28L02n18n62j44O68K51n71P92
$$ 602 -602 705 81 -177 34 -139 -27 539 -65 153 381 683 165 -397 -541 127 378 -193 599
3004E99j494J333j074Q71m53n2l1J417j221L21j039R74m39M42J93j176Q86n56
$$ 599 -895 438 -636 235 -218 -270 -301 1116 -105 216 -823 151 -288 154 347 -829 57 -499
3022d99J244p69K7O04o1m53L50m01j108P81K19r9O83j073N68N05J312j585j310
$$ -499 745 -24 3 607 546 93 443 42 -1066 -285 -66 -165 518 -555 13 518 1830 245 -1065
3041a065J725j647J719K52l33p44O20p5j702Q22K63j15j8N66l34J455j783J113
$$ -1065 660 -987 732 984 651 -93 527 452 -1250 -428 -165 -280 -298 268 -66 1389 -394 719
3059G19M8L2r72j85m79QJ083n85Q35O8o81q70J799l97r80J077o58J176n32j148
$$ 719 767 799 -173 -358 -837 -829 254 -331 504 572 -109 -979 820 423 -557 520 -138 1038 506 -642
3079f42K303k168L66n10M71k35J098m91M03l33K54p8j094N89o1L39l3P3r86Q86
$$ -642 1661 -507 -141 -651 -180 -415 683 192 595 262 516 438 -656 -67 -128 211 178 251 -735 151
3099A51J27k40n90m04N88j52J319j124R99j439Q81o14J529j598l37J929p68L73
$$ 151 278 38 -552 -956 -368 -520 799 -325 674 -765 116 -498 1031 -567 -904 1025 257 630
3117F30j405M38M40jj7R1q0l22L7J71n68P78l51O24o43P07p57M10l33q2q6J036
$$ 630 -775 -337 103 102 85 176 96 -226 -189 -18 -586 192 -159 465 -178 529 -228 182 -151 -233 -319 717
3139G17p12j78J156j061p5n37J865n51k61k57j066J012l00m12O19q6J99o13K70
$$ 717 5 -173 983 -78 -153 -690 1175 624 363 106 -960 52 -248 -660 -41 -127 72 -541 -271
3158b71q1J236k146J279M10m85K9P99j57m22l7r75M36N15l99P14q36P51N72j088
$$ -271 -352 884 -1262 17 427 -58 -29 770 613 191 154 -821 -385 130 -269 445 -391 360 932 -156
3178a56L91l94k97O37m74P86o75J257l62n47j66m87n40J008K55o07L79l76J008
$$ -156 235 -159 -456 181 -293 493 -182 1075 713 166 0 -487 -1027 -19 236 -371 8 -368 640
3197F40r14P50o75K398k457n01m76N95P49n77Q06N70j646J33o7K55O32J07q01
$$ 640 -274 476 -199 2199 -258 -759 -1235 -640 109 -468 338 908 -738 -605 -672 -417 215 322 -479
3216d79J187j555N57J209j300K8K53l93m02J336j22O59j022m38P14P8O06j964
$$ -479 708 -847 -290 919 -381 -353 -100 -493 -895 441 319 978 -44 -482 232 310 916 -1048
3234a048J938j000L0Q55j578n57J296j114J411J007j794m5Q1P77J4N1o67J138
$$ -1048 890 -110 -80 775 -803 -1360 -64 -1178 233 1240 -554 -599 -518 259 273 324 -343 795
3252G95k31k81r07M57J283m21m97o89J222j294P88P3K75r53O38p91J330j068M53
$$ 795 564 283 -624 -167 1116 695 198 -491 731 -563 225 298 573 -380 258 -533 797 -271 182
3271A82K92p80M42l42O70j193J043K46j032J51m35R75M90q94L74r0j650J093R70
$$ 182 474 -306 136 -206 464 -729 314 560 -472 -321 -756 219 709 -185 189 99 -1551 -458 512
3290E12q24R82P2q11L01o19p48J340l11j53O61q05J091j111n51P25M51L72j90
$$ 512 -312 670 742 -69 232 -387 -1135 205 -106 -259 402 -403 688 -423 -974 -249 202 574 384
3309C84L0N74j028J047M1q19ll55O64q14L68j017P86j014J094m29L96lj035J647
$$ 384 414 988 -40 1007 1048 229 226 -129 535 -279 89 -928 -142 -1156 -62 -491 -95 -98 -1133 514
3329E14J94o80o28J75l40Q38j276K86P16j19N32r50k02J391p62L98L08n87j44
$$ 514 708 28 -600 -425 -765 73 -1203 -917 -201 -320 212 -738 -940 451 -311 87 395 -192 -336
3348c36o9J461j223N34L7q01j18K93L98j02q60J596j193M07J252j849K125j668
$$ -336 -405 1056 -167 367 404 -397 -515 -222 176 74 -786 810 -383 24 1276 -573 1552 -116
3366a16n65J237j089J416l22p46k10J120r87J482j519J20J01j042Q61N09m72L45
$$ -116 -681 556 -533 883 561 -185 -395 725 -262 1220 -299 -179 -78 -1120 -259 250 -222 123
3384A23m8n2k69n61J026P22k348R74p20J316n67M21R4K32j1P7n4L02K74q89Q28
$$ 123 75 23 -246 -807 219 941 -1407 -433 -1153 163 -404 17 111 343 332 409 355 657 931 42 870
3405H70m73n54N49l89q03J518p70J92n81j07P03k1j84J404r92o90O09j221J091
$$ 870 397 -157 392 3 -800 718 -52 140 -441 -548 155 134 -50 1354 362 -328 281 -940 151
3424A51r84J277k61K1J30R61k225K27P91j447J313m69Q58J222j656Q27p93o13
$$ 151 -833 444 183 204 334 1295 -930 -703 88 -1359 -46 -515 343 1565 -91 736 -57 -670
3442f70R75n37m04k11m22K101j08j374Q33L5j57m93O22j27O93j985O15Q11L6l7
$$ -670 305 -232 -636 -847 -1269 832 724 -650 183 218 61 -432 190 63 756 -1229 -614 197 233 196
3462A96r29J252q31L73r55P24R49j299L13k19OJ185j080P77n35N13q9n80O03o48
$$ 196 -733 519 -312 61 -894 -170 779 -520 -207 -426 -420 765 -315 462 -73 440 351 -229 374 -274
3482b74K91K23o26J011n31O6l89J138q14q64K13N88Q48n29M98m45j174J755r59
$$ -274 17 240 -386 625 94 160 -229 909 95 -769 -556 32 880 351 849 404 -770 985 26
3501B6l24n6M28m27j32p62P98J09k11M69p75Q81P5Nk40k13pJ651j21j659m10J221
$$ 26 -298 -354 74 -353 -485 -1247 -449 -340 -551 -82 -857 24 99 104 -136 -349 -356 1295 1174 -485 -895 326
3523C26p87rl26O23j87J53k16j174K161J22l79l53r21J000N72p97M58r53R87Q95
$$ 326 -461 -470 -796 -173 -360 -207 -423 -1597 564 686 307 -46 -967 33 605 -192 266 -687 300 1195
3543A195j512P06k2o21l88l30J185J5o66r6J127j017M85K25P29j114l14N66L98
$$ 1195 -317 389 367 -254 -642 -972 213 228 -438 -534 593 -424 61 286 1015 -99 -413 153 551
3562E51o14r58J172q88R17o68R85n90P58q53O7M46j531N16J05N93l17N74M20k033
$$ 551 -63 -1021 151 -737 180 -488 497 -93 665 -188 -121 325 -1206 -690 -585 8 -309 265 685 -1348
3582a348J835n59o4P24r32M90K88J40O20r81p00J857j447P70l32k9j0J41q79m85
$$ -1348 487 -72 -136 588 -344 146 434 574 1194 213 -487 1370 -77 693 361 332 322 463 -416 -901
3602i01L01L07k90N31M72K95q37r44J947j352L43L92k53K84j76l91j35n7K46J061
$$ -901 -600 -293 -583 -52 420 715 -122 -1066 881 -471 -128 264 11 295 119 -272 -407 -464 -218 843
3622H43j422n48K170o74j447J221p2j275N27P88l49j61p19J144m87k93L73j1K85
$$ 843 -579 -1127 1043 369 -1078 143 71 -1204 -677 111 -238 -399 -1118 26 -461 -754 -381 -392 -107
3641a07n76j90P09j0k37Q30o33j34P47r65K41R93o26O59n35j8l9p86K16K27j56
$$ -107 -683 -873 -164 -174 -411 419 -214 -348 399 -566 -325 668 42 701 166 148 109 -677 -461 -234 -390
3662c90J159p82K8lm75P64n37N07k00l4J28j43j358J463n93L05J235j208J19k98
$$ -390 769 -13 15 12 -463 301 -236 271 71 37 165 22 -1336 127 -466 -161 1074 -134 -15 -313
3682c13J336j104p31K061k291Q58L5j9J97o41J519j01j400K92R19r08j83J66q98
$$ -313 1023 -81 -812 1249 -1042 -184 -149 -168 29 -612 907 806 -594 -302 617 -291 -474 -308 -1206
3701a206Q56R82K47r29K69k24n73O64R01j000m47QM00O78n4N26o5j529O19j1J018
$$ -1206 -350 632 879 -50 219 -5 -578 86 987 -13 -460 -452 -52 626 572 1098 1033 -496 123 112 1130
3722A130j598J76J960j513j88K06j71M15o54L20m94j38M46J392n87j89o36M19
$$ 1130 -468 -292 1668 155 -33 173 2 417 -237 83 -411 -549 -103 1289 702 513 -123 296
3740B96n56L49j79j335J819p67J99l47J020n96L1k11P78o72k01Q69k95m75k17
$$ 296 -260 89 -90 -1425 394 -373 -174 -521 499 -97 -66 -277 501 -171 -372 497 202 -273 -490
3759d90P12Q7m61M72q30Q97m08L70q96k3O21R06j555j38M50L94p43J42J145j365
$$ -490 222 309 -152 320 -510 387 -21 349 -547 -570 51 957 -598 -736 -286 108 -635 -493 652 -713
3779g13J055l14k6K93n3n0m24o82Q66K55l08l2R34j067R11K17p82k80L29n16K3
$$ -713 342 28 2 295 242 192 -232 -914 -48 207 -101 -133 801 -266 645 862 80 -200 129 -387 -364
3800c64L77J074j678m54J208l99n74L9q09M00J204K89n39l34P94n16p22J029N14
$$ -364 13 1087 -591 -1045 163 -236 -810 -771 -1580 -1180 24 313 -226 -560 234 -282 -1004 25 539
3819E39p87o86J109k06n40q71J857k20j685J310l38M91K90N78n72p78L86N38j037
$$ 539 -248 -934 175 -31 -571 -1442 415 195 -1490 -180 -518 -27 263 841 269 -509 -123 415 -622
3838f22P38O72j039P25j020J11r5O95p39J005m66n57R66K25j056M44k13P52j475
$$ -622 116 788 -251 474 -546 -435 -530 165 -574 431 -35 -592 374 599 -457 -13 -226 526 -949
3857i49J487K12o02J19L49j327J314q69m41L66M50K82p16J048j108O34r59j55
$$ -949 538 750 148 267 616 -711 603 -266 -707 -341 109 391 -325 723 -385 249 -710 -865
3875h65O40Q9o08N65J73K58Q86Q2j355M85p44pq8J450j092O45k18o98J1R76j252
$$ -865 -225 -136 -744 -179 -6 252 1138 1220 -135 350 -394 -401 -489 961 -131 514 296 -402 -391 585 -667
3896f67M12N45m55P42m31K89l38M23j084M14P78n48J096j888J111O76j893R91
$$ -667 -255 290 -165 577 146 435 97 520 -564 -150 628 80 1176 -712 399 1075 -818 173
3914A73Q8j282Q59Q03o64m66P56K55r10J55o28Q08o4N24o27J011l09l07l6J16
$$ 173 261 -1021 -162 641 -23 -489 267 522 -388 -233 -861 -53 -117 407 -220 791 482 175 139 255
3934B55m12j22N84j086J163l67N70k82p7m9l04J145j319K48P87m88r05K15p34
$$ 255 -157 -279 305 -781 382 15 585 303 226 177 -127 1018 -301 -53 734 246 -659 -444 -1178
3953a178P40M30J4p78J469j601M17L97K42o10Q65J39j547M26L69O43k08J170j605
$$ -1178 -438 -8 6 -772 697 -904 -487 -90 152 -458 407 546 -1001 -575 -206 437 229 1399 -206
3972b06Q92j114O42J28l22j68j45J166q59k94N04N23n12j051m49J295l92O15N16
$$ -206 686 -428 214 342 20 -148 -293 873 14 -280 224 747 235 -816 -1265 30 -362 253 769
3991G69r02R81p14l7j99n82O07o61R96m80J89J3N60q26J057p77J072o33L10J25
$$ 769 -133 848 134 97 -102 -684 -77 -738 258 -222 -33 -20 540 -286 771 -6 1066 433 743 868
4011H68p24p56J241R6N8j343J649o89j527J531k94K94j513K275N99k003J1J69
$$ 868 144 -612 629 725 783 -560 1089 400 -1127 404 110 404 -1109 1166 1765 -238 -227 -58
4029e8N72p29J28L12L09n01n18J38R13l98k1p2n14N75n20M22l9K39j211J226j578
$$ -58 514 -215 -87 225 534 33 -485 -347 566 168 147 75 -439 136 -384 38 -1 238 -973 253 -1325
4050a325R79M61N78j159p11O81L08P7o4J62m01j70O08n85L05N06M12j053Q01P85
$$ -1325 -346 115 693 -466 -1177 -496 -188 -111 -175 -13 -414 -584 24 -561 -256 250 662 -391 410 1195
4070A195o20j645Q64J748j635l46J129j584Q07J52q1j164J032o14q81L365j310
$$ 1195 575 -1070 -206 1542 -93 -439 690 -894 -87 65 -16 -1180 -148 -762 -1643 1722 412
4087D12P58j916L81q93N44J472j036O2J55L72q7k0J11r61J463l12P61j605l67
$$ 412 1170 -746 -365 -1258 -714 758 -278 -216 -61 311 224 204 315 -646 817 505 1266 -339 -706
4106g06J300n6k79j13K98j744J697k89n41n4N23pm01o4N43K03j02j30k99M5P6
$$ -706 594 538 259 146 444 -1300 397 108 -433 -487 36 29 -372 -436 107 310 208 78 -221 -176 -100
4127a00J57K0J37j73L6k30n9L6J69J296k092J069m94O24j543K78P67N14o76j1
$$ -100 57 77 214 41 77 -153 -212 -176 -7 1289 -803 266 -228 396 -1147 -869 -102 412 -264 -275
4147b75J172j576J094j74k31O5l43L49P13l50M24q36k96J04l16L92K00J56o8j248
$$ -275 897 -679 415 241 10 75 -268 81 794 444 868 32 -264 -160 -476 -84 116 272 204 -1044
4167a044J289r17P07K05j26o83m3J92O22M75n77R59p14p51M55m87J60n7J018j79
$$ -1044 245 -672 35 240 114 -569 -612 -420 202 677 100 1059 345 -406 49 -438 -278 -335 683 504
4187E04j46N8l28L4L13n40JP22n50R35k033J883n94N2L78l38m69n05J79N68N81
$$ 504 358 416 88 122 435 -105 -104 618 68 1003 -1030 853 259 311 689 351 -118 -623 -444 124 705
4208G05j433J323m83J11j55L29k67N85n09K96M11n23L79Jk210J629O69r50L36
$$ 705 -728 595 112 223 68 397 130 715 206 502 913 390 769 770 -1440 189 858 -92 244
4227B44l69l06r8J281n28j064J858R6k100O49j98M75K18k78Q44M60k90j854l06
$$ 244 -125 -431 -529 752 224 -840 1018 1114 -986 -337 -535 -60 158 -120 724 1184 894 -960 -1266
4246a266J102M2lO16P92j156L06r52M60n90J310j072N38O10q08K20q76j42J373
$$ -1266 -164 -122 -125 491 1283 127 433 -519 -59 -649 661 -411 127 737 -71 149 -727 -869 504
4265E04M5j021N04L68n79M89n00J047o81m73J39k06J712j758O00L13m51o50N98
$$ 504 549 -472 32 400 -179 310 -190 857 176 -297 -158 -364 1348 -410 190 503 52 -598 0
4284@L41P5j788R87j00K43J025p32K02o28K02m44J860j977R34p82Q01K19q57O66
$$ 0 341 416 -1372 -385 -485 -242 783 51 253 -375 -173 -617 1243 -734 200 -582 219 438 -419 247
4304B47J04r07L14l14M32P94j183N81j58J365j806K09J527j376o3O52j368J044
$$ 247 351 -556 -242 -556 -124 670 -513 68 -90 1275 -531 -322 1205 -171 -234 418 -950 94
4322I4Q52j613O65p49L19J119M6j81l45R6N8j33N70L92j590J99N12l44R35k38
$$ 94 946 -667 -2 -751 -432 687 733 552 207 303 361 228 798 1190 -400 -201 311 -33 902 664
4342F64k89r60R02m94q0j34j36N12N8K83k25Q38p68L4N74j289Q85M0m94K08r82
$$ 664 375 -585 317 -177 -257 -391 -527 -15 43 326 101 939 171 205 779 -510 375 415 -79 129 -853
4363h53N16J24m57N88O46j025R43j504J712k00m83Q05p65P39n32j56q05Q96k28
$$ -853 -337 -213 -670 -82 564 -461 482 -1022 690 490 7 812 47 786 254 98 -707 189 -39
4382c9r84N97M81p7l98N04o03Q83j008O71N25r62J455j025N02n51N57q4j055J037
$$ -39 -1023 -426 55 -22 -420 84 -519 364 -644 27 552 -410 1045 20 522 -29 528 444 -611 426
4402D26N45q24M51p55N57k3j481R02K37M42p41M96q29M75r71J145j64J075j380
$$ 426 971 147 598 -157 400 377 -1104 -202 35 477 -264 232 -597 -122 -1093 52 -112 963 -417
4421d17R82n13L30o06j12J464q03J15J37o90k68O26q49P70j268J182N89p86L89
$$ -417 565 52 382 -224 -336 1128 325 440 577 -113 -381 245 -604 166 -1102 80 669 -117 272
4440B72j300R68J17J530j221j017P38l22M00M95q06j43J012j040k08M37P36q78
$$ 272 -1028 -60 57 1587 366 -651 87 -235 165 660 -146 -289 723 -317 -525 -88 648 -230
4458b30J119m56m86n80l63q6J253k1j069J262j440J308N9j229J220k49k86o04
$$ -230 889 433 -53 -633 -996 -1082 171 150 -919 343 -1097 211 270 -959 261 12 -274 -878
4476h78J264j29M04r03m70J281r2n37k58K32J345j963Q74j41r26J753j133j058
$$ -878 386 257 661 -242 -712 569 477 -60 -318 -86 1259 -704 170 29 -897 856 -277 -1335
4494a335Q38M78M21OJ014j180j460J385N45k133J104J427j695P71j348P21N10
$$ -1335 -497 -19 402 408 1422 242 -1218 167 712 -1421 -317 1110 -585 186 -1162 -441 69
4511F9p42O92j1j0O75j57r32p6N02q54J140n22L92m56n99R57q4k87N83J17n06
$$ 69 -673 19 8 -2 673 516 -416 -492 10 -844 296 -226 166 -290 -889 68 -16 -303 280 397 -109
4532a09N41o29l67M72k84J377j141k65J68P92n16p21P37r7O68q56K44R88n18J71
$$ -109 432 -197 -564 -92 -376 1001 -140 -405 -237 555 39 -682 55 -42 626 -230 14 1002 484 655
4552F55j343J57R07j06q7o89J30l2O60j543J465m12J71n1K60j204J62Q7k52j7
$$ 655 -688 -531 376 270 183 -506 -376 -408 252 -1291 174 -238 -67 -118 142 -1062 -900 -813 -1065 -1082
4572a082O49j97Q67j91p20J159M76p63J89n54j004J279o10o52K115P1q90q62m21
$$ -1082 -433 -630 237 46 -674 485 961 198 387 -167 -1171 108 -502 -1154 961 1032 142 -720 -1141
4591a141L06J155j2l92J10l26n81J750m58O88j670o35K075l24n57j03P86o53J90
$$ -1141 -835 320 308 -84 26 -300 -881 869 411 1099 -571 -1206 869 545 -12 -115 671 18 208
4610B08r7J181o25J51q20K41k91n22l10O52O93q83n3J408q80J301j087j167J69
$$ 208 111 1292 667 818 -2 239 -52 -574 -884 -232 461 -422 -475 933 53 1354 267 -900 -731
4629g31R05j89N39j017p17J350r23J390p73Q25k35m29J8M07M0q95K40Q18j082
$$ -731 174 -15 524 -493 -1210 140 -783 607 -166 659 424 -5 13 420 460 -435 -195 623 -459
4648d59L61j89R18j805K643j919N45P23r6q36K98j326J249qj90R28n14m65j1J62
$$ -459 -98 -287 631 -1174 1469 -450 95 818 722 -114 184 -1142 107 99 -91 837 323 -142 -153 9
4668Ikj96o4l25J470j257N8J149p63O50n96M99r74Q41nM24o58j419J019M20j043
$$ 9 7 -189 -253 -578 892 -365 -307 842 79 729 133 632 -342 499 494 918 260 -1159 -140 280 -763
4689g63L49L20L65m85M37n74J270l53j185Q80n13M72q3l48J233o03Q02j294L2
$$ -763 -414 -94 271 -214 223 -351 919 566 -619 261 -252 220 137 -211 1022 419 1221 -73 -41
4708d1R19j534J300m70J070j048O35N2j115R31p24j97q8o64J142J79j268R25O88
$$ -41 878 -656 644 174 1244 196 831 883 -232 699 -25 -222 -310 -974 168 347 -921 4 692
4727F92p14o59m26nJ587j312L25L89J061j319O03N36j312Q99p73J89K00q81l94
$$ 692 -22 -681 -1107 -1112 475 -837 -512 -123 938 -381 222 758 -554 345 -428 -239 -39 -920 -1314
4746a314P95P42m9j92q24k3R50m08o7Q51k44l82p0r4j031J811j021Q41L81Rl22
$$ -1314 -519 223 174 -18 -842 -865 85 -323 -390 461 217 -165 -235 -329 -1360 451 -570 271 652 661 339
4767C39K45q76L41N95N8n18n25L78j16J121j654l60M85J513r51K85k201K257N11
$$ 339 584 -292 49 644 702 184 -341 37 -79 1042 -612 -972 -487 1026 75 360 -1841 416 927
4786I27m48r74J135M2j428J206L87k14j505M40j36J320j249J002o04P90m26O26
$$ 927 479 -495 640 682 -746 460 847 633 -872 -432 -568 752 -497 505 -99 691 265 891
4804H91q88L83k92p13J010k37J45o11J094r28m60N84M93r48M11l10m97L78N37
$$ 891 3 386 94 -619 391 154 299 -312 782 -146 -606 -22 471 -477 -66 -376 -873 -495 42
4823D2k27l06J228j202R26J18j234M33N24k25j033P32O63j155P4L78J388j365
$$ 42 -185 -491 737 -465 461 579 -655 -222 302 77 -956 -224 439 -716 -642 -264 1124 -241
4841b41p00o8m38J165M09m38j11J17n6J23k09M12n96N08k08q7O84j77O8L31O78
$$ -241 -941 -1009 -1447 -282 127 -311 -422 -305 -361 -238 -447 -35 -631 -123 -331 -418 266 89 157 488 1166
4862A166q96n73l95j44P86j22R8M8j90K13j003P47L04l63Q18n08J57l42j79j95
$$ 1166 270 -303 -698 -842 -56 -178 -80 -32 -222 -9 -1012 -265 39 -324 494 -14 143 -199 -378 -573
4882e73L7k0M01o33M23K50L57k94n0J1R9j71q67K70L57J121L8p88K67j48k44j50
$$ -573 -536 -556 -155 -788 -365 -115 242 -52 -102 -91 8 -163 -1030 -760 -403 718 756 -32 235 87 -157 -307
4904c07Q76q78L32r19J513n19K68j097J491p91J37l09K13m89l93J429j262Q78
$$ -307 569 -309 23 -896 617 98 366 -731 760 -31 106 -203 10 -479 -872 557 -705 173
4922A73j57Q5q89J810r53N6q06J023Q55j934N21j40M02Q6j243K018j049n26O48
$$ 173 16 101 -788 1022 69 125 -681 342 1197 -737 -216 -356 46 132 -1111 907 -142 -668 -20
4941b0q29N1R33K76k38j005P46P43q72l71J68Q33n51p43R68o15p18N86J302j760
$$ -20 -849 -798 135 411 173 -832 -86 657 -215 -586 -418 415 -136 -879 89 -526 -1244 -658 644 -1116
4961a116J006J059o16q40R6L54q90J367q44Q30o76k35J548l94j061K75J255j715
$$ -1116 -110 949 333 -507 -411 -57 -947 420 -424 406 -270 -505 1043 649 -412 -137 1118 -597
4979e97J036J7p43L4J573k170j04K156j524M96K9l96n40J304j257Q04M4L90J43
$$ -597 439 456 -287 -253 1320 -850 -954 1202 -322 174 203 -193 -733 571 -686 118 162 552 695
4998F95q35N42p39K178j866K2o68L52P93k28n01J183k20j165o25K053j010m81
$$ 695 -140 402 -337 1841 -25 -3 -671 -319 474 246 -255 928 708 -457 -1082 971 -39 -520
5016e20K32L30N22J63p75o2M47j95J38o22Q89M35j500O08r65R07O09o31m59O26
$$ -520 -288 42 564 727 -48 -110 337 142 280 -342 547 982 -518 90 -875 32 641 10 -449 177
5036A77J119j132J034j489N21p4l54k58K18M58n17J17n33Q59j98p95J199j085
$$ 177 1296 164 1198 -291 230 156 -198 -456 -238 220 -297 -180 -713 146 -52 -847 352 -733
5054g33J252j98K4n22O9N4P05r10N90J11q10j08J14K294k825J126l26k33J233
$$ -733 519 321 345 -177 -108 -54 651 -259 331 442 -368 -476 -362 1932 -893 233 -93 -326 907
5073I07l96k80l68q50P93M48j45N56m06j3K13r83J14O43q15O75J5m5j6R67j144
$$ 907 511 231 -137 -987 -194 254 109 665 259 246 459 -524 -410 233 -582 93 108 63 47 1014 -130
5094a30j58k92R04j80L38q39l27L01k33P53m42P81j232J343j330M63J938k850
$$ -130 -288 -580 324 144 482 -357 -684 -383 -616 137 -305 476 -756 587 -743 -280 1658 -1192
5112a192J075p28P20n55K76n80P06J298p63o58m75Q41M58j415J362Q82j583J186
$$ -1192 -117 -845 -125 -680 -404 -984 -278 1020 257 -401 -876 -35 423 -992 370 1252 -331 855
5130H55L2r29o29J321L61j42m07m49J152j064l70J16j422J842p9Q15q90n22R14
$$ 855 887 -42 -671 650 1011 869 462 13 1165 101 -269 -153 -1575 267 188 1003 113 -409 505
5149E05j270N83m43M15m78R5L76K55m63O68m9j49l78J64j6P91q47p02J274j11
$$ 505 -765 -182 -625 -210 -688 -593 -217 38 -425 243 194 45 -333 -169 -185 606 -241 -943 331 220
5169B20q1q33P49J1K02R04n35j050O7n43P43R61p8J99r92L92p87J55O7R2m10P85
$$ 220 139 -694 55 66 268 1172 637 -413 -346 -889 -146 815 737 936 -56 336 -451 -296 -229 -137 -547 238
5191B38j78l72L98j80k63P60l06k74J8m34R39K34n29l63N62o03J380j723R33n35
$$ 238 60 -312 86 -94 -357 403 97 -177 -159 -593 346 580 51 -312 250 -353 1027 -696 237 -298
5211b98J019j204N73q05K47Q43r49N91q26P70K20K82m67m16k52J65N2R85r09l59
$$ -298 721 -483 90 -715 -468 375 -574 17 -809 -39 181 463 -4 -420 -672 -507 -455 530 -379 -738
5231g38P30m07N24l79P6K0L07M48K39j612J058j092K1R51l03J89m13M22O23j531
$$ -738 -8 -415 109 -270 -194 -174 133 581 820 -792 266 -826 -805 146 -157 32 -381 41 664 -867
5251h67R33K18r7o15m24R61O1N56j157N80J66K41q70j230J416N60j389j3J534
$$ -867 66 284 187 -428 -852 109 170 726 -431 149 315 556 -314 -1544 -128 432 -957 -970 564
5270E64o89J7J60J43q66K89L78K59j76M40n59q56J576r95K78J03j600K160j279
$$ 564 -125 -108 52 195 -671 -382 -4 255 79 519 -40 -896 680 -315 -37 66 -1534 626 -653
5289f53J161O14k636J577K48O24j613P49O6p39R39n56O91q89O73n71k14o9j3M26
$$ -653 508 1122 -1514 63 311 935 -678 71 137 -602 337 -219 472 -417 256 -315 -529 -598 -611 -185
5309a85l7M5Q4j57K46N77j085Q10J31o44N63j53M45n15K40m54l94J909j630q36
$$ -185 -222 -177 -93 -250 -4 573 -512 298 429 -215 348 195 640 125 365 -89 -483 1426 -204 -1040
5329a040P21J50J974j915k81N77J24N0O5j146J270m07m13J42n14j46N59l4K38
$$ -1040 -319 -169 1805 -110 -391 186 310 360 425 -721 549 142 -271 -129 -643 -789 -230 -264 -26
5348b6o90Q74m16m4P76m18O09n79l31j12P93K11j043O97j128O78j56J541j122
$$ -26 -716 158 -258 -302 474 56 665 86 -245 -357 436 647 -396 301 -827 -149 -305 1236 114
5367A14k73J42M9k63j22l24R19j191O57M64K76M54p72P77j205L17J50l44N5O15
$$ 114 -159 -17 32 -231 -353 -677 242 -949 -292 172 448 902 130 907 -298 19 169 -175 -120 495
5387D95l08j190J081p2k14L45n63J93r81J501o00J16l78R70k65L14k0j132L55
$$ 495 187 -1003 78 6 -208 137 -426 -233 -1214 287 -313 -197 -575 395 130 444 424 -708 -353
5406c53J309k12j52m96N26j268L19J58j59r39J566q02L63j339K492p85jK3j150
$$ -353 956 744 592 96 622 -646 -327 -169 -328 -1267 299 -503 -140 -1479 1013 228 227 250 -900
5425i00J44L85M05m75J043K06r18m44O40L40o96K23K46q72Q71o14P79J80p20K04
$$ -900 -756 -371 34 -441 602 808 -110 -554 86 426 -270 -47 199 -673 198 -416 363 543 -177 27
5445B7M42m27N91J67j06j444O42k83Q38M46k56l19M86j511O81N90o1q73N55m96
$$ 27 469 42 633 800 694 -750 -108 -391 447 893 637 318 804 -707 -26 564 503 -370 185 -311
5465c11L29L1j8j093Q19P07N28j388N23m70K49m68O82J05m57J952j831O2J92n42
$$ -311 18 49 31 -1062 -243 464 992 -396 127 -343 -94 -562 120 225 -232 1720 -111 -49 143 -399
5485c99N12j39K58n27j41P95p0O18q56o66J161L33j221M6R5m94J69p7P86j05o74
$$ -399 113 -26 232 -295 -436 359 289 907 51 -615 546 879 -342 -296 -201 -695 -526 -603 183 78 -596
5506e96J302m21j42q2L10o56L55r4j2l15K99l26j31K90qJ349j067M75l47J0o07
$$ -596 706 285 143 61 371 -285 70 -24 -36 -351 -52 -378 -509 -219 -227 1122 55 530 183 193 -414
5527d14O07OK20j402J046K96Lj046K65J088p99p45O25N74q03Q41o12J613k92j674
$$ -414 193 199 419 -983 63 359 362 -684 -419 669 -130 -875 -250 324 -479 362 -250 1363 1071 -603
5547f03m8O37m87J492l37m33K49L46o58m75O38L6K6o24N72n92Q8M1N06O60j634
$$ -603 -651 -14 -501 991 654 221 470 816 158 -317 321 357 383 -241 331 -261 -173 -132 374 1034 -600
5568f00L35P47j45N03q50k29p2R90Q17j716Q1l92J129l56M61j190L09O65n05n78
$$ -600 -265 482 337 840 -10 -239 -311 679 1496 -220 -139 -531 598 242 703 -487 -178 487 -18 -596
5588e96N59l1J74J76Q57o64n94r27J525J28q06j327M88M49K18k62o8m08J418K29
$$ -596 -37 -68 106 282 1139 475 -119 -1046 479 607 -199 -1526 -1038 -589 -371 -633 -701 -1109 309 538
5608E38j176J095p44K34q12P73l6l16L79j65M21p27P62J97J78o52Q2K92O76p85
$$ 538 -638 457 -287 -53 -865 -92 -128 -444 -65 -230 191 -536 226 423 601 -51 31 323 999 214
5628B14M99j192P64P37j737J505q88P04j069k2J66P01m65J84j289K67J567k41
$$ 214 713 -479 285 1022 -715 790 -98 606 -463 -485 -319 382 -83 101 -1188 -921 646 405
5646D05j451J889k74l90m35M70k86N33o07K08m74P74l22m87l48J178L09r39l14
$$ 405 -1046 843 569 179 -256 214 -72 461 -146 62 -412 362 40 -447 -795 383 692 -247 -561
5665e61R92o93M51O33j07j405l69J723j55n93QO8j1j20m8k53J525r06K26p28M0
$$ -561 431 -262 189 822 715 -690 -1059 664 509 -84 -76 -8 -19 -139 -187 -440 1085 179 405 -323 -283
5686b83P09k99j76j01M56p93K62k81J39R86r67P17j62o18M76p23R09j36J13n59
$$ -283 426 127 -49 -150 306 -487 -225 -506 -367 619 -348 369 207 -411 65 -658 251 115 228 -331
5706c31J290n33k23o74J570j148J22O31m57j57j092J027O1R11j303O30m72J209
$$ -331 959 426 203 -471 1099 -49 73 704 247 90 -1002 25 86 997 -306 324 -148 1061
5724A061q66l01l03J015K20k041J444K00j336J276rl03o99K15K35P96J18p88m14
$$ 1061 195 -106 -409 606 826 -1215 229 429 -907 369 360 57 -642 -427 -192 604 722 -66 -480
5743d80k70R33L37q09o69Q3Q21K57M09j135J108K93j077N16j146M35O45J81j47
$$ -480 -750 183 520 -289 -958 -875 -54 203 612 -523 585 878 -199 317 -829 -394 251 432 285
5762B85r88k73J119l87m98M90J5P77l77m29R87j120P83j258N0J620r01K84M1l96
$$ 285 -703 -976 143 -244 -742 -252 -237 540 163 -266 721 -399 384 -874 -824 796 -105 179 220 -176
5782a76M80k60O6p11J017j041R21J65j165J572r91K78r88n68J345j59K86k38l43
$$ -176 304 44 110 -601 416 -625 296 461 -704 868 -123 155 -833 -1401 -56 -215 71 -167 -510
5801e10L37O3R00Jj53m53k96K25j579K011o29N06k65j077J420p35K44r12J040
$$ -510 -173 -110 790 791 638 185 -111 114 -1465 546 -83 423 158 -919 501 -234 10 -902 138
5820A38K73O27n96r9r72J373q43K84M63J86r14N27p88R35n90j72j07N44O37r66
$$ 138 411 1038 442 343 -629 744 -99 185 648 834 -80 447 -341 594 4 -168 -275 269 906 -60
5840f0k61O94n6p47p14J501l25L94Lj064J73p44J33J414O89OO06q94l84l26J86
$$ -60 -321 373 317 -430 -1144 357 32 426 429 -635 -462 -1206 -1073 341 1030 1036 1642 748 364 38 224
5861B24l62O72n00p81M23N86p14M3J150q99j63l56J35Q24q8o89J128j62p79J50
$$ 224 -138 534 34 -747 -324 262 -452 -409 741 -158 -321 -677 -542 282 194 -495 633 471 -308 -158
5881a58m67J127j780J645j450K039j461o44N84K39P6M91j166J676P66j303q1M4
$$ -158 -625 502 -1278 367 -1083 956 -505 -1149 -565 -326 -250 241 -925 751 1517 214 133 177
5899A77j147l02K059K9m98l80m75j231J702j65n75m2J504n76J76Q7r46M62J198
$$ 177 -970 -1272 787 816 318 -62 -537 -1768 -66 -231 -806 -848 656 80 256 343 -603 -141 1057
5918A057j384m02J896k128R43J50p89J417l66o50M74k83n01J450n46j068O63O88
$$ 1057 -327 -729 1167 -961 -18 132 -657 760 394 -256 218 -65 -566 884 338 -730 -67 621
5936F21p95l81K110r49p61nK5N06l00k31J36j070N42K03M99J45N8m26m72m21R92
$$ 621 -174 -555 1555 606 -155 -160 -135 371 71 -160 -24 -1094 -552 -349 150 295 353 -73 -545 -966 26
5957B6Q42r34n49Q92R7m3j052K67P90k00P49J83q69J47j32l02K92n99j2P57m61
$$ 26 868 -66 -615 277 374 331 -721 -454 336 136 885 1068 199 346 214 -88 204 -395 -407 350 -111
5978a11l96N90r07P18k61Q27n95k27K28N28n70K75J620j699N5P49q9l33j52r61
$$ -111 -507 83 -824 -106 -367 460 -135 -362 -134 394 -176 99 1719 20 75 824 735 402 250 -711
5998g11M9k65J98q9J177j064m64J408r62J506j012j49J243p14o07J022k33m93
$$ -711 -662 -927 -729 -818 359 -705 -1169 239 -723 783 -229 -378 865 151 -456 566 333 -160
6016a60M98q24M50K4r4r21J078P81j366J52J63N95K35j89q80M38m6l37m98J094
$$ -160 338 -486 -36 -12 -106 -1027 51 832 -534 -382 -219 376 611 422 -458 -20 -66 -403 -901 193
6036A93n06J22O98o60J304j863j60K059j316J87m64l4R70m34q91J84J208j56p89
$$ 193 -313 -191 507 -153 1151 -712 -872 1187 -129 58 -406 -440 530 96 -795 -611 597 441 -348
6055c48N17r33J167m44O35n77l4J4Q7n76K64k37K12j09M08J42o57O52P9L26j336
$$ -348 169 -764 403 -41 594 17 -17 -3 84 -492 -228 -465 -253 -362 46 188 -469 183 262 588 -748
6076g48J228l2J60o15j157K20Q70p30L35m64M95K80o74O86Q5m35R93j619J400
$$ -748 480 448 608 -7 -1164 -944 -74 -804 -469 -933 -438 -158 -832 -146 -61 -496 497 -1122 278
6095B78l45K61o00Q95o68J10O13p8K15k52n22P42m24j176J606j11o66k55N80q39
$$ 278 -67 194 -406 489 -179 -69 544 466 681 429 -93 649 225 -951 655 544 -122 -377 203 -636
6115f36J536r34j040J236o9p13N21L04r04J488n36R06j170p14J97J035r28n48
$$ -636 900 -34 -1074 162 93 -620 -99 205 -699 789 253 1159 -11 -725 -528 507 -421 -969
6133i69l06J526l50N14j116Q33M85n24j065J153j2q44M17m47L49P14k45K65n71
$$ -969 -1275 251 -99 415 -701 132 617 93 -972 181 169 -675 -258 -705 -356 358 113 378 -193
6152a93m96N00J13J229j523K53K90j011K16J94J477m40o63P83j387P87K30J056
$$ -193 -689 -189 -76 1153 -370 -117 173 -838 -622 -428 1049 609 -54 729 -658 129 359 1415
6170A415k257J271N74r82o63J023K28o34O55p38J04K58l68L76O6M82j274J001
$$ 1415 -842 429 1003 21 -642 381 609 -25 630 -108 -4 254 -114 262 328 810 -464 537
6188E37j81p69Q16o18m07K249k225j03N38j213Q88Q45j036J432n51J62j15M63
$$ 537 356 -413 403 -215 -622 1627 -598 -701 -163 -1376 -488 357 -679 753 202 364 249 712
6206G12q17l30J213o89M49J67p52R4L3P88n68P49p63k0l78k35O2N30N60n67K78
$$ 712 -105 -435 778 89 538 705 -47 47 80 868 300 1049 286 266 -112 -347 -285 245 805 238 516
6227E16m20p66m03J356J52Q7j147M64M38J82r91N57N77k38n74R08p75J347j118
$$ 516 96 -670 -1073 283 435 522 -625 -161 277 459 -532 25 602 364 -210 698 -77 1270 152
6246A52N45l96j67j127Q81p42M24r51J906o25l81J94M39L30j163J021j047P21
$$ 152 697 301 134 -993 -112 -854 -430 -1381 525 -100 -481 -287 152 482 -681 340 -707 14
6264A4L05m84k62j485R62P14J204q08j85O34M0J77r93m25J553j564J097j783J324
$$ 14 319 -165 -427 -1912 -950 -236 968 160 -25 609 649 826 -167 -592 961 -603 494 -1289 35
6283C5J64j220P52O41q46R03N6J80k34N27k33q59O7k03k84k47J316p71J102j481
$$ 35 199 -1021 -269 372 -474 429 485 665 431 958 725 -134 -67 -270 -554 -801 515 -256 846 -635
6303f35L0J793j615J187l7n11o12Q13k83j4r03J015J79q99O23j98M7l91M33q8
$$ -635 -605 1188 -427 760 723 212 -400 413 130 116 -787 228 407 -492 131 -67 -20 -411 22 -66
6323f6M33n16O51P35n69l35k91l53R8J257m69m16o51P43p17P38K2j16j118Q44
$$ -66 367 -149 502 1237 668 333 42 -311 -213 1044 575 159 -492 251 -466 272 294 178 -940 -96
6343i6k60P19q89J078k48j174J423K39j460J108p19M80k52J66N95p10ml80J91
$$ -96 -356 363 -526 552 304 -870 553 792 -668 440 -279 201 -51 115 710 0 -4 -384 -193
6362a93Q55k97j159M82j59N82R31j434M00k29Q07j11n42q8J36M08p27r2K85O14
$$ -193 662 365 -794 -312 -471 111 1042 -392 8 -221 586 475 -67 -155 -19 389 -338 -430 -145 469
6382D69j98r6O59j062K70r14R47l8k81K23l75j32J000N34j659J042r3k35J097
$$ 469 271 175 834 -228 42 -872 75 37 -244 -21 -396 -528 472 1006 -653 389 296 61 1158
6401A158j409J24J63N8l55j8N65m83P87j295Q85m37P66q81n82n36O19P08M88m69
$$ 1158 -251 -127 36 94 -261 -279 286 -197 590 -705 180 -257 509 -372 -954 -1490 -871 -163 325 -144
6421a44j80m36O5J015L36j79r54Q15r34P10p29J539r44q81L35N40J76J074j128
$$ -144 -324 -760 -695 320 656 477 -477 338 -596 114 -615 924 -20 -901 -566 -26 150 1224 96
6440I6o57O71k42k1QQ7l49J279j476k29O4Q92R02j116o33J246K26O51j012m1q06
$$ 96 -561 110 -132 -153 -145 -58 -407 872 -604 -833 -769 123 1025 -91 -724 522 748 1399 387 346 -460
6461d60M25J355j937J260M65n81k65J79j010J088n47l89M21k15J58j01J003j402
$$ -460 -35 1320 -617 643 1108 527 262 441 -569 519 -28 -417 4 -211 -53 -154 849 -553
6479e53Q22Q5p01J129r38k84n17R32N01n91P18m33k14k01O07j53q75J144o42K37
$$ -553 269 354 -347 782 -156 -440 -957 -25 476 -115 603 170 -44 -245 362 209 -666 478 -164 73
6499G3L83k36q81J454J80j24j307K72J14Q99o47L73p21L31K95p56J10J73M04p53
$$ 73 456 220 -661 793 973 849 -458 -186 -72 827 180 553 -168 163 458 -298 -188 -15 389 -364
6519c64J572k202J756r73r3J14P3Q8Q6p50O71K35k00r80J008J29j22J57l10n3
$$ -364 1208 -994 762 -211 -304 -190 -117 -29 57 -693 -22 213 13 -967 41 170 48 205 -105 -158
6539a58m49L34N88m65n86J036k78J28M15q50O86p04L39M47m81K85o09Q88j99N24
$$ -158 -607 -273 315 -150 -736 300 22 150 565 -285 401 -303 36 483 2 287 -322 566 367 891
6559H91o00q84J591j392J73l0K55n62O22L27J96j61q33J015j116o59R09m24J216
$$ 891 291 -593 998 -394 -221 -251 4 -558 64 391 587 426 -407 608 -508 -1167 -258 -682 534
6578E34j51j20M23q83m75p53Q64R35K27P04j078p14R74r15l51Q13j082J040J03
$$ 534 383 263 686 -197 -672 -1425 -561 374 601 1305 227 -487 487 -428 -779 34 -1048 -8 95
6597I5p97L02O77j30K04k84m76Q2l9R68p4o62J223k110J199q16P40m7p15O73j125
$$ 95 -702 -400 277 147 351 67 -409 -327 -366 602 528 -134 1089 -1021 178 -638 102 55 -660 13 -1112
6618a112J019Q9J19M91k33j023J129j081O61m29N21k52r11J89J227l9o96Q20p46
$$ -1112 -93 -4 115 606 373 -650 479 -602 59 -370 151 -101 -1012 -823 404 365 -331 489 -257
6637b57J01N88J28j064N82J14j273P88K49L85j313M08J035o17L65m87m81N42P64
$$ -257 -156 432 560 -504 78 192 -1081 -293 -44 341 -972 -564 471 -146 219 -268 -749 -207 557
6656E57k85j53K79r84R09j124Q93RJ19r4j93j192J553K8q80J38K1j41r1Q07n28
$$ 557 272 119 398 -586 323 -801 92 101 220 126 -67 -1259 294 322 -558 -420 -399 -540 -631 176 -352
6677c52K65j11k12OK45r22P92O73k4J96j032M39N42n08Q1n00J515j849P29q12
$$ -352 -87 -198 -410 -404 -159 -1081 -289 384 360 556 -476 -37 505 -3 78 -422 1093 -756 -27 -839
6697h39R28p63J413j683J059l08J61J24K70r55J408j233K34K80L45p76O6J2J78
$$ -839 89 -674 739 -944 115 -193 -32 92 362 -593 815 -418 -184 96 441 -335 -269 -257 -79
6716g9P45j074J259o36n79J72J71J0N24j062J324m8k80n62l85l10J907j288K59
$$ -79 666 -408 851 215 -364 -192 -21 -11 513 -549 775 727 447 -115 -500 -810 1097 -191 68
6735F8R3m70J069M87p84j289J094R69n97j093l52Q65O29j117j00K212j720J170
$$ 68 161 -309 760 1247 463 -826 268 1237 640 -453 -805 60 689 -428 -528 1684 -36 1134
6753A134r79n73O38Q1L57j557J117l03l53M91j28q54R92j80L42o34J48K82J33
$$ 1134 155 -418 220 301 658 -899 218 -85 -438 53 -75 -929 63 -117 225 -409 -261 21 154
6772A54k12j60R47j006p2Q00N09q48N1M60o6k96l89M23l64N67l07n61N44K53J47
$$ 154 -58 -218 729 -277 -349 451 960 112 163 623 557 261 -128 295 -69 498 191 -370 174 427 574
6793E74j32m05L6n58M81P49o78l69J017j006j02J099j094J402j007N26l17m71
$$ 574 442 37 73 -485 -4 745 67 -302 715 -291 -393 706 -388 1014 7 533 216 -255
6811b55K74j240L57P48K23l89M56p59J224l22k037K669K62j939M28R95j456R17
$$ -255 19 -1221 -864 -116 107 -282 174 -585 639 317 -1720 949 1211 -728 -300 695 -761 156
6829A56J66J69J0L84j127r40J925j126J786j271p73M17q16J090J02j020J481J130
$$ 156 322 491 501 885 -242 -1182 743 -383 1403 132 -641 -224 -1040 50 152 -868 613 1743
6847A743j442o31M98N42j513l54J213j059J064n72R59j59K81m73l8L9j078J542
$$ 1743 301 -330 168 710 -803 -1157 56 -1003 61 -511 448 289 570 97 59 98 -980 562
6865E62k18m48j72Q6K07K87J70k09j078J15M05P44q04N36j86m94P60N97o37p48
$$ 562 344 -104 -276 -190 17 304 474 265 -813 -698 -293 451 -353 183 -3 -497 263 860 223 -525
6885e25P03M23p41K6m33K97J94K06Q6m34O8N43k46p2J94O0o52R35n81K89p64k87
$$ -525 178 601 -140 -114 -547 -250 -56 150 236 -198 -130 413 167 95 289 349 -303 632 51 340 -424 -711
6907g11J406m3q32k01N80o26J41J933j128n20K65j92L42n19m14m95M6J535k01
$$ -711 695 652 -180 -381 199 -427 -286 1647 519 -1 264 72 414 -105 -519 -1014 -968 567 366
6926C66l31j37N8M86j541J369j14M72R8l96m67K69k19Q28r38J4Q23o52O6o04J090
$$ 366 35 -102 -44 442 -1099 270 156 628 726 330 -137 132 -87 741 -197 -183 640 -12 54 -550 540
6947E40l44j29p5K37L91n7q72K48j28L83j142J550J00j254J30o59P36R37R9n24
$$ 540 196 67 -8 229 620 563 -309 -61 -189 194 -948 602 702 -552 -422 -1081 -345 592 691 167
6967A67o99N52m26M52J266j474j63J05J44m91L32O01j067N90M44m52K02j332J330
$$ 167 -532 20 -406 46 1312 -162 -325 -220 -76 -567 -235 366 -701 -111 333 -119 83 -1249 81
6986H1m3k44q38J668l41j297K012n81q42l67K026j004P00j80j016m03L92Q89j40
$$ 81 38 -206 -1044 624 283 -1014 998 417 -425 -792 1234 230 930 750 -266 -669 -277 612 472
7005D72o60j76l57J23j96R47L5q4l31o58P69K21P10j513J329k89M42q82q27J259
$$ 472 -188 -364 -721 -598 -794 153 188 104 -227 -885 -116 105 815 -698 631 342 784 -98 -925 334
7025C34n95J82K64j832N26R64Q61q83K0J401j395R90k031J633L20n77N83j684
$$ 334 -261 -79 185 -1647 -1121 -157 704 -179 -159 1242 -153 837 -1194 439 759 182 765 -919
7043i19J678p19l75M57J335j579L09k78P33j210J016p57j73K25M42l08l42J287
$$ -919 759 40 -335 122 1457 -122 187 -91 642 -568 448 -309 -482 -257 185 -123 -465 822
7061H22j515K60r45Q73m22L24J702q70Q4O00j627J383j186l20K24J383n70j398
$$ 822 -693 -433 -1378 -505 -927 -603 1099 229 313 913 -714 669 -517 -837 -613 770 200 -1198
7079a198R17o7J400n02L44j79n21p87N63O4O93p51R10k18J53n80Q3N71m40l82
$$ -1198 -281 -348 1052 550 894 715 194 -593 -30 34 727 -24 886 668 821 241 324 895 455 73
7099G3L1l64j92P11m25n61o05J403j26j00L39r89O38O55n19n82N08p17J643m4
$$ 73 104 -260 -452 259 -166 -727 -1332 71 -55 -155 184 -805 -167 488 -31 -613 -105 -822 821 777
7119G77m15N46k119J219J35L33j195O20P76j287K35K93J315m77l65mp16l11J325
$$ 777 362 908 -1211 8 143 476 -719 -99 677 -610 -375 -82 1233 756 391 387 -329 -640 685
7138F85q49l27K24n6O82p81J31j50M10o91P77O60j094N02L36j116O05p08N81P35
$$ 685 -164 -491 -267 -323 359 -422 -291 -441 -31 -722 55 715 -379 123 459 -657 -52 -760 -179 556
7158E56l69o80J14n20J123n14K84n40J215k91m00N0K13o86R2Q14q01L39L2K55
$$ 556 187 -493 -379 -899 224 -290 -6 -546 669 378 -22 28 241 -445 -353 461 -340 -1 31 286
7178B86j208P82r14M76K105k841J932j086O02n37L4J67j146Q89m2K33m27Q14J016
$$ 286 -922 -140 -1054 -578 1527 -1314 618 -468 134 -403 -369 -202 -1348 -459 -501 -268 -695 119 1135
7197A135j656M70K81m68P64j73J73p01J335j505L94q51K90J582j327j94O45p19
$$ 1135 -521 -51 230 -238 526 353 526 -175 1160 -345 49 -802 -512 1070 -257 -451 194 -525
7215e25Q73P83m03o58r40J876p80j377L91J307q61j91N63j08j089K416j700M58
$$ -525 348 1131 728 70 -870 1006 226 -1151 -760 547 -314 -505 58 -50 -1139 1277 -423 35
7233C5O66j323J699m62q98J68M32L9m68k22Q25j187J347n31P44o41r1r81J308
$$ 35 701 -622 1077 615 -283 -115 317 356 -112 -334 491 -696 651 120 864 223 132 -849 459
7252D59l10n52K63n1J594k067l35N28O59m44J85N65j459R76M32p30K75Q95j226
$$ 459 149 -403 -140 -191 1403 -664 -999 -471 188 -256 -71 494 -965 11 443 -287 -12 883 -343
7271c43J093j026R1m73K73m07J311j244J049M63j719K085o17n30K92l31L22Q6
$$ -343 750 -276 -185 -658 -385 -792 519 -725 324 787 -932 1153 536 6 298 -33 289 375
7289C75q80J070k95J00q05J6J157j028j515K038l15l96N3R7m36K18q6R91p17j23
$$ 375 -505 565 270 370 -435 -419 738 -290 -1805 233 -82 -478 -425 -328 -764 -546 -632 359 -358 -481
7309d81l16J405j102J078o64J080o95l95M87o65l38M09M17l19R55j128N28J8q86
$$ -481 -797 608 -494 584 -80 1000 305 -90 397 -268 -606 -197 220 -99 856 -272 256 274 -612
7328f12K25o8M92O0J209j110o20P07o80J057q14j45M88m36P92o61k83Q52r08P87
$$ -612 -387 -455 37 97 1306 196 -424 283 -397 660 -154 -299 189 -247 545 -116 -399 453 -455 332
7348C32r13O37O96n49N3p44j08Q50J4L09j016O65k25J50L1O77p32l84PJ163r12
$$ 332 -581 56 752 203 256 -488 -596 254 268 577 -439 226 1 151 182 859 127 -257 -250 913 1
7369Al5j07J341r59j151J004J035k027O33J340q56l28O11j110K64N19k92R44j121
$$ 1 -34 -141 1200 241 -910 94 1129 -898 -265 1075 219 -109 502 -608 -344 175 -117 827 -294
7388b94M26j91M8j272J102O50j063o03N70O42k29R83n78M28j16n07O43j7j165
$$ -294 132 -59 -11 -1283 -181 469 -594 -1197 -627 15 -214 769 191 619 503 -4 639 622 -543
7407e43J446j031n28J005O3q47N23J437j920M30J370j850J186k168J445K98o79
$$ -543 903 -128 -656 349 412 -435 88 1525 -395 35 1405 -445 741 -1427 18 316 -363
7424c63R00L07j185N39P0o53J721j578j128L23O62l87O29j68Q08r41O41o87M55
$$ -363 537 844 -341 198 268 -385 1336 -242 -1370 -1047 -385 -772 -143 -311 497 -444 197 -490 -35
7443c5L45q00P49l10K97j22J29J61K42n39n4k96m38J733r56J29j60m87o19l3O10
$$ -35 310 -490 259 -51 246 124 253 414 656 117 63 -233 -671 1062 106 235 75 -412 -1031 -1064 -454
7464d54J48M69n88P65r73O02J071o99j206J428m09R5K11j016q8M04J11q27L84
$$ -454 -306 163 -425 340 -633 -31 1040 341 -865 563 154 249 460 -556 -644 -240 -129 -956 -572
7483e72J323j325J061j458J179o13l04O18M18J167j145n03P73k37k53R74j756
$$ -572 751 -574 487 -971 208 -405 -709 -91 327 1494 349 -154 619 382 129 1103 -653
7500f53O92j258J800j050J149k91j88j74j234P16R68N48j016J071j895l82R55
$$ -653 39 -1219 581 -469 680 389 201 27 -1207 -491 477 1025 9 1080 -815 -1197 -242
7517b42m47P69K2k48j96k42n31J20R50o76M90R58J27l84N83j302j33M69P48n50
$$ -242 -689 80 102 -146 -342 -584 -1115 -995 -45 -721 -231 727 854 470 1053 -249 -382 87 835 285
7537B85m70K49q83M95J488k309J380n29M81K01j216K266q46p2j116K1J306j528
$$ 285 -185 64 -819 -324 1164 -1145 235 -294 187 388 -828 1438 592 520 -596 -575 731 -797
7555g97J003N8n04K7J258j762J67N68J20k51O42j415O95o50N7J440j369J263p19
$$ -797 206 264 -240 -213 1045 -717 -550 18 138 -113 529 -886 -191 -841 -784 656 -713 550 -169
7574a69L09n34P87o50J229q25j45j52J27P01n41l19O06o04m85m29N05O16J27p7
$$ -169 140 -394 393 -257 972 147 2 -150 -23 678 137 -182 424 -180 -665 -1094 -589 27 154 77
7594G7L78o18j14r5P71l8m90L12n46M63l72J93M47q55M66j54k5K82j48P35q0p63
$$ 77 455 -163 -277 -372 399 361 -129 183 -363 100 -272 -79 368 -487 -21 -175 -200 82 -66 669 589 -174
7616a74k0L52l31P43K43q58L54o26m96J514j596J079j85m07M21J331j482K93J7
$$ -174 -194 158 -173 570 813 -45 309 -317 -813 701 -895 184 -1 -408 13 1344 -138 155 172
7635A72K10j393J742j490R01m3K24l37P53R7j442P73M27m88p80M91j015J074n1
$$ 172 382 -1011 731 -759 142 99 323 -14 739 836 -606 167 594 106 -674 -183 -1198 -124 -175
7654a75J456j750K20o71O51L46R21l30P37q25q07Q40r19J124j126J02J059j082
$$ -175 1281 -469 -249 -920 -269 77 998 668 1405 580 -227 613 -306 818 -308 -206 853 -229
7672b29o7Q13r63J118n05o04N84j6l08m15m8p0P28J098j373o16K93J907j299q83
$$ -229 -296 517 -446 672 167 -437 147 131 -177 -592 -640 -710 18 1116 -257 -873 -580 1327 28 -855
7692h55J351j363J196P70j561P06o9l74O05q61Q94p65k67R62J387j405j377J316
$$ -855 496 -867 329 1099 -462 244 175 -199 406 -455 439 -326 -593 369 1756 351 -1026 290
7710B90o42n82N53M6N76j710J776p39J47j15Q15J42l87L5l73QL24Q5j54K8K87
$$ 290 -352 -934 -381 -335 241 -1469 307 -432 -285 -400 415 557 170 205 -168 -160 164 249 95 123 410
7731D10l44p7n02j98P10l8j5M61n02p94J309l12K69L29j250P81n95O46j484K164
$$ 410 66 -11 -513 -711 -1 -39 -54 407 -95 -889 420 108 377 706 -544 237 -358 288 -1196 968
7751I68j010N50p52n13O41J69k70O21R68o93N54j412Q6Q13%j969J631n9o18q80
$$ 968 -42 508 -244 -757 -116 53 -217 404 1372 679 1233 -179 -93 720 720 -1249 382 323 -295 -1175
7771a175J106R1Q5n44J363j953J225p97N48J76L35k72j59J19j125Q72K02O26m19
$$ -1175 -69 22 107 -437 926 -1027 198 -599 -51 125 460 188 29 148 -977 -105 97 723 304
7790C04l82k37P36r45R54K67p04q08P79L63j28L2n66N31k48M46q88P72j194J040
$$ 304 -78 -315 421 -524 430 697 -7 -815 -36 327 199 231 -335 196 -52 394 -494 278 -916 124
7810A24L92J008j381K99K1o90l67p0J210m45L67r49L3j22J557j055o60P17Q07
$$ 124 516 1524 143 442 463 -227 -594 -664 546 101 468 -481 -448 -570 987 -68 -728 -11 796
7829G96j205L0L92L97r73J40M73q2j6M0M52o8j484J053k37P64l42n02J200j030
$$ 796 -409 -379 13 410 -563 -423 50 -32 -48 -8 444 376 -1108 -55 -292 472 130 -372 828 -202
7849b02P5O46k73p52p09R97l2K61J030p14l52M00j661M18P60L53m03R41q05J85
$$ -202 -127 519 246 -506 -1215 -218 -250 11 1041 327 -25 375 -1286 -868 -108 245 -158 783 -22 163
7869A63K47O29j576O31Q1k10J265j038Q90j420K1K20M64m53O89q69j0O21j236
$$ 163 410 1039 -537 94 175 -35 1230 192 1082 -338 -317 -97 367 -86 603 -266 -276 345 -891
7888h91J600o56p77L53o85Q64J041p65K28m85o02J367j509J629n79j013J021m58
$$ -891 709 53 -724 -371 -1056 -192 849 84 312 -173 -775 592 -917 712 133 -880 141 -317
7906c17L36K97l0k8k17K63j63m98k2N4O9O59J81j412J049q89Q99R0r30J226N96
$$ -317 19 316 286 258 41 304 141 -357 -379 -325 -256 403 584 -828 221 -668 231 321 -609 617 1213
7927A213m54k10r45K16j90J21R23j046k40l57Q59k75q07J122J1J108n76j691J169
$$ 1213 759 549 -396 -180 -370 -249 674 -372 -612 -969 -110 -385 -1192 -70 -59 1049 473 -1218 -49
7946d9J03l68o6M05K43l52M26n91L70Q20m78J01j043l07J174j141n7J173O7j833
$$ -49 54 -314 -380 25 268 -84 342 -249 121 941 463 564 -479 -786 388 -753 -810 363 430 -1403
7966a403J028O84N7J60j446R27j23N01K85j053K41m32J96K03K38p9q25P7J374
$$ -1403 -375 309 366 526 -920 7 -116 385 670 -383 -142 -574 -378 -175 63 -16 -841 -764 610
7985F10M86p63n75j39k82K82R7J51Q9p92J177m5q61K03O48K56M65K9j133M92q68
$$ 610 1096 333 -242 -381 -663 -381 -284 -133 -44 -836 341 296 -565 -362 286 542 1007 1036 -97 395 -473
8006d73J121j88QK88L55p15j357J193n12J209j46%o95K57r07L93R84p22J240q73
$$ -473 648 460 468 756 1111 396 -961 232 -280 929 783 783 88 345 -562 -169 815 93 1333 460
8026D60j04p12N3L02O07N36j073J53j10R05o71j477J549j619Q05Q72K16J68k029
$$ 460 356 -356 -303 -1 606 1142 69 222 112 1017 346 -1131 418 -1201 -396 476 692 860 -1169
8045a169J112K73L81j254P91J58k05Jj02o38M77P17j026l34R39r72%J835mj477
$$ -1169 -57 216 597 -657 134 292 87 88 -14 -652 -175 542 -484 -818 121 -851 -851 984 980 -497
8065d97Q01r57O54J39n4q86l98O32K051j203p98M01N16j508L87J025q60R90m94
$$ -497 304 -653 1 140 86 -800 -1198 -566 1485 282 -516 -115 401 -1107 -720 305 -555 435 -59
8084e9O2k49p8R50m21j47J19o47l23L04P57L08n37j278O12J046j010R76J85n22
$$ -59 3 -246 -324 626 205 58 177 -470 -793 -489 268 576 39 -1239 -627 419 -591 385 570 48
8104D8Oo34J61L34Q82j400J315q22L04P91j248P64r83l14Q71m85m00N1O29m94
$$ 48 54 -580 -419 -85 797 -603 712 -110 194 985 -263 501 -482 -796 75 -410 -810 -759 -130 -624
8124f24J097n01J78k80j553J978j52o1j040R54R28j060L49k45K65o52J200j090
$$ -624 473 -28 150 -130 -1683 295 143 82 -958 -4 924 -136 213 -32 233 -419 781 -309
8142c09O94N01j354K65j9q44m1N66R16M63n39m47L30l05j282j68J594l62J32J117
$$ -309 385 886 -468 -203 -222 -1066 -1107 -541 375 838 299 -148 182 -123 -1405 -1573 21 -341 -209 908
8162I08j552Q84l7J450j367q88J73P54l22O99k52j357K43K55R35p98m86J078M20
$$ 908 -644 240 203 1653 286 -602 -429 325 3 702 450 -907 -664 -409 526 -272 -758 320 740
8181G40j048l61k4J36J370j34o81M83J006j616
$$ 740 -308 -669 -693 -557 813 679 -2 481 1487 -129
8191a29
$$ Imaginary data points
##PAGE= N=2
##DATA TABLE= (X++(I..I)), XYDATA
0@%%%%%%%%%o4J28j28J92k56L20l84M48n76P04q33J025j280J528j784K054k375
$$ 0 0 0 0 0 0 0 0 0 0 -64 64 -64 128 -128 192 -192 256 -320 384 -449 576 -704 824 -960 1094 -1281
26a281K807l260L746m317M946n650O435p302Q257r308J0462j1734J3134j4664
$$ -1281 1526 -1734 2012 -2305 2641 -3009 3426 -3876 4381 -4927 5535 -6199 6935 -7729
40g729J6334j8168K0172k2354K4733k7341L0190l3303L6707m0445M4561m9094
$$ -7729 8605 -9563 10609 -11745 12988 -14353 15837 -17466 19241 -21204 23357 -25737
52b5737N4106n9676O5904p2910Q0851q9926J00426j12743J27416j45254J67520
$$ -25737 28369 -31307 34597 -38313 42538 -47388 53038 -59705 67711 -77543 89977
63H9977j96201K34736k89610L74591n25260Q72708l149666j188004M908638k41278
$$ 89977 -106224 128512 -161098 213493 -311767 560941 -2588725 -3776729 1131909 890631
73H90631k018407r43864K074032R42665p63622j088444Q31872J241636N50696
$$ 890631 -1127776 -2071640 2392 945057 181435 -907009 -75137 1166499 1717195
82A717195n16005l91021k67795K7009j02579j67345l81059P0114M36630J98358
$$ 1717195 1201190 810169 542374 569383 466804 299459 -81600 -11486 425144 623502
92F23502p00452p07743P8629M99164j98034n36184J28476P68320J42341o62733
$$ 623502 -76950 -784693 -706064 -206900 -404934 -941118 -812642 -44322 98019 -564714
102e64714l94605N34450N87654o1884k00262L82080M66770k34071o21055Q929
$$ -564714 -959319 -424869 162785 100901 -99361 282719 749489 515418 -105637 -96708
112i6708O74922L81182m05558n24038L5806L23918q7587n21199l23514K30241
$$ -96708 578214 959396 553838 29800 65606 389524 301937 -219262 -542776 -312535
122c12535L63257p7518m53092k33420K59311L68449K4279k44599n8782L10939
$$ -312535 50722 -26796 -479888 -713308 -453997 -85548 -61269 -305868 -364650 -53711
132e3711L74728O6968k25508j69757R8911K14567N6626j41316j48615j8766L7677
$$ -53711 321017 387985 162477 -7280 91631 306198 362824 221508 72893 54127 91804
143I1804m3701j12064m7268N6837M9746m0970o9644l2156n039P412M9631Q6803
$$ 91804 48103 -63961 -111229 -54392 -4646 -45616 -115260 -147416 -152455 -145043 -95412 -8609
155h609M0382l5404l5396J7631K8340j5779k0886O0438J18453M9203q8083j31043
$$ -8609 31773 -3631 -39027 -21396 6944 -8835 -29721 30717 149170 198373 110290 -20753
167b0753k0715R6498N9362p8073j10397K7259J37384K3075j79726j77368M4325
$$ -20753 -41468 55030 114392 36319 -74078 -46819 90565 113640 -66086 -243454 -199129
178a99129J73523N7320p8277l3580P8377O0856k8469l9903N557L0696M8160Q4073
$$ -199129 -25606 31714 -46563 -80143 -1766 59090 30621 -9282 -3725 26971 75131 159204
190A59204M3300q8729j37689k0717Q7793J1056j04440m2381R1130N0515j05707
$$ 159204 202504 113775 -23914 -44631 43162 54218 -50222 -92603 -1473 49042 -56665
201e6665j17983J6403P3273R600K416P0552M7277n2658m7653N9610O8066l8361
$$ -56665 -174648 -158245 -84972 -75372 -72956 -2404 44873 -7785 -55438 4172 72238 33877
213C3877m0501R2590J17357l9921j47928l6985Q9550K5372q9459n2358N6277L4866
$$ 33877 -6624 85966 203323 163402 15474 -21511 68039 93411 3952 -48406 7871 42737
225D2737o4050p4088p430J0960j0121J9403N8698O763o1788k6386O6066O1520
$$ 42737 -21313 -95401 -102831 -91871 -101992 -82589 -23891 -17128 -78916 -105302 -39236 22284
237B2284k7697l1353O3173R1294n687q3606l4368M9657M6336j705j4001K50j8727
$$ 22284 -5413 -36766 26407 117701 112014 28408 -5960 43697 90033 88328 74327 74577 55850
250E5850m5339k7079j773j3315k3194P562L4564k826o3106n2055K3306O1213J9488
$$ 55850 10511 -16568 -18341 -31656 -54850 -47288 -12724 -15550 -78656 -130711 -107405 -46192 -26704
263b6704j3817J3630N2619L0452k1814l1318N949L5631L4262J2909m212k4716
$$ -26704 -40521 -26891 25728 56180 34366 3048 8997 44628 78890 91799 87587 62871
275F2871l2522k0060n320j3331j9811Q08K9345J7402l7953n7775j4995M0532L4581
$$ 62871 30349 10289 4969 -8362 -28173 -27365 1980 19382 -18571 -76346 -91341 -50809 -16228
288a6228m53r258J0643J8044r98j5967p813J2277K4332K4459J1929j1331k0328
$$ -16228 -16681 -25939 -15296 2748 1750 -14217 -22030 -9753 14579 39038 50967 39636 19308
301A9308p177J3189R616j1480j1118R408J5278j2558m2596k8938M997K0125R701
$$ 19308 12131 25320 34936 23456 12338 21746 37024 24466 -18130 -47068 -42071 -21946 -12245
314a2245r349j1257j345N075L08N8N430J9621L0629J6714j0433k1876q976J3103
$$ -12245 -21594 -32851 -34196 -29121 -28813 -28755 -23325 -3704 26925 43639 33206 11330 2354 15457
328A5457J8324J725j2863o928J476l019j9952k4328o983J6926K1476N528j5465
$$ 15457 33781 35506 22643 15715 17191 14172 -5780 -30108 -37091 -20165 1311 6839 -8626
341h626j1600j347N151J935N86Q169J4609J4010j350j7692j8576l239J6623K0415
$$ -8626 -20226 -21573 -16422 -14487 -13901 -5732 8877 22887 21537 3845 -14731 -17970 -1347 19068
355A9068M294o476n481J259n240j2260o722Q364J3974O207j0949j7540j0796k833
$$ 19068 23362 16886 11405 12664 7424 -4836 -11558 -3194 10780 16987 6038 -11502 -22298 -25131
369b5131K616N919M653M725O018L944m627j0214k790J4632K1850J2320o119j2884
$$ -25131 -22515 -16596 -11943 -7218 -1200 2744 -1883 -12097 -14887 -255 21595 33915 27796 14912
383A4912n108k739m435n381L812P912K647n994j3681j4746p132N626J1788J2604
$$ 14912 9804 7065 2630 -2751 1061 8973 11620 5626 -8055 -22801 -29933 -24307 -12519 85
397H5L456k398l500k070n209k777M167J4576J6259K98r138j1189m808p04J896
$$ 85 3541 1143 -2357 -4427 -9636 -12413 -8246 6330 22589 22887 13749 2560 -2248 -2952 -1056
412a056N495P189N370j674p127j1154j0532n567P530J4477O411o096j1243p087
$$ -1056 4439 11628 16998 15324 8197 -2957 -13489 -19056 -11526 2951 9362 3266 -7977 -15064
426a5064j239k65J730P283J2674P784j682p541l881P52K818O067P490L511n001
$$ -15064 -16303 -16568 -14838 -7555 5119 12903 11221 3680 -201 551 3369 9436 16926 20437 15436
441A5436q414m013n446p634q04P489Q966k251r795r247M19N890O79L042N763O290
$$ 15436 7022 3009 -2437 -10071 -10875 -3386 5580 3329 -6466 -15713 -15294 -9404 -8725 -5683 80 6370
457F370N31m981o302k273Q45P717R565M187m665r627l331K102m59k061L088Q360
$$ 6370 6901 1920 -4382 -6655 -5810 1907 11472 15659 10994 1367 -1964 138 -321 -2382 706 9066
473I066L331o712j3053n732M46N205K641R84L387O07k020l250k666k024N156J0726
$$ 9066 12397 5685 -7368 -13100 -12654 -7449 -4808 -3824 -437 170 -1850 -5100 -7766 -9790 -4634 6092
489F092Q345L24p795n530P79K529k470l637M769N736n25r645r294l074M918M331
$$ 6092 14437 14761 6966 1436 2215 4744 2274 -1363 3406 9142 8617 -1028 -10322 -13396 -8478 -4147
505d147L97J425P08o89j190j826O8K166N520N386K300n415p156n16P292L715l036
$$ -4147 -3750 -2325 -1617 -2306 -3496 -5322 -5254 -3088 2432 7818 10118 4703 -2453 -2969 4323 8038 5002
522E002k310J854N403m130j0299n577N347Q170K345n696n094k386j174r26M73
$$ 5002 2692 4546 9949 5819 -4480 -10057 -4710 3460 5805 109 -4985 -7371 -8545 -9471 -8998
537h998L922L280K663L855J010r980o015N800J4709N529n760m026K049M85o970
$$ -8998 -5076 -1796 867 4722 5732 -4248 -10263 -4463 10246 15775 10015 5989 8038 8523 1553
552A553q900L530R035K699m418n286m200l860l216N111O566J859l183m63N062
$$ 1553 -7347 -3817 5218 7917 3499 -1787 -5987 -9847 -13063 -7952 -1386 473 -2710 -3173 1889
567A889k222r071j735J3702R879n744q080J871Q297l256q438K449P677L011m825
$$ 1889 -333 -9404 -11139 2563 12442 6698 -1382 489 8786 5530 -2908 -459 7218 10229 5404
582E404l908p14l774n471L875O814p70r134l262Q500K471q354m031Q869J1178
$$ 5404 1496 782 -2992 -8463 -4588 2226 1456 -7678 -10940 -2440 31 -8323 -12354 -3485 7693
597G693j866q011j764P031L237k944n78K493P84k726j178J714j683m695o39M830
$$ 7693 5827 -2184 -3948 3083 6320 3376 2798 5291 6075 3349 2171 3885 2202 -2493 -3132 1698
613A698K664o339o755L632Q090k397q002j181O302N719n472l231L920N570o54
$$ 1698 4362 -1977 -8732 -5100 2990 593 -7409 -8590 -2288 3431 -2041 -5272 -1352 4218 3564
628C564m109J016K954k038j119M459L127m375m214Q58N158k633q170m15Q926K781
$$ 3564 -545 471 3425 1387 268 4727 7854 3479 -735 123 5281 2648 -5522 -5937 2989 5770
644E770p109q124L699O153r38l797J123L971M12l034J431L438j230j582L231L000
$$ 5770 -1339 -9463 -5764 389 -549 -4346 -3223 748 1160 -1874 -443 2995 1765 183 3414 6414
660F414k934o521N62N713L444m577m337L51K565j670m522K46N123L629q38n617
$$ 6414 3480 -3041 -2479 3234 6678 2101 -2236 -1885 680 -990 -5512 -5266 -143 3486 2648 -2969
676b969p40o76P64J490K940L658%l191j780K51j448l316L840R021K524o511p326
$$ -2969 -3709 -4385 -3621 -2131 809 4467 4467 1276 -504 -253 -1701 -5017 -1177 7844 10368 3857 -3469
693c469J249L120j330l221J996P188J293p792o424J141L408j011K016L411L331
$$ -3469 -2220 900 -430 -3651 -1655 5533 6826 -966 -7390 -6249 -2841 -3852 -1836 1575 4906
708D906m132n282L655L426l477k35O607N033n088j0238j001Q035L725o486j471
$$ 4906 774 -4508 -853 2573 -904 -1139 5468 10501 5413 -4825 -5826 2209 5934 -552 -2023
723b023M134J503o828l741L789M416j166k827L925J016o107m528O001O618l31
$$ -2023 2111 3614 -3214 -6955 -3166 1250 84 -2743 1182 2198 -3909 -8437 -2436 4182 3851
738C851n245J909M895p99p791p77N473M383k245l435K671q19m622k962M124M742
$$ 3851 -1394 515 5410 4611 -3180 -3957 1516 5899 3654 219 2890 2071 -2551 -5513 -1389 3353
754C353l399r07J807K49l489o183M437P465J143n832j026M212M78m142k6K582
$$ 3353 -46 -953 854 1103 -2386 -8569 -4132 3333 4476 -1356 -2382 1830 2308 -1834 -1860 722
770G22L281R91k933j599Q61j551q58L24K725j268l243J138J319p31m250m98N845
$$ 722 4003 4994 2061 462 1323 -228 -1086 -762 1963 695 -2548 -1410 -91 -822 -5072 -5570 275
787B75K316k906j459q90M198j142p08M72L034o99j190k23J691r08k888Q21J841
$$ 275 2591 -315 -1774 -2664 1534 392 -316 156 3190 2491 1301 1078 2769 1861 -1027 -206 1635
804A635N0k683j885K661J810j944k061P41K119k144j092J359J090K185j664q77
$$ 1635 1685 -998 -2883 -222 1588 -356 -2417 -1676 443 -1701 -2793 -1434 -344 1841 177 -700
820g00P85J248p73J181J509r01j325l74J121j719o27N61K05K225k033k602j237
$$ -700 85 1333 560 1741 3250 2349 1024 650 1771 52 -575 -14 191 2416 383 -2219 -3456
837c456J596J330q89m39J14J223L33K05j134J42K408Q65k13k07M39j725Q48N48
$$ -3456 -1860 -530 -1419 -1858 -1744 -521 -188 17 -1117 -975 1433 2298 2085 1878 2317 592 1440 1988
855A988J18n21j167N41n82p74j429P11K72K82J393j469j416O28Q80r98J136J270
$$ 1988 2106 1585 418 959 377 -397 -1826 -1115 -843 -561 832 -637 -2053 -1425 -545 -1543 -407 863
873H63j021N05j67p94Q99J608O99m57J36j619L13k34M05j586j636J872J273j299
$$ 863 -158 347 180 -614 285 1893 2592 2135 2271 652 965 731 1136 -450 -2086 -214 1059 -240
891b40l38k293R36J745j787M94P77J62O37r98J119l76J45Q81M34R75j328R7q4
$$ -240 -578 -2871 -1935 -190 -1977 -1483 -706 -544 93 -905 214 -162 -17 864 1298 2273 945 1042 958
910I58R39k33o52j716M20R13r3q33j008m29O21M12q55O02O92q39P1J184j524K69
$$ 958 1897 1664 1012 -704 -284 629 536 -297 -1305 -1734 -1113 -701 -1556 -954 -262 -1101 -1030 154 -1370 -1101
930a101J479J345l21j439o53P45J805j283J88J58K12o99p59J025o91j006P90m53
$$ -1101 378 1723 1402 -37 -690 55 1860 577 765 923 1135 436 -323 702 11 -995 -205 -658
948f58p00K36r21J89K78Q70p62J492k4J481p39r66J782P9R36l17q06j14m82Q25
$$ -658 -1358 -1122 -2043 -1854 -1576 -706 -1468 24 0 1481 742 -224 1558 1637 2573 2256 1450 1336 854 1679
968A679k038j06j144J496M52j420O20o09m64L30p4O57O41q71J968M84p31j103
$$ 1679 -359 -465 -1609 -113 339 -1081 -461 -1070 -1534 -1204 -1278 -621 20 -851 1117 1601 870 -233
986b33J287n88K5O84RM43l00l25K52o78q58K46j2kl97o03l3P41o52J40J45n47
$$ -233 1054 466 491 1175 1184 1627 1327 1002 1254 576 -282 -36 -48 -50 -447 -1050 -1083 -342 -994 -854 -709 -1256
1008a256J102j77J54l42O1J312k28O0j79L36J268m90j279O15n63N28k62j727L90
$$ -1256 -154 -331 -177 -519 -458 854 626 686 507 843 2111 1621 342 957 394 922 660 -1067 -677
1027f77o72l2P71q38P12q77R88Q77r08K33k71R48n2K95m54Q64o10L23j8o11J270
$$ -677 -1349 -1381 -610 -1448 -736 -1613 -625 252 -656 -423 -694 254 202 497 43 907 297 620 602 -9 1261
1048A261q96J019l3j987R2M48p71P79n27j8j6J77n6k84K83l18J034P66l047L414
$$ 1261 365 1384 1351 -636 -544 -96 -867 -88 -615 -633 -649 -472 -528 -812 -529 -847 187 953 -2094 1320
1068A320k291K554j018l47J456m54o6K81o80l77q37l40L84J462j545K69j276M27
$$ 1320 -971 1583 565 218 1674 1220 1154 1435 755 378 -459 -799 -415 1047 -498 -229 -1505 -1078
1086a078k23Q06L61m24J70l18R01j72o14J374J8P48n21R4n59J81k53o95K215j548
$$ -1078 -1301 -495 -134 -558 -388 -706 195 23 -591 783 801 1549 1028 1122 563 744 491 -204 2011 463
1106D63j156O83P6l98o05n6J053m57n2M89j123R68j73m37k45J278R72l69n11o98
$$ 463 -693 -10 66 -332 -937 -993 60 -397 -449 40 -1083 -115 -288 -725 -970 308 1280 911 400 -298
1126b98K007j367L79j083P97o55O36o3j50K28q52m41M70j58l06Q6p7J151j389
$$ -298 1709 342 721 -362 435 -220 416 353 203 431 -421 -862 -392 -550 -856 -770 -847 304 -1085
1145a085j39J941k21J39m39k01N67n87JK68K94j86N64l46o71J149k313K61K62
$$ -1085 -1224 717 496 635 196 -5 562 -25 -24 244 538 352 916 570 -101 1048 -1265 -1004 -742
1164g42O53o8o76m57R19N58n75K28r12K416j095M04p25P3N04p72N07P33Q75j774
$$ -742 -89 -157 -833 -1290 -371 187 -388 -160 -1072 1344 249 653 -72 1 505 -267 240 973 1848 74
1184G4P66p09J07j86k24j70J534j087n85j61J329j481n90O8K214j597k32K26N91
$$ 74 840 131 238 52 -172 -342 1192 105 -480 -641 688 -793 -1383 -1315 899 -698 -930 -704 -113
1203a13O3J304J49j195l17k77L53L54L78q83Q54q47P46q02j04K24L38q9o14J66
$$ -113 -50 1254 1403 208 -109 -386 -33 321 699 -184 670 -177 569 -233 -337 -113 225 136 -478 -312
1223c12l72P35k08l65k22J227p35l34J486k122J385L12l01L17J267j819m5j68
$$ -312 -684 51 -157 -522 -744 483 -252 -586 900 -1222 163 475 174 491 1758 -61 -106 -274
1241b74J16l02n0m9J808o76j830J188o9p36P2R99j62M5j675J572R49n72l75M20
$$ -274 -158 -460 -510 -559 1249 573 -1257 -69 -138 -874 -802 197 35 80 -1595 -23 926 354 -21 399
1261C99O36j075Q03j324J162L77j383O96p54J10R94j782P25O02k93m61O45l72
$$ 399 1035 -40 763 -561 601 978 -405 291 -463 -353 641 -1141 -416 186 -107 -568 77 -295
1279b95j68N2o98J260J65p24J147J65m02k34j066O37K80J21L67j455J324K78k355
$$ -295 -463 -411 -1109 151 316 -408 739 904 502 268 -798 -161 119 240 607 -848 476 754 -1601
1298a601J576p06J516m40m04L91j362j46N37J6K69n08O11j043J153q2j19J027
$$ -1601 -25 -731 785 345 -59 332 -1030 -1176 -639 -623 -354 -862 -251 -1294 -141 -223 -342 685
1316F85k38N95k02j027R01n30J43J54J48n0q83M7O82J89l46o34K63j17K7n08L05
$$ 685 447 1042 840 -187 714 184 327 481 629 579 -304 -257 425 614 268 -366 -103 -220 -193 -701 -396
1337c96o38M94R58j724K127N09k485O89j35J373L34m92O2q55J067r68j133K141
$$ -396 -1034 -540 418 -1306 821 1330 -1155 -466 -601 772 1106 614 676 -179 888 -80 -1213 928
1355I28o90o42k88j05J310j227m26M12J435k85j042L26P4M71k72n73N5J244j450
$$ 928 238 -404 -692 -797 513 -714 -1140 -728 707 422 -620 -294 -220 251 -21 -594 -539 705 -745
1374g45O05p86R77N77j669J201L44j31N17p20p59R42k07o35M97J08M73j243O99
$$ -745 -140 -926 51 628 -1041 160 504 373 890 170 -589 353 146 -489 8 116 589 -654 45
1393D5k20L04J56m96Q76j613J690j059Q20rn90lQ22l59j08j014j61J472q14J95
$$ 45 -175 129 285 -211 665 -948 742 -317 503 494 -96 -99 723 364 256 -758 -919 553 -261 -66
1413f6P13p04j28J14J84J159j002l73m99K94p34K16J000k53M70n41P08m98M92
$$ -66 647 -57 -185 -71 113 1272 270 -103 -602 -308 -1042 -826 174 -79 391 -150 558 60 552
1432E52j107j95O79P31q39o4n94N63m31R93J23j073K256j593l70N08k22M0j047
$$ 552 -555 -750 -71 660 -179 -243 -837 -274 -705 288 411 -662 1594 1 -369 139 -83 -43 -1090
1451a090J105J3n05Q16o31j49P86j286P00J40l34N67j90R27m16L34p85j40l38
$$ -1090 15 28 -477 339 -292 -441 345 -941 -241 -101 -435 132 -58 869 453 787 2 -138 -476
1470d76q39O30M09j756K787j255J230r73O42K00l67o04P86k35n64L81K04m16l83
$$ -476 -1315 -685 -276 -2032 755 -500 730 -243 399 599 232 -372 414 179 -385 -4 200 -216 -599
1489e99J210o32o5j21O9n49P7Q00M50k678J911N65m75O43p49Q91k112J097R01
$$ -599 611 -21 -86 -207 -138 -687 -610 190 640 -2038 -127 438 -37 606 -143 748 -1364 -267 634
1508F34p44j11L51j42J47J34l53N27O7j07n87R05n06o14k78L01N06j213J307l04
$$ 634 -110 -221 130 -12 135 269 -84 443 510 403 -184 721 215 -399 -677 -376 130 -1083 224 -80
1528h0nk50k7l13J090j318L66m6L37K3O66n94j127K659j702p32Q02P08l94J262
$$ -80 -85 -335 -362 -675 415 -903 -537 -583 -246 -223 443 -151 -1278 1381 -321 -1053 -251 457 63 1325
1548A325p97n95O44m95J6j018k86J414m03P32Q66n93r04L72m77J297r13p29J205
$$ 1325 528 -67 577 82 98 -920 -1206 208 -195 537 1403 810 -94 278 -199 1098 185 -544 661
1567F61p57K041k747J096n6P4m94J177o21k56p02Q41p5p26l5J17N19P31j357J40
$$ 661 -96 1945 -802 294 238 312 -182 995 374 118 -584 257 182 -544 -579 -462 57 788 -569 -429
1587d29J024k67P0j78m66j22N56r11R49l6n45L42k00MN92m97q49J97N81O02k476
$$ -429 595 328 398 220 -246 -368 188 -723 226 190 -355 -13 -213 -209 383 -114 -963 -766 -185 417 -2059
1608b059R86O1J342q9j79M00j004M41K93j695L63J146n56m5P11R5j05O52m41j368
$$ -2059 -1073 -1012 330 241 62 462 -542 -101 192 -1503 -1140 6 -550 -595 116 211 106 758 317 -1051
1628a051J003M52n21l50k4J299n33o66O23r3j10r4k89P89r48J436n83p08Q86l57
$$ -1051 -48 404 -117 -467 -491 808 275 -391 232 139 29 -65 -354 435 -513 923 340 -368 518 161
1648A61p8k69J85n95n6J039P11q38m89L41j274R53O19j638n8J523p55r6j85J61
$$ 161 83 -186 -1 -596 -652 387 1098 260 -229 112 -1162 -209 410 -1228 -1286 237 -518 -614 -799 -638
1668f38j56pK260k132J160L12P23n23j33j069O28P7j545J474j479P85J46j48P61
$$ -638 -794 -801 1459 -673 487 799 1522 999 866 -203 425 502 -1043 431 -1048 -263 -117 -265 496
1687D96R0r18N68k90N12k26k62m54Q13q69L86J57K24o52N80k61J99L61m18J091
$$ 496 586 -332 236 -54 458 232 -30 -484 329 -540 -154 3 227 -425 155 -106 93 454 36 1127
1707A127m65N02j195J7l06m90Q07k95O81p94P03K24o71J940k548Q22m37M73j086
$$ 1127 662 1164 -31 -14 -320 -810 -3 -298 383 -411 292 516 -155 1785 -763 59 -378 95 -991
1726i91N79m9P92q59J082o02m99Q57n77p16J46N35K07n85J004%N40k60j208M45
$$ -991 -412 -461 331 -528 554 -48 -547 310 -267 -983 -837 -302 -95 -680 324 324 864 604 -604 -159
1746a59R72j426J76J035j094K179j629J50P53m87n21O62L35q44k33k51j8J14M21
$$ -159 813 -613 -437 598 -496 1683 54 204 957 470 -51 611 946 102 -131 -382 -400 -286 135
1765A35M53q72M9J178k26o14o75M55k6n88J723p48J89K60p88K25j222R24j78O
$$ 135 588 -284 -235 943 717 103 -572 -117 -143 -731 992 244 433 693 -95 130 -1092 -168 -346 -340
1785c40L30j31L35L49j32m5l16m35L13J527j565O96M25r81K34r24J8J282p73l26
$$ -340 -10 -141 194 543 411 366 50 -385 -72 1455 -110 586 1011 30 264 -660 -642 640 -133 -459
1805d59J072l1o73m24P30l80J137j248O11j167J317j497Q38K2q03K021j015k66
$$ -459 613 582 -91 -515 215 -165 972 -276 335 -832 485 -1012 -174 -152 -955 1066 51 -215
1823b15q3J63K07J39j84n10k40J601m52j758J071J009o31p94M9J009q30k0K83
$$ -215 -298 -135 72 211 27 -483 -723 878 426 -1332 -261 748 117 -677 -628 381 -449 -469 -186
1842a86k01J589q43m33q55J462p71j81N81l90O22J08j556o4J42Q53M70j78m92
$$ -186 -387 1202 359 -74 -929 533 -238 -419 162 -228 394 502 -1054 -1118 -976 -123 347 169 -323
1861c23Q56o81L42n34J391J80k80p88J44l49m33m11J640m69r59J122p17o8P73
$$ -323 533 -148 194 -340 1051 1231 951 163 307 -42 -475 -886 754 285 -674 448 -269 -337 436
1880D36k80J96o67J58P07L25N7j672R85k20Q38j185k23Q55p95O84n15J190p93
$$ 436 156 352 -315 -157 550 875 932 -740 245 25 863 -322 -545 310 -485 199 -316 874 81
1899H1N68K33j012j74K48j70J215j128L00N44r0n68n21P84m36M64M68K91n67n05
$$ 81 649 882 -130 -304 -56 -226 989 -139 161 705 615 47 -474 310 -126 338 806 1097 530 25
1919B5k97O17J07o00K1N4n24J157o68n08J58P52r80k40J355m31Oj53j11M76J75
$$ 25 -272 345 452 -148 -127 -73 -597 560 -108 -616 -458 294 -686 -926 429 -2 4 -149 -260 216 391
1940C91r1j006J045J8m68j53K96M7m70M01R93k153K260m77r81O71l88K96j19P23
$$ 391 300 -706 339 357 -111 -264 32 79 -391 10 1003 -1150 1110 633 -348 323 -65 231 112 835
1960H35j266P8J166q64o69K236r35l98j65O87j066J719k238M61Q97o76J78R01
$$ 835 -431 -353 813 -51 -720 1516 581 183 18 705 -361 1358 -880 -419 478 -198 -20 881
1978H81j461r7N41J0J12m36o16J227N21j449K79J71L72Q2l50J65M82m98j250L55
$$ 881 -580 -677 -136 -126 -14 -450 -1066 161 682 -767 -488 -317 55 137 -213 -48 434 -64 -1314 -959
1998i59J085N34j034o44J169n91N61J3K84r86N71p7L5O30k070J764N00r32n90
$$ -959 126 660 -374 -1018 151 -440 121 134 418 -568 3 -74 -39 591 -1479 285 785 -147 -737
2017g37J64J084n45l85J655j189L84p51R11j008J093o23j96J5N52j111m59K01
$$ -737 -573 511 -34 -419 1236 47 431 -320 591 -417 676 53 -143 -128 424 -687 -1146 -945
2035i45J200k81j312J072Q72n12R5k07m05J55m09M67J37M93L46m24N04o17j8r64
$$ -945 255 -26 -1338 -266 606 94 189 -18 -423 -268 -677 -210 -73 420 766 342 846 229 211 -753
2055g53R88j048J039l43O28j241J043J20j521Q14l04Q21p46R64p98N68N84j196
$$ -753 235 -813 226 -117 511 -730 313 433 -1088 -274 -578 243 -503 461 -337 231 815 -381
2073c81O98q05Q01l06j78kL32n94N81l05J81P10j112K5n39R67m33R26j00Jl60
$$ -381 317 -488 313 7 -171 -173 159 -435 146 -159 22 732 -380 -355 -894 73 -360 566 466 467 107
2094A07n1l86l47J133l87p1M37j007N37J47l8r6J42r77K98P84p24J136p84N3j02
$$ 107 56 -330 -677 456 69 -2 435 -572 -35 112 74 -22 120 -857 -559 225 -499 637 -147 -94 -196
2115a96k51J198j057l84J521o93L99r46L80K85m9j224J416l89K71m65J86o57N03
$$ -196 -447 751 -306 -690 831 138 537 -409 -29 256 207 -1017 399 10 281 -184 2 -655 -152
2134a52O19j185J65N62J98N53k24o70l98P18P77r7J43j343N13j829J647r2o21
$$ -152 467 -718 -553 9 207 760 536 -134 -532 186 963 866 1009 -334 179 -1650 -3 -95 -716
2153g16O76p24L16M21j187K023j133J02P9M53J96r71N37J115j235O68m34j26l3
$$ -716 -40 -764 -448 -27 -1214 809 -324 -222 -143 310 506 -465 72 1187 -48 620 186 60 27
2172B7N81J66m71rN19o00o12L25j428K471L54j424l71L72J85l65Q14R14j286j095
$$ 27 608 774 303 294 813 213 -399 -74 -1502 969 1323 -101 -472 -100 85 -280 534 1448 162 -933
2192i33J979o71m39Q3l70Q63L6L34j82L5n26p02K17k5L06q19J403j070j97N92
$$ -933 1046 375 -64 19 -351 512 548 882 700 735 209 -493 -276 -301 5 -814 589 -481 -678 -86
2212h6L36m87M56o9p78M30K60N75j023K27o93Q26P45l27k16o63Q39k14J473j387
$$ -86 250 -237 219 150 -628 -198 62 637 -386 -159 -852 -26 719 392 176 -487 352 138 1611 224
2232B24M9j012J304N30l70n03m72L55m52L84P97r35m96Q85L7l0j090O61J87o56
$$ 224 273 -739 565 1095 725 222 -250 105 -347 37 834 -101 -597 288 325 295 -795 -134 53 -603
2252f03N70q71J549j593Q09j85J94M48m8P28j607J108o70L01k0M66m64P9K04r06
$$ -603 -33 -904 645 -948 -139 -324 -130 318 270 998 -609 499 -171 130 110 576 112 191 395 -511
2272e11M0J060r84P22l34o25M3K87m59O75m93N18J095m66M85j196n98R4J048r16
$$ -511 -471 589 -395 327 -7 -632 -589 -302 -761 -86 -579 -61 1034 568 1053 -143 -741 -647 401 -515
2292e15O77o22K18P29n96J34P6j04J027l24r32N25p49O96j350K368r95l63l57
$$ -515 162 -460 -242 487 -109 25 101 -3 1024 700 -232 293 -456 240 -1110 1258 263 -100 -457
2311d57L31K41n69P39j381J118o67N87O56p56m49N26n82M21K19P05p12J130j277
$$ -457 -126 115 -454 285 -1096 22 -645 -58 598 -158 -607 -81 -663 -242 -23 682 -30 1100 -177
2330a77N41q67O22m11k00l52J046k70L3m47J79M11n59q27J448o94r35K676j645
$$ -177 364 -503 119 -292 -492 -844 202 -68 -35 -482 -303 108 -451 -1278 170 -524 -1459 1217 -428
2349d28Q45k26m60k45R83j138n39J557o96m42R48N52q56k66J032j085l3P05n97
$$ -428 417 191 -269 -514 469 -669 -1208 349 -347 -789 159 711 -145 -411 621 -464 -497 208 -389
2368c89R54J88k20q19M25Q94j048j7M15L55o65O91o24Nl09Q27n7j186R87j576
$$ -389 565 753 533 -286 139 1033 -15 -32 383 738 73 764 140 145 -164 663 606 -580 407 -1169
2388a169Q11K55k03M55L54O4p63q9q04M20Q42Q8k42Q53L04r10l60n32m05J31J346
$$ -1169 -358 -103 -306 149 503 567 -196 -285 -1089 -669 173 261 19 872 1176 266 -94 -626 -1031 -900 446
2409D46r77l0M00q80L38j26J182k72L9K64m21N94n01j85J03n00j26J041j152J811
$$ 446 -531 -561 -161 -1041 -703 -829 353 81 120 384 -37 557 56 -129 -26 -526 -652 389 -763 1048
2429A048j087O35q79j90K83J2l36O38J85j28K42k48q00J48R37j63k21Q51j260
$$ 1048 -39 596 -283 -473 -190 -178 -514 124 309 181 423 175 -625 -477 460 297 76 927 -333
2448c33O9P64K6p36r37J171k58p58l54K124q17k67J488j529O48p7L8M10m88j54
$$ -333 -264 500 526 -210 -1147 24 -234 -992 -1346 778 -39 -306 1182 -347 301 224 262 672 184 30
2468C0n10O08L65l33j13L96j103K00J299j785J207k56j58lJ922j277j935J143
$$ 30 -480 128 493 160 47 443 -660 -460 839 -946 261 5 -153 -156 1766 489 -1446 -303
2486c03J243p74j82j68J69J16O15j057O64o99n56J970l29q46k95K15l88M22J735
$$ -303 940 166 -16 -184 -15 101 716 -341 323 -376 -932 1038 709 -137 -432 -217 -605 -183 1552
2505A552k293O40J45J52j365K78Q78Q88m92J38r23N33j92l49Q66p72N27j82O30
$$ 1552 -741 -101 44 196 -1169 -891 -13 875 383 521 -402 131 -61 -410 456 -316 211 29 659
2524F59j624K58J680j429L90M41o49J744j647L88m69O43Op68O11Q63j668J054
$$ 659 -965 -707 973 -456 -66 375 -274 1470 -177 211 -258 385 391 -377 234 1097 -571 483
2542D83m62p00Q63o95N1J101K74l82p75Q01l52j520J870j142n54P08P3K10P74
$$ 483 21 -679 184 -511 -460 641 915 533 -242 559 207 -1313 557 -585 -1139 -431 -358 -148 626
2561F26k11j55p33P04K2L56n47k41K96j34J309o84j407J110L63j323J200l23j008
$$ 626 415 260 -473 231 253 609 62 -179 117 -17 1292 608 -799 311 674 -649 551 228 -780
2580g80R54n64k83Q97j95m91M52N03L5l35L66p84N21j39M62K84p4p56j198J259
$$ -780 174 -390 -673 224 29 -462 -10 493 528 193 559 -225 296 157 619 903 829 73 -1125 134
2600A34O17r14Q7L8O90K28r12O28n77n84R7R61j337J371L5K91j710J091r31J155
$$ 134 751 -163 -76 -38 652 880 -32 596 19 -565 -468 493 -844 527 562 853 -857 234 -697 458
2620D58p06k60j81J033r02R41J18j361J396k44j099J537l13l67J31j311J000J94
$$ 458 -248 -508 -689 344 -558 383 501 -860 536 292 -807 730 417 50 181 -1130 -130 64
2638F4R72r22p09M85l75Q88L03p35j072J557k54L66r24p3J253q96l17n66J399
$$ 64 1036 114 -595 -110 -485 403 706 -29 -1101 456 202 568 -356 -429 824 -72 -389 -955 444
2657D44L11p01J5M76M26j676N06J90k89K84K83k97M52o72o71M28j199J332Q82
$$ 444 755 54 69 545 971 -705 -199 -9 -298 -14 269 -28 424 -248 -919 -491 -1690 -358 524
2676E24l62o3O1l20j255J955j143P03J16q33L85p2K75n61J368m80J14l49p58J006
$$ 524 162 99 160 -160 -1415 540 -603 100 216 -617 -232 -304 -29 -590 778 298 412 63 -695 311
2696C11r48J12O62L45r73L92K02m27O23n35K68k72r6o2L54L46r30l28K74J659
$$ 311 -637 -525 137 482 -491 -99 103 -324 299 -236 32 -240 -336 -398 -44 302 -628 -956 -682 977
2716I77l51n09l48l59R15k51j80L52n35M6q2j62J07J288l52m70q4J67j78L02j170
$$ 977 626 117 -231 -590 325 74 -106 246 -289 -243 -325 -487 -380 908 556 86 2 169 -9 293 -877
2737h77R65P12j7q64q94J379o08K60K16r8m07J13p4J243j127n12O92r25J003J47
$$ -877 88 800 783 -81 -975 404 -204 56 272 174 -233 -120 -194 1049 -78 -590 102 -823 180 327
2757C27K42p85j89O77j184Q96m65N82O1l57L72R04j237N37L17j239m62J666L8
$$ 327 569 -216 -405 272 -912 -16 -481 101 162 -195 177 1081 -156 381 698 -541 -1003 663 701
2776G01j604M61J88k22P71k056J038J233j584P15J28K57J63q54M11P08m24M25
$$ 701 -903 -442 -254 -476 295 -1761 -723 510 -1074 -359 -231 26 189 -665 -254 454 30 455
2794D55J15L54j54p42j38Q02K13o66q16J349j941J865j077Q02l98j33N87o03M51
$$ 455 570 924 770 28 -110 692 905 239 -577 772 -1169 696 -381 421 23 -110 477 -126 325
2813C25p50l97J754m36R0R18j531K69K88q22P10N19j764J077J22m16m15J19L48
$$ 325 -425 -822 932 496 586 1504 -27 242 530 -292 418 937 -827 250 372 -44 -459 -340 8
2832Hj73Q59k152K078o86M75q52J068q3j039J010r34M41L9l71K34l07N35j60m27
$$ 8 -165 694 -1458 620 -66 409 -443 625 542 -497 513 -421 20 59 -312 -78 -385 150 -10 -437
2852d37Q00r38Q96r90R99n93L33q57r8J380r30J60n23j79J330r94M95o8M28l32
$$ -437 363 -575 321 -669 330 -263 70 -787 -885 495 -435 -275 -798 -977 353 -641 -146 -214 214 -118
2872a18L25j053J761j515M56M66o42M8N08l45K7K45J012j526L48Q67r81o20p5
$$ -118 207 -846 915 -600 -144 322 -320 -272 236 -109 -82 163 1175 -351 -3 864 -117 -737 -812
2891h12P62j67k58j80P92k227K664M2p25J977j670K74k10j011R89j45m97N15J58
$$ -812 -50 -217 -475 -655 137 -2090 574 616 -109 1868 198 472 262 -749 240 95 -402 113 271
2910B71m38j281K815j098n6k51L79M8j2j51l28R01j07j556J22j16M02Q28o80Q31
$$ 271 -167 -1448 1367 269 213 -38 341 389 377 226 -102 799 692 -864 -742 -858 -456 372 -308 523
2930E23l19m22k60N84MJ280q19l84m02j95R41l18r33O52j036J919l06N3j267J184
$$ 523 204 -218 -478 106 110 1390 571 187 -215 -410 531 213 -720 -68 -1104 815 509 562 -705 479
2950D79o67m49j2M85j044K061m44j271J619j441K21J331j424K30J183j96m65L07
$$ 479 -188 -637 -649 -164 -1208 853 409 -862 757 -684 -463 868 -556 -326 857 661 196 503
2968E03p41M78j769N09J315l26J56k83Q11q71J132n01r08O08L67n16k84P3N81
$$ 503 -238 240 -1529 -1020 295 -31 125 -158 653 -218 914 413 -495 113 480 -36 -320 -247 334
2987C34M36j976m52J698O97k31j576K861k360K47Q93j377J369p45Q33j731J422
$$ 334 770 -1206 -1658 40 737 506 -1070 1791 -569 -322 571 -806 563 -182 651 -1080 342
3004C42M32J7N7n82p04M31l5K04j324J000J470n95j268J46J297p82K44m62j7l26
$$ 342 774 791 848 266 -438 -7 -42 162 -1162 -162 1308 713 -555 -409 888 106 350 -112 -129 -455
3024d55K208j716j407J024K45K24R16k475J711j625K111l19l34K92j120R00lJ062
$$ -455 1753 37 -1370 -346 -101 123 1039 -1436 275 -1350 761 442 108 400 -720 180 177 1239
3042A239p15R08k381Q76O42j152J301j443J242k027J775j159m9J546j220J101
$$ 1239 524 1432 -949 -73 569 -583 718 -725 517 -1510 265 -894 -943 603 -617 484
3058D84q38J314j216k00R36j073R47J12J07m07L54J33j480J024L13J55p16P99
$$ 484 -354 960 -256 -456 480 -593 354 466 573 166 520 653 -827 197 510 665 -51 748
3076G48n7q61m8M27m50L97n04J453j828J350m88J87J82j035K36Q32L49l77n03
$$ 748 691 -170 -218 209 -241 156 -348 1105 -723 627 139 326 508 -527 -291 541 890 513 10
3095A0K37k52J70o52L60O61j962R61J32K91J16j58l35M68j567J161L89n82L0q4
$$ 10 247 -5 165 -487 -127 534 -1428 -467 -335 -44 72 -86 -421 47 -1520 -359 30 -552 -522 -606
3115f06J437r16Q4n8K61j017R90j08J05n45M54m16o13R67k55k40J470q37p30M71
$$ -606 831 -85 -1 -59 202 -815 175 67 172 -373 81 -335 -948 19 -236 -476 994 157 -573 -102
3135a02L01o14N25m27J34K70l75m42N88r02Q09n32J024o36j177J921o5p53Q47
$$ -102 199 -415 110 -317 -183 87 -288 -730 -142 -1044 -235 -767 257 -379 -1556 365 300 -453 394
3154C94K24j035Q07Q01j588Q12q20j81J336r46O17j096J577p12l81L78o52Q82
$$ 394 618 -417 390 1191 -397 415 -405 -586 750 -196 421 -675 902 190 -191 187 -465 417
3172D17K24j381J308p18K04r77P98k0K358k963N79M20p77p00J559m92r4j7K79
$$ 417 641 -740 568 -150 54 -923 -125 -145 2213 -750 -171 249 -528 -1228 331 -161 -255 -272 7
3191Gl16m67Q22n2p91M86p13R30J0O08K37j329Q07k39O08o66j2O60j258R76J08
$$ 7 -309 -776 46 -6 -797 -311 -1024 -94 -84 524 761 -568 239 0 608 -58 -70 590 -668 308 416
3212D16j92K33o78J361j162l0M56K71L83j251Q5m45J784j598J643j063O65j014
$$ 416 224 457 -221 1140 -22 -52 404 675 1058 -193 -108 -553 1231 -367 1276 213 878 -136
3230a36r3M26n92O53j157J355L86j714O64n63M62O36o10M91j35K78r71N28N90
$$ -136 -229 197 -395 258 -899 456 842 -872 -208 -771 -309 327 -283 208 73 351 -620 -92 498
3249D98j368O03P25o06K96P53p69j123J335k43j432J460n47k38R18N7k58Q94q11
$$ 498 -870 -267 458 -148 148 901 132 -991 344 101 -1331 129 -418 -656 262 319 61 955 144
3268A44p05J172l43k02r52O57O68j75p06J67R08j334J096m2J7r37K17K27k44J689
$$ 144 -561 611 268 66 -886 -229 439 264 -442 -275 633 -701 395 353 370 -567 -350 -123 -367 1322
3288A322j129O2L6K24m97N64j345R18M89j785R74l03P78j005K548j689m59K07
$$ 1322 193 255 291 515 18 582 -763 155 644 -1141 -167 -470 308 -697 1851 162 -297 -90
3306i0L49q1n9J131o71j621J111p93R09n90L95K56j90o27M27O10K87r58q66J156
$$ -90 259 178 119 1250 579 -1042 69 -724 185 -405 -10 246 56 -571 -144 466 753 -205 -1071 85
3326H5m24L57n51O71j344J810o44M73r43l75J55J725n91k71J54m36N72k73p1k82
$$ 85 -339 18 -533 138 -1206 604 -40 433 -510 -885 -730 995 404 133 287 -149 423 150 79 -203
3346b03J95P9n63N10n84N35J76L8J70M92j598J98J687p41p85P5J335m86l20k93
$$ -203 -8 71 -492 18 -566 -31 145 183 353 845 -753 -555 1132 391 -394 -319 1016 530 210 -83
3366h3n9J99J029k150P34r5l92N84o24Q30M31l47l02J172q55j65M91o98l78J562
$$ -83 -142 57 1086 -1064 -330 -425 -817 -233 -857 -27 404 57 -245 927 72 -93 398 -300 -678 884
3386H84n56j04k98J300j288L0q50J590O32j132J062j221m22K28N65j14j080O14
$$ 884 328 224 -74 1226 -62 -32 -882 708 1340 208 1270 49 -373 -145 420 306 -774 -160
3404a60P26o54n58R28l84R31j00q07n15O78N98j043J04l9M23O17K70j487P64m42
$$ -160 566 -88 -646 282 -102 829 729 -78 -593 85 683 -360 -256 -295 128 745 1015 -472 292 -150
3424a50N34k45k16J267j670Q96N01q33k50K73r74J461O41r09q67J103j326P50
$$ -150 384 139 -77 1190 -480 416 917 84 -166 107 -867 594 1235 326 -541 562 -764 -14
3442a4q3n37n63Q92L55j93P02p72M26J128j846O66J206j626N69M04p42K58k81
$$ -14 -97 -634 -1197 -305 50 -143 559 -213 213 1341 -505 161 1367 -259 310 714 -28 230 -51
3461e1o38J496j577N87N99l76p51L31P91o38l1J17o03L96L83J034n47R8j89m40
$$ -51 -689 807 -770 -183 416 40 -711 -380 411 -227 -258 -141 -744 -348 35 1069 522 620 431 -9
3481il7N68l1R5k55q36L45j039J351K41k97L1k05Q52j040l91M24M17K35n09J228
$$ -9 -46 522 491 586 331 -505 -160 -1199 152 393 96 127 -78 774 -266 -657 -233 184 419 -90 1138
3502A138o28j037j36p06J121l36Q00q10Q05j24p62M58L89K33l76J253j066L91
$$ 1138 510 -527 -663 -1369 -248 -584 216 -594 211 87 -675 -217 172 405 29 1282 216 607
3520F07O1p98N46M43j498L73k50J015q31J44K24l0P96j663J356l40n55k83N59
$$ 607 668 -130 416 859 -639 -266 -516 499 -332 -188 36 6 802 -861 495 155 -400 -683 -124
3539a24J30j140J373L57j111k66K362k614L92Q27r18R36M32O68j824o46J024n54
$$ -124 6 -1134 239 596 -515 -781 1581 -1033 -641 186 -732 204 636 1304 -520 -1166 -142 -696
3557f96J016N1k72J15p41O39m04R15J8j256J015r46M28M21R1j048j50J208l42
$$ -696 320 371 99 214 -527 112 -292 623 641 -615 400 -546 -118 303 394 -654 -804 404 62
3576F2p23Q99l09K36P15q07p12Q50r27k61J128k18k26j016J426N57j030n3J327
$$ 62 -661 238 -71 165 880 73 -639 211 -716 -977 151 -67 -293 -1309 117 674 -356 -409 918
3595I18k51Q30k232J676q90J003r95K70m35p62R97n47R61j183J327j146k81J784
$$ 918 667 1497 -735 941 51 1054 59 329 -106 -868 129 -418 543 -640 687 -459 -740 1044
3613A044j460J328j614J291j966J661j321J589n01j419P99R41j733J623J73M51
$$ 1044 -416 912 -702 589 -1377 284 -1037 552 51 -1368 -569 372 -1361 262 435 886
3629H86q36J29j228J367J76j16o07O59p20M02L13j690J111n94L97M95q4Q05p87
$$ 886 50 179 -1049 318 494 378 -229 430 -290 112 425 -1265 -154 -748 -351 144 60 865 78
3648G8J00k18r0n60J007l94K62k126J652J652j548L09p74N27L32l68j0J022j345
$$ 78 178 -40 -130 -690 317 -77 185 -1941 -289 1363 -185 124 -650 -123 209 -159 -169 853 -492
3667d92O28r60P27J147L2j666M75j38R79L23j011k11l16K49o40J56M97K84l52
$$ -492 136 -824 -97 1050 1082 -584 -109 -247 732 1055 44 -167 -483 -234 -874 -718 -221 63 -289
3686b89o21R08l72Q07q37K36Q3o2j41R24K98j683J322r53l10O39L73r78O50o07
$$ -289 -910 -2 -374 433 -404 -168 -85 -147 -288 636 934 -749 573 -380 -690 -51 322 -656 -6 -613
3706f13J466m60n03r28J212K31l55J123j605r49N40R08Q26j133R93r95m94J686
$$ -613 853 393 -110 -1038 174 405 50 1173 -432 -1381 -841 67 893 -240 753 -242 -736 950
3724I50j931R42k45m47L32N25M96k3Nj093P83Jk39O42l62r96N39Q4l51J00k07
$$ 950 -981 -39 -284 -731 -399 126 622 599 604 -489 294 295 56 698 336 -660 -121 -37 -388 -288 -495
3745d95O38O46k83P7j37k0j059l88L20k32J353q56l28R88k51N7j64l47J013O0
$$ -495 143 789 506 583 446 426 -633 -1021 -701 -933 420 -436 -764 224 -27 30 -134 -481 532 592
3765E92j002m26J410q26N60L76n64J65p34j0j36J420K87O62l61j804L42P94j22
$$ 592 -410 -836 574 -252 308 684 120 285 -449 -459 -595 825 1112 1774 1413 -391 -49 745 623
3784F23l52Mk70K11J62o9n82n48r1Q68l41O70m73k71J576o84q93R20L09Q98j814
$$ 623 271 275 5 216 378 309 -273 -821 -912 -44 -385 285 -188 -459 1117 433 -460 460 769 1667 -147
3805a47k91j08J203K47j565O06q55N72R54r05R99j66p62j127J541Q5o21Q87j363
$$ -147 -438 -546 657 904 -661 -55 -910 -338 616 -289 710 544 -218 -1345 196 281 -340 547 -816
3824h16P53L67n58M31n18l53K43P88j0o18M62o00l84N88J287j613J091k75L74
$$ -816 -63 304 -254 177 -341 -694 -451 337 327 -291 171 -429 -813 -225 1062 -551 540 265 639
3843F39j3r72N66j035J80M91q9K2K06q0K31j12p37J444j334J254j495J002r9p1
$$ 639 626 -346 220 -815 -635 -144 -233 -211 -5 -85 146 34 -703 741 -593 661 -834 168 69 -2
3863bo45O32N58n37n7n57O61J30k05j87J303m48j040P56q59l64j98J661o53N63
$$ -2 -647 -15 543 6 -51 -608 53 183 -22 -209 1094 646 -394 362 -497 -861 -1059 602 -51 512
3883E12N94q02j67j15J268r09M04o57j06k15k03J51n6P50j313J986r26n21j58
$$ 512 1106 304 137 22 1290 381 785 128 22 -193 -396 -245 -301 449 -864 1122 196 -325 -483
3902d83J130j521P46j85K98l56L45K47k61O70n24k81j84q2m84J378q87j02L36
$$ -483 647 -874 -128 -313 -15 -371 -26 221 -40 630 106 -175 -359 -441 -925 453 -434 -536 -200
3921b00k27p01J049L68m74l8k07K43j25L90q02R62o91N15M38j858K058j209K78
$$ -200 -427 -1128 -79 289 -185 -223 -430 -187 -312 78 -724 238 -453 62 500 -1358 700 -509 -231
3940b31M98o01J395j155L71j205K147j178M83j708J662p18R80j434O12n62J204
$$ -231 267 -334 1061 -94 277 -928 1219 41 524 -1184 478 -240 740 -694 -82 -644 560
3957E60n30J44l11J181j142j34k16R4j58R36j125K3J097j514J641q92J915k702
$$ 560 30 174 -137 1044 -98 -232 -448 -354 -512 424 -701 -678 419 -1095 546 -346 1569 -1133
3975a133J443k62J24k30j12n34J278k57m60o91J53J936r83j189J194j003J400
$$ -1133 310 48 172 -58 -170 -704 574 317 -143 -834 -681 1255 272 -917 277 -726 674
3992F74m8k59j878J470j93O20q74J39O38n0J96o9l54n2J147k04n77o82Q30r62
$$ 674 626 367 -1511 -41 -234 386 -488 -349 289 239 435 366 12 -40 1107 903 326 -356 474 -488
4012d88J044k73m2J34j154J432j830Q71M25L7%l11P84r22Q75j337M88M32j364
$$ -488 556 283 241 375 -779 653 -1177 -306 119 156 156 -155 629 -293 582 -755 -267 165 -1199
4031a199J285m29p46R61l57J163J34q55O84q93R71j879J340j66J19j275J015J11
$$ -1199 86 -343 -1089 -128 -485 678 812 -43 641 -252 719 -1160 180 14 133 -1142 -127 -16
4049a6k72j19M89r32N10Q47o53l24m51Q30m1k57O99j249J466r74l19J320m53j30
$$ -16 -288 -407 82 -850 -340 507 -146 -470 -921 -91 -132 -389 310 -939 527 -447 -766 554 101 -29
4069b9l17j670K235n47P74k60l87M70J06j09o72O08j37L18j457R80J041o02N47
$$ -29 -346 -2016 219 -328 446 186 -201 269 375 266 -406 202 65 383 -1074 -94 947 345 892
4088H92m97Mr86o89J368Q22j131N49NK22K34j130l62K1Q18M11n95N26K58o60N16
$$ 892 395 399 -587 -1276 92 914 -217 332 337 559 793 -337 -699 -678 140 551 -44 482 740 80 596
4109E96m31q39J848n41q84L38Q77j820R14n54O33j19M68j441Q11L09M31m41J77
$$ 596 165 -674 1174 633 -251 87 964 -856 58 -496 137 18 486 -955 -144 165 596 155 332
4128C32n11n93M01p54J3P15N06j111N92N96o94j36Q38l21l42N64m81K88M36o61
$$ 332 -179 -772 -371 -1125 -1112 -397 109 -1002 -410 186 -508 -644 194 -127 -469 95 -386 -98 338 -323
4148c23L70q69J728j692Q18K77j67n45L07k56j52J947j387L18M31j278l42j76
$$ -323 47 -822 906 -786 32 309 142 -403 -96 -352 -504 1443 56 374 805 -473 -815 -991
4166i91R38Jj671J402r85J170L34Q5j23l40L63l25q27N83P61l98o28J816j082
$$ -991 -53 -52 -1723 -321 -1306 -136 198 283 160 -180 183 -142 -969 -386 375 -23 -651 1165 83
4185H3o61O71Q24p35k76l02P64m5j315J381P70j580K39M45j374K326q46m02j74
$$ 83 -578 93 917 182 -94 -396 368 323 -992 389 1159 -421 -182 263 -1111 1215 369 -33 -207
4204b07M54K79j18r39K80M81n02N70n96L31m70N93O52k25j34r8R0l22L87p71Q98
$$ -207 247 526 408 -531 -251 230 -272 298 -298 33 -437 156 808 583 449 351 441 119 506 -265 633
4225F33J054k218p0J112o90q24K199j814R19l49m92P50j45l70j05j409K256o10
$$ 633 1687 -531 -601 511 -179 -1003 1196 -618 301 -48 -540 210 65 -305 -410 -1819 437 -173
4243a73M45r53J126j535R43n12N95R90j205K42q1N61L0j239K4L13N93J95J45j084
$$ -173 272 -681 445 -1090 -147 -659 -64 926 -279 -37 -118 443 473 -766 -742 -429 164 359 504 -580
4263e80L82O5l01k37M98M86p77J184K17q78m36J57m8K89j118J286l69J046L19
$$ -580 -198 -133 -434 -671 -173 313 -464 720 937 59 -377 -220 -268 21 -1097 189 -180 866 1185
4282A185k012J064l72Qk56J635j460k25J74K16P53q70K62M39mj654J127M20q69
$$ 1185 -827 237 -135 -127 -383 1252 -208 -433 -259 -43 710 -160 102 541 537 -1117 10 430 -439
4301d39J12J89l3m39J279j118P24n94L79m16O31j18n09M63L81N5m77M64k61j177
$$ -439 -327 -138 -171 -610 669 -449 275 -319 60 -356 275 157 -352 111 492 547 70 534 273 -904
4321i04J534o49K35K90j370R07j07K37k67K61m15J96j71k30M9J599j289P49J157
$$ -904 630 -19 216 506 -864 43 -64 173 -94 167 -248 -52 -223 -453 -404 1195 -94 655 1812
4340A812j490L69k19P36j473J53M28m79n02L33L64k69J68K85J138r50K83n73K65
$$ 1812 322 691 472 1208 -265 -112 316 -163 -665 -332 32 -237 -69 216 1354 404 687 114 379
4359C79j421J418r3m67l39M5R57j034J345j142j09J64J329j722K2O35p33P62m91
$$ 379 -1042 376 283 -184 -523 -478 479 -555 790 -352 -461 -297 1032 -690 -668 -33 -766 -4 -495
4378d95O56j65m20k09O57j16K31K66Q07j607P5m07K027N25j418q42N29k90l00
$$ -495 161 -4 -424 -633 24 -92 139 405 1212 -395 -320 -727 1300 1825 407 -435 94 -196 -496
4397d96K67P3R46Q4p6p07M15o96o23J107M25N64r31m22r47J033j18J141k090J182
$$ -496 -229 -156 790 874 798 91 506 -190 -813 294 719 1283 352 -70 -1017 16 -102 1039 -1051 131
4417A31n26r1P41k8R0L94j360O92M18k47M09j063N47J25q98O10K9M00j72n03M61
$$ 131 -395 -486 255 227 317 711 -649 43 461 214 623 -440 107 232 -666 -56 -27 373 201 -302 159
4438A59r6n57M4J15L49l66l06L06J412j494J07J051n24k43q0M98K52n75%K61o68
$$ 159 63 -494 -450 -335 14 -352 -658 -352 1060 -434 -327 724 200 -43 -123 375 627 52 52 313 -355
4459c55R70j62J67j194P86j182N39J027N91j662l35O00k54l68Q92j09L22p94k91
$$ -355 615 453 620 -574 212 -970 -431 596 1187 -475 -810 -210 -464 -832 60 -49 273 -521 -812
4478h12P20n78J277j144K41M65l2j49j79Q12q1o16n2Q65k17j152M1L8K81O8K5
$$ -812 -92 -670 607 -537 -296 169 137 -12 -191 621 540 -76 -128 737 520 -632 -591 -553 -272 -204 -179
4499a79P76o93k95P17k96l09m08J784k57q86k41Q5O67M97k51p56J6k21Q5J235
$$ -179 597 -96 -391 326 30 -279 -687 1097 840 -46 -287 -202 465 962 711 -45 -29 -250 -165 1070
4519A070q73k71L19Q5l78j96Q83O04k073J130M92j432k50R54N6o81l70l1J706
$$ 1070 197 -74 245 330 -48 -244 639 1243 -830 300 792 -640 -890 64 120 -561 -931 -962 744
4538G44p94O22Qr67R59n98j71r13J701n94J9n72O88R4r7q06J85J46M64N56n60
$$ 744 -50 572 580 -387 572 -26 -197 -1110 591 -3 16 -556 132 226 129 -677 -492 -346 118 674 114
4559A14n32q1J504j361M12K81M93L5p35j92L61p24LM64O73p31l62n50J251l03
$$ 114 -418 -499 1005 -356 56 337 830 865 130 -62 299 -425 -422 42 715 -16 -378 -928 323 20
4579B0O04P7j079R36r09J365l97n00q8n40K20J31p9M51m28k20M93n62K78m32J091
$$ 20 624 701 -378 558 -351 1014 617 117 29 -511 -291 -160 -239 212 -216 -436 57 -505 -227 -659 432
4600D32j125J50J174j26J29m57M1m06P61j319O6j43J103J188j41j811L73k25P0
$$ 432 -693 -543 631 505 634 177 218 -188 573 -746 -680 -823 280 1468 1327 -484 -111 -336 -266
4619b66j15J691j650J73l9K33M52R8r66q9p75J525k68O59J40r97M7M82k33k30
$$ -266 -381 1310 -340 -167 -206 27 479 577 -389 -478 -1253 272 4 663 803 -194 -147 335 102 -128
4639a28O50m0O8J09k030N38j35J104J118j247O99j262Q47L0l09O4q31R68n74M54
$$ -128 522 482 550 659 -1371 -833 -968 136 1254 7 706 -556 291 321 12 76 -755 213 -361 93
4659I3r11J392n6k54j71q53L67L81L21K8l28j798P95n58K389j654J666q44N3J16
$$ 93 -818 574 518 264 93 -760 -393 -12 309 337 9 -1789 -994 -1552 837 -817 849 5 58 174
4679A74o3q22J048O31o30M13j127Q21k11j296J073L6m36m10N00J189N58j264m19
$$ 174 111 -711 337 968 338 751 -376 445 234 -1062 11 47 -389 -799 -299 890 1448 184 -235
4698b35M3j094J399j076P37l00k89J264L62m6j80r16Q15l82l65m24K40L0L23O41
$$ -235 -192 -1286 113 -963 -226 -526 -815 449 811 765 585 -331 484 102 -263 -687 -447 -417 -94 547
4718E47q00O19M42n17j52m08J493j619P97o30K42L03n30m28O24j3o71O46o80O22
$$ 547 -253 366 808 291 139 -269 1224 -395 402 -228 14 317 -213 -641 -17 -30 -701 -55 -735 -113
4738a13m4R06jK7j969J994p71N2O04r82K96q48R61J111j071K78J56j438P07K50
$$ -113 -157 749 748 775 -1194 800 29 81 685 -297 -1 -849 112 1223 152 430 586 -852 -145 105
4758A05J02p7n21L16O1J078j138r94J675n64M30p80N99J92k22m1r29R97P26j421
$$ 105 207 130 -391 -75 -14 1064 -74 -1068 607 43 473 -307 292 484 262 221 -708 289 1015 -406
4778d06Q50l00j04J39l31K64p59R56q56P66m96j306J538n24J125j9o01m9q63J266
$$ -406 444 144 40 179 -152 112 -647 309 -547 219 -277 -1583 -45 -569 556 537 -64 -113 -976 290
4798B90j9j77M31o13p3K25Q3j35m16N70l19k16q9R32n75L94Rk0O5j582J688p11
$$ 290 271 94 525 -88 -161 64 147 12 -404 166 -153 -369 -458 474 -101 293 302 282 347 -1235 453 -258
4820b58m48J543k074M30M66M19L60N6Pq34M88m1J50N17J53j511m03M34N93K66
$$ -258 -706 837 -1237 -807 -341 78 438 494 501 -333 155 114 264 781 934 -577 -980 -546 47 313
4840C13R76j817J015p6R70j019j269P73q68J140q19N13j85J129n00L50n35J3k8
$$ 313 1289 -528 487 411 1381 362 -907 -134 -1002 138 -681 -168 -353 776 276 626 91 104 76
4859G6k44j06o5O0L1O62n64M04M6Q8p06l8J090j380J347n43n55N61P26j425O77
$$ 76 -168 -274 -339 -279 -248 414 -150 254 300 388 -318 -356 734 -646 701 158 -397 164 890 -535 142
4880A42L64j652P84L65j78L18P47p59j310N1N23J002l53J011l86n58p20L50K51
$$ 142 506 -1146 -362 3 -175 143 890 131 -1179 -1128 -605 397 44 1055 669 111 -609 -259 -8
4899hN96j80m65J360j338j68N86j008J276o13P0l1m97M06m31J338j41j516L05
$$ -8 588 408 -57 1303 -35 -203 383 -625 651 38 108 77 -420 -14 -445 893 752 -764 -459
4918d59j44P7J042q39R80L04M4j102m90J406J87j036O8k10N44M6o76Q16m33p07
$$ -459 -603 -526 516 -323 657 961 1005 -97 -587 819 1006 -30 38 -172 372 418 -258 558 125 -582
4938e82L81q8J449n91l94q43L29J1O41l6N0q73J8N22ll80N84K27P49j402l02k06
$$ -582 -201 -289 1160 569 175 -668 -339 -328 313 277 327 -546 -528 -6 -9 -389 195 422 1171 -231 -533 -739
4960g39R38o48K07m25J638p24L94K07j283O82j45Jn93K23L98L51M45n15j497N52
$$ -739 199 -449 -242 -667 971 247 641 848 -435 247 102 103 -490 -267 131 482 927 412 -1085 -533
4980e33R88j54j729P29O74N4R5o71J448j280j048J72Q41Q02L30o86J92r70J737
$$ -533 455 301 -1428 -699 -25 29 124 -547 901 -379 -1427 -1255 -414 388 718 32 224 -746 991
4999I91j773K78K47m50M82j85J196r14J144K15q60j336j76Q36J072o97j88m2Q96
$$ 991 -782 -504 -257 -707 -225 -410 786 -128 1016 1231 371 -965 -1141 -305 767 70 -118 -160 736
5018G36p45J28J83n95l90K271j260q31r9m19J265p98N67j024Q67m6Q64o68M65
$$ 736 -9 119 302 -293 -683 1588 328 -503 -602 -1021 244 -554 13 -1011 -144 -190 674 6 471
5037D71o14o0Q1L97Kq92P50J51p1j40J53k48M74n60m15N48R06m49m32m90O36l24
$$ 471 -143 -203 -122 275 277 -615 135 286 215 75 228 -20 454 -106 -521 27 933 484 52 -438 198 -126
5059a26J76M80l51o56K81O24q77P51q87k08L64K95M43Q2L56j347J83R77j60n71
$$ -126 50 530 179 -477 -196 428 -449 302 -585 -793 -429 -134 309 391 747 -600 -417 560 400 -171
5079a71J2N20j216Q62L33p43Q82L97l5p73Q9J70l17o0J32O89q47r5L20k13j35
$$ -171 -159 361 -855 7 340 -403 479 876 841 68 157 327 10 -50 82 771 -76 -171 149 -64 -199
5100a99J58R68O79k094P78J030o38j379L34P92k53O03j906J550j79K06l9Jn06
$$ -199 -41 927 1606 -488 290 1320 682 -697 -363 429 176 779 -1127 423 244 450 411 412 -94
5119i4K31l92O73j117Q00p34P56p65P35q80N87J17o19l67M14R91n70L39o94M52
$$ -94 137 -255 418 -699 101 -633 123 -642 93 -787 -200 -83 -702 -1069 -655 336 -234 105 -589 -137
5139a37n42Q31j69L43M44k021Q00J377j356j08j95R94m00j483K359o3p96j34l2
$$ -137 -679 152 -17 326 770 -1251 -451 926 -430 -538 -733 261 -139 -1622 737 674 -122 -256 -288
5158b88J53p2L88o09P83k82O21l67j72q1l53J91m97R76o41J196k063P14N13J3
$$ -288 -135 -207 181 -428 355 73 694 327 155 74 -279 -88 -585 391 -250 946 -1117 -403 110 123
5178A23L8j30m44N16n37Q13j502J31O05L99J325n15q12M77O3r94P47N08j00n53
$$ 123 161 31 -413 103 -434 379 -1123 -992 -387 12 1337 822 10 487 550 -444 303 811 711 158
5198A58r61J111J00K65k24m34O8K02N08j777J128o32j8J319L51j500P16j288J60
$$ 158 -803 308 408 673 449 15 83 285 793 -984 144 -488 -506 813 1164 -336 380 -908 -748
5217g48J924k268M92M83K90J054o45j216J021j117J62M50p28R6K90k17P57j525
$$ -748 1176 -1092 -600 -117 173 1227 582 -634 387 -730 -568 -118 -846 -750 -460 -677 80 -1445
5235a445J558m90O99j41Q7l41O15j081L42L50l44J087m55j88M23j36o88M98J245
$$ -1445 113 -377 322 181 268 -73 542 -539 -197 153 -191 896 441 253 676 540 -148 350 1595
5254A595j531m07J15P50r20m7R50j92q50R67L22n81O4J46j013N40n65J302j178
$$ 1595 64 -343 -228 522 -398 -445 505 313 -537 430 752 171 235 381 -632 -92 -657 645 -533
5273e33P43J78r54L29M83p34K59N1M75L6l99j5k39P33L81p75l8Q95K2m34J77j291
$$ -533 210 388 -566 -237 246 -488 -229 -178 297 333 -66 -81 -320 413 794 19 -19 876 898 464 641 -650
5295f50NR23n98J482j145K4N25m28l42O40j031J206l33n20j80Q49K70L17r6j163
$$ -650 -645 278 -320 1162 17 41 566 138 -204 436 -595 611 278 -242 -422 427 697 1014 918 -245
5315b45O73j27k51P56j110p02J617p30K90l85O34n73R3q15m95K768j327j46J69
$$ -245 428 301 50 806 -304 -1006 611 -119 171 -214 420 -153 -60 -875 -1370 1398 71 -75 94
5334I4M93M03k07q31O74o28N06j318N19P51n22N33N54j00j844J198m85j49M32
$$ 94 587 990 783 -48 626 -2 504 -814 -295 456 -66 467 1021 921 -923 275 -210 -359 73
5353G3m41N61M81r57J325q12r8p3M5M10J17n62j45q6J70pM26j469J365p10J24
$$ 73 -368 193 674 -283 1042 230 132 59 104 514 631 69 -76 -162 8 1 427 -1042 323 -387 -263
5374b63P86q07J167j174J46k9Q83r58P20q76o06R26P33P68j193N75j205M95R16
$$ -263 523 -284 883 -291 -145 -174 709 -249 471 -405 -1011 -85 648 1416 223 798 -407 88 1004
5393A004j800L05n50J121P95r39m49M43r6J433j690R85j122J944j263l40R37o71
$$ 1004 -796 -491 -1041 80 875 -64 -513 -70 -166 1267 -423 562 -560 1384 121 -219 718 47
$$ [...]
8191B94
##END NTUPLES=NMR FID
##END=
