##TITLE=1H ikalashn
DE-75k2_TFA2
15.11.2024
##JCAMPDX= 6.0         $$ Bruker NMR JCAMP-DX V2.0
##DATA TYPE= NMR FID
##DATA CLASS= NTUPLES
##ORIGIN= UXNMR, Bruker Analytische Messtechnik GmbH
##OWNER= root
$$ TOPSPIN		Version 1.3
$$ 2024-11-15 15:16:44.703 +0400  Irina@DPX200
$$ Compression mode = diff/dup
##.OBSERVE FREQUENCY= 200.131300845
##.OBSERVE NUCLEUS= ^1H
##.DELAY= (6, 6)
##.ACQUISITION MODE= SIMULTANEOUS
##.ACQUISITION SCHEME= undefined
##.AVERAGES= 64
##.DIGITISER RES= 18
##SPECTROMETER/DATA SYSTEM= spect
##.PULSE SEQUENCE= zg
##.SOLVENT NAME= CDCl3
##.SHIFT REFERENCE= INTERNAL, CDCl3, 1, 17.49637
##AUDIT TRAIL= $$ (NUMBER, WHEN, WHO, WHERE, WHAT)
$$ ##TITLE= Audit trail, TOPSPIN		Version 1.3
$$ ##JCAMPDX= 5.01
$$ ##ORIGIN= Bruker BioSpin GmbH
$$ ##OWNER= Irina
$$ $$ F:/spectra/data/iren/nmr/1H/4/audita.txt
$$ ##AUDIT TRAIL=  $$ (NUMBER, WHEN, WHO, WHERE, VERSION, WHAT)
(   1,<2024-11-15 15:16:22.078 +0400>,<Irina>,<DPX200>,<TOPSPIN 1.3>,
      <created by zg
	started at 2024-11-15 15:12:08.656 +0400,
	POWCHK disabled, PULCHK disabled
       configuration hash MD5:
       BE 6D 3F 07 2A EA 11 49 91 17 2B D3 AF B3 58 0D
       data hash MD5: 16K
       3A 8D 58 89 6A 7A 1F 3F 43 FD B4 B0 F0 08 41 A1>)
$$ ##END=
$$ 
$$ $$ hash MD5
$$ $$ 69 8C 54 D8 ED E5 DD A6 88 2C FF 87 32 39 4A 01
##$RELAX= 
##$RELAX= 
##$RELAX= 
##$RELAX= 
##$RELAX= 
##$RELAX= 
##$RELAX= 
##$RELAX= 
##$RELAX= 
$$ Bruker specific parameters
$$ --------------------------
##$DU= <F:/spectra>
##$EXPNO= 4
##$NAME= <1H>
##$PROCNO= 1
##$TYPE= <nmr>
##$USER= <iren>
##$AMP= (0..31)
100 100 100 100 100 100 100 100 100 100 100 100 100 100 100 100 100 100 
100 100 100 100 100 100 100 100 100 100 100 100 100 100 
##$ANAVPT= -1
##$AQSEQ= 0
##$AQ_mod= 1
##$AUNM= <au_zg>
##$AUTOPOS= <>
##$BF1= 200.13
##$BF2= 200.13
##$BF3= 200.13
##$BF4= 200.13
##$BF5= 200.13
##$BF6= 200.13
##$BF7= 200.13
##$BF8= 200.13
##$BYTORDA= 1
##$CFDGTYP= 0
##$CFRGTYP= 5
##$CHEMSTR= <none>
##$CNST= (0..63)
1 1 145 1 1 1 1 1 1 1 1 1 1 1 1 1 1 1 1 1 1 1 1 1 1 1 1 1 1 1 1 1 1 1 
1 1 1 1 1 1 1 1 1 1 1 1 1 1 1 1 1 1 1 1 1 1 1 1 1 1 1 1 1 1 
##$CPDPRG= <>
##$CPDPRG1= <>
##$CPDPRG2= <>
##$CPDPRG3= <>
##$CPDPRG4= <mlev>
##$CPDPRG5= <mlev>
##$CPDPRG6= <mlev>
##$CPDPRG7= <mlev>
##$CPDPRG8= <mlev>
##$CPDPRGB= <>
##$CPDPRGT= <>
##$D= (0..63)
0 2 0 0 0 0 0 0 0 0.06 0 0.03 0 0 0 0 0.0002 0 0 0 0 0 0 0 0 0 0 0 0 0 
0 0 0 0 0 0 0 0 0 0 0 0 0 0 0 0 0 0 0 0 0 0 0 0 0 0 0 0 0 0 0 0 0 0 
##$DATE= 1731669380
##$DBL= (0..7)
120 120 120 120 120 120 120 120 
##$DBP= (0..7)
150 150 150 150 150 150 150 150 
##$DBP07= 0
##$DBPNAM0= <>
##$DBPNAM1= <>
##$DBPNAM2= <>
##$DBPNAM3= <>
##$DBPNAM4= <>
##$DBPNAM5= <>
##$DBPNAM6= <>
##$DBPNAM7= <>
##$DBPOAL= (0..7)
0.5 0.5 0.5 0.5 0.5 0.5 0.5 0.5 
##$DBPOFFS= (0..7)
0 0 0 0 0 0 0 0 
##$DE= 6
##$DECBNUC= <off>
##$DECIM= 32
##$DECNUC= <off>
##$DECSTAT= 4
##$DIGMOD= 1
##$DIGTYP= 9
##$DL= (0..7)
0 120 120 120 120 120 120 120 
##$DP= (0..7)
150 150 150 150 150 150 150 150 
##$DP07= 0
##$DPNAME0= <>
$$ [...]
##$SW= 21.9926040160658
##$SWIBOX= (0..15)
0 0 2 0 0 0 0 0 0 0 0 0 0 0 0 0 
##$SW_h= 4401.40845070422
##$TD= 16384
##$TD0= 1
##$TE= 300
##$TE2= 300
##$TE3= 300
##$TEG= 300
##$TL= (0..7)
0 120 120 120 120 120 120 120 
##$TP= (0..7)
150 150 150 150 150 150 150 150 
##$TP07= 0
##$TPNAME0= <>
##$TPNAME1= <>
##$TPNAME2= <>
##$TPNAME3= <>
##$TPNAME4= <>
##$TPNAME5= <>
##$TPNAME6= <>
##$TPNAME7= <>
##$TPOAL= (0..7)
0.5 0.5 0.5 0.5 0.5 0.5 0.5 0.5 
##$TPOFFS= (0..7)
0 0 0 0 0 0 0 0 
##$TUNHIN= 0
##$TUNHOUT= 0
##$TUNXOUT= 0
##$USERA1= <user>
##$USERA2= <user>
##$USERA3= <user>
##$USERA4= <user>
##$USERA5= <user>
##$V9= 5
##$VALIST= <valist>
##$VCLIST= <CCCCCCCCCCCCCCC>
##$VD= 0
##$VDLIST= <DDDDDDDDDDDDDDD>
##$VPLIST= <PPPPPPPPPPPPPPP>
##$VTLIST= <TTTTTTTTTTTTTTT>
##$WBST= 1024
##$WBSW= 25
##$XGAIN= (0..3)
0 0 0 0 
##$XL= 0
##$YL= 0
##$YMAX_a= 2131436
##$YMIN_a= -2662817
##$ZGOPTNS= <>
##$ZL1= 120
##$ZL2= 120
##$ZL3= 120
##$ZL4= 120
##$ABSF1= 10
##$ABSF2= 0
##$ABSG= 5
##$ABSL= 3
##$ALPHA= 0
##$AQORDER= 0
##$ASSFAC= 0
##$ASSFACI= 0
##$ASSFACX= 0
##$ASSWID= 0
##$AUNMP= <proc_1d>
##$AXLEFT= 0
##$AXRIGHT= 0
##$AXTYPE= 0
##$AXUNIT= <>
##$AZFE= 0.1
##$AZFW= 0.1
##$BCFW= 1
##$BC_mod= 2
##$BYTORDP= 1
##$COROFFS= 0
##$CY= 7568.61572265625
##$DATMOD= 1
##$DC= 2
##$DFILT= <>
##$DTYPP= 0
##$F1P= 17.9538593292236
##$F2P= -4.03888763876832
##$FCOR= 0.5
##$FTSIZE= 32768
##$FT_mod= 4
##$GAMMA= 1
##$GB= 1
##$INTBC= 1
##$INTSCL= 1
##$ISEN= 128
##$LB= 0.02
##$LEV0= 0
##$LPBIN= 0
##$MAXI= 945.577
##$MC2= 0
##$MEAN= 0
##$ME_mod= 0
##$MI= -402.1523
##$NCOEF= 0
##$NC_proc= 0
##$NLEV= 6
##$NOISF1= 8.587773
##$NOISF2= 6.764455
##$NSP= 1
##$NTH_PI= 0
##$NZP= 0
##$OFFSET= 17.49637
##$PC= 1
##$PHC0= 117.373
##$PHC1= 7.63665
##$PH_mod= 0
##$PKNL= yes
##$PPARMOD= 0
##$PPDIAG= 0
##$PPIPTYP= 0
##$PPMPNUM= 100
##$PPRESOL= 1
##$PSCAL= 0
##$PSIGN= 0
##$REVERSE= no
##$SF= 200.13
##$SI= 32768
##$SIGF1= 18.5376
##$SIGF2= -6.396296
##$SINO= 400
##$SIOLD= 32768
##$SREGLST= <1H.CDCl3>
##$SSB= 3
##$STSI= 0
##$STSR= 0
##$SW_p= 4401.40845070422
##$SYMM= 0
##$S_DEV= 0
##$TDeff= 0
##$TDoff= 0
##$TI= <>
##$TILT= no
##$TM1= 0
##$TM2= 0
##$TOPLEV= 0
##$USERP1= <user>
##$USERP2= <user>
##$USERP3= <user>
##$USERP4= <user>
##$USERP5= <user>
##$WDW= 1
##$XDIM= 8192
##$YMAX_p= 0
##$YMIN_p= 0
$$ End of Bruker specific parameters
$$ ---------------------------------
##NTUPLES= NMR FID
##VAR_NAME=  TIME,          FID/REAL,        FID/IMAG
##SYMBOL=    X,             R,               I
##VAR_TYPE=  INDEPENDENT,   DEPENDENT,       DEPENDENT
##VAR_FORM=  AFFN,          ASDF,            ASDF
##VAR_DIM=   8192,          8192,            8192
##UNITS=     SECONDS,       ARBITRARY UNITS, ARBITRARY UNITS
##FACTOR=    0.0002272,     1,               1
##FIRST=     0,             0,               0
##LAST=      1.8609952,     -330,            -43
##MIN=       0,             -2662817,        -2662817
##MAX=       1.8609952,     2131436,         2131436
$$ Real data points
##PAGE= N=1
##DATA TABLE= (X++(R..R)), XYDATA
$$ [...]
$$ plain form
2340 -412 -413 -119 95 -20 -20 177 -113 -326 -506 -287 212 -371 -430 -161 73 -734 -259 195 216 288 322 324 249 2
2364 2 -3 562 -188 -16 -166 -408 -48 -164 -542 273 -29 -72 -565 -331 -13 211 -349 -207 -365 35 -357 -228
2386 -228 1 -469 -98 412 -79 68 -80 1 -17 374 384 -321 -442 -231 -210 544 -623 151 658 104 -172
2407 -172 118 290 55 -687 44 -66 376 230 48 -472 6 2 -94 385 -14 556 -1 -300 151 -141 -310
2428 -310 147 351 164 -217 -501 -369 -207 -638 -338 -303 260 -228 35 -215 40 -68 -190 690 -154 279
2448 279 -112 -101 489 396 -413 293 -71 -3 -209 257 -340 8 -410 -548 169 417 61 338 -121 -127 99 213
2470 213 -44 233 735 79 -244 48 516 63 -49 -24 125 114 -847 -335 -290 535 -147 -231 106 -226 -299 -112
2492 -112 -98 -157 219 227 154 206 -496 -294 241 278 201 -159 204 329 131 -603 -123 352 200 -318 -434 -441 -120
$$ packed form
2340d12jK94K14j15%J97k90k13j80K19M99n83n9K69K34q07M75M54K1P2L4Kp5k47
2364BnN65p50J72j50k42L60j16l78Q15l02m3m93K34L18K24n60J42j58M00l92J29
2386b28K29m70L71N10m91J47j48Q1j8L91J0p05j21K11K1P54j167P74N07n54k76
2407a72K90J72k35p42P31j10M42j46j82n20M78mr6M79l99N70n57k99M51k92j69
2428c10M57K04j87l81k84J32J62m31L00L5N63m88K63k50K55j08j22Q80q44M33
2448B79l91J1N90r3q09P06l64O8k06M66n97L48m18j38P17K48l56K77m59oK26J14
2470B13k57K77N02o56l23K92M68m53j12K5J49j1r61N12M5Q25o82q4L37l32p3J87
2492a12J4n9L76Qp3N2p02K02N35L7p7l60L63J25j98p34M80M75j52n18j16pL21
$$ plain form
2515 -120 -582 -295 -283 213 -181 -522 -87 187 -260 -286 108 1035 340 -111 -181 271 528 -3 -182 -107 350
2536 350 -154 -386 -308 -238 -704 -213 -297 343 -918 -492 -125 111 39 -176 -182 363 58 44 30 -22 332 444 301
2559 301 -19 -192 115 -193 -219 -368 28 113 -106 176 76 -34 -286 -351 335 220 28 74 -473 -131 119
2580 119 -65 442 379 196 253 365 -91 -365 -448 -17 249 234 -508 -79 -288 -186 -515 -129 -312 229 -207
2601 -207 -45 -160 486 161 421 -71 492 338 -272 -216 -51 128 -321 -361 398 512 -88 425 109 405 -125
2622 -125 -372 167 67 -440 -279 -189 -130 189 608 173 -240 -136 -101 -220 167 48 157 -330 -178 435 -150
2643 -150 119 114 -23 316 -260 -8 118 -548 -20 -205 187 -104 140 -436 -539 -70 94 -325 -419 281 96
2664 96 229 -109 254 212 178 262 453 863 -212 -704 -73 -414 37 -211 -240 -118 147 -347 76 548 -164
$$ packed form
2515a20m62K87J2M96l94l41M35K74m47k6L94R27o95m51p0M52K57n31j79P5M57
2536C50n04k32P8P0m66M91q4O40j261M26L67K36p2k15oN45l05j4j4n2L54J12j43
2559C01l20j73L07l08k6j49L96Q5k19K82j00j10k52o5O86j15j92M6n47L42K50
2580A19j84N07o3j83N7J12m56k74q3M31K66j5p42M29k09J02l29L86j83N41m36
2601b07J62j15O46l25K60m92N63j54o10N6J65J79m49m0P59J14o00N13l16K96n30
2622a25k47N39j00n07J61R0N9L19M19m35m13J04L5j19L87j19J09m87J52O13n85
2643a50K69nj37L39n76K52J26o66N28j85L92k91K44n76j03M69J64m19r4P00j85
2664I6J33l38L63m2l4Q4J91M10j075m92O31l41M51k48k9J22K65m94M23M72p12
$$ plain form
2685 -164 -16 84 336 706 153 710 298 -198 78 -86 -375 -261 90 -86 411 -35 -126 42 287 173
2705 173 196 -94 258 104 427 -9 -231 183 -24 84 -79 -193 159 -587 -352 395 165 -77 -485 -302
2725 -302 154 487 108 -75 -149 -113 -98 -147 186 -56 5 -252 132 89 -315 -539 -125 -55 524 45 477 -65
2747 -65 329 -45 -79 292 210 155 337 245 -79 -214 61 3 3 100 222 -143 -166 -360 209 -202 233 -28 -570
2770 -570 301 7 15 -101 94 203 -82 229 208 86 -199 -88 -86 31 576 116 166 -222 -280 -139 -95 -348 -179
2793 -179 220 37 -341 -164 -199 71 -312 -85 404 -166 244 -14 61 -87 242 -265 503 216 38 17 512
2814 512 -42 -48 -311 -534 -483 201 -221 -110 248 270 -265 -335 68 -87 47 394 -1 335 270 14 244 -180
2836 -180 -235 105 673 -295 -104 349 -12 201 128 -601 -217 -49 -486 -70 40 -98 -161 -148 -98 -137 -416 -367
$$ packed form
2685a64J48J00K52L70n53N57m12m96K76j64k89J14L51j76M97m46r1J68K45j14
2705A73K3k90L52j54L23m36k22M14k07J08j63j14L52p46K35P47k30k42m08J83
2725c02M56L33l79j83p4L6J5m9L33k42O1k57L84m3m04k24M14P0N79m79M32n42
2747f5L94l74l4L71q2n5J82r2l24j35K75n8%R7J22l65k3j94N69m11M35k61n42
2770e70Q71k94Qj16J95J09k85L11k1j22k85J11KJ17N45m60N0l88n8J41M4k53J69
2793a79L99j83l78J77l5K70l83K27M89n70M10k58P5j48L29n07P68k87j78k1M95
2814E12n54ok63k23N1O84m22J11L58K2n35p0M03j55J34L47l95L36o5k56K30m24
2836a80n5L40N68r68J91M53l61K13p3p29L84J68m37M16J10j38o3J3N0l9k79M9
$$ plain form
2858 -367 62 150 -155 44 422 -35 -108 131 -297 -65 -519 -240 -48 22 47 -503 -188 -535 312 -142 11
2879 11 -384 126 -23 83 284 192 411 324 75 89 100 -17 34 -312 -76 -28 -87 -533 -350 -246 -172 152 -166
2902 -166 -694 -337 -86 332 -308 -112 -97 -3 -106 -251 103 1 244 -77 -242 -46 -41 -198 435 -90 -121 -66
2924 -66 281 364 128 -51 277 -711 -461 -283 -352 133 82 -9 150 524 27 176 648 461 258 647 244 327
2946 327 45 224 -2 -73 -426 -135 108 -489 -97 -404 -618 37 -290 -138 -349 348 85 193 187 -125 -14
2967 -14 289 -212 -253 121 -159 372 136 -260 416 -43 -346 -101 88 -421 -173 318 101 -52 -164 -67 53
2988 53 635 242 -271 -102 -119 139 -461 -150 -292 211 223 -244 -405 90 -71 -291 -116 -521 28 -205 -349
3009 -349 -91 377 -399 -339 -541 -188 95 -248 90 525 187 317 -164 38 199 147 -424 173 375 326 -343
$$ packed form
2858c67M29Q8l05J99L78m57p3K39m28K32m54K79J92P0K5n50L15l47Q47m54J53
2879A1l95N10j49J06K01r2K19q7k49J4J1j17N1l46K36M8n9m46J83J04P4L24l18
2902a66n28L57K51M18o40J96J5R4j03j45L54j02K43l21j65J96Nj57O33n25l1N5
2924f6L47Q3k36j79L28r88K50J78o9M85n1r1J59L74m97J49M72j87k03L89m03Q3
2946C27k82J79k26p1l53K91K43n97L92l07k14O55l27J52k11O97k63J08ol12J11
2967a4L03n01m1L74k80N31k36l96O76m59l03K45J89n09K48M91k17j53j12R7J20
2988E3N82l93n13J69j7K58o00L11j42N03J2m67j61M95j61k20J75m05N49k33j44
3009c49K58M68p76O0k02L53K83l43L38M35l38J30m81K02J61n2n71N97K02m9o69
$$ plain form
3030 -343 -208 486 21 -267 -221 -245 373 -5 27 -12 180 -209 -487 107 474 381 11 111 99 -171 127 456
3052 456 -411 -210 -170 226 253 -387 -334 -123 -305 289 -231 -51 -36 402 -239 -135 363 -438 248 -29 400
3073 400 186 -189 603 94 -428 327 183 -87 -159 234 176 -63 106 -128 550 77 -411 139 145 84 169 150
3095 150 171 -496 -226 218 175 52 -420 -122 48 376 224 32 -188 -67 380 195 -202 -166 105 -421 370
3116 370 -205 -20 -184 -585 -20 246 -408 -7 -66 -14 106 23 -23 501 372 -42 -261 457 5 9 -123 69
3138 69 -146 214 -201 229 84 160 -125 -257 18 -133 457 548 -285 -301 -516 -45 -3 144 371 111 386 76
3160 76 343 56 -439 -106 177 -307 65 -168 -204 -154 -262 -135 -122 105 -247 19 38 -364 -562 -130 -678 -105
3182 -105 61 -65 252 -272 -473 -164 117 121 -160 15 358 318 289 97 -329 152 -158 33 -527 -449 -126 -226
$$ packed form
3030c43J35O94m65k88M6k4O18l78L2l9J92l89k78N94L67r3l70J00j2k70K98L29
3052D56q67K01M0L96K7o40N3K11j82N94n20J80J5M38o41J04M98q01O86k77M29
3073D00k14l75P92n09n22P55j44k70p2L93n8k39J69k34O78m73m88N50Oo1Q5j9
3095A50K1o67K70M44m3j23m72K98J70L28j52j92k20J21M47j85l97L6K71n26P91
3116C70n75J85j64m01N65K66o54M01n9N2J20q3m6N24j29m14k19P18m52Mj32J92
3138F9k15L60m15M30j45P6k85j32K75j51N90R1q33j6k15M71M2J47K27k60K75l10
3160G6K67k87m95L33K83m84L72k33l6N0j08J27J3K27l52K66J9m02j98M32n48N73
3182a05J66j26L17n24k01L09K81Mk81J75L43m0k9j92m26M81l10J91n60P8L23j00
$$ plain form
3204 -226 80 45 -34 -287 -57 36 -218 -62 565 -135 -8 -291 378 -125 55 168 440 -193 -185 9 -75 226
3226 226 -231 -572 -71 307 -313 -268 233 -281 -3 -129 -416 42 -263 294 182 45 -245 467 346 207
3246 207 -411 213 -46 66 -215 15 447 -22 212 23 -423 -803 -30 227 -177 -25 -155 146 66 299
3266 299 -244 -153 93 49 78 -166 364 127 34 -275 118 435 -245 -6 76 -303 16 -464 63 258 -75 -33
3288 -33 -139 233 -245 90 -126 245 -256 176 -582 57 322 -39 241 -63 214 226 -145 -258 -524 -226 516
3309 516 189 67 -279 -55 -75 280 534 -17 68 -110 311 12 76 -532 -250 108 -69 -231 -108 308 280
3330 280 -290 23 -296 -257 261 -426 -581 116 -111 -390 50 165 283 -87 69 -351 -184 10 181 182 243
3351 243 -262 749 -198 -71 -16 -69 -501 387 -133 -139 -682 107 30 -3 -338 -141 444 133 -89 -147 -38 -391
$$ packed form
3204b26L06l5p9k53K30R3k54J56O27p00J27k83O69n03J80J13K72o33QJ94q4L01
3226B26m57l41N01L78o20M5N01n14K78j26k87M58l05N57j12j37k90P12j21j39
3246B07o18O24k59J12k81K30M32m69K34j89m46l80P73K57m04J52j30L01q0K33
3266B99n43R1K46m4K9k44N30k37r3l09L93L17o80K39Q2l79L19m80N27J95l33M2
3288c3j06L72m78L35k16L71n01M32p58O39K65l61K80l04K77J2l71j13k66K98P42
3309E16l27j22l46K24k0L55K54n51Q5j78M21k99O4o08K82L58j77j62J23M16k8
3330B80n70L13l19L9N18o87j55O97k27k79M40J15J18l70J56m20J67J94J71JO1
3351B43n05J011r47J27N5n3m32Q88n20on43P89p7l3l35J97N85l11k22n8J09l53
$$ plain form
3373 -391 -351 325 110 351 -172 -108 330 -38 -7 205 80 -131 208 -543 10 485 -466 -260 336 85 -128
3394 -128 16 220 195 364 -215 496 45 517 -432 -300 293 -373 -109 304 94 -185 54 43 -244 -174 1
3415 1 221 -102 -569 -101 -113 73 -343 -226 57 51 -59 -17 104 309 -102 -342 -518 91 1 196 332 -81
3437 -81 -125 86 149 -1 -256 -145 247 260 -130 -28 -392 -315 -319 263 162 -10 314 209 -159 -168 543 -272 321
3460 321 17 353 -67 -342 3 -460 -194 -323 -498 -370 -142 81 212 252 -206 -339 -427 255 505 1 9
3481 9 -299 -144 -96 -15 -252 -180 -16 -40 56 145 -97 244 90 27 33 148 -117 -277 166 -67 66 -107 -60 148
3505 148 95 -498 -323 372 15 -63 621 -162 -110 -289 6 135 405 -504 -263 177 -415 -1 329 -191 110
3526 110 19 -538 -264 -187 356 -301 -68 38 -281 79 250 -229 -459 651 -262 53 225 -219 -208 -245 -63
$$ packed form
3373c91M0O76k15K41n23O4M38l68L1K12j25k11L39p51N53M75r51K06N96k51k13
3394a28J44K04k5J69n79P11m51M72r49J32N93o66K64M13k10k79K39j1k87P0J75
3415AK20l23m67M68j2J86m16J17K83oj10M2J21K05m11k40j76O09r0J95J36m13
3437h1m4K11O3j50k55J11L92J3l90J02l64P7mN82j01j72L24j05l68rP11q15N93
3460C21l04L36m20k75L45m63K66j29j75J28K28K23J31M0m58j33q8O82K50n04Q
3481Il08J55M8Q1k37P2J64k4R6Q9k42L41j54o3OJ15k65j60M43k33J33j73M7K08
3505A48n3n93J75O95l57p8O84p83N2j79K95J29K70r09K41M40n92M14L30n20L01
3526A10r1n57K74P7N43o57K33J06l19L60J71m79k30J110r13L15J72m44J1l7J82
$$ plain form
3547 -63 153 -160 565 -110 -257 57 -235 151 -109 -381 -192 417 -125 -319 -35 -181 75 337 -388 63
3567 63 304 202 -277 44 164 -9 -17 -141 -237 -135 -470 144 55 297 -25 -190 140 -86 167 9 -412 328
3589 328 -434 74 -75 -56 411 -261 306 86 -66 -24 73 -43 487 56 129 382 -439 173 73 -307 -273 36
3611 36 -299 369 -67 -332 -849 113 21 -415 -439 -127 -228 -123 151 -183 257 71 -232 77 251 209 81
3632 81 55 73 -226 -323 169 298 -567 292 -23 50 -27 -70 -47 165 410 54 -274 -363 -304 418 165 -169 -318
3655 -318 6 157 -123 178 69 184 255 -41 102 306 -154 -497 -237 -580 -258 -49 -34 -17 -304 85 17
3676 17 380 -289 204 175 169 -264 231 -223 296 115 19 -356 -200 -162 134 142 -37 15 -478 -83 -651 194 198 -313
3700 -313 -145 135 -166 247 53 3 175 219 341 -72 592 349 -79 7 -394 244 68 -179 -336 -346 -19
$$ packed form
3547f3K16l13P25o75j47L14k92L86k60k72J89O09n42j94K84j46K56K62p25M51
3567F3K41j02m79L21J20j73qj24r6J02l35O14q9K42l22j65L30k26K53j58m21P40
3589C28p62N08j49J9M67o72N67k20j52M2R7j16N30m31P3K53q21O12j00l80L4L09
3611C6l35O68m36k65n17R62r2m36k4L12j01J05K74l34M40j86l03L09J74m2j28
3632H1k6J8k99r7M92J29q65Q59l15P3p7m3K3K12K45l56l28q9N9P22k53l34j49
3655c18L24J51k80L01j09J15P1k96J43K04m60l43K60l43L22K09J5J7k87L89o8
3676A7L63o69M93k9om33M95m54N19j81r6l75J56L8K96Qj79N2m93L95n68Q45Mn11
3700c13J68K80l01M13j94n0J72M4J22m13O64k43m28Q6m01O38j76k47j57j0L27
$$ plain form
3721 -19 -111 -5 -9 -232 -127 139 371 -365 -108 0 56 -409 302 -149 81 -33 -39 -399 -154 100 -126 47
3743 47 294 -212 -27 -264 72 -11 208 60 60 107 7 249 -109 -160 -17 -17 364 235 93 -532 245 464 -146
3766 -146 -39 -157 360 349 -189 -467 -282 308 121 155 -58 -18 -167 -284 -400 -207 16 120 -13 -201 185
3787 185 -226 -193 -130 366 391 -8 10 -188 -321 -133 18 84 -98 -616 20 3 -84 614 87 -290 419 -197
3809 -197 -347 -65 277 -22 463 -8 222 -95 -48 -171 -333 -697 -131 246 109 327 -20 79 -211 -96 -181
3830 -181 -102 109 72 296 465 -73 -246 -231 -160 -387 420 -229 -164 -183 78 32 281 -113 282 329 -184 15 -28
3853 -28 177 334 109 179 -93 329 -213 -29 339 -165 -92 -69 -30 472 -111 151 96 186 -309 -164 61 -408
3875 -408 -79 -67 -184 -142 27 -103 48 247 -23 219 -169 -76 -136 295 -278 -163 -182 -471 68 -256 -22 -378
$$ packed form
3721a9r2J06mk23J05K66K32p36K57J08N6m65P11m51K30j14ol60K45K54k26J73
3743D7K47n06J85k37L36q3K19j48%M7j00K42l58n1J43%L81j29j42o25P77K19o10
3766a46J07j18N17j1n38k78J85N90j87L4k13M0j49j17j16J93K23J04j33j88L86
3787A85m11L3O3M96K5l99J8j98j33J88J51O6j82n18O36j7q7O98n27l77P09o16
3809a97j50K82L42k99M85m71K30l17M7j23j62l64N66L77j37K18l47R9k90J15q5
3830a81P9K11l7K24J69n38j73J5P1k27Q07o49O5j9K61m6K49l94L95M7n13J99m3
3853b8K05J57k25P0k72M22n42J84L68n04P3K3L9N02n83K62n5R0m95J45K25m69
3875d08L29J2j17M2J69j30J51J99k70K42l88R3o0M31n73J15j9k89N39l24K34l56
$$ plain form
3897 -378 77 -220 -159 642 -265 -162 -36 93 -452 232 -302 344 -26 187 321 7 -110 634 278 -435
3917 -435 186 132 31 375 283 55 -164 -284 63 -141 101 -188 344 204 -229 56 344 200 282 45 -136
3938 -136 -293 165 -181 147 1 354 290 -28 14 -395 56 -387 -124 4 -118 -153 179 -164 -35 -139 63
3959 63 410 364 -236 -320 316 10 -254 374 -429 -104 237 -504 20 37 686 -152 435 -154 119 -57 -133 -315
3981 -315 -325 34 -92 412 34 -160 -161 174 -331 -128 113 302 -492 -50 -179 -150 4 113 82 -32 267 -35
4003 -35 -385 -64 -287 104 532 -346 -187 203 21 40 -189 -250 220 -41 -187 117 -606 -344 327 172 -81
4024 -81 14 301 169 396 -67 -423 671 -303 -156 -11 96 -138 207 -216 -136 -202 169 84 34 -111 41 -310
4046 -310 35 214 -123 -38 263 97 -376 261 -111 -348 -383 536 -7 183 -530 325 205 126 50 -195 -49
$$ packed form
3897c78M55k97O1Q01r07J03J26J29n45O84n34O46l70K13J34l14j17P44l56p13
3917d35O21n4j01L44r2k28k19j20L47k04K42k89N32j40m33K85K88j44Q2k37j81
3938a36j57M58l46L28j46L53o4l18M2m09M51m43K63J28j22l5L32l43J29j04K02
3959F3L47m6o00q4O36l06k64O28q03L25L41p41N24J7O49q38N87n89K73j76p6j82
3981c15j0L59j26N04l78j94jL35n05K03K41J89p94M42j29K9J54J09l1j14K99l02
4003c5l50L21k23L91M28q78J59L90j82J9k29o1M70k61j46L04p23K62O71j55k53
4024h1R5K87j32K27m63l56J094r74J47J45J07k34L45m23Q0o6L71q5n0j45J52l51
4046c10L45J79l37Q5L01j66m73O37l72k37l5R19n43J90p13Q55j20p9p6k45J46
$$ plain form
4067 -49 -53 168 -228 -356 -228 -246 -137 291 -2 1 313 -34 -688 -113 -216 4 93 409 -376 -289 -316 -18 -275
4090 -275 144 -601 -118 -326 281 204 -238 137 -104 -52 92 319 -56 578 -291 441 -485 209 -257 -335 -147
4111 -147 -159 -351 -32 10 335 -116 -220 15 165 -178 80 383 -44 249 99 -250 -296 26 -86 -272 -40
4132 -40 -215 -218 523 -107 238 52 52 -272 100 421 -301 -164 -418 58 -13 29 -262 -474 -142 325 -84 -373
4154 -373 -256 -238 174 350 30 74 184 384 -358 292 94 94 339 -220 -388 274 111 -73 177 -52 287
4175 287 79 319 6 408 -80 -77 -46 -201 23 -286 -217 -88 309 -179 243 -331 -139 -225 207 -15 -50 -89
4197 -89 454 -417 -215 -48 -164 -316 -222 -248 37 166 -131 82 80 -18 -379 -289 124 -94 157 304 66 751
4219 751 -355 -123 -236 427 207 -157 109 281 3 83 279 -333 -299 233 -326 -3 6 -233 -72 -132 -338
$$ packed form
4067d9mK21l96j28J28j8J09M28k93LL12l47o54N75j03K20Q9L16p85Q7k7K98k57
4090b75M19p45M83k08O07p7m42L75k41N2J44K27l75O34q69P32r26O94m66p8J88
4111a47j2j92L19M2L25m51j04K35J50l43K58L03m27K93j50l49m6L22j12j86K32
4132d0j75lP41o30L45j86%l24L72L21p22J37k54M76p1M2k91k12L32M67m09k89
4154c73J17J8M12J76l20M4J10K00p42O50j98%K45n59j68O62j63j84K50k29L39
4175B87k08K40l13M02m88LL1j55K24l09O9J29L97m88M22n74J92q6M32k22l5l9
4197h9N43q71K02J67j16j52R4k6K85J29k97K13kr8l61R0M13k18K51J47k38O85
4219G51j106K32j13O63k20l64K66J72k78Q0J96o12L4N32n59L23Rk39J61o0k06
$$ plain form
4240 -338 -196 -55 230 -188 -79 128 190 61 -351 340 99 521 6 -300 10 -505 3 421 156 170 663
4261 663 -399 -118 84 271 68 -5 -607 160 130 -155 -11 -48 -12 95 268 74 -48 -338 -356 -268 148 255
4283 255 96 -111 177 -24 31 408 476 285 84 40 -261 57 123 -251 54 -4 -448 201 288 -57 273 -127
4305 -127 15 17 224 387 184 246 560 -448 -467 40 -220 -37 -73 -510 -552 -128 133 491 94 -97 36 -6
4327 -6 34 -112 265 -400 64 516 331 78 -383 195 -98 -500 159 395 -119 68 -352 -612 189 -194 584
4348 584 143 52 -165 -382 243 73 61 -502 -28 238 52 -56 162 113 469 -143 131 9 129 261 -232
4369 -232 213 -109 433 -127 805 42 -126 265 208 435 357 295 -176 319 10 -29 -286 -117 295 98 -41
4390 -41 -387 -204 4 301 289 -27 46 71 -62 -56 80 10 -1 -15 420 353 -44 -256 -312 -103 -126 48 -18 -41 16
$$ packed form
4240c38J42J41K85m18J09K07O2j29m12O91k41M22n15l06L10n15N08M18k65J4M93
4261F63j062K81K02J87k03p3o02P67l0k85J44l7L6J07J73j94j22k90j8Q8M16J07
4283B55j59k07K88k01N5L77O8j91k01m4l01L18O6l74L05n8m44O49Q7l45L30m00
4305a27J42KK07J63k03O2L14j008j9N07k60J83l6m37m2M24K61L58l97j91J33m2
4327fM0j46L77o65M64M52j85k53m61N78k93m02O59K36n14J87m20k60Q01l83P78
4348E84m41r1k17k17O25j70j2n63M74K66j86j08K18m9L56o12K74j22J20J32m93
4369b32M45l22N42n60R32p63j68L91n7K27p8o2m71M95l09l9k57J69M12j97j39
4390d1l46J83K08K97j2l16P3K5j33OJ36p0j1j4M35o7l97k12n6K09k3J74o6k3N7
$$ plain form
4415 16 114 -153 -199 -269 171 -205 57 70 347 -48 341 -144 303 -150 335 -86 -52 200 -395 24 -139 618
4437 618 43 301 185 -695 125 -151 -131 105 -186 -116 175 -405 134 -372 -276 -238 -402 152 -272 57 490
4458 490 -43 321 505 209 97 69 0 -251 -99 163 -21 509 277 -293 -325 -213 339 62 217 -268 308
4479 308 465 -77 189 -107 348 -237 -100 116 -48 288 -202 11 -158 423 -320 -110 -202 -113 -53 110 340
4500 340 89 496 -57 -119 151 -134 -9 27 323 107 8 453 177 353 -15 90 -338 -98 -198 207 266
4521 266 115 164 -268 4 134 -49 -611 -62 -99 124 -292 168 -212 -44 65 478 163 -30 -11 83 -59
4542 -59 158 -26 -195 321 369 -256 -208 267 184 276 -14 -293 -190 93 -279 -491 350 -231 -275 251 -138 -10
4564 -10 26 267 137 -347 398 -186 -265 10 -125 181 -117 -232 109 351 -232 -98 242 412 -4 239 -14
$$ packed form
4415A6R8k67m6p0M40l76K62J3K77l95L89m85M47m53M85m21L4K52n95M19j63P57
4437F18n75K58j16q80Q20k76K0K36k91P0K91n80N39n06R6L8j64N54m24L29M33
4458D90n33L64J84k96j12k8o9k51J52K62j84N30k32n70l2J12N52k77J55m85N76
4479C08J57n42K66k96M55n85J37K16j64L36m90K13j69N81p43K10r2Q9O0J63K30
4500C40k51M07n53o2K70k85J25L6K96k16r9M45k76J76l68J05m28K40j00M05N9
4521B66j51M9m32K72J30j83n62N49l7K23m16M60l80J68J09M13l15j93J9R4j42
4542e9K17j84j69N16M8o25M8M75q3R2k90k79J03K83l72k12Q41n81m4N26l89J28
4564a0L6K41j30m84P45n84p9K75j35L06k98j15L41K42n83J34L40J70m16K43k53
$$ plain form
4585 -14 -93 -79 41 -204 -164 -173 126 210 -1 569 61 -533 -624 146 -64 75 230 178 -552 -153 -540 -153 202
4608 202 -565 63 173 381 125 -63 232 70 -216 258 -115 267 163 228 108 214 183 89 -167 -57 117
4629 117 -104 338 -177 -324 48 49 179 28 82 -110 18 79 230 358 258 -338 101 17 230 378 -140 -109
4651 -109 288 629 199 -65 -304 -442 -106 -33 374 -68 -426 -417 -6 164 302 343 70 -33 331 100 156 -44
4673 -44 -6 -160 -404 82 -302 423 487 78 -197 -633 15 373 -361 646 -338 -438 222 -301 4 -50 241
4694 241 130 -365 -324 -317 -27 -273 159 290 -351 -228 39 143 -292 187 -270 528 70 91 -18 -353 95
4715 95 -22 328 261 150 -274 255 -470 105 -353 367 -7 -452 -107 247 -293 252 -81 -283 -189 351 -251
4736 -251 -237 312 141 -213 -63 -51 -333 238 164 -139 -104 424 64 190 254 -231 65 492 -19 -96 -32 -11 207
$$ packed form
4585a4p9J4J20k45M0rK99Q4k11N70n08n94r1P70k10J39J55n2p30L99l87L87L55
4608B02p67O28J10K08k56j88K95j62k86M74l73L82j04O5j20J06l1r4k56J10J74
4629A17k21M42n15j47L72JJ30j51N4j92J28O1J51J28j00n96M39q4K13J48n18L1
4651a09L97L41m30k64k39j38L36P3M07m42l58RM11J70J38M1k73j03L64k31N6k00
4673d4L8j54k44M86l84P25O4m09k75m36O48L58p34J007r84j00O60n23L05n4K91
4694B41j11m95M1PK90k46M32J31o41J23K67J04m35M79m57P98m58K1j09l35M48
4715I5j17L50o7j11m24N29p25N75m58P20l74m45L45L54n40N45l33k02R4N40o02
4736b51J4N49j71l54J50J2k82N71p4l03L5N28l60J26O4m85K96M27n11p7O4K1K18
$$ plain form
4759 207 -150 -23 -360 46 -281 318 377 -302 324 199 -208 544 174 -116 215 184 -203 189 321 -567 84
4780 84 -532 186 -46 -518 415 140 194 216 218 36 261 -406 126 118 26 345 568 -39 -189 102 276 350 523
4803 523 74 -393 -143 -4 110 -129 29 -166 -548 385 -139 -127 145 273 409 -301 -160 -301 -492 72
4823 72 -122 -54 -516 58 260 -289 -21 -476 76 70 80 -46 76 -273 -76 287 248 49 73 -61 -248 -351
4845 -351 -239 45 31 -542 208 -51 -173 -2 -25 269 360 145 -278 -22 -199 74 77 -410 -146 208 364 371
4867 371 -100 -432 465 73 -459 56 90 -185 -215 55 -195 -217 548 -67 -133 331 -174 118 -35 55 271 481
4889 481 -421 190 -162 -262 48 -37 503 254 19 58 47 -14 94 474 -180 -141 -144 -91 194 4 154 103 -564
4912 -564 -318 -54 -827 -120 -104 -238 -126 -179 -108 215 -175 69 5 260 -209 -154 -41 -63 -3 -154 490 -414
$$ packed form
4759B07l57J27l37M06l27N99N9o79O26j25m07P52l70k90L31l1l87L92J32q88O51
4780H4o16P18k32m72R33k75N4K2Kj82K25o67N32qr2L19K23o07j50K91J74P4J73
4803E23m49m67K50J39J14k39J58j95l82R33n24J2K72J28J36p10J41j41j91N64
4823G2j94O8m62N74K02n49K68m55N52oJ0j26J22l49J97L63l9j99K4j34j87j03
4845c51J12K84j4n73P50k59j22J71k3K94R1k15m23K56j77K73Lm87K64L54J56P
4867C71m71l32Q97l92n32N15L4k75l0K70k50k2P65o15o6M64n05K92j53R0K16K10
4889D81r02O11l52j00L10q5N40k49k35L9j1o1J08L80o54L9lN3K85j90J50n1o67
4912e64K46K64p73P07J6j34J12n3P1L23l90K44o4K55m69N5J13k2O0j51O44r04
$$ plain form
4934 -414 -337 -167 168 -313 -86 340 -54 58 65 -285 -5 -63 85 -310 278 -94 155 705 -57 223 131 -512
4956 -512 -99 146 180 92 -207 -291 107 -150 11 -355 306 366 113 125 45 -65 216 -241 -247 36 -184 -213 428
4979 428 487 466 13 502 230 78 -49 231 -59 -134 -26 -175 -117 571 -365 156 -58 124 -120 20 -360
5000 -360 -9 -355 127 173 -147 152 -353 -125 32 -290 -213 -41 43 30 24 98 -293 163 139 88 131 101 -231 -87
5024 -87 -68 -126 56 147 186 6 -102 144 -166 -199 70 307 218 -26 -450 208 91 387 543 -330 -89 -80 86
5047 86 347 -224 -93 -553 -159 -495 -480 -208 193 186 141 286 -160 446 -78 114 -269 517 618 -298 -336 -209
5069 -209 -226 -304 209 -125 -3 150 -122 -61 -730 120 396 248 -124 -191 -73 -307 106 -128 281 -162 48
5090 48 77 -19 227 -201 -370 -127 -167 -59 392 -364 223 61 297 -46 492 -655 309 -116 -59 -532 242
$$ packed form
4934d14P7J70L35m81K27M26l94J12Pl50K80n8J48l95N88l72K49N50p62K80r2o43
4956e12M13K45L4q8k99q4L98k57J61l66O61O0k53J2q0j10K81m57oK83k20k9O41
4979D28N9k1m53M89k72j52j27K80k90p5J08j49N8O88r36N21k14J82k44J40l80
5000c60L51l46M82M6l20K99n05K28J57l22P7J72Q4j3oP4l91M56k4n1M3l0l32J44
5024h7J9n8J82R1L9j80j08K46l10l3K69K37q9k44m24O58j17K96J56q73K41RJ66
5047H6K61n71J31m60L94l36J5K72M01pm5J45m46O06n24J92l83P86J01r16l8J27
5069b09j7p8N13l34J22J53k72O1o69Q50K76j48l72o7J18k34M13k34M09m43K10
5090D8K9r6K46m28j69K43m0J08M51p56N87j62K36l43N38j147R64m25N7m73P74
$$ plain form
5111 242 251 -39 254 -125 300 199 -85 231 175 -127 133 -465 -7 -119 -118 -116 343 -17 -398 -598 -157 -217 -262
5134 -262 -176 -359 -296 -534 264 315 -381 21 96 138 -137 585 -23 145 -96 104 145 -53 -342 121 -134 134
5156 134 85 211 365 -442 238 159 -454 -182 441 103 -170 -294 -135 -22 -41 100 -637 -402 25 -18 258
5177 258 402 469 -14 121 110 -51 -25 115 260 -148 -329 51 -279 -24 -322 -325 18 54 24 79 -111 516 470
5200 470 87 -88 -10 400 220 -218 151 291 128 25 60 387 -288 -328 -349 -33 -92 -130 179 -536 -304 414
5222 414 -54 -498 -155 -463 153 34 -146 -335 -84 108 -181 -161 -22 -78 -318 -265 -109 -16 -8 196 -617 314
5244 314 -50 7 142 28 -137 717 301 4 -23 152 111 23 -5 -32 456 -213 -113 389 -312 -373 121 -329
5266 -329 89 33 249 343 172 197 -209 -19 -157 -267 346 -502 -24 -110 -124 475 329 186 255 107 -348 175
$$ packed form
5111B42Rk90K93l79M25j01k84L16n6l02K60n98M58j12JKM59l60l81k00M41o0m5
5134b62Q6j83O3k38P98N1o96M02P5M2k75P22o08J68k41K00M1j98k89M63k55K68
5156A34m9J26J54q07O80p9o13K72O23l38k73j24J59J13j9J41p37K35M27m3K76
5177B58J44O7m83J35j1j61K6J40J45m08j81L80l30K55k98lL43L6l0N5j90O27m6
5200D70l83j75P8M10j80m38L69J40j63j03L5L27o75m0k1L16n9l8L09p15K32P18
5222D14m68m44L43l08O16j19j80j89K51J92k89K0J39n6k40N3J56R3QK04q13R31
5244C14l64N7J35j14j65Q54m16k97k7J75m1q8k8k7M88o69J00N02p01o1M94m50
5266c29M18n6K16R4j71K5m06J90j38j10O13q48M78q6j4N99j46j43O9j48m55N23
$$ plain form
5288 175 53 -229 16 212 500 16 -110 -284 125 77 -144 2 224 -55 319 -187 -4 -217 -182 -129 -205
5309 -205 129 -126 368 -468 -119 38 -181 184 -766 -262 -148 -304 -559 158 92 -119 -307 -113 -161 -70 -9
5330 -9 -79 -178 -24 -218 -81 262 54 120 174 78 -139 -72 -237 -177 -70 -298 295 -474 -276 87 -256 -154 273
5353 273 203 342 289 -3 322 -217 -643 8 477 -120 72 497 -374 -95 133 25 -540 -331 -6 -79 394
5374 394 38 262 301 -103 -381 42 -364 35 437 38 165 -58 248 -1 109 689 206 -48 -60 97 -164
5395 -164 84 184 258 135 -240 153 404 10 7 271 145 588 569 -657 -424 65 -206 203 -170 -41 208
5416 208 58 476 288 12 -85 -17 402 -414 7 95 631 -120 -21 146 -33 354 -195 -54 41 0 191 -28
5438 -28 61 145 -21 437 -218 578 210 -642 187 501 -182 232 69 -251 66 360 183 334 -396 115 -298
$$ packed form
5288A75j22k82K45J96K88m84j26j74M09m8k21J46K22k79L74n06J83k13L5N3p6
5309b05L34k55M94q36L49J57k19L65r50N04J14j56k55P17o6k11j88J94m8R1O1
5330ip0r9J54j94J37L43k08O6N4r6k17O7j65O0J07k28N93p69J98L63l43J02M27
5353B73p0J39n3k92L25n39m26O51M69n97J92M25q71K79K28j08n65K09L25p3M73
5374C94l56K24L9m04k78M23m06L99M02l99J27k23L06k49J10N80m83k54j2J57k61
5395a64K48J00P4j23l75L93K51l94lK64j26M43j9j226K33M89k71M09l73J29K49
5416B08j50M18j88k76r7O8M19q16M21Q8N36p51R9J67j79L87n49J41R5m1J91k19
5438b8Q9Q4j66M58o55P96l68q52Q29L14o83M14j63l20L17K94j77J51p30N11m13
$$ plain form
5459 -298 519 448 -350 -91 32 376 20 344 -132 -492 -5 -230 -105 139 -365 178 109 322 171 -514 370
5480 370 290 -33 -745 -167 -371 -153 333 514 67 205 126 343 556 -226 -369 -16 -241 35 -21 -281 -154
5501 -154 416 364 400 262 528 322 -577 25 13 -37 98 -36 -223 763 -345 -152 -11 132 -174 -137 0
5522 0 180 232 263 478 100 -226 -503 -108 300 -142 -167 -49 -302 534 -231 -377 -88 -332 317 70 366 -491
5544 -491 -144 83 165 222 -106 -26 65 -393 150 -17 -166 -47 300 -19 -246 125 390 -164 127 -235 -134
5565 -134 78 -197 -37 -294 130 172 -136 -216 134 10 -93 -320 149 -222 6 52 179 2 -14 335 116
5586 116 89 -202 44 -405 89 -103 169 -177 -50 -115 44 -171 -733 -18 215 7 117 486 236 -236 11
5607 11 442 -69 -371 251 101 20 -364 26 -205 255 89 -3 -201 368 -122 -177 -35 247 -152 -26 -197
$$ packed form
5459b98Q17p1p98K59J23L44l56L24m76l60M87k25J25K44n04N43o9K13j51o85Q84
5480C70q0l23p12N78k04K18M86J81m47J38p9K17K13p82j43L53k25K76n6k60J27
5501a54N70n2L6j38K66k06q99O02j2n0J35j34j87R86j108J93J41J43l06L7J37
5522@J80N2L1K15l78l26k77L95M08m42k5J18k53Q36p65j46K89k44O49k47K96q57
5544d91L47K27Q2N7l28Q0R1m58N43j67j49J19L47l19k27L71K65n54K91l62J01
5565a34K12k75J60k57M24M2l08q0L50j24j03k27M69l71K28M6J27j77j6L49k19
5586A16k7k91K46m49M94j92K72l46J27o5J59k15n62P15K33k08J10L69k50m72K47
5607A1M31n11l02O22j50q1l84L90k31M60j66r2j98N69m90n5J42K82l99J26j71
$$ plain form
5628 -197 -85 334 -124 348 -194 -266 165 -64 -178 104 495 -161 -213 -210 168 374 242 -252 149 -1 76 36
5650 36 -311 68 -250 -174 186 46 -23 -125 -29 -66 -114 -52 195 -28 250 -322 310 198 241 -114 -527 -90 138
5673 138 122 0 -22 78 155 -252 168 257 -5 -514 216 301 202 -318 119 237 -217 -479 91 34 -111 169
5695 169 -197 41 140 77 238 -494 -318 -506 -203 -206 18 243 -340 228 -76 137 -340 -485 387 438 -202 -157
5717 -157 219 -386 152 -238 -319 55 -152 -231 -68 324 -100 249 245 -404 52 -271 -147 234 -115 -53 151 112
5739 112 376 206 -483 72 95 132 -246 -162 -53 181 67 434 -93 547 73 330 -91 -138 88 -45 -226
5760 -226 -473 238 -262 -58 -88 -200 -91 168 607 -82 -51 -471 -411 -91 -201 458 567 -258 25 273 120
5781 120 181 -559 -53 -64 96 -11 137 -332 -131 -99 188 -176 -588 212 294 -99 -488 -131 -111 -108 183 134 27
$$ packed form
5628a97J12M19m58M72n42p2M31k29j14K82L91o56n2LL78K06j32m94M01j50P7m0
5650C6l47L79l18P6L60j40o9j02R6l7m8O2K47k23K78n72O32j12M3l55m13M37K28
5673A38j6j22k2J00P7m07M20Q9k62n09P30Q5r9n20M37J18m54k62N70n7j45K80
5695A69l66K38R9o3J61p32J76j88L03lK24K25n83N68l04K13m77j45Q72N1o40M5
5717a57L76o05N38l90q1L74k07p9J63L92m24L49mo49M56l23J24L81l49O2K04l9
5739A12K64j70o89N55K3L7l78Q4J09K34j14L67n27O40m74K57m21m7K26j33j81
5760b26k47P11n00K04l0j12J09K59M39o89L1m20O0L20j10O59J09q25K83K48j53
5781A20O1p40N06j1J60j07J48m69K01L2K87l64m12Q00Q2l93l89L57K0LK91m9j07
$$ plain form
5804 27 55 227 245 -171 45 -6 -60 -491 162 -104 133 -173 53 431 -35 -15 351 224 -283 40 -156 94
5826 94 -277 -113 519 -291 97 -36 -328 66 -271 -419 -99 -271 308 -194 -95 -479 -279 -420 436 421 -260
5847 -260 556 254 -138 151 -785 9 161 186 -283 -314 -226 -145 -57 30 -348 -92 30 -431 -205 203 -14 -362
5869 -362 -37 -450 -17 6 -50 158 -263 -55 -291 344 -71 157 26 35 260 20 109 249 138 -337 -197 1
5891 1 -91 -101 -191 29 29 17 72 -45 -274 2 370 315 222 -103 69 -446 137 2 -51 24 414 189 183 -599 -8
5916 -8 -190 95 -188 -387 -151 -92 -262 -287 -268 -336 -19 462 239 131 -81 3 -114 140 86 275 180 222 181 -103
5940 -103 19 324 -273 -139 -395 89 242 68 -447 69 345 342 -85 26 221 313 -23 -27 476 234 579 -86
5962 -86 165 -140 -152 -568 -25 426 432 -58 622 367 196 22 -120 176 -186 99 -362 193 -124 239 -267
$$ packed form
5804B7K8J72J8m16K16n1n4m31O53k66K37l06K26L78m66K0L66j27n07L23j96K50
5826I4l71J64O32q10L88j33k92L94l37j48L20j72N79n02R9l84K00j41Q56j5o81
5847b60Q16l02l92K89r36P94J52K5m69l1Q8Q1Q8Q7l78K56J22m61K26M08k17l48
5869c62L25m13M33K3n6K08m21K08k36O35m15K28j31RK25k40Q9J40j11m75J40J98
5891Ar2j0r0K20%j2N5j17k29K76L68n5r3l25J72n15N83j35n3P5L90k25op82N91
5916hj82K85k83j99K36N9j70k5J9o8L17M81k23j08k12Q4j17K54n4J89r5M2m1k84
5940a03J22L05n97J34k56M84J53j74n15N16K76lm27J11J95R2l36mN03k42L45o65
5962h6K51l05j2m16N43M51Om90O80k55j71j74j42K96l62K85m61N55l17L63n06
$$ plain form
5983 -267 -87 359 -344 -92 483 255 -362 -6 -261 -260 -98 -376 79 263 -34 295 134 -121 -88 94 115
6004 115 466 -433 8 -211 72 86 -202 235 410 336 -88 50 98 79 59 -36 -42 22 277 -47 288 58 -429
6027 -429 -22 -324 -4 -154 -606 -81 -320 -135 123 -106 423 211 -23 520 -91 -47 -413 -192 9 133
6047 133 238 -66 -141 78 -490 140 -97 176 27 -9 166 -143 187 -207 -22 -252 166 -17 -162 435 -79
6068 -79 -99 -167 106 111 164 75 298 400 -90 72 -63 465 -324 -152 -88 -133 -65 293 -111 -537 -219 -132 124 -160
6092 -160 29 350 17 -172 -61 212 -444 -455 160 -332 181 -17 714 127 -38 7 -26 -139 -243 -63 -34
6113 -34 -294 80 286 242 -152 -515 253 -153 79 -290 -140 58 211 -134 -108 120 -73 102 145 -1 -148
6134 -148 592 53 146 156 196 359 14 606 110 -99 -177 -558 82 -317 81 17 -176 202 118 -65 -41 46 -251
$$ packed form
5983b67J80M46p03K52N75k28o17L56k55JJ62k78M55J84k97L29j61k55L3J82K1
6004A15L51q99M41k19K83J4k88M37J75p4m24J38M8j9k0r5oO4K55l24L35k30m87
6027d29M07l02L20j50m52N25k39J85K58k29N29k12k34N43o11M4l66K21K01J24
6047A33J05l04p5K19n68O30k37K73j49l6J75l09L30l94J85k30M18j83j45N97n14
6068g9k0o8K73NN3q9K23J02m90J62j35N28p89J72O4m5O8L58m04m26L18Q7K56k84
6092a60J89L21l33j89J11K73o56j1O15m92N13j98P31n87j65M5l3j13j04J80K9
6113c4k60L74K06m4l94l63P68m06K32l69J50J98J53l45K6K28j93J75M3j46j47
6134a48P40n39R3J0M0J63l45N92m96k09p8l81O40l99L98o4j93L78q4j83K4Q7k97
$$ plain form
6157 -251 290 -181 45 47 -151 -95 35 30 117 66 18 60 549 -228 -118 79 50 34 380 -96 -12 180 -40 9
6181 9 -22 462 -312 207 208 374 251 34 158 -141 -68 -72 -331 -234 -131 486 15 -103 -170 -961 343 -181 140
6204 140 -100 284 -156 -46 -51 -59 102 -704 308 86 106 -408 -273 244 -210 112 -100 -223 220 107 31 -258
6226 -258 201 -80 -176 75 265 81 105 -276 -125 -223 -169 -128 51 -194 489 172 -245 411 254 241 -36 142
6248 142 -105 25 -32 320 -56 -45 -68 -374 -120 157 214 426 138 34 41 -426 -35 74 -57 298 -332 156
6270 156 -300 37 327 -337 -222 -220 -5 70 -672 325 74 -93 -206 -224 -39 61 -27 -181 191 -128 27 83
6292 83 159 15 -462 -1 101 -92 -168 178 333 92 -170 -426 49 511 -433 284 239 45 -51 -340 -193 -93
6314 -93 224 -160 -95 186 24 319 90 -501 -240 -177 587 -135 -305 254 21 312 271 432 99 -61 -195
$$ packed form
6157b51N41m71K26Kj98N6J30nQ7n1m8M2M89p77J10J97k9j6L46m76Q4J92k20M9
6181Il1M84p74N19JJ66j23k17J24k99P3mk59R7J03O17m71j18o7p91J304n24L21
6204A40k40L84m40J10nqJ61q06J012k22K0n14J35N17m54L22k12j23M43j13p6k89
6226b58M59k81r6K51J90j84K4l81J51r8N4M1J79k45O83l17m17O56j57j3k77J78
6248A42k47J30n7L52l76J1k3l06K54K77N7K12k88j04Pm67L91J09j31L55o30M88
6270A56m56L37K90o64J15KK15P5p42R97k51j67j13j8J85J00q8j54L72l19J55N6
6292H3P6j44m77M61J02j93p6L46J55k41k62k56M75M62r44P17m5j94r6k89J47J00
6314i3L17l84O5K81j62K95k29n91K61O3P64p22j70N59k33K91m1J61l33j60j34
$$ plain form
6335 -195 249 -89 304 460 109 -13 -131 -16 -100 -43 -148 -64 -529 29 14 -177 234 319 345 517 -201 165
6357 165 -50 -133 -6 49 -102 -137 287 -361 -423 435 -9 432 101 402 -26 6 74 -130 157 161 365 235 -204
6380 -204 -84 -12 97 267 -405 -179 -53 224 212 121 -216 -142 239 -41 -98 -156 37 -204 106 -160 251 9
6402 9 -179 -94 -371 -736 190 -41 122 -99 31 93 -121 -342 -347 118 595 16 -227 -556 -157 155 -49 212
6424 212 -65 -2 -451 -148 -92 -69 13 -51 277 303 63 -222 239 -385 -262 423 -351 -32 -279 32 -6 -100 58
6447 58 163 341 205 46 245 -343 -445 -192 35 -157 -263 -348 -148 -24 -234 -268 -205 -113 -21 -228 74 -44
6469 -44 354 153 122 -61 -148 -47 -34 -89 104 62 -112 -236 -163 -301 262 298 -159 -13 -8 275 231 -75 183 153
6493 153 -520 48 -14 -167 -211 24 231 152 333 -23 214 361 104 -156 -82 -144 146 207 -274 -50 -95 -60 -302
$$ packed form
6335a95M44l38L93J56l51j22j18J15q4N7j05Q4m65N58j5j91M11Q5K6J72p18L66
6357A65k15q3J27N5j51l5M24o48o2Q58m44M41l31L01m28L2O8k04K87MK04j30m39
6380b04J20P2J09J70o72K26J26K77j2r1l37P4L81k80n7n8J93k41L10k66M11k42
6402Ij88Q5k77l65R26k31J63k21J30O2k14k21nM65M77n79k43l29L99L12k04K61
6424B12k77O3m49L03N6K3Q2o4L28K6k40k85M61o24J23O85p74L19k47L11l8r4J58
6447E8J05J78j36j59J99n88j02K53K27j92j06q5K00J24k10l4O3R2R2k07L02j18
6469d4L98k01l1j83q7J01J3n5J93m2j74j24P3j38N63L6m57J46NK83m4l06K58l0
6493A53o73N68o2j53m4K35K07p9J81l56K37J47k57k60P4o2K90O1m81K24m5L5k42
$$ plain form
6516 -302 375 218 -148 69 392 8 247 202 -428 -408 -112 -189 381 -329 24 183 -260 320 176 -107 33
6537 33 285 -66 156 -25 -114 145 255 114 371 -145 -433 63 53 -33 -49 -193 -19 -109 202 227 209 330 150
6560 150 -249 -10 -44 -347 -312 403 158 -127 219 -259 -742 -21 -158 -39 -169 -175 163 -142 -200 456 -1 -95
6582 -95 -238 67 -340 -127 465 -292 39 -16 -22 121 -124 27 271 -356 -42 113 -172 -263 -98 -393 210 -214
6604 -214 -150 -103 469 155 -468 -188 327 151 -351 -48 -96 -229 -27 -250 -185 165 -157 -92 -24 234 -79 -97
6626 -97 209 109 117 -121 70 70 122 65 -286 372 463 361 -129 -277 527 -387 -418 1 -101 -158 -502 -463 -448 201
6650 201 -114 264 -291 -250 -55 -115 -174 196 39 -346 -180 -357 142 299 -378 -403 462 -49 42 334 129 51
6672 51 137 -205 -39 -312 151 -89 11 178 -282 -300 53 -27 3 96 -25 -313 31 172 -229 -82 -38 293
$$ packed form
6516c02O77j57l66K17L23l84K39m5o30K0K96p7N70p10L53J59m43N80j44k83J40
6537C3K52l51K22j81q9K59J10j41K57n16k88M96j0q6j6j44J74r0L11K5j8J21j80
6560A50l99K39l4l03L5P15k45k85L46m78m83P21j37J19j30oL38l05n8O56m57r4
6582i5j43L05m07K13N92p57L31n5oJ43k45J51K44o27L14J55k85r1J65k95O03m24
6604b14O4M7N72l14o23K80N15j76n02L03m8j33K02k23O5L50l22O5O8K58l13j8
6626i7L06j00Qk38J91%N2n7l51O58R1j02m90j48Q04r14l1M19j02n7l44L9J5O49
6650B01l15L78n55M1J95o0n9L70j57l85J66j77M99J57o77k5Q65n11R1K92k05p8
6672E1Q6l42J66k73M63k40J00J67m60j8L53q0L0R3j21k88L44J41m01J47M4L31
$$ plain form
6694 293 -35 -2 -308 292 -38 -343 261 44 -527 -51 -480 -152 346 -161 -114 566 8 -78 77 39 43 -457
6716 -457 106 -185 187 232 220 210 -10 -123 163 143 40 -60 117 -331 29 37 87 -354 118 -287 252 180 116
6739 116 391 -666 -108 410 -176 -527 -100 -324 -44 720 227 -113 -199 -157 -15 -388 80 -192 36 -6 483
6760 483 0 -21 147 652 -122 -81 -5 421 -158 -274 -181 294 117 -132 -65 267 219 35 -151 80 437 -278
6782 -278 141 395 -188 -211 -198 -12 337 63 48 -339 415 128 101 10 227 -156 -175 79 232 -461 -29 331
6804 331 163 222 276 -58 -154 590 248 -17 317 -319 -54 66 183 7 256 190 505 315 -195 332 513
6825 513 -56 276 14 -31 -269 381 -91 130 109 369 -336 607 76 -79 849 18 336 -567 71 129 32
6846 32 415 -273 15 607 -438 300 -546 344 -294 -183 309 -82 190 -567 -170 -270 -272 -96 42 -136 83
$$ packed form
6694B93l28L3l06O00l30l05O04k17n71M76m29L28M98n07M7O80n58q6J55l8Mn00
6716d57N63k91L72M5j2j0k20j13K86k0j03j00J77m48L60QN0m41M72m05N39p2o4
6739A16K75j057N58N18n86l51M27k24K80P64m93l40q6M2J42l73M68k72K28m2M89
6760D83m83k1J68N05p74M1P6M26n79j16R3M75j77k49O7L32m8j84j86K31L57p15
6782b78M19K54n83k3J3J86L49k74j5l87P54k87k7r1K17l83j9K54J53o93M32L60
6804C31j68N9N4l34r6P44l42k65L34o36K65J20J17j76K49o6L15j90n10N27J81
6825E13n69L32k62m5k38O50m72K21k1K60p05R43n31j55R28q31L18r03O38N8r7
6846C2L83o88K88N92j045P38q46Q90o38J11M92l91K72p57L97j00kJ76J38j78K19
$$ plain form
6867 83 -50 -657 -369 -77 57 -174 -11 -231 -186 16 186 -158 81 14 -95 -60 159 -2 139 320 343 458
6889 458 -585 28 177 46 335 236 -97 -383 69 160 50 -152 211 14 -34 -370 107 104 28 -328 189 -128
6911 -128 55 -24 171 -414 -22 178 96 -93 -169 304 -207 109 200 73 -275 184 -116 159 536 -169 -54
6932 -54 -211 16 -3 -466 -227 123 16 112 -324 -231 35 373 149 92 316 -26 -134 -87 -455 111 -124 -29
6954 -29 -651 -71 175 -467 -408 -630 -277 122 348 68 -117 214 207 80 55 -112 45 -57 -269 -102 -162 74
6976 74 -197 63 174 385 213 -205 -348 537 223 -18 127 -145 -481 -318 -70 -163 -174 -82 -362 174 317
6997 317 -295 268 -351 -28 300 274 23 -81 -161 -25 27 -264 188 156 310 -180 -261 -317 203 -323 -432 -36
7019 -36 -188 -385 384 -223 -166 106 -149 378 476 -163 259 180 -168 173 396 283 -1 -276 334 0 378
$$ packed form
6867H3j33o07K88K92J34k31J63k20M5K02J70l44K39o7j09L5K19j61J41J81K3J15
6889D58j043O13J49j31K89r9l33k86M52R1j10k02L63j97m8l36M77lp6l56N17l17
6911a28J83p9J95n85L92K00q2j89p6M73n11L16R1j27l48M59l00K75L77p05J15
6932e4j57K27j9m63K39L50j07R6m36R3K66L38k24n7K24l42j08M7l68N66k35R5
6954b9o22N80K46o42N9k22L53L99K26k80j85L31pj27k5j67J57j02k12J67o0K36
6976G4k71K60J11K11j72m18j43Q85l14k41J45k72l36J63K48r3j1R2k80N36J43
6997C17o12N63o19L23L28k6k51j04q0J36N2k91M52l2J54m90q1n6N20n26j09L96
7019c6j52j97P69o07N7K72k55N27R8o39M22p9l48L41K23j13k84k75O10l34L78
$$ plain form
7040 378 321 421 61 -92 104 -50 1 239 -26 -367 245 -394 182 158 -344 -100 119 -169 -12 -551 -195
7061 -195 22 -172 -118 -257 -362 193 409 110 127 -331 241 -161 -403 323 -52 -275 94 -299 -2 90 -88
7082 -88 -19 -156 292 -273 -264 -38 -277 -116 -43 118 -154 18 565 93 -102 54 -277 179 -304 -158 25 1
7104 1 -103 -3 -580 17 145 -255 -13 55 -214 146 -12 42 -461 -302 71 -212 -224 -519 -199 92 72 27
7126 27 -400 -223 68 -71 -699 52 90 413 -268 -301 -67 -219 -219 117 54 638 -408 476 -151 -404 77 -248
7148 -248 112 -89 110 -142 -227 313 167 -272 20 -255 -298 -15 235 -3 17 -322 -453 151 -400 -387 -63
7169 -63 53 445 -213 -314 -105 422 139 -324 -461 295 -3 212 -219 -143 -229 -201 -6 -300 -210 -184 -53 185
7191 185 -72 238 -123 207 76 41 45 -369 51 170 -163 -224 40 366 144 -645 373 -22 174 -188 50
$$ packed form
7040C78n7J00l60j53J96j54N1K38k65l41O12o39N76k4n02K44K19k88J57n39L56
7061a95K17j94N4j39j05N55K16k99J7m58N72m02k42P26l75k23L69l93K97R2j78
7082h8O9j37M48n65RK26k39J61P3J61k72J72N47m72j95J56l31M56m83J46J83k4
7104Aj04J00n77N97J28m00K42O8k69L60j58N4n03J59L73k83j2k95L20K91k0m5
7126B7m27J77K91j39o28P51L8L23o81l3K34j52%L36o3N84j046Q84o27k53M81l25
7148b48L60k01J99k52q5N40j46m39K92k75m3K83K50k38K0l39j31O04n51J3L24
7169f3J16L92o58j01K09N27k83m63j37P56k98K15m31P6q6K8J95k94R0K6J31K38
7191A85k57L10l61L30j31l5Mm14M20J19l33o1K64L26k22p89J018l95J96l62K38
$$ plain form
7212 50 -493 -554 288 300 191 -35 77 -516 180 -33 -84 -463 169 -42 155 259 -379 257 -32 250 -389
7233 -389 -75 180 207 -300 -267 83 108 -23 -43 192 54 111 -212 97 11 122 -254 -397 48 161 5 54
7255 54 93 -220 325 -15 258 17 133 311 -531 9 462 -176 -88 30 -280 28 -289 -176 41 64 76 224
7277 224 -3 -35 -332 -161 88 -296 245 533 217 -285 141 -178 -51 -152 344 115 52 5 101 -223 -223 94
7299 94 -111 -414 -345 -66 -300 -94 -336 219 37 -28 131 -29 -238 12 368 -172 528 419 373 -55 -91 312
7321 312 310 348 136 -154 -562 -24 231 144 6 165 340 -453 -15 125 380 -24 -150 -7 114 335 319 72
7343 72 175 207 -215 -209 -245 -335 101 75 367 -73 -432 -15 314 22 -522 -312 -87 241 82 -332 422 -77
7365 -77 390 331 -35 338 369 29 -260 374 157 -142 -81 -453 424 256 286 4 -158 116 -85 302 -90 -39
$$ packed form
7212E0n43o1Q42J2j09k26J12n93O96k13n1l79O32k11J97J04o38O36k89K82o39
7233c89L14K55K7n07L3L50K5j31k0K35j38N7l23L09q6J11l76j43M45J13j56M9
7255E4L9l13N45l40K73k41J16J78q42N40M53o38Q8J18l10L08l17J13K17K3J2J48
7277B24k27l2k97J71K49l84N41K88l16n02M26l19J27j01M96k29o3m7R6l24%L17
7299I4k05l03O9K79k34K06k42N55j82o5J59j60k09K50L56n40P00j09m6m28l6M03
7321C12kL8k12k90m08N38K55q7j38J59J75p93M38J40K55m04j26J43J21K21j6k47
7343G2J03L2m22Ol6r0M36k6K92m40l59M17L29k92n44K10K25L28j59m14P54m99
7365g7M67n9l66L73L1l40k89O34k17k99O1l72Q77j68L0k82j62K74k01L87l92N1
$$ plain form
7387 -39 -508 -229 181 179 -146 361 300 -2 144 -273 453 182 206 -180 435 186 16 -93 170 212 23 -184
7409 -184 -206 340 315 -270 -101 -283 616 -86 -36 169 161 27 295 210 186 -14 -177 40 81 -22 300 204 88
7432 88 -606 295 -232 -358 424 56 -144 267 -292 -83 380 -375 -53 -112 209 907 313 -466 63 -165 -98
7453 -98 -194 64 167 252 132 -31 -350 -284 -34 2 347 -189 -366 72 -290 204 -116 -370 -2 205 -356 100
7475 100 -207 -226 202 212 22 -228 -27 -261 -26 -222 197 364 86 -61 -243 474 -134 -218 417 -345 -167
7496 -167 -205 426 226 279 -238 99 -100 -266 18 280 -64 166 -145 -145 372 100 103 191 10 -397 -6 -219
7518 -219 -422 32 83 -53 271 -53 55 -95 -493 218 537 9 -447 -184 150 -57 -52 -57 -236 112 51 115
7540 115 229 -242 -90 297 -19 346 94 69 199 96 -132 236 -437 10 81 -96 -97 -355 267 247 -7 248
$$ packed form
7387c9m69K79M10kl25N07o1l02J46m17P26k71K4l86O15k49j70j09K63M2j89k07
7409a84k2N46k5n85J69j82Q99p02N0K05qj34K68q5k4k00j63K17M1j03L22r6j16
7432H8o94R01n27j26P82l68k00M11n59K09M63p55L22n9L21O98n94p79N29k28O7
7453i8r6K58J03Q5j20j63l19O6K50L6L45n36j77M38l62M94l20k54L68K07n61M56
7475A00l07j9M28J0j90k50K01k34K35j96M19J67k78j47j82P17o08q4O35p62J78
7496a67l8O31k00N3n17L37j99j66K84K62l44K30l11%N17k72LQ8j81m07L91k13
7518b19k03M54N1j36L24l24J08j50l98P11L19n28m56K63L34k07Nnj79L48o1O4
7540A15J14m71J52L87l16L65k52k5J30j03k28L68o73M47P1j77jk58O22k0k54K55
$$ plain form
7562 248 -141 51 309 352 -45 -512 136 -134 157 -511 166 226 -7 -64 -173 5 -349 -29 -429 -159 -248
7583 -248 -41 183 228 -343 -291 163 -31 -84 221 322 -21 589 42 51 -57 63 -212 -8 146 -147 -154 -60 -145
7606 -145 -260 -170 293 -212 160 145 319 -79 -87 -46 -297 74 -516 0 -175 -158 -149 -431 -29 -232 -380 123 265
7629 265 147 56 95 -100 -251 -341 60 -314 -170 322 47 -297 259 -155 332 -70 175 -571 196 149 176 442
7651 442 -39 -542 -177 -309 197 -24 -220 147 692 248 -210 -151 -95 33 -198 -23 220 117 167 325 205
7672 205 236 146 145 14 -284 135 31 -63 -5 207 292 -4 120 250 270 123 139 -178 -420 79 -115 -107 -80 -553
7696 -553 237 -106 132 200 95 153 266 212 -424 127 -65 -191 345 -300 -82 256 102 -413 -459 161 138 489
7718 489 61 255 6 139 -357 42 -300 366 -458 -269 -18 -535 196 -264 209 -227 -470 167 233 248 87
$$ packed form
7562B48l89J92K58M3l97m67O48k70K91o68O77O0k33n7j09J78l54L20m00K70q9
7583b48K07K24M5n71N2M54j94n3L05J01l43O10n47Rj08J20k75K04J54k93pR4q5
7606a45j15R0M63n05L72j5J74l98qM1k51L71n90N16j75J7Rk82M02k03j48N03J42
7629B65j18r1L9j95j51r0M01l74J44M92k75l44N56m14M87m02K45p46P67m7K7K66
7651D42m81n03L65j32N06k21j96L67N45m44m58N9N6J28k31J75K43j03N0J58j20
7672B05L1r0jj31k98M19j04r4N8K12Q5k96J24J30K0j47J6l17k42M99j94QK7m73
7696e53P90l43K38O8j05N8J13n4o36N51j92j26N36o45K18L38j54n15m6O20k3L51
7718D89m28J94k49J33m96L99l42O66q24J89K51n17P31m60M73m36k43O37O6J5j61
$$ plain form
7739 87 135 -404 -103 142 -111 162 119 -63 20 -233 -223 156 17 -47 104 182 -388 -241 42 365 -96 -87 153
7762 153 66 -266 -98 -286 18 -358 255 98 -114 317 61 54 375 -115 131 645 91 -174 -550 -120 -251
7783 -251 -183 -61 -4 -62 488 -94 285 -278 -178 92 -431 239 19 311 110 -594 25 149 274 -248 184
7804 184 170 -244 -613 178 234 -759 131 -136 42 -18 65 221 -241 462 49 -174 466 -228 -492 -227 -185 -107
7826 -107 669 14 -78 -181 -256 -94 456 -320 -276 -297 -464 25 -399 89 156 -620 76 -442 -31 358 -277 -198
7848 -198 -487 -239 -267 -209 -274 79 732 282 -121 124 -102 107 -379 -108 131 10 -68 239 -57 297 160
7869 160 -69 80 -114 -112 52 -159 594 -167 -459 184 173 -117 189 -12 -155 274 -293 410 -165 -126 -382
7890 -382 591 -79 381 -78 -651 61 -110 14 411 22 125 162 505 -43 83 37 53 26 151 202 433 -294
$$ packed form
7739H7M8n39L01K45k53K73m3j82Q3k53J0L79j39o4J51P8n70J47K83L23m61RK40
7762A53q7l32J68j88L04l76O13j57k12M31k56pL21m90K46N14n54k65l76M30j31
7783b51O8J22N7n8N50n82L79n63J00K70n23O70k20K92k01p04O19J24J25n22M32
7804A84j4m14l69P91N6r93Q90k67J78o0Q3J56m62P03m13k23O40o94k64K65M2P8
7826a07P76o55r2j03p5J62N50p76M4k1j67M89m24M88O7p76O96n18M11L89o35P9
7848a98k89K48k8N8o5L53O53m50m03K45k26K09m86K71K39j21p8L07k96L54j37
7869A60k29J49j94KJ64k11P53p61k92O43j1k90L06k01j43M29n67P03n75L9k56
7890c82R73o70M60m59n73P12j71J24L97l89J03L7L43n48J26m6J6k7J25N1K31p27
$$ plain form
7912 -294 43 99 -263 286 -58 101 -243 -103 -233 -525 52 -132 408 -454 -236 23 223 231 -209 -746 -338
7933 -338 59 -220 191 -105 83 275 265 100 489 275 610 162 -152 83 -24 267 58 -234 -328 166 128
7954 128 -39 168 -41 409 -93 -15 -460 -163 -203 282 -44 66 283 13 88 -70 -35 -59 221 -110 221 466
7976 466 -74 28 -383 46 -172 576 -313 -386 62 -382 -10 106 -594 298 301 -194 -238 11 578 -410 42
7997 42 41 -134 -180 351 -55 -334 122 -217 139 -13 -262 49 360 95 -91 120 -70 -148 259 -99 -62 -216
8019 -216 364 210 7 -330 -95 137 -1 0 128 108 274 -348 -54 174 -57 22 310 -209 -377 6 221
8040 221 65 -219 -467 -153 191 47 -20 -57 218 217 162 -215 377 249 -210 288 602 313 -10 133 -246 123
8062 123 -157 61 -191 128 -271 224 -451 -25 15 107 95 -101 385 184 382 -10 367 -50 289 319 409 -136
$$ packed form
7912b94L37N6l62N49l44J59l44J40j30k92N77j84N40q62K18K59K00Qm40n37M08
7933c38L97k79M11k96J88J92j0j65L89k14L35m48l14K35j07K91k09k92r4M94l8
7954A28j67K07k09M50n02P8m45K97m0M85l26J10K17k70P5j58L5k4K80l31L31K45
7976D66n40J02m11M29k18P48q89p3M48m44L72J16p00Q92Lm95m4K49N67r88M52
7997D2jj75m6N31m06k79M56l39L56j52k49L11L11k65j86K11j90p8M07l58L7j54
8019b16N80j54k03l37K35K32j38JJ28k0J66o22K94K28k31P9K88n19j68L83K15
8040B21j56k84k48L14L44j44o7l7K75jn5l77N92j28m59M98L14k89l23J43l79L69
8062A23k80K18k52L19l99M95o75M26M0R2j2j96M86k01J98l92L77m17L39L0R0n45
$$ plain form
8084 -136 107 316 40 275 120 178 266 -428 35 134 69 -113 -48 -13 46 -240 120 -8 -17 -239 50 -406 424
8107 424 101 174 -174 -146 -545 -205 258 -38 264 -224 -156 -71 31 -106 -317 21 65 398 -39 505 318 -86
8129 -86 203 423 400 66 244 200 -354 35 -103 160 -145 -243 -226 -216 -395 74 -361 -324 -342 -202 464 -144 295
8152 295 -136 -33 -301 397 743 -32 -185 367 -567 113 -60 425 -83 119 60 110 -370 -51 -390 134 -392
8173 -392 42 91 -105 -609 -275 187 147 -4 -186 427 -633 -313 -288 622 64 135 -325 -330
$$ packed form
8084a36K43K09k76K35j55N8Q8o94M63R9o5j82O5L5N9k86L60j28rk22K89m56Q30
8107D24l23P3l48K8l99L40M63k96L02m88O8Q5J02j37k11L38M4L33m37N44j87m04
8129h6K89K20k3l34J78m4n54L89j38K63l05r8J7J0j79M69m35L7j8J40O66o08M39
8152B95m31J03k68O98L46p75j53N52r34O80j73M85n08K02n9N0m80L19l39N24n26
8173c92M34M9j96n04L34M62m0j51j82O13j060L20K5R10n58P1m60n
8191c30
$$ Imaginary data points
##PAGE= N=2
##DATA TABLE= (X++(I..I)), XYDATA
$$ plain form
0 0 0 0 0 0 0 0 0 0 0 0 -64 64 -64 64 -128 128 -128 192 -256 257 -320 386 -509 576 -645 769 -897
27 -897 1027 -1216 1395 -1586 1796 -2053 2310 -2621 2948 -3316 3711 -4147 4632 -5161 5729
42 5729 -6348 7041 -7786 8596 -9489 10463 -11538 12702 -14003 15421 -16997 18752
54 18752 -20723 22945 -25461 28355 -31729 35689 -40436 46270 -53610 63172 -76207 95139
66 95139 -125237 180682 -317022 1355809 992104 -1807240 69751 1742367 333163
75 333163 -2396326 -1420101 1284316 1287153 -1571444 -2168409 312767 1650141 -611269
84 -611269 -2365316 -510894 2116909 1208193 -1399638 -1270844 1336417 1831307 -551432
93 -551432 -1766495 289969 2131436 795270 -1414897 -853033 1291003 1299704 -865588
$$ packed form
0@%%%%%%%%%%o4J28j28J28j92K56k56L20m48N13n77P06q95J085j221J414j666
27h97J924k243K611k981L382l849M363m931N569o264P027p858Q779r793J0890
42E729j2077J3389j4827J6382j8085J9952k2001K4240k6705K9424l2418L5749
54A8752l9475M3668m8406N3816o0084O7418p6125Q6706r9880J16782j39379J71346
66I5139k20376L05919m97704J672831l63705k799344J876991J672616j409204
75C33163k729489R76225K704417K837k858597n96965K481176J337374k261410
84f11269j754047J854422K627803r08716k607831J28794K607261M94890k382739
93e51432j215063K056464J841467j336166k210167N61864K144036Q701k165292
$$ plain form
102 -865588 -1535320 350502 1589366 97294 -1637511 -889017 861516 594650 -1089169
111 -1089169 -1178014 566957 1218795 -283781 -1355854 -143016 1339783 649815 -951026
120 -951026 -653263 1093622 1335684 -380156 -1220545 148077 1354548 344468 -1206138
129 -1206138 -762559 837156 873501 -693929 -1242469 79114 998120 26644 -1080172
138 -1080172 -401531 888392 597869 -721516 -763335 575826 1043510 -118412 -922602
147 -922602 -31776 989703 361164 -877810 -632584 687549 854750 -411631 -986282
156 -986282 56906 909395 125704 -946076 -478467 751457 705547 -497901 -838197
165 -838197 197856 817014 -1862 -814562 -218708 769285 487772 -542121 -560635 413940
$$ packed form
102h65588o69732J885822J238864j492072j734805P48494J750533k66866j683819
111a089169q8845J744971O51838j502576j072073J212838J482799o89968j600841
120i51026K97763J746885K42062j715840q40389J368622J206471j010080j550606
129a206138M43579J599715L6345j567430n48540J321583R19006r71476j106816
138a080172O78641J289923k90523j319385m1819J339161M67684j161922q04190
147i22602Q90826J021479o28539j238974K45226J320133J67201j266381n74651
156i86282J043188Q52489p83691j071780M67609J229924m5910j203448l40296
165h38197J036053O19158q18876q12700N95854R87993k81513j029893j8514R74575
$$ plain form
175 413940 670922 -229271 -725458 47253 777109 213479 -712323 -469492 491389 522229
185 522229 -431901 -747766 126243 747291 111916 -687178 -324503 555904 483555 -360170
195 -360170 -505648 306309 708078 35195 -575943 -130438 556013 286113 -473843 -413840
205 -413840 353732 494047 -259395 -646201 -35352 510193 64785 -588494 -306014 458524
215 458524 424123 -339974 -535019 166715 588699 54237 -489945 -116254 529041 356966
225 356966 -324257 -377417 243556 467926 -58807 -425627 -31672 408258 121667 -412425
235 -412425 -298074 252916 301477 -219222 -410851 48343 367166 -2020 -436134 -190535
245 -190535 349695 315754 -204488 -328719 141577 408096 27395 -349917 -84166 382059
$$ packed form
175D13940K56982r00193m96187P72711P29856n63630r25802K42831R60881L0840
185E22229r54130l15865Q74009O21048o35375p99094L62675Q80407p2349q43725
195c60170j45478Q11957M01769o72883o11138M45505O86451k69900p59956O0003
205d13840P67572J40315p53442l86806O10849N45545m45408o53279K82480P64538
215D58524l4401p64097j95045P01734M21984n34462n44182L73691O45295j72075
225C56966o81223n3160O20973K24370n26733l66820L93955M39930k86591n34092
235d12425J14351N50990M8561n20699j91629M59194L18823l69186m34114K45599
245a90535N40230l3941n20242j24231M70296K66519l80701l77312K65751M66225
$$ plain form
255 382059 278202 -209209 -277224 142154 300831 -80282 -350128 -55651 297482 106994
265 106994 -301140 -236919 173312 217090 -178588 -317120 68376 347722 61557 -301100
275 -301100 -128780 280772 233792 -184445 -257684 145166 351129 14917 -307466 -102886
285 -102886 253610 154705 -214686 -218570 141303 246263 -77568 -278107 -29959 228898
295 228898 61650 -225121 -124267 196516 186026 -144667 -236755 65255 248378 9692
305 9692 -234688 -61958 239318 157922 -174488 -209460 102119 239230 -13032 -220659 -43529
316 -43529 204394 98066 -180820 -168336 101554 172480 -54698 -177643 8807 174067
326 174067 30882 -171137 -80787 153656 139366 -93003 -143240 72571 177640 -19902
$$ packed form
255C82059j03857m87411o8015M19378J58677l81113k69846K94477L53133j90488
265A06994m08134O4221M10231M3778l95678j38532L85496K79346k86165l62657
275c01100J72320M09552m6980m18237p3239M02850K05963l36212l22383K04580
285a02886L56496r8905l69391l884L59873J04960l23831k00539K48148K58857
295B28898j67248k86771J00854L20783j0490l30693r2088L02010J83123k38686
305I692k44380J72730L01276q1396l32410l4972L11579J37111k52262k07627J77130
316d3529K47923j06328k78886J2484K69890P0926k27178j22945J86450J65260
326A74067j43185k02019R0350K34443j4290k32369n0237K15811J05069j97542
$$ plain form
336 -19902 -196964 -55794 172879 111902 -132764 -157271 66748 156035 -36684 -181015 -31325
347 -31325 167569 96178 -112072 -109202 81962 126247 -45383 -129852 21004 147796 34291
358 34291 -126472 -66532 99907 79298 -94964 -117513 61808 144417 -11261 -148054 -40523
369 -40523 125295 69312 -110335 -106413 79585 139027 -25276 -143407 -29638 117222 57383
380 57383 -92125 -71635 79578 101748 -38603 -103252 12044 102421 16030 -89611 -27799
391 -27799 91657 54483 -85610 -94264 44350 98415 -21233 -108110 -13413 103891 45090
402 45090 -93735 -80453 63809 105349 -15284 -90609 -1474 92288 31051 -80154 -56799
413 -56799 55809 68783 -30746 -68742 12576 62228 -10199 -78125 -18554 71719 43858 -52588
$$ packed form
336a9902j77062J41170K28673o0977k44666k4507K24019Q9287j92719j44331J49690
347c1325J98894p1391k08250K870J91164M4285j71630q4469J50856J26792j13505
358C4291j60763N9940J66439k0609j74262k2549J79321Q2609j55678j36793J07531
369d0523J65818n5983j79647L922J85998N9442j64303j18131J13769J46860n9839
380E7383j49508K0490J51213K2170j40351o4649J15296R0377q6391j05641O1812
391b7799J19456l7174j40093q654J38614N4065j19648q6877R4697J17304n8801
402D5090j38825J3282J44262M1540j20633p5325Q9135R3762o1237j11205K3355
413e6799J12608J2974r9529l7996Q1318M9652p2427o7926N9571R0273k7861r6446
$$ plain form
425 -52588 -52186 41402 64134 -27512 -80094 78 85131 37712 -63188 -54986 40774 59888
437 59888 -27118 -71080 2481 72646 27616 -53702 -40802 32754 38714 -28836 -47650 15634
449 15634 51870 -1745 -53165 -16396 41534 19110 -44047 -33048 41835 57455 -13849 -58001
461 -58001 -2418 57410 21647 -47319 -34073 40519 50737 -20569 -59666 -8613 43683 13049
473 13049 -41478 -26074 31147 31909 -21929 -38329 9294 37595 793 -31718 231 40723
485 40723 16300 -36361 -28624 28117 38611 -15291 -42421 3268 45727 9967 -46332 -31357
497 -31357 29570 39049 -14046 -37547 4243 37108 3851 -37162 -17841 28077 24738 -15332
509 -15332 -21126 13268 22248 -12503 -29334 4885 34157 9741 -25371 -11995 23682 16351 -25635
$$ packed form
425e2588M02R3588K2732r1646n2582Q0172Q5053m7419j00900Q202R5760J9114
437E9888q7006m3962P3561P0165m5030q1318J2900P3556N960o7550j8814O3284
449A5634L6236n3615n1420L6769N7930k2424o3157J0999P4883J5620p1304m4152
461e8001N5583N9828l5763o8966J3246P4592J0218p1306l9097N1053N2296l0634
473A3049n4527J5404N7221P62n3838j6400M7623K8301l6802l2511L1949M0492
485D0723k4423n2661P737N6741J0494n3902k7130M5689M2459l5760n6299J4975
497c1357O0927R479n3095k3501M1790L2865l3257m1013J9321M5918l339m0070
509a5332n794L4394Q980l4751j6831L4219K9272k4416l5112J3376L5677p331m1986
$$ plain form
522 -25635 -32201 11404 36304 5015 -30127 -15746 18513 14699 -17268 -19928 12895 29593 7105
535 7105 -16562 -7243 10365 4688 -11813 -6237 13414 13927 -7281 -16487 -2826 7169 -4773 -15545
549 -15545 -1909 19114 13014 -12156 -19496 834 16510 4685 -11616 -5004 15755 15463 -7292
562 -7292 -18373 -2493 14787 9509 -6533 -6475 6907 6873 -7722 -12694 623 9488 217 -10085
576 -10085 -3368 7245 -1102 -16942 -10850 11831 16433 -4863 -15255 2255 18605 5781 -14796
589 -14796 -6829 17997 20099 -3872 -14507 643 12579 -246 -13789 -4807 9948 3835 -12510
602 -12510 -11427 2812 4146 -10071 -10867 5771 12724 -1975 -12868 -484 15747 8324 -9429
615 -9429 -7426 11456 16834 -262 -10536 752 12922 5428 -9222 -7270 4778 5431 -4730
$$ packed form
522b5635o566M3605K4900l1289l5142J4381L4259l814l1967k660L2823J6698k2488
535G105k3667R319J7608n677j6501N576J9651N13k1208r206J3661R995j1942j0772
549a5545J3636K1023o100k5170p340K0330J5676j1825j6301O612K0759k92k2755
562g292j1081J5880J7280n278j6042N8J3382l4j4595m972J3317Q865r271j0302
576a0085O717J0613q347j5840O092K2681M602k1296j0392J7510J6350j2824k0577
589a4796P967K4826K102k3971j0635J5150J1936j2825j3543Q982J4755o113j6345
602a2510J083J4239J334j4217p96J6638O953j4699j0893J2384J6231p423j7753
615i429K003J8882N378j7096j0274J1288J2170p494j4650J952J2048O53j0161
$$ plain form
628 -4730 -6999 -659 709 -8645 -11258 -995 5302 -1962 -7866 111 8429 3534 -7906 -4679 10327
643 10327 15535 5986 -1407 1972 6706 1666 -5209 -3893 1759 4452 859 -2744 -5406 -8130 -9680
658 -9680 -5458 587 1753 -610 -1133 1374 278 -3974 -5177 1343 9402 10741 5862 1239 80
673 80 -351 -165 1731 3606 4248 3102 2249 -1250 -7404 -11223 -6323 2436 3887 -3359 -6912 -2647 -373
690 -373 -4740 -7692 -350 8665 7909 1822 626 3016 1249 -929 4422 10601 7530 -858 -2411 2441
706 2441 1041 -8560 -8856 2453 8279 -1934 -12119 -9218 -423 -428 -5593 -2318 6468 6414 -1766 -3874
722 -3874 1340 3022 -372 2242 10864 10975 -490 -7929 -679 6658 1529 -6002 -1338 7215 3328
737 3328 -9242 -12207 -3615 2345 -1914 -4061 744 3147 -2734 -6418 -1364 5249 2892 -380 4254
$$ packed form
628d730k269O340J368r354k613J0263O297p264n904P977Q318m895j1440L227J5006
643A0327N208r549p393L379M734n040o875J316N652K693l593l603k662k724j550
658i680M222O045J166k363n23K507j096m252j203O520Q059J339m879m623j159
673H0m31J86J896J875O42j146q53l499o154l819M900Q759J451p246l553M265K274
690c73m367k952P342R015p56o087j196K390j767k178N351O179l071q388j553M852
706B441j400r601k96J1309N826j0213j0185K901Q795nn165L275Q786n4q180k108
722c874N214J682l394K614Q622J11j1465p439P250P337n129p531M664Q553l887
737C328j2570k965Q592N960m259k147M805K403n881l684N054O613k357l272M634
$$ plain form
752 4254 9620 4298 -5198 -3727 5936 8614 441 -4246 790 4973 -2462 -8843 -7115 -14 1001
767 1001 -2693 -3854 -1696 -1083 -3991 -3414 2256 4433 1539 455 4288 6440 2102 -1888 1035 6136
783 6136 5999 -849 -3608 -305 1894 -424 -3761 -3209 -1282 -1948 -3297 -3776 -2830 -2496 -586 1112 997
800 997 -1091 -2010 805 3809 3462 2546 2350 3613 3089 1034 278 -17 650 1885 1555 61 -3484 -4376
818 -4376 -2993 -789 -2641 -4596 -3297 127 1246 -2246 -4217 -1085 3041 3914 1589 490 3257
833 3257 3437 1873 770 2197 3175 1519 266 723 785 -2573 -4975 -2146 1648 481 -4945 -5584 -384
850 -384 1509 -2483 -4557 147 5231 3699 -1738 -1753 2326 3813 1626 568 3084 3752 575 -1353
866 -1353 -17 1383 -792 -2217 -216 2169 -273 -4793 -4831 -989 378 -2567 -3819 -203 3265 1900
$$ packed form
752D254N366n322r496J471R663K678q173m687N036M183p435o381J728P101J015
767A001l694j161K158O13k908N77N670K177k894j084L833K152m338l990K923N101
783F136j37o848k759L303K199k318l337N52J927o66j349m79R46L34J910J698j15
800I97k088r19K815L004l47r16j96J263n24k055p56k95O67J235l30j494l545q92
818d376J383K204j852j955J299L424J119l492j971L132M126Q73k325j099K767
833C257J80j564j103J427R78j656j253M57O2l358k402K829L794j167n426o39N200
850c84J893l992k074M704N084j532n437j5M079J487k187j058K516O68l177j928
866a353J336J400k175j425K001K385k442m520l8L842J367k945j252L616L468j365
$$ plain form
882 1900 -2452 -3735 779 3801 3110 1113 1428 3075 2402 1108 -473 220 852 142 714 277 -1001
899 -1001 -3001 -4041 -1908 -178 -1089 -2896 -1907 603 1324 -700 -2731 -614 3230 3581 300 -832
915 -832 1360 3182 2227 -564 -640 1550 2414 430 -946 -1041 0 -1669 -1712 -796 -662 -1701 -2660 -1173
933 -1173 164 -517 -2000 -1790 1944 2956 412 -1552 -83 3255 2618 252 -725 1860 3280 1894
949 1894 -1574 -1425 95 1082 -890 -1533 -1147 -1243 -1819 -2220 -1250 -953 -1648 -1362 747 1537 381 -822
967 -822 -362 1801 2427 655 -469 1537 3222 1898 -639 -2144 -214 1150 324 -1365 -1206 522
983 522 -65 -1881 -2641 -1358 -304 -756 -266 -60 475 -499 -698 521 1617 1160 632 166 2810 2816 350
1002 350 -1070 -286 2563 1930 -1082 -2253 79 808 -709 -3091 -2695 -923 87 -1047 -1490 -796 -473
$$ packed form
882A900m352j283M514L022o91j997L15J647o73j294j581O93O32p10N72m37j278
899a001k000j040K133J730r11j807R89K510P21k024k031K117L844L51l281j132
915h32K192J822r55k791p6K190Q64j984j376r5J041j669m3R16J34j039r59J487
933a173J337o81j483K10L734J012k544j964J469L338o37k366r77K585J420j386
949A894l468J49J520R87j972o43L86r6n76m01R70K97o95K86K109P90j156j203
967h22M60K163O26j772j124K006J685j324k537j505J930J364q26j689J59J728
983E22n87j816p60J283J054m52M90K06N35r74j99J219J096m57n28m66K644Ok466
1002C50j420P84K849o33l012j171K332P29j517k382L96J772J010j134m43O94L23
$$ plain form
1019 -473 -261 -316 1365 1325 1017 619 1595 2417 1185 -286 372 1746 2060 107 -1651 -349 768 522
1037 522 -1836 -1846 -300 651 -1117 -1699 -1788 -631 213 -598 -853 501 630 246 501 1074 1229 761 704
1056 704 1535 2441 456 -501 -158 608 588 -1134 -1980 -493 187 -445 -1781 -2609 -379 -10 -391 -718 -501
1075 -501 566 755 241 -30 846 196 743 1444 1612 1452 38 -566 322 581 -20 -1074 -314 963 147
1094 147 -1695 -1928 -1270 -135 -379 -809 -861 117 580 -488 -472 86 1270 1776 1312 1244 856 596 411 884
1114 884 1200 159 -134 -209 -323 -390 -1565 -1691 -1169 -394 -257 -529 -987 -599 178 7 346 -98 529 1958
1134 1958 1318 685 -725 105 998 1065 683 597 665 296 -585 -1053 -600 -241 -485 -636 27 -594 -1303 -1731
1154 -1731 -216 869 -461 -693 291 1719 1593 -185 -835 888 2224 1738 113 449 1401 91 -1276
$$ packed form
1019d73K12n5J681m0l08l98R76Q22j232j471O58J374L14j953j758J302J117k46
1037E22k358j0J546R51j768n82q9J157Q44q11k55J354J29l84K55N73J55m68n7
1056G04Q31R06j985r57L43P66k0j722q46J487O80o32j336q28K230L69l81l27K17
1075e01J067J89n14k71Q76o50N47P01J68j60j414o04Q88K59o01j054P60J277q16
1094A47j842k33O58J135k44m30n2R78M63j068J6N58J184N06m64o8l88k60j85M73
1114H84L16j041k93p5j14o7j175j26N22P75J37k72m58L88P77j71L39m44O27J429
1134A958o40o33j410Q30Q93O7l82q6O8l69q81m68M53L59k44j51O63o21p09m28
1154a731J515J085j330k32R84J428j26j778o50J723J336m86j625L36R52j310j367
$$ plain form
1171 -1276 -713 581 316 -927 -1489 -383 -548 -2047 -2284 -498 829 -295 -1606 -475 1510 1106
1187 1106 -491 113 1886 2377 -185 -724 723 1951 1121 -349 -98 967 -173 -1488 -947 247
1203 247 -417 -1197 -1063 295 -180 -1962 -2364 -78 1117 109 -917 21 1088 64 -848 314 2053
1220 2053 1769 704 775 662 154 -1398 -200 1101 425 -898 -2054 -138 -619 -1947 -2470 -362 1101
1237 1101 279 -680 -347 614 483 -301 896 2395 2317 588 -458 887 745 -821 -502 1210 2149 89
1255 89 -2500 -1699 -76 -742 -1920 -900 1575 820 -1362 -3113 -913 622 -129 0 1688 2389 249
1272 249 -1436 -594 1563 1116 516 816 2841 1172 -1911 -2824 213 889 -240 -1315 108 688 -941
1289 -941 -3049 -1732 468 611 -40 691 1620 805 -1003 -974 1579 2631 468 306 1652 1386 -554
$$ packed form
1171a276N63J294k65j243n62J106j65j499k37J786J327j124j311J131J985m04
1187A106j597O04J773M91k562n39J447J228q30j470K51J065j140j315N41J194
1203B47o64p80J34J358m75j782m02K286J195j008j026R38J067j024r12J162J739
1220B053k84j065P1j13n08j552J198J301o76j323j156J916m81j328n23K108J463
1237A101q22r59L33R61j31p84J197J499p8j729j046J345j42j566L19J712R39k060
1255H9k589Q01J623o66j178J020K475p55k182j751K200J535p51J29J688P01k140
1272B49j685Q42K157m47o00L00K025j669l083r13L037O76j129j075J423N80j629
1289i41k108J317K200J43o51P31R29q15j808K9K553J052k163j62J346k66j940
$$ plain form
1306 -554 -2491 -912 1388 1313 -619 -1128 -515 -754 -2115 -1842 485 1149 -138 -5 -283 -249 -738 -1269
1324 -1269 786 2219 1921 -11 -197 459 997 -525 -388 1695 1852 385 -1236 -883 -834 -1104 -1484 -731
1342 -731 731 43 -1959 -1642 -140 -128 -1177 0 1238 2245 -197 -1083 403 2233 623 -236 826
1359 826 2180 1020 -1670 -1432 307 634 -1203 -782 623 9 -1759 -2452 34 465 -594 -757 306
1376 306 1471 -102 -1304 -318 1834 1150 14 -192 1448 447 -417 -454 442 1187 113 -606 -148 216
1394 216 -871 -2053 -363 726 191 -674 -627 -123 70 -563 -509 627 1698 535 -913 245 1062 834
1412 834 448 752 1482 771 -1054 -909 -383 -174 -566 -669 169 416 -1191 -1696 -1173 317 182 -931 -140
1431 -140 647 474 -885 -522 820 1328 505 225 652 904 -180 -1068 -140 481 57 -779 -162 243 -846
$$ packed form
1306e54j937J579K300p5j932n09O13k39j361K73K327O64j287J33k78L4m89n31
1324a269K055J433k98j932j86O56N38j522J37K083J57j467j621L53M9k70l80P53
1342g31J462o88k002L17J502J2j049J177J238J007k442q86J486J830j610q59J062
1359H26J354j160k690K38J739L27j837M21J405o14j768o93K486M31j059j63J063
1376C06J165j573j202R86K152o84j136k06J640j001q64l7Q96P45j074p19M58L64
1394B16j087j182J690J089n35q65M7N04J93o33N4J136J071j163j448J158Q17k28
1412H34l86L04P30p11j825J45N26K09l92j03Q38K47j607n05N23J490j35j113P91
1431a40P87j73j359L63J342N08q23k80M27K52j084q88R28O21m24q36O17M05j089
$$ plain form
1450 -846 -1530 -1020 78 841 -445 -1007 -59 -10 -287 -744 728 1229 686 518 148 689 312 -211 407
1469 407 1416 1245 149 -40 -399 -548 -766 -681 195 179 -393 -1006 -974 -661 -723 -964 234 1021 720 631 -16
1490 -16 420 934 199 -194 639 696 571 -403 -455 -318 -500 -343 -268 374 161 -562 -1202 55 -612 -401 -611
1511 -611 413 624 -365 -799 287 95 847 412 890 1201 843 812 1 541 626 -256 -463 357 188 -557
1531 -557 -886 -493 -447 -182 -117 -197 -475 299 -706 -399 -488 414 405 483 997 897 626 295 141 261 759 374
1553 374 -101 129 -90 91 -297 -612 -102 -479 -257 -387 -45 -317 -682 -482 516 88 -602 -75 738 272
1573 272 611 570 315 557 413 201 619 209 231 -171 -220 -462 -381 -9 -419 -869 -190 -799 -722 -789 168 -587
1595 -587 276 -11 219 81 248 559 861 605 991 851 248 624 -97 196 -434 52 -134 -260 77 -220
$$ packed form
1450h46o84N10J098P63j286n62R48M9k77m57J472N01n43j68l70N41l77n23O18
1469D07J009j71j096j89l59j49k18Q5Q76j6n72o13L2L13o2k41J198P87l01q9o47
1490a6M36N14p35l93Q33N7j25r74n2J37j82J57P5O42k13p23o40J257o67K11k10
1511f11J024K11r89m34J086j92P52m35M78L11l58l1q11N40Q5q82k07Q20j69p45
1531e57l29L93M6K65O5q0k78P74j005L07q9R02rP8N14j00k71l31j54J20M98l85
1553C74m75K30k19J81l88l15N10l77K22j30L42k72l65K00R98m28o90N27Q13m66
1573B72L39m1k55K42j44k12M18m10K2m02m9k42Q1L72m10m50O79o09P7o7R57p55
1595e87Q63k87K30j38J67L11L02k56L86j40o03L76p21K93o30M86j86j26L37k97
$$ plain form
1615 -220 -798 -538 -804 -561 -413 230 -172 34 -157 -592 -136 364 338 653 630 723 268 704 432 410 142
1636 142 418 100 46 -114 -305 -415 -939 141 33 -174 -174 -796 -335 45 -797 -337 -24 15 566 614 533 820
1658 820 419 -109 701 312 274 -24 248 257 23 -507 -522 22 -86 -269 -363 72 81 -713 -469 367 35 217
1680 217 314 236 553 -289 -63 772 305 790 615 800 91 352 -511 -103 -614 156 -670 -451 -122 -127 -523
1701 -523 -402 -566 -4 213 415 -62 274 32 -133 728 383 467 252 742 659 404 -11 -194 151 728 -507
1722 -507 -484 254 261 -560 -687 -746 81 51 -724 -258 -90 362 -511 -218 -247 551 732 44 434 773 319 -218
1744 -218 -20 763 624 -68 -309 -347 -38 -792 -892 -384 -56 -612 -111 -364 -140 -313 -760 -171 566 -85
1764 -85 603 157 303 115 238 155 396 492 531 289 -162 -103 -725 -989 -112 329 -302 -553 -349 -204 -424 -1012
$$ packed form
1615b20n78K60k66K43J48O43m02K06j91m35M56N00k6L15k3R3m55M36k72k2k68
1636A42K76l18n4j60j91j10n24J080j08k07%o22M61L80q42M60L13L9N51M8q1K87
1658H20m01n28Q10l89l8k98K72Rk34n30j5N44j08j83r4M35Rp94K44Q36l32J82
1680B17R7p8L17q42K26Q35m67M85j75J85p09K61q63M08n11P70q26K19L29nl96
1701e23J21j64N62K17K02m77L36k42j65Q61l45Q4k15M90q3k55m15j83L45N77j235
1722e07K3P38Pq21j27n9Q27l0p75M66J68M52q73K93k9P98J81o88L90L39m54n37
1744b18J98P83j39o92k41l8L09p54j00N08L28n56N01k53K24j73m47N89P37o51
1764h5O88m46J46j88J23q3K41R6L9k42m51N9o22k64Q77M41o31k51K04J45k20n88
$$ plain form
1786 -1012 -222 483 514 12 -680 204 178 247 39 318 1232 813 129 -223 399 59 -81 -554 778 137
1806 137 -473 -512 -523 -59 -627 -564 122 534 334 -715 -160 398 461 -220 157 772 1141 239 -115 305 594
1827 594 -173 -337 598 752 -112 -409 -346 246 -26 -734 -295 591 178 -780 -780 173 628 38 -215 617 689
1848 689 -111 -96 -345 362 346 -339 296 944 338 -428 -999 485 280 -653 -549 104 333 -403 -860 -206
1868 -206 290 -16 -589 -571 93 539 -748 -583 738 814 -243 -363 -55 622 -81 -473 -24 1125 203
1887 203 -880 -887 -324 -7 -412 -404 370 213 -852 -1019 115 391 -86 222 518 619 -175 -629 81 527
1907 527 704 417 460 15 314 -556 -1485 -147 453 29 -467 -23 219 -585 -898 -537 755 770 -517 -302
1927 -302 642 204 -803 -66 966 1042 362 -562 480 384 -56 -831 -11 600 47 -137 -689 -681 -308 -897
$$ packed form
1786a012P90P05L1n02o92Q84k6O9k08K79R14m19o84l52O22l40j40m73J332o41
1806A37o10l9j1M64n68O3O86M12k00j049N55N58O3o81L77O15L69r02l54M20K89
1827E94p67j64R35J54q64k97O3N92k72p08M39Q86m13r58%R53M55n90k53Q32P2
1848F89q00J5k49P07j6o85O35O48o06p66n71J484k05r33J04O53K29p36m57O54
1868b06M96l06n73J8O64M46j287J65J321P6j057j20L08O77p03l92M49J149r22
1887B03j083pN63L17m05QP74j57j065j67J134K76m77L08K96J01p94m54P10M46
1907E27J77k87M3m45K99q70r29J338O00m24m96M44K42q04l13L61J292J5j287K15
1927c02R44m38j007P37J032P6o80r24J042r6m40p75Q20O11n53j84n52QL73n89
$$ plain form
1947 -897 -285 445 263 190 -982 -442 254 -61 127 800 1045 429 245 -380 -8 226 -17 79 771 749 -480
1968 -480 -741 -426 -183 -389 -229 148 424 -211 -746 -822 -198 -200 -265 -202 773 696 -163 -56 -65 721 777 -114 159
1991 159 82 315 -555 -727 -246 359 -55 122 530 -1 -1102 -703 186 396 92 -23 115 821 512 95
2011 95 -195 843 581 16 618 310 223 -335 -49 273 1036 -381 -314 -241 203 -395 -319 -149 162 -85 -607
2032 -607 -540 135 -5 -107 -311 80 396 41 -99 -43 524 101 -224 85 433 352 -101 -272 204 341 -293
2053 -293 -552 0 166 -568 -169 -393 -103 -257 -187 -15 432 222 13 155 -149 220 535 39 459 623
2073 623 4 -10 87 186 97 -471 -242 61 40 -872 -376 167 297 3 -442 -345 471 -93 -352 101 80 609
2095 609 -271 154 495 440 -283 113 410 227 -331 -342 -732 -288 328 -280 -27 -33 -332 -470 -118 74 -5 -72
$$ packed form
1947h97O12P30j82p3j172N40O96l15J88O73K45o16j84o25L72K34k43R6O92k2j229
1968d80k61L15K43k06J60L77K76o35n35p6O24ko5O3R75p7q59J07rP86N6q91K73
1991A59p7K33q70j72M81O05m14J77M08n31j101L99Q89K10l04j15J38P06l09m17
2011I5k90J038k62n65O02l08q7n58K86L22P63j417O7P3M44n98P6J70L11k47n22
2032f07O7O75j40j02k04L91L16l55j40N6N67m23l25L09L48q1m53j71M76J37o34
2053b93k59N52J66p34L99k24K90j54P0J72M47k10k09J42l04L69L15m96M20J64
2073F23o19j4R7R9q9n68K29L03k1r12M96N43J30k94m45R7Q16n64k59M53k1N29
2095F09q80M25L41n5p23L96K97j83n58j1l90M44O16o08K53ok99j38L52J92p9o7
$$ plain form
2117 -72 -233 -188 -403 336 -362 218 409 -14 -308 369 199 -232 -212 -493 141 155 -198 -70 -97 -277 39 -611
2139 -611 -347 73 145 197 358 87 -43 21 -388 373 134 183 308 325 124 3 -138 420 -340 -169 -54 5
2161 5 1 -359 -350 -580 -41 169 -412 -148 -82 -186 185 -70 422 165 65 400 27 -64 -90 268 458 4 157
2184 157 112 102 241 -326 -248 88 -441 -148 -140 -419 -195 -191 -646 -59 363 -267 -259 -479 521 -103 302 334 182
2207 182 379 -25 140 415 278 316 -145 304 -250 -436 -100 18 -202 109 -237 -385 -84 -243 432 -207
2227 -207 -301 -380 110 -238 153 537 604 341 -174 1 -287 -108 630 -101 -12 22 81 87 -374 -220 -630 319 -185
2250 -185 -171 -2 78 -435 -320 13 -80 -398 424 -251 197 -63 295 -241 582 167 -103 105 -221 42 -284
2271 -284 183 161 -452 -583 -677 -297 63 -281 77 -154 -112 -116 78 -244 364 77 540 -338 -73 -272 323 -391
$$ packed form
2117g2j61M5k15P39o98N80J91m23k94O77j70m31K0k81O34J4l53J28k7j80L16o50
2139f11K64M20P2N2J61k71j30O4m09P61k39M9J25J7k01j21j41N58p60J71J15N9
2161Eml60Rk30N39K10n81K64O6j04L71k55M92k57j00L35l73r1k6L58J90m54J53
2184A57m5j0J39n67P8L36n29K93Qk79K24Mm55N87M22o30Qk20J000o24M05L2j52
2207A82J97m04J65K75j37L8m61M49n54j86L36J18k20L11l46j48L01j59O75o39
2227b07r4p9M90l48L91L84O7k63n15J75k88J79P38p31Q9L4N9Om61J54m10R49n04
2250a85J4J69Q0n13J15L33r3l18Q22o75M48k60L58n36Q23m15k70K08l26K63l26
2271b84M67k2o13j31r4L80L60l44L58k31M2mJ94l22O08k87M63q78K65j99N95p14
$$ plain form
2293 -391 -138 -96 456 422 36 -334 -577 108 -34 -423 -258 120 -259 -88 114 -235 274 -350 -202 289 -137
2314 -137 -123 -202 578 298 271 -328 -37 48 -157 182 162 -381 -54 74 -259 -498 -500 36 -586 -485 -141 -59 -311
2337 -311 388 126 90 229 445 202 -75 254 -25 519 117 462 119 492 293 2 314 5 41 -48 109
2358 109 -773 -631 -506 330 40 -306 83 -349 157 142 159 140 798 92 701 365 125 279 341 267 -277 28
2380 28 -438 -463 -11 -790 -300 308 -602 -154 -137 -27 220 -280 -526 -224 28 352 -123 73 -287 -117 -127
2401 -127 106 -18 -181 -230 -613 25 -293 -504 -347 111 -410 -403 -284 -213 -7 -320 145 -138 -184 -102 206 -7
2423 -7 -83 -127 -78 -244 309 265 454 218 -54 135 -284 -43 68 38 -47 -427 -510 -367 -81 -126 -533 -27 645
2446 645 -122 -258 97 199 -423 -92 176 822 41 -425 -218 44 145 388 175 123 168 -197 -314 -231 -297
$$ packed form
2293c91K53M2N52l4l86l70k43O85j42l89J65L78l79J71K02l49N09o24J48M91m26
2314a37J4p9P80k80k7n99K91Q5k05L39k0n43L27J28l33k39kN36o22J01L44Q2k52
2337c11O99k62l6J39K16k43k77L29k79N44m02L45l43L73j99k91L12l09L6q9J57
2358A09q82J42J25Q36k90l46L89m32N06j5J7j9O58p06O09l36k40J54O2p4n44L05
2380B8m66k5M52p79M90O08r10M48J7J10K47n00k46L02K52L24m75J96l60J70j0
2401a27K33j24j63m9l83O38l18k11J57M58n21PJ19P1K06l13M65k83m6Q2L08k13
2423gp6m4M9j66N53m4J89k36k72J89m19K41J11l0q5l80q3J43K86m5m07N06O72
2446F45p67j36L55J02o22L31K68O46p81m66K07K62J01K43k13n2M5l65j17Q3o6
$$ plain form
2467 -297 -237 -262 234 -74 -209 47 -110 68 449 314 -417 -18 406 412 -164 -255 633 -109 64 -286 473 76
2489 76 -292 -492 436 5 8 212 -157 -147 154 -582 -215 286 -72 -207 -343 264 129 353 660 606 389 63
2511 63 75 33 385 68 15 263 395 284 -703 -222 -401 92 -349 -146 337 218 -596 -19 -212 2 502
2532 502 68 799 369 37 -184 566 320 295 87 225 -42 383 -28 -943 -145 -143 -15 -632 -248 -91 -265
2553 -265 -580 -133 388 743 -300 -53 -205 105 -553 319 -165 52 298 128 152 118 -288 -258 -141 446 -189
2574 -189 -579 -264 -579 -333 212 -670 447 -44 16 128 -325 175 223 56 -8 119 50 349 -5 -350 286
2595 286 -212 -252 146 -85 -107 -378 -106 384 -112 -264 -136 5 -26 -225 159 113 -23 -202 -96 161 11
2616 11 231 269 -145 192 -147 245 475 54 -145 -356 50 131 -188 -205 -186 -522 -438 -192 -25 -436 418 413 -514
$$ packed form
2467b97O0k5M96l08j35K56j57J78L81j35p31L99M24On76r1Q88p42J73l50P59l97
2489G6l68k00R28m31LK04l69J0L01p36L67N01l58j35j36O07j35K24L07n4k17l26
2511F3J2m2L52l17n3K48J32j11r87M81j79M93m41K03M83j19q14N77j93K14N00
2532E02m34P31m30l32k21P50k46k5k08J38k67M25m11r15P98KJ28o17L84J57j74
2553b65l15M47N21L55j043K47j52L10o58Q72m84K17K46j70K4l4m06L0J17N87o35
2574a89l90L15l15K46N45q82J117m91O0J12m53N00M8j67o4J27o9K99l54l45O36
2595B86m98m0L98k31k2k71K72M90m96j52J28J41l1j99L84m6j36j79J06K57j50
2616A1K20L8m14L37l39L92K30m21j99k11M06Q1l19j7J9l36Q4K46J67m11Q54nr27
$$ plain form
2639 -514 -142 -103 57 -282 60 338 -117 234 -81 228 -271 13 23 -181 393 331 -479 -154 56 198 249
2660 249 62 300 -29 -179 -251 423 -11 -110 611 480 191 183 -432 -215 -8 -243 -452 182 304 327 -355 -470
2682 -470 -239 204 252 -73 182 282 -327 -253 450 -287 363 266 -24 439 467 -152 194 -6 -217 144 -535
2703 -535 254 -301 -158 -130 214 -46 30 -403 192 203 -173 -122 -615 -483 428 -189 365 51 432 -276 119
2724 119 -99 329 0 155 676 208 154 164 -96 -161 -199 -323 -407 -77 -18 94 -89 20 27 67 -313 -207 259
2747 259 -140 -41 -139 298 -332 -295 54 151 283 331 -259 381 -361 4 -216 -298 -183 271 -90 155 -13 -104
2769 -104 -127 114 -522 -30 -135 140 -210 179 -133 -225 -90 -186 388 135 202 -117 359 7 -91 504 -283 356
2791 356 -122 43 -100 -185 -78 172 63 287 1 485 -708 -157 205 31 -297 79 -408 -186 331 170
$$ packed form
2639e14L72L9J60l39L42K78m55L51l15L09m99K84J0k04N74o2q10L25K10J42N1
2660B49j87K38l29j50p2O74m34r9P21j31k89qo15K17K07k35k09O34J22K3o82j15
2682d70K31M43M8l25K55J00o09P4P03p37O50r7k90M63K8o19L46k00k11L61o79
2703e35P89n55J43K8L44k60P6m33N95J1l76N1m93J32R11o17N54l14L81p08L95
2724A19k18M28l29J55N21m68n4J0k60o5l8j24q4L30N9J12j83J09PM0l80J06M66
2747B59l99R9r8M37o30L7L49R7J32M8n90O40p42L65k20q2J15M54l61K45j68r1
2769a04k3K41o36M92j05K75l50L89l12r2J35r6N74k53O7l19M76l52r8N95p87O39
2791C56m78J65j43q5J07K50j09K24k86M84j193N51L62j74l28L76m87K22N17j61
$$ plain form
2811 170 -313 318 -195 149 211 -149 -428 -20 -469 149 287 87 -263 151 -231 106 -86 40 -23 184 8
2832 8 -224 254 -41 324 -6 -367 31 -386 -196 237 -242 118 -424 59 -160 38 214 -278 -22 336 -228
2853 -228 -21 -68 -251 -503 -200 -288 -531 -808 -125 201 682 125 233 -20 312 81 -196 81 133 -429 131
2874 131 -244 2 314 -232 -427 -421 -161 -96 -509 24 -158 -315 -124 -10 -141 183 -101 37 151 128 108 56
2896 56 -128 101 173 -10 -288 504 302 -102 70 -529 -457 -154 -222 -163 -198 -227 -156 78 -12 -16 57 15 -386 -303 321
2921 321 17 60 154 447 -174 175 80 -194 -181 -470 529 -190 -400 25 99 -66 -201 318 -195 188 -261 -341
2943 -341 69 100 -42 -39 407 424 69 74 185 182 121 167 -303 -677 -184 77 154 -299 -767 44 153 -126 -234 -292
2967 -292 14 -39 267 145 150 -93 114 -153 9 163 480 -256 150 -126 -240 -409 -667 170 323 -182 272
$$ packed form
2811A70m83O31n13L44O2l60k79M08m49O18J38k00l50M14l82L37j92J26o3K07j76
2832Hk32M78k95L65l30l61L98m17J90M33m79L60n42M83k19J98J76m92K56L58n64
2853b28K07m7j83k52L03q8k43k77O83L26M81n57J08k53L32k31k77K77N2n62N60
2874A31l75K46L12n46j95OK60O5m13N33j82j57J91J14j31L24k84J38J14k3k0n2
2896E6j84K29P2j83k78P92k02m04J72n99P2L03o8N9l5k9P1K34r0mP3m2m01Q3O24
2921C21l04M3R4K93o21L49r5k74J3k89R99p19k10M25P4j65j35N19n13L83m49q0
2943c41M10L1j42LM46J7l55NJ11lo1M6m70l74M93K61P7m53m68Q11J09k79j08n8
2967b92L06n3L06j22Nk43K07k67J62J54L17p36M06k76j14j69k58Q37J53n05M54
$$ plain form
2988 272 186 -152 -123 -348 345 -435 297 -288 404 322 68 630 540 13 72 313 15 166 224 160 352 -89
3010 -89 -263 -24 62 -104 -111 -2 137 -181 -233 119 101 -275 -9 92 136 95 174 -27 -102 -96 81 160 -163 -227 -60
3035 -60 125 157 -146 -45 37 -105 193 -10 11 64 -131 343 -362 -201 -132 -366 149 48 76 439 338 219
3057 219 -369 -374 236 75 -131 59 2 97 -314 -56 135 176 119 -55 -308 321 438 9 -56 -421 145 292
3079 292 -416 263 230 -668 51 262 39 343 -631 -59 15 53 190 381 8 -169 -260 -274 262 114 -194 -329
3101 -329 -236 315 272 -415 -161 263 272 295 6 164 284 -272 -51 52 124 162 94 165 114 -200 126 -108 21
3124 21 -8 -180 -536 -376 -252 -288 -345 -46 -333 -182 62 7 279 235 63 49 41 -345 -279 -365 64 -107 200 180
3148 180 -38 -496 -140 264 288 419 -12 -448 -337 78 -115 -117 -123 -51 -38 -84 71 122 -340 -303 -183 132 66 -113
$$ packed form
2988B72q6l38K9k25O93p80P32n85O92q2k54N62r0n27N9K41k98J51N8o4J92m41
3010h9j74K39Q6j66pJ09J39l18n2L52j8l76K66J01M4m1P9k01p5OJ77P9l23o4J67
3035f0J85L2l03J01Q2j42K98k03K1N3j95M74p05J61O9k34N15j01K8L63j01j19
3057B19n88nO10j61k06J90n7R5m11K58J91M1n7j74k53O29J17m29o5l65N66J47
3079B92p08O79l3q98P19K11k23L04r74N72P4L8J37J91l73j77r1j4N36j48l08j35
3101c29R3N51m3o87K54M24RK3k89J58J20n56K21J03P2L8o8P1n1l14L26k34J29
3124B1k9j72l56J60J24l6n7K99k87J51K44n5K72m4j72j4ql86O6q6M29j71L07k0
3148A80k18m58L56M04K4J31m31m36J11M15j93koP2J3m6J55N1m62L7J20L15o6j79
$$ plain form
3172 -113 67 206 114 438 -3 -390 13 89 -783 -215 55 346 -53 -84 204 -64 -38 -149 -493 -357 196
3193 196 114 -530 137 85 187 -121 67 837 129 4 196 -378 7 -84 -243 282 -275 76 -186 58 346
3214 346 40 -106 402 411 310 -245 -126 178 330 508 11 -247 98 4 -74 -269 224 -239 374 -124 193
3235 193 -389 112 -373 -317 14 -410 -388 -152 171 -94 120 -263 285 24 337 54 95 253 325 166 -113
3256 -113 -90 18 -37 99 -23 87 -84 -123 183 309 -64 -494 -418 -69 48 197 166 127 -447 82 -137 71
3278 71 -375 -88 315 -599 79 -168 207 28 -80 -39 15 -25 -179 235 -446 107 -56 166 -283 -115 -432
3299 -432 -268 -118 -369 127 101 5 -164 32 -80 41 -510 -2 -254 39 274 -364 -58 98 -361 628 -373
3320 -373 -133 116 -293 218 -208 460 -358 -255 75 84 364 -178 87 -155 528 146 -133 457 92 182 -103
$$ packed form
3172a13J80J39r2L24m41l87M03P6q72N68K70K91l99l1K88k68K6j11l44J36N53
3193A96q2o44O67n2J02l08J88P70p08j25J92n74L85r1j59N25n57L51k62K44K88
3214C46l06j46N08Rj01n55J19L04J52J78m97k58L45r4p8j95M93m63O13m98L17
3235A93n82N01m85N6L31m24K2K36L23k65K14l83N48k61L13k83M1J58P2j59k79
3256a13K3J08n5J36j22J10j71l9L06J26l73m30P6L49J17J49l1l9n74N29k19K08
3278G1m46K87M03r14O78k47L75j79j08M1N4m0j54M14o81N53j63K22m49J68l17
3299d32J64J50k51M96k6r6j69J96j12J21n51N08k52K93K35o38L06J56m59R89j001
3320c73K40K49m09N11m26O68q18J03L30RK80n42K65k42O83l82k79N90l65R0k85
$$ plain form
3341 -103 -467 -110 -166 -386 -106 -81 -268 389 63 -95 -191 56 -222 37 -52 393 404 42 -102 6 159 -46
3363 -46 -38 -250 -26 267 -409 -74 -533 51 -218 -124 -218 136 -15 -510 -328 -124 -210 -2 27 -126 -253 206
3385 206 267 -200 -249 -128 -22 -86 800 73 333 -288 -245 -172 -359 6 69 -374 93 -172 -332 329 146 -328
3407 -328 5 -120 95 58 262 108 449 266 103 -293 -27 151 -226 141 -119 504 128 141 -348 -386 152
3428 152 3 -130 23 -194 31 -138 -613 149 -337 118 47 187 -69 -74 -398 316 70 -179 228 123 -173
3449 -173 186 -80 -291 144 -470 50 171 -251 -258 -122 486 -335 287 -91 -327 426 -106 -304 -389 9 68
3470 68 -129 -265 -19 -202 -113 -136 -29 167 -325 37 -270 -616 177 -107 -75 -117 -406 -285 170 149 121 11
3492 11 -266 -191 -269 -332 157 346 184 91 -143 -279 -337 216 -56 -89 -239 -225 -165 302 -171 199 37 20 206
$$ packed form
3341a03l64L57n6k20K80K5j87O57l26j58r6K47k78K59q9M45J1l62j44J08J53k05
3363d6Qk12K24K93o76L35m59N84k69R4r4L54j51m95J82K04q6K08K9j53j27M59
3385B06O1m67m9J21J06o4Q86p27K60o21M3P3j87L65O3m43M67k65j60O61j83m74
3407c28L33j25K15l7K04j54L41j83j63l96K66J78l77L67k60O23l76J3m89l8N38
3428A52j49j33J53k17K25j69m75P62m86M55p1J40k56nl24P14k46k49M07j05k96
3449a73L59k66k11M35o14N20J21m22pJ36O08q21O22l78k36P53n32j98q5L98N9
3470F8j97j36K46j83Q9k3J07J96m92L62l07l46P93k84L2m2k89J21M55k1k8j10
3492A1k77P5p8o3M89J89j62r3k34j36n8N53k72l3j50J4O0M67m73L70j62j7J86
$$ plain form
3515 206 -383 564 -483 -118 89 287 -33 -325 -23 -189 -47 -69 -237 248 -292 156 -53 196 -145 115
3535 115 -336 -213 89 -280 -390 -121 393 -103 386 13 -185 -182 -440 -73 285 148 -96 -276 -245 -280 187
3556 187 -128 -108 693 -195 -6 20 9 -92 -266 70 241 577 111 -447 202 -339 222 495 275 198 81
3577 81 -360 107 12 -418 299 146 -80 145 190 27 -33 -141 193 -358 24 141 150 172 114 -141 -73 565 -280
3600 -280 143 -132 300 365 106 -255 189 108 -92 296 -448 -304 362 232 294 -157 99 15 73 -111 7 325
3622 325 -45 -368 -89 59 -58 -63 108 30 346 209 446 -115 21 -20 -38 241 -260 -309 126 -106 -231 -285
3644 -285 -401 19 241 -422 -172 -646 -35 604 -273 -292 -373 -277 -152 -297 -7 -89 499 201 133 -5 173 3
3666 3 188 -77 352 -233 -200 130 -92 -154 52 -686 -201 -208 -29 72 -36 -198 -610 -265 -4 -103 -417 220
$$ packed form
3515B06n89R47j047L65K07J98l20k92L02j66J42k2j68M85n40M48k09K49l41K60
3535A15m51J23L02l69j10K69N14m96M89l73j98Lk58L67L58j37k44j80L1l5M67
3556A87l15K0Q01q88J89K6j1j01j74L36J71L36m66n58O49n41N61K73k20p7j17
3577H1m41M67r5m30P17j53k26K25M5j63o0j08L34n51L82J17RK2n8k55O8O38q45
3600b80M23k75M32O5k59l61M44q1k00L88p44J44O66j30O2m51K56q4N8j84J18L18
3622C25l70l23K79J48j17nJ71p8L16j37K37n61J36m1j8K79n01m9M35k32j25n4
3644b85j16M20K22o63K50m74O11O39q77j9q1R6J25j45K90q2N88k98o8j38J78j70
3666CJ85k65M29n85L3L30k22o2K06p38M85pJ79J01j08j62m12L45K61r9l14O37
$$ plain form
3688 220 -48 41 -288 -287 7 79 -245 55 -12 333 188 9 226 352 -226 526 -219 -306 181 -505 -252 -24
3710 -24 240 -529 -152 65 -159 136 102 322 133 -98 -247 621 -413 322 597 266 149 70 -51 -715 -201
3731 -201 -89 -110 -96 -51 -247 502 -29 256 -121 -54 -255 -455 -223 -20 -305 -38 -79 460 122 -58 385 -124
3753 -124 -269 -251 -343 166 -163 -267 -1 121 88 -14 267 -43 -101 129 -181 -77 -80 -516 72 451 323 -328
3775 -328 89 179 254 179 -724 -236 -137 391 237 -196 171 187 -58 19 -250 163 53 140 16 -4 -35 260 -378
3798 -378 154 -58 -83 166 25 768 -40 -401 -143 -49 -281 -65 -305 239 167 85 -56 83 -90 113 -175
3819 -175 41 -194 182 -312 -21 244 -221 109 -105 164 -307 -217 86 269 67 -263 475 20 -255 -151
3839 -151 127 -94 32 -215 296 33 235 -81 -33 261 -20 15 89 -61 -92 -647 -75 262 -613 -13 -178
$$ packed form
3688B20k68Q9l29JK94P2l24L00o7L45j45j79K17J26n78P52p45q7M87o86K53K28
3710b4K64p69L77K17k24K95l4K20j89k31j49Q68j034P35K75l31j17p9j21o64N14
3731b01J12k1J4M5j96P49n31K85l77O7k01k00K32K03k85K67m1N39l38j80M43n09
3753a24j45J8r2N09l29j04K66J22l3j02K81l10n8K30l10J04lm36N88L79j28o51
3775c28M17R0P5p5r03M88R9N28j54m33L67J6k45P7k69M13j10Q7j24k0l1K95o38
3798c78N32k12k5K49j41P43q08l61K58R4k32K16k40N44p2q2j41J39j73K03k88
3819a75K16k35L76m94K91K65m65L30k14K69m71R0L03J83k02l30P38m55k75J04
3839a51K78k21J26k47N11k63K02l16M8K94k81L5P4j50l1n55N72L37q75O00j65
$$ plain form
3860 -178 381 135 483 62 -412 138 280 -200 -214 -126 -375 18 59 -400 49 140 -191 -514 -144 366 -276
3881 -276 -331 -176 88 -292 -397 106 -270 -135 -233 -174 -42 356 304 -151 135 -203 -283 -145 -363 113 -303 245
3903 245 28 -288 -70 0 585 -357 -300 -504 77 -103 380 -73 106 51 29 275 370 -47 66 -282 -382 177
3925 177 -19 125 408 -3 -284 467 -216 147 56 -18 -24 392 48 -184 160 93 -28 -151 -61 -147 -17 258
3947 258 26 308 291 12 -319 237 -447 -172 241 -24 177 -652 1 -44 787 47 177 74 199 -43 197
3968 197 -19 -26 18 -250 38 -316 -203 -499 -443 -222 -86 -107 97 -87 53 23 -251 118 241 150 -228 299
3990 299 11 51 -365 -95 324 37 -171 128 -384 -100 266 102 -626 82 -573 115 234 -226 -575 -358
4010 -358 -64 -408 212 -366 -281 192 101 193 -15 -582 258 211 -249 9 -382 344 -42 14 -114 -59 214 269
$$ packed form
3860a78N59k46L48m21m74N50J42m80j4Q8k49L93M1m59M49R1l31l23L70N10o42
3881b76n5J55K64l80j05N03l76J35r8N9J32L98n2m55K86l38q0J38k18M76m16N48
3903B45k17l16K18P0N85r42N7k04N81j80M83m53J79n5k2K46R5m17J13l48j00N59
3925A77j96J44K83m11k81P51o83L63r1p4oM16l44k32L44o7j21j23R0q6J30K75
3947B58k32K82j7k79l31N56o84K75M13k65K01q29O53m5Q31p40J30j03J25k42K40
3968A97k16pM4k68K88l54J13k96N6K21J36k1K04j84J40l0k74L69J23r1l78N27
3990B99k88M0m16K70M19k87k08K99n12K84L66j64p28P08o55O88J19m60l49K17
4010c58K94l44O20n78Q5M73r1R2k08n67Q40m7m60K58l91P26l86N6j28N5K73N5
$$ plain form
4032 269 255 -173 255 517 -385 -211 -46 217 278 -284 377 -77 8 -38 -18 -196 47 575 -54 -101 202 -165
4054 -165 459 -244 -162 131 252 48 311 144 48 -613 561 14 260 136 -70 -350 -333 -142 -95 83 -263
4075 -263 -505 -373 -274 -222 -247 202 -292 -146 55 442 -10 -305 142 -159 178 -211 315 -232 227 299 -419
4096 -419 173 -75 52 -62 -285 113 392 -286 -238 -83 -230 125 524 61 73 -46 104 222 -19 -89 -218
4117 -218 29 -286 -212 354 127 399 -364 513 -287 272 414 -143 -337 50 -287 127 -233 235 239 -174 -234
4138 -234 -567 434 30 131 20 -184 -58 89 455 89 -95 -196 288 92 62 -154 193 -106 -73 -252
4158 -252 -218 -231 175 79 -519 -145 98 147 -81 237 -73 -533 6 116 74 605 -308 -24 -351 -309 583 -97
4180 -97 23 -473 149 -295 -268 257 -191 399 -289 2 453 -102 472 165 46 -219 55 234 329 -3 -521
$$ packed form
4032B69j4m28M28K62r02J74J65K63O1n62O61m54Q5m6K0j78K43N28o29m7L03l67
4054a65O24p03Q2K93J21k04K63j67r6o61J174n47K46j24k06k80J7J91M7J78l46
4075b63k42J32R9N2k5M49m94J46K01L87m52k95M47l01L37l89N26n47M59P2p18
4096d19N92k48J27j14k23L98K79o78M8J55j47L55L99m63J2j19J50J18k41p0j29
4117b18K47l15P4N66k27K72p63Q77q00N59J42n57j94L87l37M14l60M68Mm13o0
4138b34l33J001m04J01j11k04J26J47L66l66j84j01M84j96l0k16L47k99L3j79
4158b52L4j3M06r6n98L74K43M9k28L18l10m60N39J10m2N31r13K84l27M2Q92o80
4180i7J20m96O22m44K7N25m48N90o88K91M51n55N74l07j19k65K74J79R5l32n18
$$ plain form
4201 -521 405 -127 444 273 168 77 252 -453 -217 344 496 -13 -321 -348 -60 -158 41 361 444 -37 59 201
4223 201 -425 -304 -249 463 -101 -3 -426 -52 -174 335 135 287 110 -303 277 374 84 -136 242 345 266
4244 266 -130 140 -49 -68 360 -52 431 279 -293 -574 -172 78 484 76 -28 -137 83 -120 20 184
4264 184 -428 95 143 312 -157 -65 -268 135 -74 -23 -166 -246 209 93 -201 -96 182 -18 79 192 232 272
4286 272 -68 -175 155 -34 317 -302 126 202 -366 22 -259 -185 251 -213 -22 383 205 -147 -120 -284 -178
4307 -178 -227 -180 -223 -198 -662 125 -57 193 -252 -152 -465 10 93 391 -51 -222 -105 -150 -39 87 -248 163
4329 163 452 -127 -115 20 -14 -253 -173 -10 70 -74 127 -220 -21 -98 -265 68 98 419 -543 -545 34 -131 340
4352 340 341 -20 286 -2 202 92 -320 7 104 648 -328 -42 -47 -422 -96 -317 182 263 354 -229 -230 -29 124
$$ packed form
4201e21R26n32N71j71j05r1J75p05K36N61J52n09l08k7K88r8J99L20Q3m81R6J42
4223B01o26J21N5P12n64R8m23L74j22N09k00J52j77m13N80R7k90k20L78J03p9
4244B66l96K70j89j9M28m12M83j52n72k81M02K50M06m08j04j09K20k03J40J64
4264A84o12N23M8J69m69R2k03M03k09N1j43q0M55j16k94J05K78k00R7J13M0M0
4286B72l40j07L30j89L51o19M28P6n68L88k81P4M36m64J91M05j78l52K7j64J06
4307a78m9M7m3K5m64P87j82K50m45J00l13M75Q3K98m42j71J17m5J11J26l35M11
4329A63K89n79J2J35l4k39Q0J63Q0j44K01l47J99p7j67L33L0L21r62kN79j65M71
4352C40Jl61L06k88K04j10m12L27R7N44r76K86nl75L26k21M99Q1R1n83jK01J53
$$ plain form
4375 124 -83 299 -89 98 238 193 -69 43 -112 -207 45 -154 -4 286 249 140 -36 104 84 610 339
4396 339 169 -606 53 -28 -177 224 327 -41 90 43 -148 -298 154 91 -367 -663 197 47 173 -441 -214
4417 -214 -285 206 207 97 41 -305 -421 -313 -176 -75 -165 83 72 -73 -17 414 7 -143 443 -359 25 71 87
4440 87 11 -158 193 117 -26 -78 -354 212 -622 171 77 40 459 -43 -43 145 -265 -132 -47 -204 -35 106 349
4463 349 13 50 61 282 -78 236 86 125 -249 -97 -432 -215 -228 -67 204 13 -178 -214 -224 183 19 -435
4485 -435 186 291 336 -134 6 96 2 -204 -241 333 274 201 -151 292 -543 213 -191 36 193 170 322 -274
4507 -274 338 -698 -396 -9 153 279 -135 14 -215 -321 -279 -584 372 -162 730 -73 -10 124 -172 -123 147
4528 147 90 -469 -112 -69 9 214 -43 -54 48 62 132 -301 -102 -399 45 116 150 190 -183 -45 129 47 45 210
$$ packed form
4375A24k07L82l88J87J40m5k62J12j55r5K52j99J50K90l7j09j76J40k0N26k71
4396C39j70p75O59q1j49M01J03l68J31m7j91j50M52o3m58k96Q60j50J26o14K27
4417b14p1M91Jj10n6l46j16J08J37J01r0K48j1j45N6M31m07j50N86q02L84M6J6
4440H7p6j69L51p6j43n2k76N66q34P93r4l7M19n02%J88m10J33Q5j57J69J41K43
4463C49l36L7J1K21l60L14j50L9l74J52l35K17j3J61K71j91j91l6j0M07j64m54
4485d35O21J05M5m70J40R0r4k06l7N74n9p3l52M43q35P56m04K27J57k3J52n96
4507b74O12j036L02L87J62J26m14J49k29j06M2l05R56n34Q92q03O3J34k96M9K70
4528A47n7n59L57M3P8K05k57j1J02J4P0m33J99k97M44P1L4M0l73J38J74q2kJ65
$$ plain form
4552 210 130 12 -268 -551 -43 122 -81 -300 51 23 -273 -682 -358 -76 274 37 250 200 158 223 -61 20
4574 20 -148 22 -202 -178 86 -164 -212 -154 112 430 -124 440 167 -14 -181 418 -201 462 225 25 207
4595 207 45 390 62 -208 256 -682 -148 190 -420 -82 535 420 -183 24 154 27 10 8 -427 83 -396
4616 -396 26 44 -132 -252 324 -37 58 307 -42 225 -373 -72 118 304 -203 -40 -281 39 -22 337 561
4637 561 198 -70 -130 554 -43 94 232 96 575 21 40 290 -94 -171 407 -481 165 354 -154 -202 213
4658 213 532 288 103 -176 306 49 -72 236 175 71 -106 44 -219 -430 -5 -136 51 163 -254 -455
4678 -455 294 98 401 -91 420 -7 -27 61 -129 537 -102 129 53 -328 311 -108 -288 250 527 211 440
4699 440 281 188 246 -259 -40 208 89 -140 474 357 205 -102 20 -104 426 -75 -487 -98 -122 170 -114
$$ packed form
4552B10q0j18k80k83N08J65k03k19L51k8k96m09L24K82L50k37K13n0m2O5k84Q1
4574B0j68J70k24K4K64k50m8N8K66L18n54N64k73j81j67N99o19O63k37k00J82
4595B07j62L45l28k70M64r38N34L38o10L38O17j15o03K07J30j27j7km35N10m79
4616c96M22J8j76j20N76l61R5K49l49K67n98L01J90J86n07J63k41L20o1L59K24
4637E61l63k68o0O84n97J37J38j36M79n54J9K50l84p7N78q88O46J89n08m8M15
4658B13L19k44j85k79M82k57j21L08o1j04j77J50k63k11M25j31J87J12m17k01
4678d55P49j96L03m92N11m27k0Q8j90O66o39K31p6l81O39m19j80N38K77l16K29
4699D40j59r3N8n05K19K48j19k29O14j17j52l07J22j24N30n01m12L89k4K92k84
$$ plain form
4720 -114 -115 356 219 118 -88 -67 -67 -58 -151 -413 -90 -86 195 110 -333 123 7 195 249 -7 82 -74 149 -127
4744 -127 227 121 -53 19 341 -124 204 -71 172 -460 71 -143 -104 278 373 -54 -120 -200 -160 -132 -268 -72
4766 -72 -50 210 -126 588 -63 -225 -264 -344 -221 -713 -351 -276 -533 -89 -194 238 142 48 87 463 155 -478 -72
4789 -72 423 -285 9 273 69 58 -181 198 -160 463 129 -32 202 102 -520 173 435 45 -333 -205 250
4810 250 417 -223 -24 635 -659 232 147 224 -75 122 -67 -79 -461 214 -176 52 -109 -196 -275 560 -54
4831 -54 -397 130 127 70 82 133 -58 -165 193 34 299 474 460 -534 126 76 313 -512 -435 -91 207 -326 81
4854 81 -248 293 -50 175 224 39 434 -130 30 155 30 -109 -134 65 -310 -19 700 -144 -295 32 4
4875 4 -49 -295 466 216 -302 118 -445 334 -149 482 100 -80 -64 -173 -81 -265 -158 92 160 164 -238 275 -177
$$ packed form
4720a14jM71j37j01k06K1%Rr3k62L23MK81q5m43M56j16J88N4k56Q9j56K23k76
4744a27L54j06j74P2L22m65L28k75K43o32N31k14L9L82R5m27o6q0M0K8j36J96
4766g2K2K60l36P14o51j62l9q0J23m92L62P5k57M44j05M32r6r4L9L76l08o33M06
4789g2M95p08K94K64k04j1k39L79l58O23l34j61K34j00o22O93K62l90l78J28M55
4810B50J67o40J99O59j294Q91q5P7k99J97j89j2l82O75l90K28j61q7p9Q35o14
4831e4l43N27ln7J2N1j91j07L58j59K65J75j4r94O60n0K37q25P7L44K98n33M07
4854H1l29N41l43K25M9j85L95n64J60J25j25j39k5J99l75K91P19q44j51L27k8
4875Dn3k46P61k50n18M20n63P79m83O31l82j80J6j09R2j84J07K50O8Mm02N13m52
$$ plain form
4898 -177 -168 -178 -82 -140 139 -39 -216 79 -206 200 70 286 279 -6 -159 50 -57 -91 -18 -34 -304 -8 -78 371
4922 371 99 -216 -137 -189 107 -78 -400 -34 -134 111 -143 -615 -525 25 168 30 -193 192 112 181 -186 196
4944 196 409 -82 195 250 -311 -168 149 -325 -105 190 -447 336 -240 -15 -146 106 288 -264 65 -279
4964 -279 -180 79 199 374 -12 -201 -382 207 -249 -49 238 258 350 -172 -129 -234 -221 -110 171 -264 2 238
4986 238 224 213 11 212 -77 449 -86 -271 352 378 -533 70 434 385 290 31 110 -467 -122 -49 -25 -168 307
5009 307 -27 -287 196 247 -615 -213 212 380 -209 132 -51 174 155 -281 173 473 3 434 -250 103 364
5030 364 -178 151 85 -329 -435 -410 161 -85 -117 -235 191 161 163 -359 169 -49 -284 296 223 -37 -115 -16 -495
5053 -495 198 -77 452 402 -223 -339 261 -71 -63 -236 -130 -279 518 -269 303 -174 32 292 -201 -236 601
$$ packed form
4898a77Rj0R6n8K79j78j77K95k85M06j30K16pk85j53K09j07l4P3j6k70K96p0M49
4922C71k72l15P9n2K96j85l22L66j00K45k54m72R0N50J43j38k23L85q0O9l67L82
4944A96K13m91K77N5n61J43L17m74K20K95o37P83n76K25j31K52J82n52L29l44
4964b79R9K59J20J75l86j89j81N89m56K00K87K0R2n22M3j05J3J11K81m35K66K36
4986B38j4j1k02K01k89N26n35j85O23K6r11O03L64m9r5k59P9n77L45P3K4j43M75
5009C07l34k60M83N1q62M02M25J68n89L41j83K25j9m36M54L00m70M31o84L53K61
5030C64n42L29o6m14j06K5N71k46l2j18M26l0Kn22N28k18k35N80p3k60p8R9m79
5053d95O93k75N29n0o25j16O00l32Qj73J06j49P97p87N72m77K06K60m93l5Q37
$$ plain form
5074 601 -481 -647 -204 -38 -157 -120 60 48 142 -60 -63 -412 474 24 64 -23 -216 298 -211 -161 -416 -420 -199
5097 -199 10 203 226 30 -145 -103 289 -136 95 73 186 219 1 18 -81 474 394 103 -161 91 -155 291
5119 291 52 -181 94 219 384 267 -87 363 -187 15 -291 -116 -357 416 114 -170 -391 511 -192 -274
5139 -274 518 180 -290 -347 -136 -190 -424 116 -29 230 171 -317 -69 144 527 -466 -79 -62 -35 338 -154 366
5161 366 -13 267 -160 36 400 -79 250 191 -74 -134 -469 48 -175 -76 90 376 189 -321 236 -161 -76
5182 -76 172 -51 19 -223 -189 -361 -209 119 96 24 -150 65 244 -25 -189 -52 226 123 74 391 196 100
5204 100 126 518 -132 -364 -199 150 97 40 -7 139 -527 -335 83 -27 -64 -144 335 92 -39 -220 -195 -657
5226 -657 455 -78 -28 330 329 -133 -153 392 118 -164 187 -219 -180 157 390 135 5 25 -374 226 318 -62
$$ packed form
5074F01j082j66M43J66j19L7J80j2R4k02ll49Q86m50M0q7j93N14n09N0k55mK21
5097a99K09J93K3j96j75M2L92m25K31k2J13L3k18J7r9N55q0k91k64K52k46M46
5119B91k39k33K75J25J65j17l54M50n50K02l06J75k41P73l02k84k21R02p03q2
5139b74P92l38m70n7K11n4k34N40j45K59n9m88K48K13L83r93L87J7K7L73m92N20
5161C66l79K80m27J96L64m79L29n9k65o0l35N17k23R9J66K86j87n10N57l97Q5
5182g6K48k23P0k42L4j72J52L28k3p2j74K15J79k69j64J37K78j03m9L17j95r6
5204A00K6L92o50k32J65L49n3n7m7J46o66J92M18j10l7q0M79k43j31j81K5m62
5226f57J112n33N0L58jm62k0N45k74k82L51m06L9L37K33k55j30K0l99O00R2l80
$$ plain form
5248 -62 220 -203 124 -415 272 201 34 52 -143 50 232 47 606 51 275 -313 327 114 -262 -41 175
5269 175 -107 -118 207 -397 -700 572 -161 -189 -104 336 -199 610 -307 -435 262 -75 -37 -150 -44 91 0
5290 0 -36 -95 24 275 296 -637 -105 -172 397 -80 146 171 559 41 35 -67 49 83 236 -55 -189 235 -68
5313 -68 141 13 148 119 225 7 226 157 -79 94 265 -355 226 -112 186 -319 193 11 -316 -136 -153
5334 -153 52 19 -194 274 -319 37 466 -83 469 -321 620 -18 -23 -245 21 91 291 32 0 138 270 456
5356 456 -124 289 -164 252 102 -4 -203 63 128 -212 50 -83 315 334 402 -297 225 -326 29 -48 53
5377 53 -245 110 -270 -356 11 208 -351 169 -103 195 -356 143 -40 256 -51 335 87 -136 -80 84 166
5398 166 -391 204 393 -146 172 492 -14 -163 473 202 -326 -82 89 29 373 -137 12 -239 139 -124
$$ packed form
5248f2K82m23L27n39O87p1j67J8j95J93J82j85N59n55K24n88O40k13l76K21K16
5269A75k82j1L25o04l03J272p33k8Q5M40n35Q09r17j28O97l37L8j13J06J35r1
5290@l6n9J19K51K1r33N32o7N69m77K26K5L88n18oj02J16L4J53k91j34M24l03
5313f8K09j28J35k9J06k18K19o9k36J73J71o20N81l38K98n05N12j82l27J80j7
5334a53K05l3k13M68n93L56M29n49N52p90R41o38nk22K66P0K00k59l2J38J32J86
5356D56n80M13m53M16j50j06j99K66O5l40K62j33L98J9O8o99N22n51L55p7J01
5377E3k98L55l80q6L67J97n59N20k72K98n51M99j83K96l07L86k48k23N6J64Q2
5398A66n57N95J89n39L18L20n06j49O36k71n28K44J71o0L44n10J49k51L78k63
$$ plain form
5418 -124 -177 25 -74 240 -11 -173 -201 -426 -203 159 -261 65 -182 274 80 47 294 9 -106 -567 117
5439 117 -21 -164 85 99 298 -344 174 -113 -181 84 -202 -181 -230 409 -15 -101 205 227 76 -13 -333 163
5461 163 -283 248 -197 -316 139 -46 -319 55 -56 -103 319 21 -6 382 136 132 -78 -210 -63 466 441 154
5483 154 -576 207 -261 288 188 -95 -317 -73 -243 180 -177 162 250 57 347 -40 340 -276 12 -334
5503 -334 -94 577 123 -201 66 2 -294 -31 -15 114 115 -299 -59 -135 1 -234 -225 -318 -445 -174 -137 -75 -235
5526 -235 -60 85 -229 431 -27 352 -125 -179 313 -116 519 230 -252 152 -34 650 -154 115 -252 350
5546 350 165 205 -16 -59 442 -75 213 0 159 318 63 149 -270 499 5 79 446 -233 51 -416 260
5567 260 -169 -227 -227 -186 42 -373 177 104 -351 155 65 153 -67 270 63 -40 -92 289 -188 79 29 -48 -249
$$ packed form
5418a24n3K02r9L14k51j62k8k25K23L62m20L26k47M56j94l3K47k85j15m61O84
5439A17j38j43K49J4J99o42N18k87o8K65k86K1m9O39m24q6L06K2j51q9l20M96
5461A63m46N31m45j19M55j85k73L74j11m7M22k98k7L88k46mk10j32J47N29k5k87
5483A54p30P83m68N49j00k83k22K44j70M23l57L39Q8j93K90l87L80o16K88l46
5503c34K40O71m54l24K67o4k96K63J6J29Jm14K40p6J36k35Rr3j27K71L7O2j60
5526b35J75J45l14O60m58L79m77n4M92m29O35k89m82M04j86O84q04K69l67O02
5546C50j85M0k21m3N01n17K88k13J59J59k55Q6m19P69m94P4L67o79K84m67O76
5567B60m29n8%M1K28m15N50p3m55N06r0Q8k20L37k07j03n2L81m77K67n0p7k01
$$ plain form
5590 -249 114 131 58 95 -3 -87 -108 -7 134 468 229 233 244 -221 -8 -191 -227 12 -393 -314 -135 104 -57 -62
$$ packed form
5590b49L63J7p3L7r8q4k1J01J41L34k39MJ1m65K13j83l6K39m05P9J79K39j61n
$$ [...]
8191d3
##END NTUPLES=NMR FID
##END=
