##TITLE=1H ikalashn
DE-75k2_TFA
15.11.2024
##JCAMPDX= 6.0         $$ Bruker NMR JCAMP-DX V2.0
##DATA TYPE= NMR FID
##DATA CLASS= NTUPLES
##ORIGIN= UXNMR, Bruker Analytische Messtechnik GmbH
##OWNER= root
$$ TOPSPIN		Version 1.3
$$ 2024-11-15 14:03:19.171 +0400  Irina@DPX200
$$ Compression mode = diff/dup
##.OBSERVE FREQUENCY= 200.131300845
##.OBSERVE NUCLEUS= ^1H
##.DELAY= (6, 6)
##.ACQUISITION MODE= SIMULTANEOUS
##.ACQUISITION SCHEME= undefined
##.AVERAGES= 64
##.DIGITISER RES= 18
##SPECTROMETER/DATA SYSTEM= spect
##.PULSE SEQUENCE= zg
##.SOLVENT NAME= CDCl3
##.SHIFT REFERENCE= INTERNAL, CDCl3, 1, 17.49637
##AUDIT TRAIL= $$ (NUMBER, WHEN, WHO, WHERE, WHAT)
$$ ##TITLE= Audit trail, TOPSPIN		Version 1.3
$$ ##JCAMPDX= 5.01
$$ ##ORIGIN= Bruker BioSpin GmbH
$$ ##OWNER= Irina
$$ $$ F:/spectra/data/iren/nmr/1H/4/audita.txt
$$ ##AUDIT TRAIL=  $$ (NUMBER, WHEN, WHO, WHERE, VERSION, WHAT)
(   1,<2024-11-15 14:01:57.281 +0400>,<Irina>,<DPX200>,<TOPSPIN 1.3>,
      <created by zg
	started at 2024-11-15 13:57:44.187 +0400,
	POWCHK disabled, PULCHK disabled
       configuration hash MD5:
       BE 6D 3F 07 2A EA 11 49 91 17 2B D3 AF B3 58 0D
       data hash MD5: 16K
       F6 90 E3 05 92 61 70 B2 E7 0A D0 1A 18 64 10 70>)
$$ ##END=
$$ 
$$ $$ hash MD5
$$ $$ F2 1A 5B E0 99 10 C3 35 E3 74 AE 02 EB FB E0 6C
##$RELAX= 
##$RELAX= 
##$RELAX= 
##$RELAX= 
##$RELAX= 
##$RELAX= 
##$RELAX= 
##$RELAX= 
##$RELAX= 
$$ Bruker specific parameters
$$ --------------------------
##$DU= <F:/spectra>
##$EXPNO= 4
##$NAME= <1H>
##$PROCNO= 1
##$TYPE= <nmr>
##$USER= <iren>
##$AMP= (0..31)
100 100 100 100 100 100 100 100 100 100 100 100 100 100 100 100 100 100 
100 100 100 100 100 100 100 100 100 100 100 100 100 100 
##$ANAVPT= -1
##$AQSEQ= 0
##$AQ_mod= 1
##$AUNM= <au_zg>
##$AUTOPOS= <>
##$BF1= 200.13
##$BF2= 200.13
##$BF3= 200.13
##$BF4= 200.13
##$BF5= 200.13
##$BF6= 200.13
##$BF7= 200.13
##$BF8= 200.13
##$BYTORDA= 1
##$CFDGTYP= 0
##$CFRGTYP= 5
##$CHEMSTR= <none>
##$CNST= (0..63)
1 1 145 1 1 1 1 1 1 1 1 1 1 1 1 1 1 1 1 1 1 1 1 1 1 1 1 1 1 1 1 1 1 1 
1 1 1 1 1 1 1 1 1 1 1 1 1 1 1 1 1 1 1 1 1 1 1 1 1 1 1 1 1 1 
##$CPDPRG= <>
##$CPDPRG1= <>
##$CPDPRG2= <>
##$CPDPRG3= <>
##$CPDPRG4= <mlev>
##$CPDPRG5= <mlev>
##$CPDPRG6= <mlev>
##$CPDPRG7= <mlev>
##$CPDPRG8= <mlev>
##$CPDPRGB= <>
##$CPDPRGT= <>
##$D= (0..63)
0 2 0 0 0 0 0 0 0 0.06 0 0.03 0 0 0 0 0.0002 0 0 0 0 0 0 0 0 0 0 0 0 0 
0 0 0 0 0 0 0 0 0 0 0 0 0 0 0 0 0 0 0 0 0 0 0 0 0 0 0 0 0 0 0 0 0 0 
##$DATE= 1731664916
##$DBL= (0..7)
120 120 120 120 120 120 120 120 
##$DBP= (0..7)
150 150 150 150 150 150 150 150 
##$DBP07= 0
##$DBPNAM0= <>
##$DBPNAM1= <>
##$DBPNAM2= <>
##$DBPNAM3= <>
##$DBPNAM4= <>
##$DBPNAM5= <>
##$DBPNAM6= <>
##$DBPNAM7= <>
##$DBPOAL= (0..7)
0.5 0.5 0.5 0.5 0.5 0.5 0.5 0.5 
##$DBPOFFS= (0..7)
0 0 0 0 0 0 0 0 
##$DE= 6
##$DECBNUC= <off>
##$DECIM= 32
##$DECNUC= <off>
##$DECSTAT= 4
##$DIGMOD= 1
##$DIGTYP= 9
##$DL= (0..7)
0 120 120 120 120 120 120 120 
##$DP= (0..7)
150 150 150 150 150 150 150 150 
##$DP07= 0
##$DPNAME0= <>
$$ [...]
##$SW= 21.9926040160658
##$SWIBOX= (0..15)
0 0 2 0 0 0 0 0 0 0 0 0 0 0 0 0 
##$SW_h= 4401.40845070422
##$TD= 16384
##$TD0= 1
##$TE= 300
##$TE2= 300
##$TE3= 300
##$TEG= 300
##$TL= (0..7)
0 120 120 120 120 120 120 120 
##$TP= (0..7)
150 150 150 150 150 150 150 150 
##$TP07= 0
##$TPNAME0= <>
##$TPNAME1= <>
##$TPNAME2= <>
##$TPNAME3= <>
##$TPNAME4= <>
##$TPNAME5= <>
##$TPNAME6= <>
##$TPNAME7= <>
##$TPOAL= (0..7)
0.5 0.5 0.5 0.5 0.5 0.5 0.5 0.5 
##$TPOFFS= (0..7)
0 0 0 0 0 0 0 0 
##$TUNHIN= 0
##$TUNHOUT= 0
##$TUNXOUT= 0
##$USERA1= <user>
##$USERA2= <user>
##$USERA3= <user>
##$USERA4= <user>
##$USERA5= <user>
##$V9= 5
##$VALIST= <valist>
##$VCLIST= <CCCCCCCCCCCCCCC>
##$VD= 0
##$VDLIST= <DDDDDDDDDDDDDDD>
##$VPLIST= <PPPPPPPPPPPPPPP>
##$VTLIST= <TTTTTTTTTTTTTTT>
##$WBST= 1024
##$WBSW= 25
##$XGAIN= (0..3)
0 0 0 0 
##$XL= 0
##$YL= 0
##$YMAX_a= 1573132
##$YMIN_a= -1023009
##$ZGOPTNS= <>
##$ZL1= 120
##$ZL2= 120
##$ZL3= 120
##$ZL4= 120
##$ABSF1= 10
##$ABSF2= 0
##$ABSG= 5
##$ABSL= 3
##$ALPHA= 0
##$AQORDER= 0
##$ASSFAC= 0
##$ASSFACI= 0
##$ASSFACX= 0
##$ASSWID= 0
##$AUNMP= <proc_1d>
##$AXLEFT= 0
##$AXRIGHT= 0
##$AXTYPE= 0
##$AXUNIT= <>
##$AZFE= 0.1
##$AZFW= 0.1
##$BCFW= 1
##$BC_mod= 2
##$BYTORDP= 1
##$COROFFS= 0
##$CY= 7568.61572265625
##$DATMOD= 1
##$DC= 2
##$DFILT= <>
##$DTYPP= 0
##$F1P= 17.9538593292236
##$F2P= -4.03888763876832
##$FCOR= 0.5
##$FTSIZE= 32768
##$FT_mod= 4
##$GAMMA= 1
##$GB= 1
##$INTBC= 1
##$INTSCL= 1
##$ISEN= 128
##$LB= 0.02
##$LEV0= 0
##$LPBIN= 0
##$MAXI= 945.577
##$MC2= 0
##$MEAN= 0
##$ME_mod= 0
##$MI= -402.1523
##$NCOEF= 0
##$NC_proc= 0
##$NLEV= 6
##$NOISF1= 8.587773
##$NOISF2= 6.764455
##$NSP= 1
##$NTH_PI= 0
##$NZP= 0
##$OFFSET= 17.49637
##$PC= 1
##$PHC0= 118.9324
##$PHC1= -1.002602
##$PH_mod= 0
##$PKNL= yes
##$PPARMOD= 0
##$PPDIAG= 0
##$PPIPTYP= 0
##$PPMPNUM= 100
##$PPRESOL= 1
##$PSCAL= 0
##$PSIGN= 0
##$REVERSE= no
##$SF= 200.13
##$SI= 32768
##$SIGF1= 18.5376
##$SIGF2= -6.396296
##$SINO= 400
##$SIOLD= 32768
##$SREGLST= <1H.CDCl3>
##$SSB= 3
##$STSI= 0
##$STSR= 0
##$SW_p= 4401.40845070422
##$SYMM= 0
##$S_DEV= 0
##$TDeff= 0
##$TDoff= 0
##$TI= <>
##$TILT= no
##$TM1= 0
##$TM2= 0
##$TOPLEV= 0
##$USERP1= <user>
##$USERP2= <user>
##$USERP3= <user>
##$USERP4= <user>
##$USERP5= <user>
##$WDW= 1
##$XDIM= 8192
##$YMAX_p= 0
##$YMIN_p= 0
$$ End of Bruker specific parameters
$$ ---------------------------------
##NTUPLES= NMR FID
##VAR_NAME=  TIME,          FID/REAL,        FID/IMAG
##SYMBOL=    X,             R,               I
##VAR_TYPE=  INDEPENDENT,   DEPENDENT,       DEPENDENT
##VAR_FORM=  AFFN,          ASDF,            ASDF
##VAR_DIM=   8192,          8192,            8192
##UNITS=     SECONDS,       ARBITRARY UNITS, ARBITRARY UNITS
##FACTOR=    0.0002272,     1,               1
##FIRST=     0,             0,               0
##LAST=      1.8609952,     -21,             -143
##MIN=       0,             -1023009,        -1023009
##MAX=       1.8609952,     1573132,         1573132
$$ Real data points
##PAGE= N=1
##DATA TABLE= (X++(R..R)), XYDATA
$$ plain form
0 0 0 0 0 0 0 0 0 0 0 0 0 0 0 0 64 -64 64 -64 65 -128 128 -192 192 -256 256 -320 384 -448 510 -576 640
31 640 -718 832 -956 1069 -1205 1345 -1507 1678 -1874 2092 -2322 2577 -2856 3157 -3490 3850
47 3850 -4244 4676 -5161 5678 -6256 6897 -7614 8406 -9312 10337 -11511 12878 -14498
60 -14498 16431 -18805 21801 -25712 31057 -38842 51292 -74390 132078 -585226 -637342 539169
72 539169 82661 -756400 -1023009 -452827 -274665 -481317 -547375 -66506 339774 422892
82 422892 287821 258253 204316 173510 220437 376014 401665 326658 254563 232618 107213
93 107213 -67046 -179263 -153584 -78684 -23841 -81836 -218572 -315065 -283199 -249290 -289754
104 -289754 -285751 -109102 72440 20729 -207667 -274322 -43742 237288 294995 204644 194126
$$ packed form
0@%%%%%%%%%%%%%%O4j28J28j28J29j93K56l20L84m48N12n76P04q32R58j086J216
31F40j358J550j788K025k274K550k852L185l552L966m414M899n433O013o647P340
47C850q094Q920r837J0839j1934J3153j4511J6020j7718J9649k1848K4389k7376
60a4498L0929l5236M0606m7513N6769o9899R0134j25682K06468p17304n2116J176511
72E39169m56508q39061k66609N70182J78162k06652o6058M80869M06280Q3118
82D22892j35071k9568n3937l0806M6927J55577K5651p5007p2095k1945j25405
93A07213j74259j12217K5679P4900N4843n7995j36736r6493L1866L3909m0464
104b89754M003J76649J81542n1711k28396o6655K30580K81030N7707r0351j0518
$$ plain form
115 194126 267646 265085 169962 101806 95315 96816 92103 62954 -46079 -203332 -265152 -183832
127 -183832 -99611 -140924 -233123 -210865 -55897 59579 5977 -110868 -97677 54398 172610
138 172610 155883 74713 35478 57738 93169 94937 62900 39398 46681 54115 20802 -47797
150 -47797 -101003 -92043 -23781 27195 114 -60937 -72883 -47360 -55818 -87769 -69438 6936
162 6936 68692 65325 15942 -27912 -26971 15435 52362 53075 36254 44791 78861 80271 7469 -85660
176 -85660 -96762 -22601 31065 7855 -29819 -29016 -24221 -42670 -53492 -40792 -24173 2655 61014
189 61014 105446 67119 -18045 -36877 29501 78691 45969 5418 35063 72509 25376 -60536
201 -60536 -77342 -37255 -24065 -35912 -21060 -6990 -43811 -84987 -60337 -8599 -8399 -30654
$$ packed form
115A94126P3520k561r5123o8156o491J501m713k9149j09033j57253o1820Q1320
127a83832Q4221m1313r2199K2258J54968J15476n3602j16845J3191J52075J18212
138A72610j6727q1170l9235K2260L5431J768l2037k3502P283P434l3313o8599
150d7797n3206Q960O8262N0976k7081o1051j1946K5523q458l1951J8331P6374
162F936O1756l367m9383m3854R41M2406L6927P13j6821Q537L4070J410p2802r3129
176h5660j1102P4161N3666k3210l7674Q03M795j8449j0822J2700J6619K6828N8359
189F1014M4432l8327q5164j8832O6378M9190l2722m0551K9645L7446m7133q5912
201f0536j6806M0087J3190j1847J4852J4070l6821m1176K4650N1738K00k2255
$$ plain form
213 -30654 6680 77014 77938 7279 -23068 32210 80749 56235 23168 41982 62732 27119
225 27119 -23010 -25476 -9974 -17962 -23576 -3224 -888 -48546 -90594 -68485 -19172 -11808 -35508
238 -35508 -26815 18036 29940 -12989 -44671 -15329 34953 53383 49240 49973 45866 26313 12643
251 12643 19295 27542 21894 17983 27947 26400 -10540 -58119 -68638 -39231 -19699 -34241 -49540
264 -49540 -35144 -14081 -20794 -38866 -32297 -1335 26880 40427 42554 36902 25597 18452 24725
277 24725 33864 28939 16839 16860 24674 10892 -25349 -44826 -25764 3679 5381 -13477 -25237
290 -25237 -23120 -20894 -23743 -23303 -14942 -2966 6678 9170 2027 -10815 -15970 -2271 21475 32134
304 32134 27635 23246 28851 28918 13179 -3990 -2612 13076 23183 14374 -6727 -23792 -31512 -31845
$$ packed form
213c0654L7334P0334R24p0659l0347N5278M8539k4514l3067J8814K0750l5613
225B7119n0129k466J5502p988n614K0352K336m7658m2048K2109M9313P364k3700
238c5508Q693M4851J1904m2929l1682K9342N0282J8430m143P33m107j9553j3670
251A2643O652Q247n648l911R964j547l6940m7579j0519K9407J9532j4542j5299
264d9540J4396K1063o713j8072O569L0962K8215J3547K127n652j1305p145O273
277B4725R139m925j2100K1P814j3782l6241j9477J9062K9443J702j8858j1760
290b5237K117K226k849M40Q361J1976R644K492p143j2842n155J3699K3746J0659
304C2134m499m389N605O7j5739j7169J378J5688J0107q809k1101j7065p720l33
$$ plain form
318 -31845 -31089 -25826 -16919 -6395 -659 -3668 -11688 -17070 -7553 13577 30592 30754 19290 12175
332 12175 12922 11833 3072 -4591 1744 13268 15179 -47 -16106 -22038 -17611 -8859 -1201 2835
346 2835 545 -2909 -4638 -7604 -14634 -17143 -5659 14113 20943 9439 -6924 -11654 -4474 2125
360 2125 6829 12592 20447 21435 13171 -123 -11205 -14587 -7144 5249 11744 3418 -11259 -19577
374 -19577 -20431 -20150 -21701 -14918 3014 19020 17609 2034 -10312 -7600 3191 14766 19826 20089
388 20089 16602 10485 3270 -5545 -13590 -12723 -1440 10936 10426 -3281 -16653 -17749 -11336 -8432
402 -8432 -8169 -2664 8566 12309 2794 -11680 -16287 -7052 6418 14902 14413 9243 4126 3077 1365
417 1365 -2119 -4199 2719 16603 22858 9925 -11475 -19658 -11620 -1318 -219 -4104 -2130 2310
$$ packed form
318c1845P56N263Q907J0524N736l009q020n382R517K1130J7015J62j1464p115
332A2175P47j089q761p663O335J1524J911j5226j6059n932M427Q752P658M036
346B835k290l454j729k966p030k509J1484J9772O830j1504j6363m730P180O599
360B125M704N763P855R88q264j3294j1082l382P443J2393O495q326j4677q318
374a9577q54K81j551O783J7932J6006j411j5575j2346K712J0791J1575N060K63
388B0089l487o117p215q815q045Q67J1283J2376n10j3707j3372j096O413K904
402h432K63N505J1230L743r515j4474m607R235J3470Q484m89n170n117j049j712
417A365l484k080O918J3884O255j2933k1400q183Q038J0302J099l885J974M440
$$ plain form
431 2310 -976 -11534 -19931 -15392 -3122 10569 16668 12300 2955 -1352 1180 4512 1883 683
445 683 9237 20481 17786 245 -16548 -16739 -4382 3505 1171 -2904 -1800 1175 -2314 -10085 -14523
460 -14523 -9804 1402 10469 9893 356 -7602 -6100 1565 4308 689 -418 6789 14198 8227 -5963
475 -5963 -12604 -3842 8307 8802 -90 -5402 -2544 -500 -5381 -10578 -10184 -3129 4704 8138 2685
490 2685 -7502 -12035 -3776 7413 8497 1619 1144 8617 11219 257 -11533 -9637 3602 11291
504 11291 6263 -2490 -4926 -4373 -4720 -5548 -5681 -2949 1852 6660 5845 -3299 -12093 -10106 2693 10178
520 10178 4947 -2659 92 7696 6348 -3939 -8925 -632 11767 12205 2097 -6575 -6240 -2148 -71
535 -71 -705 -2287 -2120 -1836 -602 -1959 -8074 -10387 -2610 11121 13641 969 -8714 -2735 7231 6100
$$ packed form
431B310l286j0558q397M539J2270J3691O099m368r345m307K532L332k629j200
445F83Q554J1244k695j7541j6793j91J2357P887k334m075J104K975l489p771m438
460a4523M719J1206R067n76r537p958J502P665K743l619j107P207P409n971j4190
475e963o641Q762J2149M95q892n312K858K044m881n197L94P055P833L434n453
490B685j0187m533Q259J1189J084o878m75P473K602j0962j1790J896J3239P689
504A1291n028q753k436N53l47q28j33K732M801M808q15r144q794J987J2799P485
520A0178n231p606K751P604j348j0287m986Q293J2399M38j0108q672L35M092K077
535g1o34j582J67K84J234j357o115k313P777J3731K520j2672r683N979R966j131
$$ plain form
551 6100 -2041 -289 10030 12279 1503 -8105 -7962 -3119 178 2431 5589 1827 -4980 -6011 -764
566 -764 -581 -7797 -7666 5381 13113 2648 -12085 -9131 3391 6309 -1078 -2946 4313 8522 3803
581 3803 -876 -709 124 552 4272 7939 2779 -7331 -8548 844 5164 -3163 -10231 -5539 3617 1170
597 1170 -7405 -9521 -844 6903 5459 77 -2180 187 2699 2727 2965 2922 2807 2209 3026 1831 -2640
614 -2640 -6629 -2944 5077 6347 -1631 -8127 -2353 5542 1582 -8173 -8323 1601 4287 -2620 -6997
629 -6997 -1722 2879 746 -1610 1023 2587 7 793 8075 9620 -299 -6618 448 7731 743
644 743 -8900 -5023 7095 6923 -4903 -11010 -4819 -81 -2266 -2149 2387 3859 -533 -3227 -492
659 -492 145 -2430 -1222 7785 13479 4798 -5571 -5677 2029 3851 -1251 -1565 3887 6952 214 -9233
$$ packed form
551F100q141J752J0319K249j0776r608J43M843L297K253L158l762o807j031N247
566g64J83p216J31J3047P732j0465j4733K954J2522K918p387j868P259M209m719
581C803m679J67Q33M28L720L667n160j0110j217R392M320q327p068M692R156k447
597A170q575k116Q677P747j444n382k257K367K512K8K38m3j15n98Q17j195m471
614b640l989L685Q021J270p978o496N774P895l960r755j50R924K686o907m377
629f997N275M601k133k356K633J564k580P86P282J545r919o319P066P283o988
644G43r643L877J2118j72j1826o107O191M738k185J17M536J472m392k694K735
659d92O37k575J208R007N694q681j0369j06P706J822n102l14N452L065o738r447
$$ plain form
675 -9233 -10473 -3618 1192 1643 1606 1287 -1495 -5289 -5770 -2036 1136 1111 2983 7959 6590 -2266 -9128
692 -9128 -2901 9010 9666 1621 -1262 3869 4133 -5117 -9954 -2126 4993 3585 -2003 -1656 -1991 -6630
708 -6630 -8451 -841 5679 1872 -3872 -1096 4541 -112 -7936 -3646 9380 14102 3370 -4325 -308
723 -308 3133 -778 -4118 1248 6854 2013 -4437 -5254 -3858 -7009 -7435 467 8932 3966 -6237 -7194
739 -7194 227 2473 -2206 -2476 6036 10236 4684 -3313 -2890 948 1983 -77 1935 5586 2979 -2589
755 -2589 -3958 -750 -2256 -4927 -2812 3514 3588 -3311 -7660 -2517 1595 -794 -4111 -882 4788 3702
771 3702 -1237 -1703 2608 4794 2482 1344 3167 2826 568 25 1956 1843 -3010 -6317 -2526 1080
787 1080 -2279 -6077 -4240 1068 2178 -3074 -4585 -735 3329 2411 1295 2788 2749 668 -470 2001
$$ packed form
675i233j240O855M810M51l7l19k782l794m81L734L172k5J872M976j369q856o862
692i128O227J1911O56q045k883N131K64r250m837P828P119j408n588L47l35m639
708f630j821P610O520l807n744K776N637m653p824M290J3026M722j0732p695M017
723c08L441l911l340N366N606m841o450q17J396l151m26P902Q465m966j0203r57
739g194P421K246m679k70Q512M200n552p997M23L838J035k060K012L651k607n568
755b589j369L208j506k671K115O326P4o899m349N143M112k389l317L229N670j086
771C702m939m66M311K186k312j138J823l41k258n43J931j13m853l307L791L606
787A080l359l798J837N308J110n252j511L850M064r18j116J493l9k081j138K471
$$ plain form
803 2001 4149 1438 -941 892 2975 -156 -3829 -4139 274 1631 -1345 -2712 -1334 -919 -2763 -3787
819 -3787 -858 1793 806 -1002 -1148 -218 701 106 1837 4407 4360 2253 1515 2002 1175 -927 -949 1530
837 1530 3704 1067 -3923 -4917 -3261 -2400 -2047 -2098 -317 1033 -29 -825 -1292 -1436 -806 2406 5214
854 5214 5947 2597 -952 -443 1890 1557 75 -546 2040 2051 -890 -3575 -4192 -2579 -1534 -159 663
871 663 -5 -1748 -3239 -2734 -1037 281 634 1742 3190 1800 -293 -708 1123 2114 2620 2611 2416 1781
889 1781 327 -1491 -2466 -1119 -371 -20 -828 -2281 -2425 -3453 -3422 -1850 -1042 -63 745 2179 2188 126
907 126 -894 399 2897 3719 2179 1275 1156 1270 499 -656 -1198 -672 -53 -111 -534 -1522 -3440 -2640 -1095
926 -1095 -189 -651 -1214 -828 170 -344 -780 -510 985 1900 2575 2461 1471 1042 110 1025 1112 1147 1000 565
$$ packed form
803B001K148k711k379J833K083l131l673l10M413J357k976j367J378M15j844j024
819c787K929K651r87j808j46R30R19n95J731K570m7k107p38M87q27k102k2K479
837A530K174k637m990r94J656Q61L53n1J781J350j062p96m67j44O30L212K808
854E214P33l350l549N09K333l33j482o21K586J1k941k685o17J613J045J375Q22
871F63o68j743j491N05J697J318L53J108J448j390k093m15J831R91N06rj95o35
889A781j454j818r75J347P48L51q08j453j44j028L1J572Q08R79Q08J434Rk062
907A26j020J293K498Q22j540r04j19J14p71j155n42N26O19n8m23r88j918Q00J545
926a095R06m62n63L86R98n14m36K70J495R15O75j14r90m29r32R15Q7L5j47m35
$$ plain form
946 565 308 -1201 -2386 -2316 -1671 -1425 -1358 -1602 -1772 -135 -273 -552 -1005 -247 1164 2185 2251 1137 503
965 503 285 1436 1700 1458 942 1191 732 133 -1179 -1892 -1597 -1228 -172 -359 -1089 -1416 -1852 -802 -819
984 -819 -611 -504 397 984 1263 569 453 1295 1593 1506 1017 973 1412 1140 -13 -148 -1017 -288 -74 -73 -454
1005 -454 -1568 -2623 -1536 -668 -831 -747 -434 403 750 168 -680 -131 613 1609 1372 1053 793 866 1095 546
1025 546 25 -700 -25 -18 537 -375 -2193 -2239 -1638 -951 -1227 -1104 -715 83 -347 14 -93 30 446 1509
1045 1509 1642 1408 1218 677 831 783 405 -27 792 356 209 -661 -1400 -1197 -644 -1018 -1192 -668 -181 -695
1065 -695 -1467 -1242 -709 -132 876 1292 599 626 644 1062 1523 1369 618 838 1612 445 82 -1001 -747 -899
1085 -899 -961 -893 -1132 -1410 -1610 -1808 -1130 -936 -779 -329 797 1198 491 -91 299 1252 1081 1212 1494 1486 892
$$ packed form
946E65k57j509j185P0O45K46O7k44j70J637j38k79m53P58J411J021O6j114o34
965E03k18J151K64k42n16K49m59n99j312p13K95L69J056j87p30l27m36J050j7
984h19K08J07R01N87K79o94j16Q42K98q7m89m4M39k72j153j35q69P29K14Jl81
1005d54j114j055J087Q68j63Q4L13Q37L47n82q48N49P44R96k37l19k60P3K29n49
1025E46n21p25O75PN55r12j818m6O01O87k76J23L89P98m30L61j07J23M16J063
1045A509J33k34j90n41J54m8l78m32Q19m36j47q70p39K03N53l74j74N24M87n14
1065f95p72K25N33N77J008M16o93K7J8M18M61j54p51K20P74j167l63j083K54j52
1085h99o2O8k39k78k00j98O78J94J57M50J126M01p07n82L90R53j71J31K82qn94
$$ plain form
1106 892 308 -676 -149 522 -326 -177 257 -66 -1383 -1725 -646 -291 -1042 -1436 -165 80 -492 -1600 -994
1125 -994 803 1174 713 1193 2059 2097 398 154 917 1209 861 162 1294 322 -1559 -2461 -1726 -101 -577
1144 -577 -1550 -837 -125 -188 -1580 -1117 421 1592 1276 1189 1119 856 99 -93 1462 1929 1508 548 336 1065
1164 1065 -868 -1330 -894 748 1472 -528 -1215 -1169 -404 -1315 -1710 -560 705 219 -96 -427 26 372
1182 372 -644 684 2463 2336 436 -622 420 1734 623 -368 538 1442 114 -1901 -2202 -722
1198 -722 -347 -1258 -889 -409 -439 -1150 -1194 547 1384 284 507 1521 2084 303 -1149 163 1810 1419
1216 1419 190 -421 484 696 -1240 -1463 276 894 274 -1283 -741 -61 -894 -1501 -283 1645 708 -512
1234 -512 -429 522 846 -1079 -251 1705 2848 605 -1054 100 1298 312 -86 331 1021 76 -1249 -1508
$$ packed form
1106H92n84r84N27O71q48J49M34l23j317l42J079L55p51l94J271K45n72j108O06
1125i94J797L71m61M80Q66L8j699k44P63K92l48o99J132r72j881r02P35J625m76
1144e77r73P13P12o3j392M63J538J171l16q7p0k63p57j92J555M67m21r60k12P29
1164A065j933m62M36J642P24k000o87M6P65r11l95J150J265m86l15l31M53L46
1182C72j016J328J779j27j900j058J042J314j111r91R06R04j328k015l01J480
1198g22L75r11L69M80l0p11m4J741Q37j100K23J014N63j781j452J312J647l91
1216A419j229o11R05K12j936k23J739O18o20j557N42O80q33o07J218J928r37j220
1234e12Q3R51L24j925Q28J956J143k243j659J154J198r86l98M17O90r45j325k59
$$ plain form
1252 -1508 -638 -594 -1560 -895 492 654 -1875 -2084 189 1738 1681 165 1392 2308 638 -1181 0
1269 0 1669 2035 550 -501 355 -251 -2160 -1727 376 1198 -45 -1461 -116 52 -1264 -2196 -34
1286 -34 2193 1919 -697 -648 497 377 -563 -615 1363 2300 656 -1255 -228 623 -241 -770 709 1767
1304 1767 531 -1444 -1882 -180 -461 -1522 -1102 1436 1541 -444 -2727 -966 1228 1124 78 776
1320 776 2288 840 -571 204 1218 1021 259 -70 827 502 -1953 -2848 -598 661 -253 -1048 -269 375
1338 375 -417 -1852 -1248 1381 1265 713 -297 811 436 -791 -1169 1395 1844 179 -520 545 1093
1355 1093 -276 -998 -147 2047 1072 -770 -1592 -226 -293 -1653 -1857 194 503 -184 -883 -518 357 -81
1373 -81 -620 1094 2309 1261 -224 -153 1130 1044 -75 -753 682 1016 -794 -1842 -812 500 -445
$$ packed form
1252a508Q70M4r66O65J387J62k529k09K273J549n7j516J227R16j670j819J181
1269@J669L66j485j051Q56o06j909M33K103Q22j243j416J345J68j316r32K162
1286c4K227k74k616M9J145j20r40n2J978R37j644j911J027Q51q64n29J479J058
1304A767j236j975m38J702k81j061M20K538J05j985k283J761K194j04j046O98
1320G76J512j448j411P75J014j97p62l29Q97l25k455q95K250J259r14p95P79O44
1338C75p92j435O04K629j16n52j010J108l75j227l78K564M49j665o99J065N48
1355A093j369p22Q51K194r75j842q22J366o7j360k04K051L09o87o99L65Q75m38
1373h1n39J714J215j048j485P1J283q6j119o78J435L34j810j048J030J312r45
$$ plain form
1390 -445 -795 -980 147 -332 -1186 -244 1224 1143 -563 -253 1003 1094 -257 -393 410 1647 831 -412
1408 -412 -58 770 -177 -373 369 376 277 -521 -1386 -389 46 -745 -776 506 219 -920 -1409 -13 997 606
1428 606 -74 889 1389 842 -548 -855 883 915 316 22 276 -188 -968 -990 -430 -101 -649 -686 -134 -180 -375
1449 -375 -1129 -792 628 723 244 283 466 1104 -216 -40 629 1073 1019 333 -60 166 -413 -928 -464 343
1469 343 24 -157 -332 -783 -690 -831 -458 430 1130 36 -534 -1009 32 181 -243 402 621 675 34 312
1489 312 -227 -301 356 60 557 606 -552 -1240 -259 -377 -153 -367 -354 180 -136 -580 -658 -642 412 417 674 734
1511 734 587 410 422 556 579 224 278 216 -209 -7 -1143 -761 -486 -375 -639 91 -541 -90 -222 -872 -385
1532 -385 376 170 469 -194 -305 -27 43 103 154 209 -205 -95 812 537 -360 -310 -35 447 427 -9 -100 -588
$$ packed form
1390d45l50j85J127m79q54R42J468q1j706L10J256R1j351j36Q03J237q16j243
1408d12L54Q28r47j96P42Pr9p98q65R97M35p91l1J282k87j139m89J396J010l91
1428F06o80R63N00n47j390l07J738L2n99k94K54m64p80k2N60L29n48l7N52m6j95
1449c75p54L37J420R5m79L9J83O38j320J76O69M44n4o86l93K26n79n15M64Q07
1469C43l19j81j75m51R3j41L73Q88P00j094n70m75J041J49m24O45K19N4o41K78
1489C12n39p4O57k96M97M9j158o88R81j18K24k14J3N34l16m44p8J6J054NK57O0
1511G34j47j77J2J34K3l55N4o2m25K02j136L82K75J11k64P30o32M51j32o50M87
1532c85P61k06K99o63j11K78P0O0N1N5m14J10R07k75q97N0K75M82k0m36r1m88
$$ plain form
1554 -588 -541 -20 -488 -456 -144 274 63 -532 -283 310 431 218 492 1013 337 786 163 246 -420 29 60
1575 60 424 -249 -556 -488 -675 -348 -204 -466 -562 186 18 -32 -484 181 -63 390 731 467 378 230 139 575
1597 575 116 244 73 404 570 -441 -584 121 232 -604 -320 -589 -333 -291 -133 -515 -31 -563 -356 356
1617 356 165 179 -199 635 415 475 63 135 601 1312 453 33 -175 -286 -153 -148 -150 17 -308 -687 -87 -371
1639 -371 -310 -568 -7 476 588 -320 42 -358 36 123 109 -123 897 590 -102 -94 -212 79 -259 530 75
1660 75 -11 255 149 -129 -695 -468 -75 62 -31 -223 -414 160 144 -251 -138 651 578 695 322 499 -74 160
1682 160 -12 -210 271 388 -694 -451 109 -338 -431 -31 -255 -638 -229 -95 -395 -102 -142 -117 63 -130 573
1703 573 -30 46 136 -29 -99 497 234 131 45 -434 -313 -139 -14 -362 -275 525 -132 -154 -694 -134 -475 88
$$ packed form
1554e88M7N21m68L2L12M18k11n95K49N93J21k13K74N21o76M49o23Q3o66M49L1
1575F0L64o73l07O8j87L27J44k62r6P48j68n0m52O65k44M53L41k64q9j48r1M36
1597E75m59J28j71L31J66j011j43P05J11q36K84k69K56M2J58l82M84n32K07P12
1617C56j91J4l78Q34k20O0m12P2M66P11q59m20k08j11J33NkJ67l25l79O00k84
1639c71O1k58N61M83J12r08L62m00L94Q7j4k32J020l07o92Qj18K91l38P89m55
1660G5q6K66j06k78n66K27L93J37r3j92j91N74j6l95J13P89p3J17l73J77n73K34
1682A60j72j98M81J17j082K43N60m47r3M00k24l83M09J34l00K93m0K5J80j93P03
1703E73o03P6R0j65p0N96k63j03q6m79J21J74J25l48Q7Q00o57k2n40N60l41N63
$$ plain form
1725 88 -458 267 243 186 -74 -162 33 -131 279 50 821 321 -107 -328 600 143 -327 70 -254 118 -392
1746 -392 -398 -41 -210 45 -325 209 297 -290 -253 111 213 117 -84 534 1057 362 -429 -609 73 420 75 -71
1768 -71 232 -122 -328 -558 -295 -335 -347 -119 -112 413 -257 -515 -253 242 333 544 -222 -291 -143 170 162 -275 -100
1791 -100 362 84 -381 -141 -29 -269 -141 350 403 -216 -474 -48 124 -633 -602 13 279 -330 -215 -152 52
1812 52 180 -214 -326 567 757 -38 -51 -30 417 71 125 194 104 5 -277 -421 252 -110 -384 -74 357 273 -183
1835 -183 -201 165 169 216 -98 338 133 249 -391 211 170 200 -71 114 153 79 -184 -736 -135 -261 -590 -442 -217
1858 -217 0 24 -693 -449 257 124 -104 -368 232 270 132 353 373 670 -465 -125 -60 335 -266 -92 -73
1879 -73 445 -303 -168 -223 168 -24 -421 -233 -63 -158 -173 -396 567 616 485 260 -111 129 -29 -176 -434 286
$$ packed form
1725H8n46P25k4n7k60q8J95j64M10k29P71n00m28k21R28m57m70L97l24L72n10
1746c92oL57j69K55l70N34Q8n87L7L64J02r6k01O18N23o95p91j80O82L47l45j46
1768g1L03l54k06k30K63m0j2K28PN25o70k58K62M95R1K11p66o9J48L13qm37J75
1791a00M62k78m65K40J12k40J28M91N3o19k58M26J72p57L1O15K66o09J15O3K04
1812E2J28l94j12Q93J90p95j3K1M47l46N4O9r0r9k82j44O73l62k74L10M31q4m56
1835a83j8L66MM7l14M36k05J16o40O02m1L0k71J85L9p4k63n52O01j26l29J48K25
1858b17K17K4p17K44P06j33k28k64O00L8j38K21K0K97j135L40O5L95o01J74J9
1879g3N18p48J35n5L91j92l97J88J70r5j5k23R63M9j31k25l71K40j58j47k58P20
$$ plain form
1901 286 181 105 3 22 -22 -210 -606 -347 -266 -74 -72 276 -104 25 -252 -88 22 293 31 406 -105 430
1923 430 270 -53 318 410 198 -121 -203 -302 117 -365 196 613 209 -92 -478 -64 87 9 228 117 332
1944 332 -444 -440 -176 -271 99 251 -198 537 -190 -600 -281 3 440 -48 -127 337 -103 -256 -286 -401 656
1965 656 381 26 101 -193 -562 -415 -266 565 229 693 -296 227 502 -41 192 -170 970 34 -44 -29 384
1986 384 -348 -651 344 469 243 -392 -416 -301 437 -507 -18 23 148 43 -222 -499 -107 225 -104 199 39
2007 39 240 -34 -118 184 160 -218 124 149 -46 110 -158 -602 -169 -294 31 -61 295 396 -248 -240 265 -101
2029 -101 -230 -64 360 211 147 149 173 296 333 109 96 -378 104 -420 96 272 283 -23 120 337 53 -235
2051 -235 -586 -195 110 -107 234 -2 -256 306 -330 20 104 490 96 -104 -669 -177 -18 153 487 156
$$ packed form
1901B86j05p6j02J9m4j88l96K59Q1J92KL48l80J29k77J64J10K71k62L75n11N35
1923D30j60l23L71R2k12l19q2r9M19m82N61M17m04l01l86M14J51p8K19j11K15
1944C32p76MK64r5L70J52m49P35p27m10L19K84M37m88p9M64m40j53l0j15J057
1965F56k75l55P5k94l69J47J49Q31l36M64r89N23K75n43K33l62J140r36p8J5M13
1986C84p32l03R95J25k26o35k4J15P38r44M89M1J25j05k65k77L92L32l29L03j60
2007C9K01k74q4L02k4l78L42K5j95J56k68m44M33j25L25r2L56J01o44QN05l66
2029a01j29J66M24j49o4KK4J23L7k24j3m74M82n24N16J76J1l06J43K17k84k88
2051b35l51L91L05k17L41k36k54N62o36L50Q4L86l94k00n65M92J59J71L34l31
$$ plain form
2071 156 121 -252 -482 -135 105 -225 402 -1 -167 -279 -125 -578 -148 -102 -23 527 67 227 -231 7 507
2092 507 -351 -277 238 -160 179 -80 153 377 -185 238 -283 -140 -162 -158 -279 -183 161 84 -101 62 29 330
2114 330 -505 464 113 343 130 -360 -329 767 321 -165 120 171 -30 -340 185 -131 -18 31 210 -67 -14
2135 -14 -304 -119 -277 474 650 267 62 276 101 -31 -36 404 333 474 -374 -283 -193 193 -448 -384 83 267
2157 267 1 -215 -112 -442 -241 -469 685 275 -163 18 344 -480 112 -90 34 296 -262 433 16 329
2177 329 -92 -61 -476 306 70 -101 -81 127 2 -391 -573 69 -190 -303 -228 -163 66 33 153 141 159 -73
2199 -73 -57 154 16 -499 -159 279 86 267 164 -72 343 -339 -316 59 -12 -156 -525 68 -88 -309 -4
2220 -4 79 115 218 197 412 -478 216 -189 594 120 314 -7 -82 368 304 -134 -209 -215 -319 287 139 257 -258
$$ packed form
2071A56l5l73k30L47K40l30O27m03j66j12J54m53M30M6P9N50m60J60m58K38N00
2092E07q58P4N15l98L39k59K33K24n62M23n21J43k2Mj21R6L44p7j85J63l3L01
2114C30q35R69l51K30k13m90L1J096m46m86K85N1k01l10N25l16J13M9J79k77N3
2135a4k90J85j58P51J76l83k05K14j75j32nM40p1J41q48R1R0L86o41O4M67J84
2157B67k66k16J03l30K01k28J154m10m38J81L26q24N92k02J24K62n58O95m17L13
2177C29m21L1m15P82k36j71K0K08j25l93j82O42k59j13P5O5K29l3J20j2J8k32
2199g3J6K11j38n15L40M38j93J81j03k36M15o82K3L75p1j44l69N93j56k21L05
2220dQ3L6J03k1K15q90O94m05P83m74J94l21p5M50o4m38p5oj04O06j48J18n15
$$ plain form
2243 -258 27 -34 369 370 10 -301 2 -15 183 262 577 191 -458 45 48 106 28 137 544 162 -189 -565 201
2266 201 -379 213 305 61 -9 -212 -5 -284 -544 -40 -137 -47 -203 -3 -193 98 -22 321 -317 226 233 -341
2288 -341 230 -23 -109 141 -64 430 -218 -85 -144 -242 415 198 96 24 -169 228 466 -95 -135 3 70 198
2310 198 -43 -277 259 -173 -133 -59 -43 248 -13 -176 364 6 -381 -82 -145 235 -288 -161 443 -524 136
2331 136 -19 362 -17 -95 -52 -103 66 18 -225 3 -355 -106 -469 -100 204 105 -69 25 43 -21 571 -111 -224
2354 -224 282 -103 -332 -317 209 -6 119 84 40 56 34 5 -86 218 875 21 -53 -214 -26 49 671 355 29
2377 29 203 -10 407 -196 -181 575 -21 -2 -495 147 -311 154 -93 -107 35 51 320 -28 65 -27 -62 695 -101
2400 -101 542 -80 -93 -35 -176 -2 -256 -129 70 -18 57 -22 -321 413 239 334 120 -113 -165 -29 154 -22
$$ packed form
2243b58K85o1M03Jl60l11L03j7J98P9L15l86o49N03LN8p8J09M07l82l51l76P66
2266B01n80N92R2k44p0k03K07k79k60N04r7R0j56K00j90K91j20L43o38N43Pn74
2288c41N71k53q6K50k05M94o48J33n9r8O57k17j02p2j93L97K38n61m0J38O7J28
2310A98k41k34N36m32M0P4J6K91k61j63N40l58l87K99o3L80n23J27O04r67O60
2331A36j55L81l79p8M3n1J69m8k43K28l58K49l63L69L04r9j74R4J8o4N92o82j13
2354b24N06l85k29J5N26k15J25l5m4J6k2k9r1L04O57q54p4j61J88P5O22l16l26
2377B9J74k13M17o03J5P56n96J9m93O42m58M65k47j4J42J6K69l48R3r2l5P57p96
2400a01O43o22j3N8j41J74k54J27J99q8P5p9k99P34j74R5k14k33n2J36J83j76
$$ plain form
2422 -22 -251 -11 28 -394 329 5 32 -86 79 -197 45 14 216 -46 48 304 -386 511 34 -106 -191 130
2444 130 64 132 609 -161 174 -288 -148 -125 -16 -327 -18 142 231 -36 -226 197 175 299 -12 -467 232 387
2466 387 30 -4 -36 123 -189 -332 245 156 -170 255 -108 -25 -166 -31 58 272 -355 -57 1 362 177 -9
2488 -9 -119 43 -349 348 166 212 41 -229 67 251 403 -148 -184 -323 -82 -743 -54 12 -189 -56 -701 470
2510 470 -171 -18 289 -107 283 -319 -26 -289 21 134 -195 42 55 421 91 406 -201 -110 402 487 -209
2531 -209 10 243 155 -477 124 69 -125 -334 -30 -56 29 164 -102 -203 -49 -399 48 336 -310 -208 -97
2552 -97 -389 64 -137 -197 33 -86 297 72 175 131 101 7 -79 -221 544 -170 -239 -206 -34 594 -61 -72 209
2575 209 176 186 -145 325 -267 -611 200 -138 -307 30 456 124 -207 -400 71 101 147 -154 190 231 180 360
$$ packed form
2422b2k29K40L9m22P23l24K7j18J65k76K42l1K02k62R4K56o90Q97m77j40q5L21
2444A30o6O8M77p70L35m62J40K3J09l11L09J60Q9k67j90M23k2J24l11m55O99J55
2466C87l57l4l2J59l12j43N77q9l26M25l63Q3j41J35Q9K14o27K98N8L61j85j86
2488ij10J62l92O97j82M6j71k70K96J84J52n51l6j39K41o61O89O6k01J33o45J171
2510D70o41J53L07l96L90o02K93k63L10J13l29K37J3L66l30L15o07R1N12Q5o96
2531b09K19K33q8o32O01n5j94k09L04k6Q5J35k66j01J54l50M47K88o46J02J11
2552i7k92M53k01o0K30j19L83k25J03m4l0r4q6j42P65p14o9L3J72O28o55j1K81
2575B09l3J0l31M70n92l44Q11l38j69L37M26l32l31j93M71L0M6l01L44M1n1J80
$$ plain form
2597 360 261 147 74 589 -128 215 -73 3 250 -38 136 -167 -150 -61 -71 255 121 181 -23 -180 -89 22 367
2620 367 -45 304 191 329 149 398 493 188 -146 -44 -492 99 559 -456 127 -94 -50 -507 -3 -47 11
2641 11 293 618 -371 -106 -113 99 -435 86 239 273 230 -72 -83 207 122 -309 -275 -133 -58 202 299 -353 -141
2664 -141 96 -69 115 -351 104 493 -302 -175 -282 -128 -238 41 -469 147 67 218 242 113 -224 135 -121
2685 -121 -484 -218 232 581 -58 132 174 201 -169 -21 124 272 -138 -144 -295 -176 19 179 51 -329 -42
2706 -42 48 -97 251 425 370 99 434 -59 -61 -48 188 292 -371 149 101 -363 -300 -164 -196 -80 560 79 514
2729 514 212 -265 219 -438 241 227 -100 -360 -312 237 -194 163 -112 297 142 -369 508 53 302 184 650
2750 650 207 -384 323 -160 4 -90 337 -137 -186 -231 52 437 387 259 56 293 -147 -308 179 -170 -174 430
$$ packed form
2597C60r9j14p3N15p17L43k88P6K47k88J74l03J7Q9j0L26j34O0k04j57R1J11L45
2620C67m12L49j13J38j80K49R5l05l34J02m48N91M60j015N83k21M4m57N04m4N8
2641A1K82L25r89K65pK12n34N21J53L4m3l02j1K90q5m31L4J42P5K60R7o52K12
2664a41K37j65J84m66M55L89p95J27j07J54j10K79n10O16q0J51K4j29l37L59k56
2685a21l63K66M50L49o39J90M2K7l70J48J45J48m10oj51J19J95J60j28l80K87
2706d2R0j45L48J74n5k71L35m93kJ3K36J04o63N20m8m64O3J36l2J16O40m81M35
2729E14l02m77M84o57O79j4l27k60M8N49m31L57k75M09j55n11Q77m55K49j18M66
2750F50m43n91P07m83J64r4M27m74m9m5K83L85n0j28k03K37m40j61M87l49mO04
$$ plain form
2772 430 126 28 216 227 584 -316 -282 -355 158 -286 -568 -62 -161 -74 -102 -283 -44 423 -32 96 -437 35
2794 35 -30 248 161 154 215 143 -218 367 63 -155 25 356 373 64 435 -108 138 -111 222 -452 149 415 333
2817 333 -201 250 -128 505 372 181 215 -57 -156 75 -353 -210 112 44 59 -25 -111 44 91 261 -78 208
2839 208 -324 166 96 11 240 179 425 140 -295 112 -82 100 -111 -241 505 19 -48 -502 278 -207 -201 -69
2861 -69 342 -290 -70 59 342 136 -1 -33 -467 142 166 482 -279 -550 -799 228 -125 -208 -124 -202 -560 295
2883 295 -502 606 136 231 264 1 -39 43 101 -269 -485 150 567 14 75 186 -80 -461 277 -14 84 -352
2905 -352 -9 325 114 574 -8 -8 -376 155 -190 -210 300 -170 -17 -157 -128 207 155 311 -82 43 59 51 -32
2928 -32 284 237 34 287 -314 -342 322 278 -214 -248 332 -120 -302 64 488 192 -306 205 -629 -167 -235 -123
$$ packed form
2772D30l04r8J88J1L57r00L4p3N13m44k82N06r9Q7k8j81K39M67m55J28n33M72
2794C5o5K78q7pO1p2l61N85l04k18J80L31J7l09L71n43K46k49L33o74O01K66q2
2817C33n34M51l78O33j33j91L4k72r9K31m28J43L22o8J5q4q6J55M7J70l39K86
2839B08n32M90p0q5K29o1K46k85m35M07j94J82k11j30P46m86o7m54P80m85OJ32
2861f9M11o32K20J29K83k06j37l2m34O09K4L16p61k71k49J027l53q3Q4p8l58Q55
2883B95p97J108m70R5L3k63m0Q2N8l70k16O35M17n53O1J11k66l81P38k91R8m36
2905c52L43L34k11M60n82%l68N31l45k0N10m70J53j40K9L35n2J56l93J25J6qq3
2928c2L16m7k03K53o01k8O64m4m92l4N80m52j82L66M24k96m98N11q34M62o8J12
$$ plain form
2950 -123 -213 -245 -188 -43 441 236 231 148 270 178 235 -227 -100 290 227 -212 159 -226 -98 -101 208 -153 -174 -195
2974 -195 -295 166 -120 102 -677 176 -34 9 -145 113 -594 396 -328 -166 0 -139 245 -56 246 -225
2994 -225 -107 42 -288 -12 -288 -245 -5 122 -139 -313 314 371 495 117 -199 488 547 -124 159 115 154 336
3016 336 -72 -92 68 247 -227 13 -381 283 126 -174 -352 65 289 -471 142 159 -75 205 41 -598 -284
3037 -284 155 229 -269 340 -181 -113 546 -342 132 544 248 51 -184 -34 93 -97 281 96 101 -195 -363
3058 -363 -262 -70 164 -266 457 30 133 -191 142 -55 136 305 18 -207 -63 280 -327 -215 -197 663
3078 663 64 110 -83 53 -162 -332 145 -405 -254 -426 -3 -63 -158 -527 39 477 107 -92 -3 -342 -231
3099 -231 -44 329 142 -372 18 -214 291 333 214 263 -143 337 -540 161 22 268 537 187 198 270 -27
$$ packed form
2950a23r0l2N7J45M84k05nq3J22r2N7m62J27L90o3m39L71l85J28lL09l61k1k1
2974a95j00M61k86K22p79Q53k10M3j54K58p07R90p24J62J66j39L84l01L02m71
2994b25J18J49l30K76k76M3K40J27k61j74O27N7J24l78l16O87N9o71K83m4L9J82
3016C36m08k0J60J79m74K40l94O64j57l00j78M17K24p60O13J7k34K80j64o39L14
3037b84M39P4m98O09n21O8O59q88M74M12k96j97k35J50J27j90L78j85Nk96j68
3058c63J01J92K34m30P23m27J03l24L33j97J91J69k87k25J44L43o07J12J8Q60
3078F63n99M6j93J36k15j70M77n50J51j72M23o0r5l69N66M38l70j99Q9l39J11
3099b31J87L73j87n14L90k32N05M2j19M9m06M80q77P01j39K46K69l50J1P2k97
$$ plain form
3120 -27 387 -20 -294 39 -15 192 613 -41 -280 -328 -132 -39 579 -248 251 -168 135 -75 60 295 110
3141 110 341 -94 92 85 140 135 187 32 7 -147 418 -337 71 22 -197 -358 361 -33 -321 194 107 502 -200
3164 -200 -32 -233 299 -71 161 139 -56 166 -285 42 -339 401 -456 -153 489 -13 -159 37 -117 -258
3184 -258 68 317 -120 133 32 -23 24 106 -1 -130 249 -50 25 115 92 618 -461 -758 16 267 -119 150
3206 150 85 504 -48 451 -185 159 -30 -94 -326 252 -176 78 -119 118 -96 -10 91 -406 46 -33 253
3227 253 83 168 337 81 108 -289 -536 105 -92 -213 -24 -118 -464 495 301 -90 72 -420 122 -67 74
3248 74 -311 -206 -34 -165 -134 -203 -343 54 -198 -371 -159 157 -161 349 289 484 194 -202 -89 79 -297
3269 -297 -574 191 -111 337 -393 -192 144 -325 77 -63 -127 -226 65 -147 -459 47 368 -260 -294 524 248
$$ packed form
3120b7M14m07k74L33n4K07M21o54k39m8J96R3O18q27M99m19L03k10J35K35j85
3141A10K31m35J86pN5nN2j55k5j54N65p55M08m9k19j61P19l94k88N15q7L95p02
3164b00J68k01N32l70K32k2j95K22m51L27l81P40q57L03O42n02j46J96j54j41
3184b58L26K49m37K53j01n5M7Q2j07j29L79k99P5R0k3N26j079k97P74K51l86K69
3206A50o5M19n52M99o36L44j89o4k32N78m28K54j97K37k14Q6J01m97M52p9K86
3227B53j70Q5J69k56K7l97k47O41j97j21J89r4l46R59j94l91J62m92N42j89J41
3248G4l85J05J72j31L1o9j40L97k52j73K12L16l18N10o0J95k90l96J13J68l76
3269b97k77P65l02M48p30K01L36m69M02j40o4r9K91k12l12N06L21o28l4Q18k76
$$ plain form
3290 248 74 146 -128 -475 -42 -123 683 -285 -7 -157 122 181 -284 27 -261 -56 -251 430 183 61 -249
3311 -249 282 491 106 -415 -112 142 102 -144 -693 -269 25 263 8 -98 -114 -17 213 -265 352 80 -310
3332 -310 -61 -686 483 144 7 247 468 -62 -101 312 -196 -389 -76 126 -32 102 295 -395 219 -483
3352 -483 150 -250 323 1 -220 264 -168 102 -52 340 -51 -636 324 291 -511 50 -114 -310 -203 111
3372 111 188 26 197 -254 -57 -295 152 -55 -63 131 316 -211 -312 321 -201 148 -15 431 -122 -207 187
3393 187 138 -134 -355 277 149 -175 15 84 -149 229 -219 -56 -51 -191 -208 -502 85 -148 -426 41 -273 439
3415 439 385 -5 51 29 187 -109 91 164 -409 13 257 -231 275 57 -547 -48 -105 -198 121 -23 -100 -49 493
3438 493 -87 -84 36 197 264 -338 23 -361 51 -162 -154 298 299 153 63 121 341 -208 -432 65 -291 162 -111
$$ packed form
3290B48j74P2k74l47M33q1Q06r68K78j50K79N9m65L11k88K05j95O81k47j22l10
3311b49N31K09l85n21L03K54m0k46n49M24K94K38k55j06j6R7K30m78O17k72l90
3332c10K49o25J169l39j37K40K21n30l9M13n08j93L13K02j58J34J93o90O14p02
3352d83O33m00N73l22k21M84m32K70j54L92l91n85R60l3q02N61j64j96J07L14
3372A11P7j62J71m51J97k38M47k07qJ94J85n27j01O33n22L49j63M46n53q5L94
3393A87m9k72k21O32j28l24J90O9k33L78m48J63Nj40j7k94N87k33k78M67l14P12
3415D39n4l90N6k2J58k96K00P3n73M22K44m88N06k18o04M99n7r3L19j44p7N1N42
3438D93n80LJ20J61O7o02L61l84M12k13QM52Jj46r0N8K20n49k24M97l56M53k73
$$ plain form
3461 -111 -370 -76 193 53 15 221 430 -224 -284 -233 -28 -174 120 -32 117 -201 116 -192 -145 -97 -579 355
3483 355 237 -315 -606 -103 -172 273 137 11 -74 219 -175 -223 77 -32 -136 -1 109 -513 148 -468 -167
3504 -167 567 356 182 351 -2 -347 -353 -61 218 120 255 180 -542 138 56 -253 -294 297 -349 269 219 33
3526 33 -43 38 -293 -296 105 50 -73 215 240 -188 99 2 -137 196 -216 474 -103 -20 -839 -131 157 -413 160
3549 160 158 145 -134 62 -332 76 225 -76 -321 260 -3 -592 80 -44 168 -140 -47 134 145 209 431 -174
3571 -174 -36 -205 28 -160 369 23 -5 103 -139 383 -133 35 -5 218 525 -153 -174 119 -130 -20 -505
3592 -505 -27 -147 50 -4 -9 -147 200 333 -84 30 94 0 -39 -149 -309 -85 32 -240 -96 -45 86 221
3614 221 -472 -308 -37 -29 -39 54 -578 117 236 87 140 195 185 -41 212 256 171 -306 169 -403 31 105 -92
$$ packed form
3461a11k59K94K69j40l8K06K09o54o0N1K05j46K94j52J49l18L17l08M7M8m82R34
3483C55j18n52k91N03o9M45j36j26q5K93l94m8L00j09j04J35J10o22O61o16L01
3504a67P34k11j74J69l53l45oK92K79r8J35p5p22O80q2l09m1N91o46O18n0j86
3526C3p6Q1l31lM01n5j23K88K5m28K87r7j39L33m12O90n77Q3q19P08K88n70N73
3549A60kj3k79J96l94M08J49l01k45N81k63n89O72j24K12l08R3J81J1O4K22o05
3571a74J38j69K33j88N29l46k8J08k42N22n16J68m0K23L07o78k1K93k49J10m85
3592e05M78j20J97n4nj38L47J33m17J14O4r4l9j10j60K24J17k72J44N1J31J35
3614B21o93J64K71Qj0R3o32O95J19j49N3N5j0k26K53M4q5m77M75n72M34P4j97
$$ plain form
3637 -92 -158 -264 32 96 -51 -441 27 277 30 -157 292 -390 281 -66 455 349 365 -182 -131 79 -193 -298
3659 -298 -709 -316 -56 8 141 -40 226 -143 218 -174 -62 30 -150 -237 -421 326 408 -70 169 276 -610
3680 -610 -49 166 -126 413 -351 -138 -164 241 -284 149 78 -482 -252 -114 370 -612 -116 -136 -53 134 226 -164
3702 -164 -273 -134 -365 451 242 148 -28 261 -104 -10 -78 -70 61 -44 -23 144 374 289 250 52 17 42 849
3725 849 -24 -126 55 179 7 -164 261 -508 -154 -105 133 -128 -241 -43 -229 135 176 -223 230 -300 6
3746 6 -170 -128 -114 224 -378 217 62 -369 112 77 -342 -137 99 -317 73 -339 -8 -313 317 -84 -53 128
3768 128 524 -104 -93 -476 196 286 29 22 29 169 -29 -176 -760 455 -177 32 -132 -18 -159 3 -247 216
3790 216 -349 -73 20 349 -66 220 29 129 -162 167 52 55 -186 85 352 -307 39 -155 -145 -82 -83 -236
$$ packed form
3637i2o6j06K96O4j47l90M68K50k47j87M49o82O71l47N21j06J6n47N1K10k72j05
3659b98m11L93K60O4J33j81K66l69L61l92J12R2j80q7j84P47Q2m78K39J07q86
3680f10N61K15k92N39p64K13k6M05n25M33p1n60K30J38M84r82M96k0Q3J87R2l90
3702a64j09J39k31Q16k09r4j76K89l65R4o8QJ31j05K1J67K30q5l9j98l5K5Q07
3725H49q73j02J81J24j72j71M25p69L54M9K38k61j13J98j86L64M1l99M53n30L06
3746Fj76M2J4L38o02N95j55m31M81l5m19K05K36m16L90m12L31l05O30m01L1J81
3768A28L96o28J1l83O72R0k57pPJ40j98j47n84J215o32K09j64J14j41J62k50M63
3790B16n65K76R3L29m15K86j91J00k91L29j15Lk41K71K67o59L46j94J0O3jj53
$$ plain form
3812 -236 69 406 -459 -167 -65 -429 20 141 123 -194 102 359 134 39 9 80 -94 -2 -46 -321 -412 -13
3834 -13 -163 -63 10 161 202 -253 269 506 -327 511 -15 -151 -38 -809 435 23 -173 188 89 -408 -231
3855 -231 -111 -379 -8 21 547 -84 479 665 -254 178 -29 -82 -155 0 -73 -193 -121 -7 -25 30 292 766
3877 766 -74 66 -64 24 -68 28 -9 -593 116 -127 -490 480 14 -288 194 27 192 -302 202 -2 181
3898 181 -166 192 -89 -387 -284 -43 -87 212 -394 19 11 -630 505 -448 95 191 276 24 -32 352 -67 -304
3920 -304 -386 284 -476 225 142 -253 -305 -474 16 -222 -349 -205 -187 -455 -288 46 -455 442 -260 220 -134
3941 -134 -285 -157 1 212 233 203 -95 94 391 225 -213 -75 -4 -108 -74 220 21 365 300 53 -447 54
3963 54 478 363 -14 241 147 70 -93 395 0 311 -135 -162 325 231 -72 -12 -67 -191 -29 -8 289 -250 323
$$ packed form
3812b36L05L37q65K92J02l64M49J21j8l17K96K57k25r5l0P1j74R2m4k75r1L99
3834a3j50J00P3J51M1m55N22K37q33Q38n26j36J13p71J244m12j96L61r9m97J77
3855b31J20k68L71K9N26o31N63J86r19M32k07n3p3J55p3j20P2J14j8N5K62M74
3877G66q40J40j30Q8r2R6l7n84P09k43l63R70m66l02M82j67J65m94N04k04J83
3898A81l47L58k81k98J03K41m4K99o06M13qo41J135r53N43R6Q5k52n6L84m19k37
3920c04q2O70p60P01q3l95n2j69M90k38j27J44J8k68J67L34n01Q97p02M80l54
3941a34j51J28J58K11K1l0k98J89K97j66m38J38P1j04L4K94j99L44o5k47n00N01
3963E4M24j15l77K55r4p7j63M88l95L11m46k7M87r4l03O0n5j24J62K1K97n39N73
$$ plain form
3986 323 -333 138 114 -12 -74 133 -10 -301 -61 42 -33 -331 71 383 -256 -33 15 304 -202 -218 207 -197
4008 -197 -338 -71 13 -68 207 16 248 -309 36 -65 -224 -304 336 -501 230 -274 -717 -302 136 -84 -125
4029 -125 228 64 -24 -118 -357 218 215 497 -145 -130 115 64 303 -506 -269 -20 204 187 -320 203 295 9 188
4052 188 227 88 -317 497 322 -92 -389 354 84 85 139 -91 -1 -146 31 -340 55 -246 -250 241 -235 -212 -338
4075 -338 114 -131 146 72 -184 43 -254 -243 502 86 58 -270 69 612 33 258 -77 289 22 310 -241
4096 -241 289 -261 -367 -282 420 -76 -191 55 33 28 -19 77 -158 -124 8 -138 77 -228 139 64 -467 -94 -165
4119 -165 369 -317 -317 -161 213 441 -191 178 -191 257 22 -110 -60 -364 -16 223 -203 161 -217 -43 -135
4140 -135 -209 175 174 133 -373 91 168 -192 278 287 -35 256 230 116 149 80 6 411 -173 318 -278 -198 -368 502
$$ packed form
3986C23o56M71k4j26o2K07j43k91K40J03p5k98M02L12o39K23M8K89n06j6M25m04
4008a97j41K67Q4q1K75j91K32n57L45j01j59q0O40q37P31n04m43M15M38k20m1
4029a25L53j64q8r4k39N75lK82o42J5K45n1K39q09K37K49K24j7n07N23R2k86J79
4052A88L9j39m05Q14j75m14k97P43k70JN4k30R0j45J77l71L95l01mM91m76K3j26
4075c38M52k45K77p4k56K27k97J1P45m16k8l28L39N43n79K25l35L66k67K88n51
4096b41N30n50j06Q5P02m96j15K46k2nm7R6k35L4J32j46K15l05L67p5n31L73p1
4119a65N34o86%J56L74K28o32L69l69M48k35j32N0l04L48K39m26L64l78J74r2
4140a35p4L84jm1n06M64P7l60M70Rl22K91k6j14L3o9p4M05n84M91n96Q0j70Q70
$$ plain form
4164 502 100 199 -588 28 156 -79 708 370 -249 -221 16 -260 -298 293 217 311 279 -74 35 70 50 -145 -22
4187 -22 -311 -6 -53 -3 -185 -338 -47 63 22 156 53 443 717 149 -68 93 108 25 -287 -27 38 -298
4209 -298 114 177 -299 155 56 4 116 -138 604 -498 -83 -149 236 286 253 47 138 502 -239 -25 -67 -307
4231 -307 -133 -57 -434 108 456 -490 -454 -56 -172 12 -291 -41 -60 -273 68 -60 217 275 -45 -46 70 -28
4253 -28 -452 30 -233 188 -171 432 -281 105 -48 -53 113 674 -132 -23 101 63 197 -136 70 45 -524 45
4275 45 -110 37 -214 -180 -273 -167 -90 -81 215 290 355 115 200 -126 -166 -400 -109 33 -164 3 35 59 114 54 -276
4300 -276 -223 -34 234 -169 -403 104 -359 -576 163 -75 342 194 417 -208 19 -105 397 476 57 280 84
4321 84 43 -42 148 -543 159 217 70 386 304 -428 168 -153 -154 -41 181 140 -60 321 -727 -12 -657 165
$$ packed form
4164E02m02R9p87O16J28k35P87l38o19K8K37k76l8N91p6R4l2l53J09L5k0j95J23
4187b2k89L05m7N0j82j53K91J10m1J34j03L90K74n68k17J61J5q3l12K60O5l36
4209b98M12O3m76M54r9n2J12k54P42j102M15o6L85N0l3k06R1L64p41K14m2k40
4231c07J74P6l77N42L48r46L6L98j16J84l03K50j9k13L41j28K77N8l20jJ16r8
4253b8m24M82k63M21l59O03p13L86j53nJ66N61q06J09J24l8J34l33K06k5n69N69
4275D5j55J47k51L4r3J06P7RK96P5O5k40Q5l26m0k34K91J42j97J67L2K4N5o0l30
4300b76N3J89K68m03k34N07m63k17P39k38M17j48K23o25K27j24N02P9m19K23j96
4321H4m1q5J90o91P02N8j47L16q2p32N96l21jJ13K22m1k00L81j048P15o45Q22
$$ plain form
4343 165 -173 -415 465 288 93 -381 189 97 -297 -342 -29 189 -336 324 -55 567 -26 -133 -1 -166 -37
4364 -37 179 381 -607 479 -275 153 -428 -391 171 -187 122 -89 572 454 83 -303 402 -397 -6 356
4384 356 -326 226 -220 -70 -70 -170 -243 44 4 -216 -130 206 162 24 -31 -203 -114 16 20 -89 56 98 494 -51
4408 -51 -217 -313 19 148 133 -181 -59 288 31 26 -132 -88 12 -27 -482 -170 -161 162 26 90 152 -23 148 223
4432 223 212 71 353 -309 -235 -93 -56 -56 535 421 104 -47 153 102 59 -160 -150 -165 -612 -37 119 20 -255
4455 -255 -351 -444 -57 -17 137 45 -541 -309 -134 81 -157 -37 69 -25 187 -439 261 -187 273 276 43 -280
4477 -280 213 -190 212 -80 -203 104 -276 -204 -382 52 -381 232 -423 3 -474 -333 98 87 80 -98 143
4498 143 -215 276 178 -39 -528 -185 314 -202 258 81 289 203 107 -356 -165 21 226 -178 -103 -75 307 343
$$ packed form
4343A65l38k42Q80j77j95m74N70r2l94m5L13K18n25O60l79O22n93j07J32j65J29
4364c7K16K02r88J086p54M28n81L7N62l58L09k11O61j18l71l86P05p99L91L62
4384C56o82N52m46J50%j00p3K87m0k20Q6L36m4j38n5j72Q9J30Mj09J45M2L96n45
4408e1j66r6L32J29j5l14J22L47k57nj58M4J00l9m55L12RL23j36O4O2j75J71P5
4432B23j1j41K82o62P4J42L7%N91j14l17j51K00n1m3k19J0j5m47N75J56r9k75
4455b55r6r3L87M0J54r2n86K32J75K15k38J20J06r4K12o26P00m48M60Lk33l23
4477b80M93m03M02k92j23L07l80P2j78M34m33O13o55M26m77J41M31j1pj78K41
4498A43l58M91r8k17m89L43M99n16M60j77K08q6r6m63J91J86K05m04P5K8L82L6
$$ plain form
4520 343 -105 -222 -254 11 349 234 -98 123 -110 -59 -2 -501 261 12 -117 -108 241 -208 -221 215 -420 121
4542 121 38 -317 208 -281 180 -423 157 98 -431 539 149 -122 -136 -210 -221 -326 298 168 -548 -238 97 -18
4564 -18 196 43 149 120 -57 -23 -244 -234 -216 -133 -48 61 -414 51 -2 -256 165 84 60 188 216 -366 -131 -159
4588 -159 134 -298 263 -344 110 -52 -64 -453 -18 -192 333 476 199 -445 -190 32 -148 165 297 583
4608 583 116 -155 -222 428 544 -105 24 -49 43 84 -226 -437 -10 -15 -619 -217 82 224 59 267 194 328
4630 328 -46 62 3 -488 -169 -11 -117 401 -18 44 -78 -263 -172 53 -399 292 96 736 5 -18 185
4651 185 293 -69 527 499 -225 -184 -276 -34 -464 -309 203 238 -229 101 -203 145 398 -142 126 -28 -427
4672 -427 179 240 -425 9 -146 -283 13 -301 -221 41 -168 -372 -18 -494 -11 233 -70 -350 -96 -39 116
$$ packed form
4520C43m48j17l2K65L38j15l32K21k33N1N7m99P62k49j29RL49m49j3M36o35N41
4542A21q3l55N25m89M61o03N80n9n29R70l90k71j4p4j1j05O24j30p16L10L35j15
4564a8K14j53J06k9j77L4k21J0J8Q3Q5J09m75M65n3k54M21q1k4J28K8n82K35k8
4588a59K93m32N61o07M54j62j2l89M35j74N25J43k77o44K55K22j80L13J32K86
4608E83m67k71o7O50J16o49J29p3R2M1l10k11M27no04M02K99J42j65K08p3J34
4630C28l74J08n9m91L19J58j06N18m19O2j22j85R1K25m52O91j96O40p31k3K03
4651A85J08l62N96k8p24M1r2K42m30J55N12L5m67L30l04L48K53n40K68j54l99
4672d27O06O1o65M34j55j37K96l14Q0K62k09k04L54m76M83K44l03k80K54N7J55
$$ plain form
4693 116 205 140 -401 60 -93 86 -234 -163 122 173 -341 9 81 -192 170 314 -145 -258 174 264 109 79
4715 79 -282 -40 110 76 -39 -77 283 -242 -1 238 8 437 -283 238 -183 -37 394 94 -23 -287 -30
4736 -30 22 94 46 148 69 -119 319 33 168 71 -62 -332 -367 -264 67 29 841 -108 -367 -45 -693 97 -37
4759 -37 73 135 -43 371 -413 -164 22 -222 241 -300 150 226 367 144 -77 -170 -90 14 -451 152 -277 -62
4781 -62 48 -396 7 263 -116 -81 184 519 208 470 -149 140 -237 -74 -85 305 330 528 216 -351 -207
4802 -207 223 -386 -53 92 -191 400 -320 -256 -117 -422 -359 290 -292 14 197 308 -150 53 276 -139 252
4823 252 46 165 448 304 -55 199 205 133 -186 34 325 -119 -130 2 80 211 64 -169 -303 113 99 -182
4845 -182 -194 80 -718 108 27 -31 -414 53 313 117 -140 -314 189 190 4 89 27 -213 -345 -144 -139 34 -102
$$ packed form
4693A16Q9o5n41M61j53J79l20P1K85N1n14L50P2k73L62J44m59j13M32R0j55l0
4715G9l61K42J50l4j15l8L60n25K41K39k30M29p20N21m21J46M31l00j17k64K57
4736c0N2P2m8J02p9j88M38k86J35r7j33k70l5J03L31l8Q12r49k59L22o48P90j34
4759c7J10O2j78M14p84K49J86k44M63n41M50P6J41k23k21r3Q0J04m65O03m29K15
4781f2J10m44M03K56l79L5K65L35l11K62o19K89l77J63j1L90K5J98l12n67J44
4802b07M30o09L33J45k83N91p20O4J39l05O3O49n82L06J83J11m58K03K23m15L91
4823B52k06J19K83j44l59K54Op2l19K20K91m44j1J32P8J31j47k33j34M16j4k81
4845a82j2K74p98Q26q1n8l83M67K60j96k57j74N03Jj86Q5o2k40j32K01NJ73j36
$$ plain form
4868 -102 -208 388 491 -9 -35 -489 121 -260 -173 -649 406 -154 -221 -18 -83 143 107 62 -218 -108 125 -364
4890 -364 -135 -219 628 344 3 -360 52 606 433 -168 62 188 -450 -149 -76 -369 -224 -57 166 184 -69
4911 -69 -21 82 -155 120 406 -210 -251 150 -253 283 56 192 300 29 299 234 -453 243 15 432 18
4932 18 -308 264 303 521 -392 67 -88 466 337 296 -342 156 -69 -120 94 165 372 -229 -66 92 372 331
4954 331 -230 134 78 88 -79 -209 246 -33 87 313 96 -201 361 243 7 104 -483 32 584 -12 -90
4975 -90 -29 -136 209 356 86 408 -305 -206 60 9 -218 -160 123 -373 239 72 -201 41 280 -160 38 216
4997 216 231 -134 -169 -131 83 -510 -323 -186 17 -178 180 286 -131 -198 140 228 -99 -167 78 -94 251 -120
5019 -120 546 385 -227 25 389 -137 230 583 -59 67 -92 292 -99 201 -144 -108 87 -313 304 -33
$$ packed form
4868a02j06N96J03n00k6m54O10l81Q7m76J055n60o7K03o5K26l6m5k80J10K33m89
4890c64K29q4Q47k84l41l63M12N54j73o01K30J26o38L01P3k93J45J67K23J8k53
4911f9M8J03k37K75K86o16m1M01m03N36k27J36J08k71K70o5o87O96k28M17m14
4932A8l26N72L9K18r13M59j55N54j29m1o38M98k25n1K14P1K07o01J63J58K80m1
4954C31n61L64n6J0j67j30M55k79J20K26k17k97N62j18k36R7n87N15N52n96p8
4975i0O1j07L45J47k70L22p13R9K66n1k27N8K83m96O12j67k73K42K39m40J98J78
4997B16J5l65l5L8K14n93J87J37K03j95L58J06m17o7L38Q8l27o8K45j72L45l71
5019a20O66j61o12K52L64n26L67L53o42J26j59L84l91L00l45L6J95m00O17l37
$$ plain form
5039 -33 -296 171 160 291 34 122 262 561 59 288 556 316 192 -288 470 -581 -122 -500 -140 -142 500
5060 500 88 24 17 -404 -93 193 322 199 -80 -17 -1 34 -318 406 106 -51 -129 224 143 -110 -332 -397 -247
5083 -247 279 8 382 190 -243 -506 -290 -35 -126 387 -18 289 4 98 62 197 294 107 -322 -250 322 388
5105 388 -144 -41 -361 364 81 109 -94 -59 107 152 297 127 -274 -134 256 422 -235 246 -208 -164 80
5126 80 322 -104 98 -29 19 -187 -411 162 -128 -123 -617 199 83 -49 -199 14 -296 -617 611 173 -189
5147 -189 391 165 15 422 -428 247 49 290 265 211 275 358 89 169 276 347 -46 19 -48 -19 -2 158 42
5170 42 -143 130 -525 14 100 319 274 -146 16 -237 148 433 -358 -68 47 -156 -454 60 226 -492 201
5191 201 -289 -193 -214 339 -190 22 -15 81 -433 -716 424 -259 -136 -115 -62 -140 2 -247 -325 206 204 147 391
$$ packed form
5039c3k63M67j1J31k57Q8J40K99n02K29K68k40j24m80P58j051M59l78L60kO42
5060E00m12o4pm21L11K86J29j23k79O3J6L5l52P24l00j57p8L53q1k53k22o5J50
5083b47N26k71L74j92m33k63K16K55r1N13m05L07k85R4l6J35R7j87m29P2N72O6
5105C88n32J03l20P25k83K8k03L5J66M5J45j70m01J40L90J66o57M81m54M4K44
5126H0K42m26K02j27M8k06k24N73k90Nm94Q16j16j32j50K13l10l21J228m38l62
5147a89N80k26j50M07q50O75j98K41k5n4O4Q3k69Q0J07P1l93O5o7K9J7J60j16
5170D2j85K73o55N39Q6K19m5m20J62k53L85K85p91K90J15k03k98N14J66p18O93
5191B01m90R6k1N53n29K12l7R6n14k83J140o83J23K1N3p8J42k49p8N31kn7K44
$$ plain form
5214 391 -404 187 -78 343 -16 92 247 275 -216 89 -1 -320 -134 24 -149 218 -21 397 303 21 106
5235 106 27 -15 -129 -260 188 -75 21 177 401 -517 -393 277 225 -248 -262 497 62 -23 -142 -107 -194 -109 -301
5258 -301 472 -304 277 -87 -273 -182 -116 84 376 -452 -378 -86 451 198 331 274 -52 -119 176 -325 -120 -65
5280 -65 -166 -261 228 258 -368 -71 434 -114 -113 10 -48 139 -101 -144 336 -167 47 423 -164 101 -7 114
5302 114 -20 -77 78 -39 -119 388 -202 -434 -86 -539 -110 113 -62 -325 -117 -270 471 -153 283 -91 -78
5323 -78 -301 225 328 -52 -164 242 91 -302 -272 -447 -117 248 -88 -155 108 170 27 233 -433 -175 98
5344 98 584 277 219 -396 -70 346 7 -252 394 563 -363 41 -261 -151 -406 -538 346 -184 -114 -379 -201
5365 -201 328 -169 315 -123 -211 -224 255 444 247 -167 -83 19 -509 85 -186 93 -236 564 -423 59 -21
$$ packed form
5214C91p95N91k65M21l59J08J55K8m91L05r0l19J86J58j73L67k39M18r4k82Q5
5235A06p9m2j14j31M48k63R6J56K24r18J24O70n2m73j4P59m35q5j19L5q7Q5j92
5258c01P73p76N81l64j86R1O6K00K92q28P4K92N37k53J33n7l26o7K95n01K05N5
5280f5j01r5M89L0o26K97N05n48JJ23n8J87k40m3M80n03K14L76n87K65j08J21
5302A14j34n7J55j17q0N07n90k32L48m53M29K23j75k63K08j53P41o24M36l74J3
5323g8k23N26J03l80j12M06j51l93L0j75L30L65l36o7K63O2j43K06o66K58K73
5344I8M86l07n8o15L26M16l39k59O46J69r26M04l02J10k55j32Q84n30P0k65J78
5365b01N29m97M84m38q8j3M79J89j97m14Q4J02n28N94k71K79l29Q00r87M82q0
$$ plain form
5386 -21 342 -137 -90 76 -208 -44 216 36 176 -93 202 27 -123 206 -428 110 -131 77 -90 213 618
5407 618 740 227 -194 -183 243 -323 -88 144 -4 64 -693 -7 -353 -37 -103 231 -315 116 219 434 -79
5428 -79 -96 72 470 307 43 256 32 130 -201 344 138 -21 -249 -77 462 93 -83 -190 -296 -367 -7
5449 -7 120 564 -409 -489 91 -152 57 -86 153 223 -10 34 73 -65 196 -170 -157 136 -341 -16 71 394 273
5472 273 -153 94 141 -401 -86 254 215 141 185 -62 -312 177 198 -23 126 -54 23 -106 -26 -4 239 230 167 -69
5496 -69 262 141 103 -235 -213 194 -363 -92 454 -320 708 -184 -570 -385 429 -126 -114 -27 -413 -280 -263 -375
5518 -375 -130 -460 -287 -255 16 315 -145 -4 -152 209 316 -184 -259 -174 -174 356 -254 114 192 175 -25 115
5540 115 464 -492 7 -85 -309 -483 260 439 117 188 -110 18 27 447 396 133 -55 -27 854 -45 466 258
$$ packed form
5386b1L63m79M7J66k84J64K60j80J40k69K95j75j50L29o34N38k41K08j67L03M05
5407F18J22n13m21J1M26n66K35K32j48O8p57O86l46L16o6L34n46M31J03K15n13
5428g9j7J68L98j63k64K13k24R8l31N45k06j59k28J72N39l69j76j07j06p1L60
5449gJ27M44r73q0N80k43K09j43K39P0k33M4L9j38K61l66J3K93m77L25Q7L23j21
5472B73m26K47M7n42L15L40l9p4M4k47k50M89K1k21J49j80P7j29Q0K2K43ro3k36
5496f9L31j21l8l38K2M07n57K71N46p74J028q92l86J85Q14n55J2Q7l86J33J7j12
5518c75K45l30J73L2K71K99m60J41j48L61J07n00p5Q5%N30o10L68P8j7k00J40
5540A15L49r56M99r2k24j74P43J79l22P1k98J28RM20n1k63j88K8Q81q99N11k08
$$ plain form
5562 258 140 16 -368 166 12 -179 -42 -52 145 -120 -97 -11 -352 -124 140 -426 124 -17 29 73 -148 -353
5584 -353 -59 34 465 215 69 -680 -50 246 32 76 195 385 -249 -80 252 8 292 470 35 -172 249
5605 249 197 -78 -498 35 -91 -248 -181 -227 148 58 70 389 -24 -118 302 -3 -308 169 32 -163 -188 55
5627 55 -24 418 -160 191 -388 -17 373 180 -61 -111 -306 178 383 -71 119 -451 194 139 -60 -79 21 166
5649 166 546 297 -279 -1 -54 122 63 361 -140 135 -62 544 93 -148 -238 -453 -151 -52 184 320 242 291
5671 291 346 -13 -98 95 49 -190 337 257 369 -216 -267 -91 22 -295 -52 -294 25 151 -40 -241 321 175
5693 175 143 221 48 68 15 106 -428 -183 -424 -36 56 279 285 154 63 27 -309 -49 -192 15 119 214 133 -238
5717 -238 72 383 -215 -294 321 -51 -198 148 248 -329 -367 15 -198 68 -514 -40 158 -102 453 65 38
$$ packed form
5562B58j18j24l84N34j54j91J37j0J97k65K3Q6l41K28K64n66N50j41M6M4k21k05
5584c53K94R3M31k50j46p49O30K96k14M4J19J90o34J69L32k44K84J78m35k07M21
5605B49n2k75m20N33j26j57O7m6L75r0J2L19m13r4M20l05l05M77j37j95k5K43
5627E5p9M42n78L51n79L71L90j93k41n0j95M84K05m54J90n70O45n5j99j9J00J45
5649A66L80k49n76K78n3J76n9K98n01K75j97O06m51k41r0k15L02R9K36J36p8M9
5671B91N5l59q5J93m6k39N27q0J12n85n1J76J13l17K43k42L19J26j91k01N62j46
5693A75l2P8j73K0n3R1n34K45k41L88R2K23Oj31r1l6l36K60j43K07J04R5q1l71
5717b38L10L11n98p9O15l72j47L46J00n77l8L82k13K66n82M74J98k60N55l88k7
$$ plain form
5738 38 193 -120 320 91 451 -247 342 -315 -30 -366 175 -43 -240 316 248 310 298 227 -68 -257 80 136
5760 136 148 313 -340 87 232 289 -43 195 61 45 -120 136 -495 -10 299 -293 -295 -241 261 -468 193 233
5782 233 356 209 345 16 220 272 257 -178 -7 47 -278 154 274 99 -244 -92 -115 61 -83 312 335 -230
5804 -230 357 98 288 80 -341 49 194 -217 374 278 190 -18 148 235 -151 -66 -389 18 -341 -100 -396
5825 -396 -144 206 -262 -73 -12 -219 -272 -286 -38 -144 -295 201 244 193 57 8 -20 182 -378 247 41 -137
5847 -137 270 -291 -19 124 290 123 -21 126 36 221 596 -289 -205 -146 106 -99 -237 -235 -172 -375 220 774
5869 774 99 164 -36 284 76 -171 235 -169 -124 -56 218 -146 205 -157 148 12 -454 266 -351 331 -159
5890 -159 275 -500 -146 -175 100 -47 -306 257 16 -124 -62 240 -56 -123 -154 278 196 -215 -114 181 586 70
$$ packed form
5738C8J55l13M40k29L60o98N89o57K85l36N41k18j97N56o8O2j2p1k95j89L37N6
5760A36J2J65o53M27J45N7l32K38j34j6j65K56o31M85L09n92kN4N02p29O61M0
5782B33J23j47J36l29K04N2j5m35J71N4l25M32J20j75l43J52k3J76j44L95K3n65
5804b30N87k59J90k08m21L90J45m11N91r6q8k08J66Q7l86Q5l23M07l59K41k96
5825c96K52L50m68J89O1k07n3j4K48j06j51M96M3n1j36m9k8K02n60O25k06j78
5847a37M07n61K72J43J66j67j44J47r0J85L75q85Q4N9K52k05j38KO3k03N95N54
5869G74o75O5k00L20k08k47M06m04M5O8K74l64L51l62L05j36m66P20o17O82m90
5890a59M34p75L54k9K75j47k59N63k41j40O2L02k96o7l1M32q2m11J01K95M05n16
$$ plain form
5912 70 212 55 77 187 222 1 -240 -207 127 135 136 -671 -56 -379 -107 66 -378 -159 139 -417 -99 31 -553
5935 -553 107 -72 104 -575 46 -126 212 134 25 -187 -17 -172 -75 203 336 -79 -119 139 61 269 -146
5956 -146 -467 -181 388 122 475 121 -93 -687 46 140 -94 -71 66 28 -138 -73 -236 -553 -158 -646 -237
5977 -237 2 -170 -57 109 205 223 -331 366 138 349 257 -502 -198 127 -98 410 105 -126 -260 126 100
5998 100 179 -103 -29 320 333 145 414 276 171 245 242 99 478 -80 225 217 23 -113 -196 -134 63 14 -139 -91
6022 -91 -553 214 -569 238 -193 -32 -273 -36 4 -345 80 66 402 -274 400 28 -240 -66 129 281 71
6043 71 217 319 -60 412 47 -208 59 30 173 154 -176 -158 200 247 53 -94 -16 -121 211 -144 151 -253
6065 -253 -132 92 -357 373 -10 -36 311 6 -260 -216 -269 140 358 -143 255 359 193 -134 38 90 -60
$$ packed form
5912G0J42j57K2J10L5k21k41L3L34QJq07O15l23K72J73m44K19K98n56L18J30n84
5935e53O60j79J76o79O21j72L38p8j09k12J70j55R7K78J33m15m0K58p8K08m15
5956a46l21K86N69k66L53l54k14n94P33R4k34K3J37l8j66O5j63l17L95m88M09
5977b37K39j72J13J66R6J8n54O97k28K11r2p59L04L25k25N08l05k31j34L86k6
5998A00P9k82P4L49J3j88K69j38j05P4lj43L79n58L05qj94j36q3O2J97m9j53M8
6022i1m62P67p83Q07m31J61k41K37M0l49M25j4L36o76O74l72k68J74J95J52k10
6043G1J46J02l79M72l65k55K67k9J43j9l30J8L58M7j94j47P8j05L32l55K95m04
6065b53J21K24m49P30l83k6L47l05k66M4n3M09K18n01L98J04j66l27J72N2j50
$$ plain form
6086 -60 199 -520 -253 -149 450 25 -152 77 184 329 65 316 122 -373 -721 -131 -187 138 -24 -16 -395
6107 -395 419 -320 271 349 192 277 -205 -332 285 261 286 -77 -111 79 371 411 200 -260 -95 3 -148 -77 224
6130 224 -256 322 -75 -431 337 -127 309 -6 -294 232 534 147 7 166 -177 48 319 298 -621 271
6150 271 286 -161 -161 106 -286 -473 -481 10 373 -112 -119 -421 -481 -351 -124 107 -42 -122 -133 99 -735 267 203
6173 203 -55 -259 110 -96 -49 70 -75 -488 -221 -60 -260 -262 -11 510 27 -232 -40 -156 -17 -21 211 -108
6195 -108 -15 161 49 116 -58 -179 5 -247 -315 366 -231 131 10 -419 -226 -26 -289 -83 407 99 190
6216 190 -281 29 -338 -143 110 -15 332 157 31 -41 295 153 211 291 226 -243 195 235 -225 482 221 -368
6238 -368 -158 -249 -58 -136 270 263 115 15 103 -72 212 16 -52 294 199 274 34 408 91 37 122 -108 -216
$$ packed form
6086f0K59p19K67J04N99m25j77K29J07J45k64K51j94m95l48N90n6L25j62Ql79
6107c95Q14p39N91P8j57Q5m82j27O17k4K5l63l4J90K92M0k11m60J65R8j51P1L01
6130B24m80N78l97l56P68m64M36l15k88N26L02l87j40J59l43K25K71k1r19Q92
6150B71J5m47%K67l92j87qM91L63m85pl02o0J30K27K31j49q0j1K32q34J002o4
6173B03k58k04L69k06M7J19j45m13K67J61k00kK51N21m83k59J92j16J39mK32l19
6195a08R3J76j12O7j74j21J84k52o8O81n97L62j21m29J93K00k63K06M90l08R1
6216A90m71L10l67J95K53j25L47j75j26p2L36j42N8Q0o5m69M38M0m60P07k61n89
6238c68K10r1J91p8M06pj48j00Q8j75K84j96o8L46r5P5k40L74l17n4Q5k30j08
$$ plain form
6261 -216 327 -166 -63 -74 -471 -301 -472 386 71 -312 -162 120 70 -380 -269 -409 135 -430 -342 76 298
6282 298 -52 -536 83 -194 -208 -268 -222 337 -1 63 -267 -221 295 -95 -465 336 -282 194 102 222 3 -11
6304 -11 -163 70 51 -187 112 -105 370 47 80 -23 -299 -5 -184 327 -210 -429 157 -175 -72 -286 -557
6325 -557 -161 -69 166 -391 5 425 -128 122 0 -11 3 -177 -366 -378 513 339 -230 125 18 142 -607
6346 -607 -9 168 442 516 -70 115 73 -66 259 189 -132 -88 471 35 -148 221 24 100 -153 -445 -239 -162
6368 -162 -217 133 700 25 -295 -125 481 386 -340 -346 -67 22 -54 -121 -24 -312 252 -170 -158 97 -458 -131 195
6391 195 17 461 108 -53 -197 -50 -50 58 177 456 -181 -58 304 -214 -59 413 183 -623 458 862
6411 862 114 286 138 -113 79 226 -76 241 172 62 -67 -63 100 -6 238 501 150 147 62 355 -215 152
$$ packed form
6261b16N43m93J03j1l97J70j71Q58l15l83J50K82n0m50J11j40N44n65Q8M18K22
6282B98l50m84O19k77j4o0M6N59l38O4l30M6N16l90l70Q01o18M76r2J20k19j4
6304a1j52K33j9k38K99k17M75l23L3j03k76K94j79N11n37k19N86l32J03k14k71
6325e57L96R2K35n57L96M20n53K50j22j1J4j80j89j2Q91j74n69L55j07J24p49
6346f07N98J77K74P4n86J85m2j39L25p0l21M4N59m36j83L69j97P6k53k92K06P7
6368a62n5L50N67o75l20J70O06r5p26oK79Q9p6o7R7k88N64m22J2K55n55L27L26
6391A95j78M44l53j61j44J47%J08J19K79o37J23L62n18J55M72k30q06J081M04
6411H62p48J72j48k51J92J47l02L17o9j10j29MJ63j06K44K63l51lq5K93n70L67
$$ plain form
6433 152 304 255 -196 -189 247 -13 369 97 35 266 65 199 30 502 -405 -74 321 -530 137 96 -255 173
6455 173 38 -71 -310 38 194 -30 -85 -227 -109 -228 -362 97 114 66 -176 169 242 31 15 452 273 61
6477 61 287 -48 -254 129 -427 -72 -490 16 103 -256 -50 -304 22 179 15 439 -244 37 285 -391 -9
6498 -9 -172 18 21 186 -252 269 83 227 540 -23 -337 441 -261 -240 572 481 227 197 121 534 251 52 -117
6521 -117 -23 -115 64 -234 178 408 239 130 -370 63 -90 110 382 458 356 95 128 -116 -121 -393 189 143
6543 143 54 235 -150 -688 -576 377 391 -3 35 21 204 -268 322 461 -170 53 453 88 -232 17 57 106
6565 106 75 -292 50 -118 6 -174 6 -147 -145 -117 -88 -491 338 -122 -167 -158 -264 -153 -337 -545 -76 67 -114
6588 -114 174 -277 261 -77 -562 255 89 131 215 235 -101 -223 97 -61 29 51 -240 125 57 -322 42 147
$$ packed form
6433A52J52m9m51PM36k60L82k72o2K31k01J34j69M72r07L31L95q51O67m1l51M28
6455A73j35j09k39L48J56k24n5j42J18j19j34M59J7m8k42L45P3k11j6M37j79k12
6477F1K26l35k06L83n56L55m18N06Q7l59K06k54L26J57j64M24o83K81K48o76L82
6498ij63J90LJ65m38N21j86J44L13n63l14P78p02K1Q12r1k54l0p6M13k83j99j69
6521a17R4r2J79k98M12K30j69j09n00M33j53K00K72P6j02k61L3k44nk72N82m6
6543A43q9J81l85n38J12R53J4l94L8j4J83m72N90J39o31K23M00l65l20K49M0M9
6565A06l1l67L42j68J24j80J80j53KK8K9m03Q29m60m5Rj06J11j84k08M69J43j81
6588a14K88m51N38l38m85Q17j66M2Q4K0l36j22L20j58R0K2k91L65o8l79L64J05
$$ plain form
6610 147 328 -25 92 151 -243 -15 -155 364 406 73 -236 -81 -95 182 145 -34 -224 -111 -106 4 39 237
6632 237 182 189 447 349 -139 62 298 47 -104 225 6 -177 200 -339 206 417 -85 58 90 -104 56 -3
6654 -3 -620 -13 303 256 -236 208 -304 -102 215 66 562 272 261 -65 -88 238 416 312 -412 -197 31 -454
6676 -454 209 -172 -279 -134 -36 -374 73 2 -67 -5 -382 288 31 398 417 -415 87 27 -8 -272 -56 112
6698 112 117 206 -323 73 -78 112 211 -493 226 59 -47 306 -127 -504 -71 -96 -230 35 136 -250 -247 411
6720 411 -269 -131 -353 104 -339 295 354 295 -56 -367 320 -37 -420 204 -188 367 124 -329 -121 -100 18
6741 18 -80 214 215 -45 93 -37 -480 -52 286 -447 -447 535 25 -290 8 173 -360 232 -225 -507 -177 98
6763 98 -161 -130 -674 -184 198 -11 -102 -267 -343 -146 189 278 -100 293 -225 347 -103 -57 313 -480 11 390
$$ packed form
6610A47J81l53J17N9l94K28j40N19M2l33l09J55j4K77l7j79j90J13NJ10L5J98
6632B37n5PK58r8m88K01K36k51j51L29k19j83L77n39N45K11n02J43L2j94J60n9
6654co17O07L16m7m92M44n12K02L17j49M96k90j1l26k3L26J78j04p24K15K28m85
6676d54O63l81j07J45R8l38M47p1o9O2l77O70k57L67J9q32N02o0l5k64K16J68
6698A12NQ9n29L96j51J90R9p04P19j67j06L53m33l77M33k5j34K65J01l86LO58
6720D11o80J38k22M57m43O34N9n9l51l11O87l57l83O24l92N55k43m53K08K1J18
6741A8r8K94Jk60J38j30m43M28L38p33%R82n10l15K98J65n33N92m57k82L30K75
6763I8k59L1n44M90L82k09r1j65p6J97L35Q9l78L93n18N72m50M6L70p93M91L79
$$ plain form
6785 390 252 -463 -14 180 -312 147 -121 248 14 -65 403 -195 -107 219 308 -111 46 -131 245 59 10
6806 10 -235 295 -54 72 -85 -264 608 -530 -199 -185 41 206 -137 -569 -219 50 25 -246 -75 288 -110
6827 -110 94 -21 -198 239 -34 -336 -439 -314 72 -152 199 -115 -21 71 197 282 -58 241 -118 -48 -80 252
6849 252 -263 271 190 384 -121 200 -185 175 -312 -305 216 -196 108 -182 -82 -73 -265 117 77 53 -6 -391 215
6872 215 406 337 273 262 167 -326 -323 -243 -521 -105 405 -523 -211 -16 -127 29 -497 142 -486 -305 -235 110 113
6895 113 -209 94 -308 156 -282 118 157 -516 505 79 -150 -11 -295 -509 150 -246 -43 -365 -73 -330
6915 -330 -278 -53 -220 -353 412 -148 549 -277 102 85 475 427 62 497 447 202 83 -78 -60 185 237 -44
6937 -44 -260 -210 -266 15 -206 -79 159 -478 -215 -474 51 754 -53 -622 -694 -87 -2 266 -232 -111 -319 187
$$ packed form
6785C90j38p15M49J94m92M59k68L69k34p9M68n98Q8L26Q9m19J57j77L76j86m9
6806A0k45N30l49J26j57j79Q72j138L31J4K26J65l43m32L50K69k5k71J71L63l98
6827a10K04j15j77M37k73l02j03J25L86k24L51l14R4R2J26Q5l40K99l59P0l2L32
6849B52n15N34q1J94n05L21l85L60m87PN21m12L04k90J00Rj92L82m0k4n9l85O06
6872B15J91o9o4j1r5m93LQ0k78M16N10r28L12J95j11J56n26O39o28J81P0L45L
6895A13l22L03m02M64m38M00L9o73J021m26k29J39k84k14O59l96K03l22K92k57
6915c30N2K25j67j33P65n60O97q26L79j7L90m8l65M35n0k45j19j61J8K45N2k81
6937d4k16N0n6K81k21J27K38o37K63k59N25P03q07n69p2O07Q5K68m98J21k08N06
$$ plain form
6959 187 163 -10 -166 348 -203 -377 -481 195 430 -130 158 -191 40 -503 -369 -379 -12 -315 142 -91 167
6980 167 47 -109 -148 336 -245 250 19 -92 -8 -72 546 -116 36 -149 -25 -26 3 -292 351 290 74 -38
7002 -38 -33 -373 -57 -20 17 -124 361 218 -45 203 257 -33 362 257 -51 160 -362 208 3 -131 363 278
7024 278 106 -13 -254 -191 532 7 601 -277 -15 168 -161 -116 -415 -160 -3 150 158 388 32 -224 201
7045 201 -284 -118 -372 -131 167 404 -24 -269 239 -38 -81 -411 -437 -58 -2 101 -150 -365 92 444 -88
7066 -88 247 455 -321 -5 11 475 -306 -171 213 -115 157 322 91 276 12 349 -16 217 242 329 163
7087 163 170 -46 -740 -285 -325 64 133 176 343 -81 415 -122 -144 -328 -263 -175 110 -667 44 176 -323 352 -111
7110 -111 -54 -73 262 180 -230 371 179 -29 396 123 -157 -254 247 256 333 -175 303 60 639 8 -170 113
$$ packed form
6959A87k4j73j56N14n51j74j04O76K35n60K88l49K31n43J34j0L67l03M57k33K58
6980A67j20j56l9M84n81M95k31j11Q4o4O18o62J52j85J24jK9k95O43o1k16j12
7002c8Nl40L16L7L7j41M85j43k63K48N4k90L95j05l08K11n22N70k05j34M94q5
7024B78j72j19k41O3P23n25N94q78K62J83l29M5k99K55J57J53QK30l56k56M25
7045B01m85J66k54K41K98K37m28k45N08k77m3l30k6L79N6J03k51k15M57L52n32
7066h8L35K08p76L16J6M64p81J35L84l28K72J65k31J85k64L37l65K33K5Q7j66
7087A63Pk16o94M55m0L89O9M3J67m24M96n37k2j84O5Q8K85p77P11J32m99O75m63
7110a11N7j9L35q2m10O01j92k08M25k73k80r7N01RP7n08M78k43N79o31j78K83
$$ plain form
7132 113 27 399 -286 572 410 -386 173 -173 -169 115 -495 -364 -163 -237 -108 20 -67 159 113 -96 105 -567
7154 -567 -417 7 -50 -225 71 111 -243 -207 -291 -314 257 -527 144 71 -83 -53 14 668 -587 -232 -246 276 -258
7177 -258 -59 -453 -131 497 -14 -335 147 -605 -542 -176 -68 130 72 -43 123 -302 430 9 -454 465 135
7198 135 296 168 -62 225 -217 -7 -96 43 -171 266 -476 277 416 -102 -649 -121 -401 316 88 -1 81
7219 81 417 147 -404 -260 307 -213 -262 -134 88 552 -155 -74 11 201 122 177 260 301 145 84 129 -219 391
7242 391 -13 92 -283 -458 618 185 357 -276 209 88 71 84 -43 -107 279 -280 -505 31 162 107 -112
7263 -112 558 -288 527 -103 -168 -103 524 -52 179 63 -189 66 -582 142 -25 647 6 22 -67 -39 -90 -96 260
7286 260 -48 139 -25 151 258 -220 -64 133 110 -275 -55 -252 127 145 69 80 247 197 -140 -54 -31 -5 84
$$ packed form
7132A13q6L72o85Q58j62p96N59l46MK84o10J31K01p4J29J28q7K26m6k09K01o72
7154e67J50M24n7j75K96M0l54L6q4k3N71p84O71p3j54L0O7O54j255L55j4N22n34
7177b58J99l94L22O28n11l21M82p52O3L66J08J98n8j15J66m25P32m21m63R19l30
7198A35J61j28k30K87m42K10q9J39k14M37p42P53J39n18n47N28k80P17k28q9Q2
7219H1L36k70n51J44N67n20m9J28K22M64p07Q1Q5J90p9N5Q3M1j56o1M5l48O10
7242C91m04J05l75j75J076m33J72o33M85j21j7J3j27o4L86n59k25N36J31n5k19
7263a12O70q46Q15o30o5O5O27n76K31j16k52K55o48P24j67O72o41J6q9K8n1oL56
7286B60l08J87j64J76J07m78J56J97k3l85K20j97L79J8p6J1J67n0l37Q6K3K6Q9
$$ plain form
7309 84 -643 0 -217 -36 -592 267 -12 276 313 -138 -201 42 -192 1 13 23 464 341 55 -58 -51 42 239
7332 239 -226 -29 316 47 -178 191 225 275 -138 -150 16 292 -151 144 65 415 87 227 236 -237 0 211
7354 211 -276 62 307 -73 -56 318 191 198 -736 -502 -163 -323 -348 -358 -291 108 148 480 -102 -155 14 -267 270
7377 270 354 26 -282 489 -150 -257 123 156 -155 46 -137 187 22 35 265 -107 183 200 52 92 241 -489
7399 -489 237 360 26 485 107 -629 180 406 -42 -257 -65 22 -300 -142 -31 -43 502 81 547 -151 26
7420 26 252 313 -519 -38 -94 152 19 -497 152 -220 416 254 -152 182 -190 -125 -207 -301 323 89 -22 -91
7442 -91 110 69 -48 -324 -329 324 205 229 -29 73 316 334 -104 42 -284 -138 132 -190 196 -44 359 178
7464 178 303 -134 138 -283 96 -285 -332 19 200 75 -510 200 215 -571 -80 142 -64 -116 -93 10 56 -231
$$ packed form
7309H4p27O43k17J81n56Q59k79K88L7m51o3K43k34J93J2J0M41j23k86j13PR3J97
7332B39m65J97L45k69k25L69L4N0m13j2J66K76m43K95p9L50l28J40Rm73K37K11
7354B11m87L38K45l80J7L74j27Pr34K34L39j60k5j0O7L99M0L32n82n3J69k81N37
7377B70Q4l28l08P71o39j07L80L3l11K01j83L24j65J3K30l72K90J7j48M0J49p30
7399d89P26J23l34M59l78p36Q09K26m48k15J92Q7l22J58J11j2N45m21M66o98J77
7420B6K26O1q32M81n6K46j33n16O49l72O36j62m06L34l72O5q2r4O24k34j11o9
7442i1K01m1j17k76nO53j19K4k58J02K43J8m38J46l26J46K70l22L86k40M03j81
7464A78J25m37K72m21L79l81m7L51J81j25n85P10J5p86M91K22k06n2K3J03M6k87
$$ plain form
7486 -231 -137 216 -57 -366 123 -428 519 -370 13 555 141 254 -57 -42 47 15 36 -102 155 503 -19 217
7508 217 271 17 -176 -278 288 -137 186 -438 69 -223 133 -72 390 298 -65 -165 -287 -165 -111 153 -260
7529 -260 59 198 -41 0 336 -362 -270 227 23 -146 -64 273 -145 162 524 208 34 -43 11 -100 543 193
7551 193 -246 75 -444 -422 -62 -198 137 25 -295 -166 -198 -262 212 130 -245 324 -160 -210 -567 -66 -129 -52
7573 -52 -123 -361 -436 -16 47 37 -103 -363 53 219 148 -157 -190 67 65 106 382 -299 122 -205 -10 -145 114
7596 114 56 138 163 -177 -187 -130 376 -347 286 87 -3 -63 -179 186 198 535 270 -52 191 -205 -241 180 -324
7619 -324 -178 1 -47 238 484 -93 69 106 -16 -260 -28 27 84 257 -156 -223 -257 235 -211 137 293 -8
7641 -8 -430 -104 170 63 176 198 176 272 -76 -236 -257 -142 -649 -227 -12 41 116 300 -101 -40 143 30 6
$$ packed form
7486b31R4L53k73l09M89n51R47q89L83N42m14J13l11J5Q9l2K1j38K57L48n22K36
7508B17N4k54j93j02N66m25L23o24N07k92L56k05M62r2l63j00j22J22N4K64m13
7529b60L19J39k39M1L36o98R2M97k04j69Q2L37m18L07L62l16j74p7N4j11O43l50
7551A93m39L21n19K2L60j36L35j12l20J29l2o4M74q2l75N69m84n0l57N01o3P7
7573e2p1k38p5M20O3j0j40k60M16J66p1l05l3K57kM1K76o81M21l27J95j35K59
7596A14n8Q2K5l40j0N7N06p23O33j99r0o0j16L65J2L37k65l22K43l96l6M21n04
7619c24J46J79m8K85K46n77J62L7j22k44K32N5N7J73m13o7l4M92m46L48J56l01
7641hm22L26K74j07J13K2k2R6l48j60k1J15n07M22K15N3P5J84m01O1J83j13k4
$$ plain form
7664 6 -276 -62 -267 266 286 400 170 -139 119 -25 -61 -397 457 269 -38 216 33 -68 367 378 -227 111
7686 111 161 -18 347 220 -33 127 68 4 341 -46 122 530 81 35 -359 122 31 216 -535 194 534 182
7708 182 315 192 92 167 -32 -321 344 -303 -82 342 185 279 -630 -343 -385 -450 374 -10 -51 -88 -423 -223
7730 -223 -194 -188 -135 293 -311 -10 42 275 14 -13 -151 12 40 93 344 381 -57 376 277 170 -143 -159 -176 233
7754 233 -69 -277 243 -58 -260 317 134 45 283 486 371 9 -139 109 -190 -70 60 14 167 -232 -185
7775 -185 -224 -352 206 67 -22 118 -119 -113 -238 -299 19 -124 -12 -336 -333 -199 87 -239 127 159 60 -204 -116
7798 -116 -53 -284 95 -432 422 -54 13 296 564 -373 -109 258 153 88 11 387 -195 283 232 -3 146 -313
7820 -313 -23 257 -4 -356 290 -205 74 -66 -198 77 -340 40 450 -125 -279 -109 -399 -312 -500 -218
$$ packed form
7664Fk82K14k05N33K0J14k30l09K58j44l6l36Q54j88l07K54j83j01M35J1o05L38
7686A11N0j79L65j27k53J60n9o4L37l87J68M08m49m6l94M81r1J85p51P29L40l52
7708A82J33j23j00P5j99k89O65o47K21M24j57R4r09K87m2o5Q24l84m1l7l35K00
7730b23K9ON3M28o04L01N2K33k61k7j38J63K8N3K51L7m38M33r9j07l13j6j7M09
7754B33l02k08N20l01k02N77j83q9K38K03j15l62j48K48k99J20J30m6J53l99M7
7775a85l9j28N58j39q9J40k37Oj25o1L18j43J12l24LJ34K86l26L66L2r9k64Q8
7798a16O3k31L79n27Q54m76O7K83K68r37K64L67j05o5p7L76n82M78n1k35J49m59
7820c13K90K80k61l52O46m95K79j40j32K75m17L80M10n75j54J70k90Q7j88K82
$$ plain form
7840 -218 54 127 -395 221 17 272 -91 -122 129 -175 -262 -386 -159 35 124 251 519 161 -281 128 312
7861 312 175 -44 103 -183 -61 555 -111 -20 -412 -388 -256 75 282 -61 -18 139 235 240 353 -162 -167 -320 80
7884 80 -102 230 -250 -257 42 -108 -377 -142 124 -189 157 214 -69 145 80 280 -376 10 51 158 110 -97
7906 -97 -85 206 279 -40 156 -265 209 -54 352 173 -300 16 -275 -234 -21 177 -14 221 -294 -194 -179 -200
7928 -200 167 321 -108 -4 -34 -8 -129 -460 -56 -23 447 -245 -207 252 274 -235 -7 632 108 370 241 -287
7950 -287 426 9 459 124 -85 -18 190 94 -49 -150 129 107 440 262 -47 85 126 -247 -337 -89 142 -168
7972 -168 -370 251 -103 300 -252 284 -2 -254 251 296 233 52 432 57 150 32 -801 -53 50 -411 114
7993 114 276 77 -1 -373 150 -227 313 -613 -292 302 -19 60 -25 -74 -28 77 -127 100 -15 -93 -172 48
$$ packed form
7840b18K72P3n22O16k04K55l63l1K51l04q7j24K27J94Q9J27K68l58m42M09J84
7861C12j37k19J47k86J22O16o66R1l92K4J32L31K07l43M3J57R6NJ13n15nj53M00
7884H0j82L32m80pK99j50k69K35K66l13L46N7k83K14o5K00o56L86M1J07m8k07
7906i7J2K91P3l19J96m21M74k63M06j79m73L16k91M1K13J98j91K35n15J00J5k1
7928b00L67J54m29J04l0K6j21l31M04L3M70o92L8M59K2n09K28O39n24K62j29n28
7950b87P13m17M50l35k09O7K08r6j43j01K79k2L33j78l09J32M1l73r0K48K31l10
7972a68k02O21l54M03n52N36k86k52N05M5o3j81L80l75R3j18q33P48J03m61N25
7993A14J62j99p8l72N23l77N40r26L21N94l21P9q5m9M6J05k04K27j15p8p9K20
$$ plain form
8015 48 116 158 -9 417 -199 520 -200 -137 427 363 -416 -282 -94 -592 69 -215 162 484 -475 253 620 278
8037 278 40 631 321 -32 -328 121 -238 451 -282 -167 -219 -323 32 251 -2 77 -79 147 -20 -133 -293
8058 -293 -585 113 61 -173 282 -266 261 10 36 -279 -83 162 244 -73 436 23 260 46 -91 -138 764
8079 764 448 -271 15 91 392 -241 -11 -56 -234 -357 684 -41 -104 -231 -307 -33 20 310 249 -56 -99 544
8101 544 37 -32 -135 -474 -42 208 270 -169 199 235 -112 137 -332 289 -311 -160 -97 22 191 -102 -123 -55
8123 -55 122 23 -483 32 -75 -559 -23 633 -57 -39 15 327 282 165 151 -68 162 290 333 -151 -168 42 -23
8146 -23 152 123 -293 -91 -240 32 168 248 190 115 -35 141 -6 443 -143 394 -28 -448 -26 115 290 -55
8168 -55 -90 -243 154 387 -12 92 46 -65 -167 -329 201 328 -81 458 -35 -358 -195 -457 256 -490 416
$$ packed form
8015D8O8M2j67M26o16P19p20O3N64o4p79J34J88m98O61k84L77L22r59P28L67l42
8037B78k38N91l10l53k96M49l59O89p33J15n2j04L55K19k53P9j56K26j67j13j60
8058b93k92O98n2k34M55n48N27k51K6l15J96K45Q2l17N09m13K37k14j37m7R02
8079G64l16p19K86P6L01o33K30m5j78j23J041p25o3j27p6K74N3K90o1l05m3O43
8101E44n07o9j03l39M32K50O2m39L68L6l47K49m69O21o00J51O3J19J69k93k1O8
8123e5J77r9n06N15j07m84N36O56o90J8N4L12m5j17j4k19K30J28M3m84j7K10o5
8146b3J75k9m16K02j49K72J36Q0n8p5j50J76j47M49n86N37m22m20M22J41J75l45
8168e5l5j53L97K33l99J04m6j11j02j62N30J27m09N39m93l23J63k62P13p46R06
$$ plain form
8189 416 -510 -21
$$ packed form
8189D16r26M89
8191b1
$$ Imaginary data points
##PAGE= N=2
##DATA TABLE= (X++(I..I)), XYDATA
$$ plain form
0 0 0 0 0 0 0 0 0 0 0 0 0 0 -64 64 -64 64 -64 128 -128 192 -192 256 -256 320 -384 448 -512 587 -704
29 -704 799 -897 1025 -1183 1344 -1521 1705 -1920 2143 -2393 2670 -2973 3302 -3667 4060 -4489
45 -4489 4957 -5468 6032 -6648 7327 -8063 8887 -9799 10816 -11954 13234 -14694 16371
58 16371 -18329 20633 -23411 26823 -31131 36771 -44524 55891 -74203 108721 -196908
69 -196908 906202 1573132 -19662 -146721 32504 -156093 -818353 -566042 -20768 -55420
79 -55420 -668283 -598429 -107059 -137300 -774958 -711620 145216 630455 106634 -292937 118028
90 118028 571029 185052 -308829 -37940 589346 577024 122964 18202 298244 284488
100 284488 -61864 -185360 80818 224339 6098 -239409 -244513 -248571 -399219 -420162 -131904
$$ packed form
0@%%%%%%%%%%%%o4J28j28J28j28J92k56L20l84M48n12N76p04Q32r60J099j291
29g04J503j696J922k208K527k865L226l625M063m536N063n643O275o969P727q549
45d489R446j0425J1500j2680J3975j5390J6950j8686K0615k2770K5188k7928L1065
58A6371l4700L8962m4044N0234n7954O7902q1295J00415j30094J82924l05629
69a96908J103110O66930j592794j27059J79225j88597o62260K52311N45274l4652
79e5420o12863O9854M91370l0241o37658O3338Q56836M85239n23821l99571M10965
90A18028M53001l85977m93881K70889O27286j2322m54060j04762K80042j3756
100B84488l46352j23496K66178J43521k18241k45507n104m058j50648k0943K88258
$$ plain form
111 -131904 96729 -55110 -309507 -231967 53059 130075 -18800 -28332 215096 396350 271172
122 271172 35970 10877 171753 234596 115743 6586 14629 29750 -25533 -84559 -118649
133 -118649 -178428 -222646 -145615 2535 34778 -91509 -186974 -96680 66333 96530 8104
144 8104 -3565 103327 151378 52350 -51882 -25505 64488 96600 64680 32517 18806 -1849
156 -1849 -34081 -54774 -43554 -16697 -474 4635 136 -34639 -91452 -100815 -32997 29635 13616
169 13616 -27093 2116 75555 80130 -6355 -68404 -14024 85974 99764 29387 -10650 6912
181 6912 2059 -44104 -61393 -35591 -25939 -32596 -6375 24694 -15842 -91194 -80740 20256 78665
194 78665 31088 -14424 31310 88869 48942 -26281 -12483 60029 75355 32823 16895 22172
$$ packed form
111a31904K28633j51839k54397P7540K85026P7016j48875r532K43428J81254j25178
122B71172k35202k5093J60876O2843j18853j09157Q043J5121n5283n9026l4090
133a18649n9779m4218P7031J48150L2243j26287r5465R0294J63013L0197q8426
144H104j1669J06892M8051r9028j04232K6377Q9993L2112l1920l2163j3711k0655
156a849l2232k0693J1220K6857J6223N109m499l4775n6813r363O7818O2632j6019
169A3616m0709K9209P3439M575q6485o2049N4380R9998J3790p0377m0037J7562
181F912m853m6163j7289K5802R652o657K6221L1069m0536p5352J0454J00996N8409
194G8665m7577m5512M5734N7559l9927p5223J3798P2512J5326m2532j5928N277
$$ plain form
206 22172 -14957 -64148 -50898 -7141 -19190 -62609 -51404 -3341 -14556 -81608 -95301 -18673
218 -18673 43581 23455 -8761 22866 64306 47585 11623 23353 57363 57912 42713 46095 40545
231 40545 -280 -32224 -10045 24310 10165 -34592 -42961 -15139 -13999 -55952 -78982 -43124
243 -43124 1045 598 -23938 -31111 -23152 -17284 -5409 20760 39767 41130 38347 45613 46082 25140
257 25140 6586 21567 55090 58669 19569 -18601 -23130 -17084 -33624 -53677 -47212 -23447 -12825
270 -12825 -22864 -37701 -44985 -42063 -23885 4069 27876 32573 25921 27176 31816 20803 -2134
283 -2134 -1766 30265 54883 40522 5706 -13688 -12261 -9115 -10833 -8294 -1076 3832 293 -11367
297 -11367 -26704 -39166 -37080 -18763 1082 3571 -8712 -14569 -7129 -887 -5092 -3100 15527
$$ packed form
206B2172l7129m9191J3250M3757j2049m3419J1205M8063j1215o7052j3693P6628
218a8673O2254k0126l2216L1627M1440j6721l5962J1730L4010N49j5199L382n550
231D0545m0825l1944K2179L4355j4145m4757q369K7822J140m1953k3030L5858
243d3124M4169m47k4536p173P959N868J1875K6169J9007J363k783P266M69k0942
257B5140j8554J4981L3523L579l9100l8170m529O046j6540k0053O465K3765J0622
270a2825j0039j4837p284K922J8178K7954K3807M697o652J255M640j1013k2937
283b134L68L2031K4618j4361l4816j9394J427L146j718K539P218M908l539j1660
297a1367j5337j2462K086J8317J9845K489j2283n857P440O242m205J992J8627
$$ plain form
310 15527 39882 47665 33905 13662 3090 5271 11528 14093 12307 9764 1740 -11664 -26999
323 -26999 -38445 -37996 -22837 -1190 8177 -454 -15380 -18529 -8722 1518 4323 9822 23039 33615
337 33615 26363 4823 -11438 -11326 208 10757 16810 15542 7184 -2420 -7753 -13151 -16855 -13432
351 -13432 2221 17986 16586 -3011 -21276 -23022 -13621 -5892 -2491 3213 10449 10411 3278 -5219
365 -5219 -7059 -150 12003 24307 25894 14339 689 -4919 -3462 -5058 -9443 -7249 1372 5466
379 5466 -6204 -23543 -28312 -17940 -2404 7121 8230 6631 3707 2047 1247 646 1264 7292 17482
394 17482 21125 12281 -4802 -14511 -9434 423 2482 166 1619 5896 3020 -9844 -20264 -17424
408 -17424 -4214 7884 9475 2452 -5631 -9192 -7691 -5321 -4551 -2263 6674 18227 18570 4955
$$ packed form
310A5527K4355P783j3760k0243j0572K181O257K565j786k543q024j3404j5335
323b6999j1446M49J5159K1647R367q631j4926l149R807J0240K805N499J3217J0576
337C3615p252k1540j6261J12J1534J0549O053j268q358r604n333n398l704L423
351a3432J5653J5765j400j9597j8265j746R401P729L401N704P236l8p133q497
365e219j840O909J2153J2304J587j1555j3650n608J457j596m385K194Q621M094
379E466j1670j7339m769J0372J5536R525J109j599k924j660q00o01O18O028J0190
394A7482L643q844j7083r709N077R857K059k316J453M277k876j2864j0420K840
408a7424J3210J2098J591p023q083l561J501K370P70K288Q937J1553L43j3615
$$ plain form
422 4955 -10294 -8837 6084 15907 11020 3140 2144 3623 -833 -11158 -16332 -10335 -821 3992 184
437 184 -8229 -14320 -11926 -1649 4167 3282 2001 8622 15570 10550 -3960 -10699 821 15274 17015
452 17015 6070 -3165 -3763 -1126 -3352 -8131 -7253 2 7429 7680 -896 -11817 -15268 -7097 3854
467 3854 6951 1955 -1462 2703 5186 -1916 -11431 -8582 7009 18696 14088 1834 -3356 469
481 469 2939 -716 -4069 -1280 5074 7847 2758 -8057 -16330 -16269 -4903 5789 3782 -3775 -4444
496 -4444 3513 5293 -3645 -9586 -525 14678 17778 6681 -3439 -4434 316 1699 979 387 1376
511 1376 2428 1898 -3036 -11456 -14084 -6219 6393 9405 -735 -9161 -6960 566 -76 -7309 -6284
526 -6284 5550 14955 10018 -3110 -9153 -3819 4606 8183 7202 6136 3615 2064 -982 -4782 -9492
$$ packed form
422D955j5249J457J4921R823m887p880r96J479m456j0325n174N997R514M813l808
437A84q413o091K394J0277N816q85j281O621O948n020j4510o739J1520J4453J741
452A7015j0945r235n98K637k226m779Q78P255P427K51q576j0921l451Q171J0951
467C854L097m996l417M165K483p102r515K849J5591J1687m608j2254n190L825
481D69K470l655l353K789O354K773n089j0815q273O1J1366J0692k007p557o69
496d444P957J780q938n941R061J5203L100j1097j0120r95M750J383p20n92R89
511A376J052n30m934q420k628P865J2612L012j0140q426K201P526o42p233J025
526f284J1834R405m937j3128o043N334Q425L577r81j066k521j551l046l800m710
$$ plain form
541 -9492 -8759 697 10365 6672 -8873 -16435 -8944 2298 129 -6404 -1281 9837 11150 -959
555 -959 -8017 -3303 4417 6113 5702 6601 2873 -2770 -2607 2849 1606 -5190 -4937 6945 10332 -2703
571 -2703 -13731 -8182 5433 5786 -4949 -7614 -336 2953 -1934 -5594 -3305 1353 2633 4647 6670
586 6670 2120 -4555 -1412 9130 11218 1368 -5642 -572 6348 2090 -8126 -8565 138 5514 -254
601 -254 -7585 -7282 -2330 423 245 -13 152 308 884 1730 1697 -235 -1739 2754 7766 6024 -3284 -6992
619 -6992 1064 8761 4213 -5270 -4195 4675 5384 -3978 -8985 -1739 3523 13 -3859 -2073 -1059
634 -1059 -4375 -4070 2949 4526 -2820 -5687 3368 10511 3086 -5833 -447 10887 8891 -3439 -7605
649 -7605 847 5225 1222 -3048 -1445 -1028 -5179 -7235 -3034 10 -2136 -969 4931 6135 -2540
$$ packed form
541i492P33R456R668l693j5545p562P491J1242k169o533N123J1118J313j2109
555i59p058M714P720J696m11Q99l728n643J63N456j243o796K53J1882L387j3035
571b703j1028N549J3615L53j0735k665P278L289m887l660K289M658J280K014K023
586F670m550o675L143J0542K088r850p010N070O920m258j0216m39Q703N376n768
601b54p331L03M952K753j78k58J65J56N76Q46l3j932j504M493N012j742r308l708
619f992Q056P697m548r483J075Q870P09r362n007P246N262l510l872J786J014
634a059l316L05P019J577p346k867R055P143p425q919N386J1334j996j2330m166
649g605Q452M378m003m270J603M17m151k056M201L044k146J167N900J204q675
$$ plain form
664 -2540 -10196 -4870 6196 8005 1831 598 5153 5950 -1224 -7558 -3447 4449 8796 5245 775
679 775 -2612 -4964 -7237 -6315 -555 1785 51 -637 1723 77 -7714 -9836 -18 10300 8267 -1689
695 -1689 -3966 2495 3282 -2519 -3802 5357 11023 5261 -2323 -1776 35 -2492 -3157 2799 6511 -635
711 -635 -9053 -6120 -216 -3080 -8717 -3132 9763 8788 -4196 -10615 -2613 4115 2665 829 6655
726 6655 10418 4236 -3490 -2985 -169 -87 -495 5050 9103 701 -10104 -10079 -1151 980 -4472 -4543 3385
743 3385 6285 -1251 -7828 -4877 1277 2709 648 2984 5636 3072 -2304 -1499 2045 2190 -642 789
759 789 6168 4303 -3019 -5759 -1469 2398 -1164 -5234 -2853 1884 -588 -5637 -5712 59 2279 -195
775 -195 -1532 729 2466 1539 2128 4915 4404 300 -154 2967 6291 1738 -3446 -2817 2083 890 -5045
$$ packed form
664b540p656N326J1066J809o174j233M555P97p174o334M111P896M347l551m470
679G75l387k352k273R22N760K340j734o88K360j646p791k122R818J0318k033r956
695a689k277O461P87n801j283R159N666n762p584N47J811k527o65N956L712p146
711f35q418K933N904k864n637N585J2895r75j2984o419Q002O728j450j836N826
726F655L763o182p726N05K816Q2m08N545M053q402j0805K5Q928K131n452p1P928
743C385K900p536o577K951O154J432k061K336K652k564n376Q05L544J45k832J431
759G89N379j865p322k740M290L867l562m070K381M737k472n049p5N771K220k474
775a95j337K261J737r27N89K787n11m104m54L121L324m553n184O29M900j193n935
$$ plain form
792 -5045 -6593 -2817 1044 -911 -3127 -2178 -1247 -2335 -1741 1358 3465 1929 -642 1015 3269 1177
808 1177 -2012 159 4489 5109 1768 -908 218 726 -1452 -2183 109 1986 441 -3612 -3653 -2981 -3069
825 -3069 -3630 -1288 575 675 -903 -1380 377 594 331 1661 5348 6209 3301 -1161 -488 1170 2442
842 2442 523 -546 -357 -902 -3070 -3904 -4057 -2684 -1671 -292 987 511 -2715 -3740 -803 2852
858 2852 3546 1762 1279 3264 3134 -75 -1613 -397 1910 2896 2655 1741 -391 -2872 -3207 -1744 -366
875 -366 -23 -560 -506 -642 -2359 -3831 -2765 -685 1299 1992 856 939 837 519 253 1026 2855 4264
893 4264 2977 1112 -292 -304 -1117 -985 -291 -695 -1597 -1795 -1575 -1422 -3540 -3751 -1004 1180 1668 295
911 295 -483 286 1388 1199 1333 1676 2369 2260 1790 1134 -608 -1530 -124 1068 1579 -175 -1349 -1434 -1754
$$ packed form
792e045j548L776L861j955k216R49R31j088N94L099K107j536k571J657K254k092
808A177l189K171M330O20l341k676J126N08k178p31K292J877j545m053m1O72q8
825c069n61K342J863J00j578m77J757K17k63J330L687Q61k908m462O73J658J272
842B442j919j069J89n45k168q34j53J373J013J379J279m76l226j025K937L655
858B852O94j784m83J985j30l209j538J216K307R86k41r14k132k481l35J463J378
875c66L43n37N4j36j717j472J066K080J984O93j136Q3j02l18k66P73J829J409
893D264j287j865j404j2q13J32O94m04r02j98K20J53k118k11K747K184M88j373
911B95p78P69J102j89J34L43O93j09m70o56j742r22J406J192N11j754j174q5l20
$$ plain form
930 -1754 -2189 -1922 -2021 -923 469 210 -422 -1572 -1912 -512 518 1448 2525 2263 2620 1551 916 500
948 500 563 1356 1239 633 -416 -1025 -928 -1040 -2012 -2299 -1635 -387 305 -1070 -1967 -1528 -664 765 1514 938
968 938 1519 1584 1520 1224 570 -44 1182 2359 1945 1049 -229 -1277 -880 -942 -924 -677 -1531 -943 -721 -1525
988 -1525 -1980 -1830 -431 155 -5 720 724 1338 933 961 943 1106 1975 2452 2255 1229 -36 -881 -652 412
1008 412 -603 -718 -674 -691 -1326 -2003 -2409 -1639 -639 -54 -10 -227 282 768 604 617 815 692 1589 1562 1881
1029 1881 1286 -205 215 485 648 -89 -927 -988 -897 -1003 -1488 -1772 -801 -601 -437 -1107 -997 -1057 -590 502
1049 502 709 1019 859 1368 1616 1255 493 405 1480 1685 1348 356 -112 557 -366 -858 -1617 -1215 -782 -778 -572
1070 -572 -967 -1711 -1493 -444 454 80 331 691 1744 1170 725 498 884 1562 1408 1690 722 -119 -428
$$ packed form
930a754m35K67r9J098J392k59o32j150l40J400J030R30J077k62L57j069o35m16
948E00O3P93j17o06j049o09R7j12r72k87O64J248O92j375q97M39Q64J429P49n76
968I38N81O5o4k96o54o14J226J177m14q96j278j048L97o2J8K47q54N88K22q04
988a525m55J50J399N86j60P25MO14m05K8j8J63Q69M77j97j026j265q45K29J064
1008D12j015j15M4j7o35o77m06P70J000N85M4k17N09M86j64J3J98j23Q97k7L19
1029A881n95j491M20K70J63p37q38o1R1j06m85k84R71K00J64o70J10o0M67J092
1049E02K07L10j60N09K48l61p62q8J075K05l37r92m68O69r23m92p59M02M33MK06
1070e72l95p44K18J049Q98l74K51L60J053n74m45k27L86O78j54K82r68q41l09
$$ plain form
1089 -428 -610 -78 -1005 -1937 -1030 -37 -445 -1573 -1858 -1153 -225 228 -30 70 407 227 -271 1 1047
1108 1047 1232 1022 1208 918 1010 -236 -252 989 1329 106 -541 48 -106 -1057 -2210 -2275 147 253 -1211
1127 -1211 -1071 -230 -346 -1359 -600 1399 1920 676 1245 1201 1388 -52 -402 547 2256 1164 -675 -778
1145 -778 -367 -825 -2002 -2154 274 84 -444 -1276 -781 -930 -704 -611 986 2005 407 -732 16 853
1163 853 79 -167 584 2352 1867 211 -1002 -256 683 136 -583 195 829 -201 -2102 -1603 -681 -754 -834
1182 -834 -437 1008 337 -1193 -1267 347 1439 1160 304 1090 2963 918 -432 -915 983 1650 -209
1199 -209 -510 -226 -372 -1835 -2108 -503 411 -643 -1104 -161 445 -582 -1439 174 2293 1573 -279 -280
1217 -280 645 1185 86 -889 1744 1945 134 -740 -223 -155 -295 -614 652 1335 -55 -2078 -1681 -32
$$ packed form
1089d28j82N32r27r32R07R93m08j128k85P05R28M53k58J00L37j80m98K72J046
1108A047J85k10J86k90R2j246j6J241L40j223o47N89j54r51j153o5K422J06j464
1127a211J40Q41j16j013P59J999N21j244N69m4J87j440l50R49J709j092j839j03
1145g78M11m58j177j52K428j90n28q32M95j49K26R3J597J019j598j139P48Q37
1163H53p74k46P51J768m85j656j213P46R39n47p19P78O34j030j901M99R22p3q0
1182h34L97J445o71j530p4J614J092k79q56P86J873k045j350m83J898O67j859
1199b09l01K84j46j463k73J605R14j054m61R43O06j027q57J613K119p20j852j
1217b80R25N40j099r75K633K01j811q74N17O8j40l19J266O83j390k023L97J649
$$ plain form
1235 -32 160 -1184 -1062 772 826 -428 -1763 -338 1299 1104 -129 858 2129 1595 -505 -70 1228
1252 1228 1169 -209 -489 156 364 -1965 -2192 -738 928 -74 -1983 -1109 178 -284 -1181 -349 2147
1269 2147 2532 67 -179 1128 1102 -505 -45 1608 2428 -150 -2010 -642 203 -908 -1999 -49 1973
1286 1973 121 -1757 -1930 -263 363 -613 -439 1276 1111 -352 -1407 -290 928 462 358 1458 2059
1303 2059 282 -1011 -842 1778 1352 -674 0 1284 139 -1682 -2980 -1176 250 -451 -1487 -234
1319 -234 623 -813 -2071 -439 1882 1286 362 843 2170 1119 -496 -1041 991 2394 627 -975
1335 -975 189 700 -1133 -2088 -314 1158 555 -673 -1054 -143 -266 -992 -599 782 1402 -258 -1107 101
1353 101 893 89 -650 524 2236 1357 -433 -370 233 618 -636 -809 677 700 -488 -2142 -1205 -250
$$ packed form
1235c2J92j344J22J834N4j254j335J425J637j95j233R87J271n34k100M35J298
1252A228n9j378k80O45K08k329k27J454J666j002j909Q74J287m62q97Q32K496
1269B147L85k465k46J307k6j607M60J653Q20k578j860J368Q45j111j091J950K022
1286A973j852j878j73J667O26r76J74J715j65j463j055J117J218m66j04J100O01
1303B059j777j293J69K620m26k026O74J284j145j821j298J804J426p01j036J253
1319b34Q57j436j258J632K321n96r24M81J327j051j615n45K032J403j767j602
1335i75J164N11j833r55J774J472o03j228l81R11j23p26L93J381O20j660q49J208
1353A01P92q04p39J174J712q79j790O3O03L85j254j73J486K3j188j654R37R55
$$ plain form
1371 -250 -1059 -1503 -340 595 3 -1270 -485 1308 1299 79 160 1515 1771 -156 -398 406 1126 346 -532
1390 -532 -449 360 -196 -1520 -565 905 296 -1011 -1380 379 -69 -1300 -1060 262 1173 350 -476 -83
1408 -83 510 692 238 97 1099 945 -311 -235 923 829 -99 -476 204 -245 -1528 -1539 -359 179 -260 -951
1428 -951 -100 -120 -236 -1214 -603 523 1162 42 615 491 732 -73 -512 95 585 315 -94 256 -301 -747
1448 -747 -922 -944 570 519 -1520 -1387 -629 325 -487 -826 85 722 723 105 -182 526 347 -65 641 1277 1111
1469 1111 112 -554 -248 148 -623 -265 342 921 -554 -1398 -1071 340 -284 -430 113 636 679 99 -756
1488 -756 -11 351 -16 791 884 694 -10 -572 315 664 580 -10 51 437 -760 -831 -966 -129 -70 -171 -517
1509 -517 -585 -596 -345 3 430 755 382 669 300 114 -24 49 -13 647 414 -49 -236 436 -45 -877 -652
$$ packed form
1371b50q09m44J163R35n92j273P85J793rj220Q1J355K56j927k42Q04P20p80q78
1390e32Q3Q09n56j324R55J470o09j307l69J759m48j231K40J322R11q23q26L93
1408h3N93J82m54j41J002j54j256P6J158r4r28l77O80m49j283j1J180N38m39o91
1428i51Q51k0j16r78O11J126O39j120N73j24K41q05m39O07M90k70m09L50n57m46
1448g47j75k2J514n1k039J33P58R54q12l39R11O37Jo18k87P08j79m12P06O36j66
1469A111r99o66L06L96p71L58O07N79j475q44L27J411o24j46N43N23M3n80q55
1488g56P45L62l67Q07R3j90p04n62Q87L49q4n90O1L86j197p1j35Q37N9j01l46
1509e17o8j1K51L48M27L25l73K87l69j86j38P3o2O60k33m63j87O72m81q32K25
$$ plain form
1530 -652 -384 -52 168 -279 -33 -552 -246 -343 -677 165 39 124 -249 190 202 -198 35 617 608 462 304 -314
1552 -314 -72 103 397 31 205 -51 -34 -603 -969 -874 -548 -347 20 -75 -82 -361 -24 432 -44 102 169 1192
1574 1192 713 262 -547 -60 220 539 -414 481 118 -221 -368 -436 -430 -675 -255 -79 203 394 291 19 94
1595 94 343 270 211 100 278 238 -370 -121 144 89 321 307 392 33 314 -324 112 -147 118 162 18 33 -93
1618 -93 -840 -251 -224 -251 -236 -291 267 811 344 24 373 601 301 577 176 225 196 252 -191 -346 -507 -318 -499
1641 -499 342 -280 -778 -329 -222 148 -361 471 -185 256 407 -76 81 -655 357 129 247 123 37 500
1661 500 504 221 -159 135 -60 191 189 -293 -388 -183 -101 54 90 -135 -526 -668 -110 -134 -584 -111 87 465 285
1684 285 21 -334 490 -21 207 -32 105 609 532 1 -947 -448 222 271 -354 -186 7 166 -419 -320 77
$$ packed form
1530f52K68L32K20m47K46n19L06r7l34Q42j26Q5l73M39J2m00K33N82rj46j58o18
1552c14K42J75K94l66J74k56J7n69l66R5L26K01L67r5pk79L37M56m76J46O7J023
1574A192m79m51q09M87K80L19r53Q95l63l39j47o8Ok45M20J76K82J91j03k72P5
1595I4K49p3n9j11J78m0o08K49K65n5K32j4Q5l59K81o38M36k59K65M4j44J5j26
1618i3p47N89K7k7J5n5N58N44m67l20L49K28l00K76m01M9k9N6m43j55j61J89j81
1641d99Q41o22m98M49J07L70n09Q32o56M41J51m83J57p36J012k28J18j24q6M63
1661E00Mk83l80K94j95K51km82r5K05Q2J55L6k25l91j42N58k4m50M73J98L78j80
1684B85k64l55Q24n11K28k39J37N04p7n31r48M99O70M9o25J68J93J59n85R9L97
$$ plain form
1705 77 74 -56 -47 220 78 557 -37 179 371 -312 488 292 760 140 -335 -229 113 -153 -57 -240 -109 -668
1727 -668 -504 -389 56 -170 -630 -174 160 578 48 20 -144 692 523 -432 -294 -6 264 -158 -374 -104
1747 -104 328 -282 -686 -575 -419 -313 -411 -235 1 433 82 169 45 179 -324 -699 227 852 399 141 -177
1768 -177 639 247 -70 -284 326 215 347 -56 38 296 -766 -360 425 164 229 125 133 -169 -452 -438 -223
1789 -223 478 857 179 -53 134 494 568 -122 108 109 283 -199 -315 -308 -95 -286 223 418 -268 -549 -59 172
1811 172 -190 -346 -464 -131 816 -683 -234 310 782 181 -59 54 621 29 -434 -488 181 77 -550 -268
1831 -268 225 218 -953 -229 310 441 -76 -627 -256 230 41 -406 -87 396 377 346 370 458 43 -9 -342 618
1853 618 299 27 -606 -78 246 -261 -938 -394 303 352 -400 -86 504 234 -423 114 -5 397 379 -500 -155
$$ packed form
1705G7lj30RK67j42M79n94K16J92o83Q00j96M68o20m75J06L42k66R6j83J31n59
1727f68J64J15M45k26m60M56L34M18n30k8j64Q36j69r55J38K88K70m22k16K70
1747a04M32o10m04J11J56J06r8J76K36M32l51Q7j24J34n03l75R26O25m53k58l18
1768a77Q16l92l17k14O10j11J32m03R4K58j062M06P85k61O5j04Ql02k83J4K15
1789b23P01L79o78k32J87L60P4o90K30JJ74m82j16PK13j91N09J95o86k81M90K31
1811A72l62j56j18L33R47j499M49N44M72o01k40J13N67n92m63n4O69j04o27K82
1831b68M93pj171P24N39J31n17n51L71M86j89m47L19M83j9l1K4Q8m15n2l33R60
1853F18l19k72o33N28L24n07o77N44O97M9p52L14N90k70o57N37j19M02j8q79L45
$$ plain form
1874 -155 736 119 -347 580 103 -131 107 113 303 470 -14 -355 -517 151 -374 -669 -431 241 -32 -212 -66
1895 -66 183 -474 -337 -541 616 -96 221 10 -40 463 23 -38 5 592 210 -265 -193 -3 -144 -50 -125 113
1917 113 -223 -454 -453 135 -337 83 -252 9 737 -238 -327 -339 246 728 -250 975 353 286 -376 -460 72 -62
1939 -62 150 -524 181 -137 -622 -726 -42 236 212 -274 135 228 -581 -250 -117 376 470 618 21 534 90
1960 90 -72 -340 38 564 328 78 419 -51 -145 -595 -1 -46 894 -477 -477 -308 250 -696 -710 190 141 -12
1982 -12 -164 -137 261 27 5 -168 235 224 38 -268 -195 147 -31 141 370 402 -272 -465 -373 120 197 -555 -81
2005 -81 69 -85 -416 -135 53 -205 722 11 48 335 271 -220 -29 169 252 -89 525 588 -402 -576 -388 -267
2027 -267 126 338 -559 -51 128 185 -183 -279 -369 544 -44 242 20 387 48 194 771 530 -366 -135 287
$$ packed form
1874a55Q91o17m66R27m77k34K38OJ90J67m84l41j62O68n25k95K38O72k73j80J46
1895f6K49o57J37k04J157p12L17k11n0N03m40o1M3N87l82m75P2J90j41R4p5K38
1917A13l36k31JN88m72M20l35K61P28r75q9j2N85M82r78J225o22o7o62q4N32j34
1939f2K12o74P05l18m85j04O84K78k4m86M09R3q09L31J33M93R4J48n97N13m44
1960I0j62k68L78N26k36k50L41m70r4m50N94m5R40j371%J69N58r46j4R00m9j53
1982a2j52K7L98k34k2j73M03j1j86l06P3L42j78J72K29L2o74j93R2M93P7p52M74
2005h1J50j54l31K81J88k58R27p11L7K87o4m91J91J98Q3l41O14O3r90j74J88J21
2027b67L93K12q97N08J79N7l68r6r0R13n88K86k22L67l39J46N77k41q96K31M22
$$ plain form
2048 287 -69 -235 117 267 293 -322 -316 -336 -288 -21 -350 -224 238 55 -178 -136 218 277 -579 379 -60 507
2070 507 182 -516 -178 -249 567 -454 57 -250 414 250 -291 97 36 -716 -249 -482 -128 -408 286 592
2090 592 3 -148 -57 -59 6 347 397 146 247 433 -182 -177 -202 280 149 -241 38 49 40 -119 -3 -147 642 -167
2114 -167 8 134 156 6 364 -283 29 -275 -39 41 -258 262 -359 131 272 196 392 -34 -349 -245 285
2135 285 -570 -79 -150 -22 -124 218 393 211 298 264 -303 -174 259 275 258 26 -43 243 757 118 -200 -261
2157 -261 -330 -41 49 231 -198 115 -216 213 94 173 -672 308 -286 143 303 59 -85 -135 361 -78 -448
2178 -448 216 192 480 -153 -245 -510 151 -132 -216 -71 -483 -271 -139 246 525 74 -145 165 14 -409 -662
2199 -662 412 -119 234 -60 265 415 -37 88 156 -226 -136 -11 -9 -220 -436 64 -276 -12 -242 56 -207
$$ packed form
2048B87l56j66L52J50K6o15Ok0M8K67l29J26M62j83k33M2L54N9q56R58m39N67
2070E07l25o98L38p1Q16j021N11l07O64j64n41L88o1p52M67k33L54k80O94L06
2090E92n89j51R1kO5L41N0k51J01J86o15Nk5M82j31l90K79J1rj59J16j44P89q09
2114a67J75J26K2j50L58o47L12l04K36Q0k99N20o21M90J41p6J96m26l15J04N30
2135B85q55M91p1J28j02L42J75j82Q7l4n67J29M33J6j7k32o9K86N14o39l18o1
2157b61o9K89R0J82m29L13l31M29j19P9q45R80n94M29J60k44j44n0M96m39l70
2178d48O64k4K88o33r2k65O61k83q4J45m12K12J32L85K79m51k19L10j51m23k53
2199f62J074n31L53k94L25J50m52J25O8l82R0J25Kk11k16N00l40K64k30K98k63
$$ plain form
2220 -207 400 -221 -78 22 363 223 -50 159 -224 299 -275 -29 -95 428 306 106 161 110 107 298 131 -326
2242 -326 581 -7 -306 -49 94 -116 -178 436 -527 207 -224 -20 471 -36 199 233 541 405 102 -11 -184
2263 -184 -17 41 -623 -326 -509 -397 -67 -140 -234 -267 -499 130 95 -239 440 -103 -322 149 268 15 -145 301
2285 301 -75 496 10 158 162 -32 -68 -297 275 -200 -23 290 -301 310 83 80 -5 672 37 -183 -112 -527
2307 -527 -30 265 312 217 313 202 174 99 -148 210 -46 -240 147 -174 64 -113 120 448 7 456 -284 -61
2329 -61 -20 -206 339 281 -197 -225 -219 -291 -510 289 810 399 -28 -506 -232 327 387 420 10 -48 246 -180 11
2352 11 -193 475 219 -342 -229 -177 573 379 192 320 -44 208 47 414 -27 -21 -437 -67 -37 368 81 252
2374 252 881 20 453 255 -123 213 -20 -329 318 -287 -460 -229 -321 370 -131 29 -133 410 -442 -136
$$ packed form
2220b07O07o21J43J00L41j40k73K09l83N23n74K46o6N23j22k00N5n1lJ91j67m57
2242c26R07n88k99K57J43k10o2O14r63P34m31K04M91n07K35L4L08j36l03j13j73
2263a84J67N8o64K97j83J12L30p3r4l3k32O29l5l34O79n43k19M71J19k53j60M46
2285C01l76N71m86J48Mj94l6k29N72m75J77L13n91O11k27lq5O77o35k20P1m15
2307e27M97K95M7r5R6j11k8p5k47L58k56j94L87l21K38j77K33L28m41M49p40K23
2329f1M1j86N45n8m78k8Op2k19P99N21m11m27m78K74N59O0L3m10n8K94m26J91
2352A1k04O68k56n61J13N2P50j94j87J28l64K52j61L67m41Om16L70L0M05k87J71
2374B52O29q61M33j98l78L36k33l09O47o05j73K31r2O91n01J60j62N43q52L06
$$ plain form
2394 -136 269 153 -185 -186 -78 -477 149 300 -362 -199 328 -220 -76 -243 106 -428 -346 563 -202 -334 267
2415 267 -199 -241 74 -191 -54 47 -20 -384 308 354 -196 -163 152 -31 -75 -137 272 -554 112 -12 -253 79
2437 79 792 70 -33 -400 -190 -99 256 126 -299 45 153 -194 -18 85 -73 265 175 103 -325 -420 44 235
2459 235 -227 293 -38 20 43 -234 133 -381 -143 158 12 225 240 309 -228 128 330 -95 272 234 61 430
2481 430 -131 368 251 -149 -402 -143 -121 -21 -90 -133 181 -299 -11 120 -167 -180 -363 -266 393 379 270 6
2503 6 -84 -23 121 -467 20 -319 -368 -66 -37 -155 -15 191 432 -288 103 -18 -280 -90 -411 293 -16 -50
2525 -50 -309 90 -392 -78 -46 -110 -211 111 526 333 436 218 363 267 -230 -186 -167 424 -289 -121 274 -188
2547 -188 88 -223 -78 -369 356 -559 -198 84 566 -243 -343 572 416 -376 -32 -58 -162 -71 48 490 396
$$ packed form
2394a36M05j16l38jJ08l99O26J51o62J63N27n48J44j67L49n34Q2R09p65j32O01
2415B67m66m2L15k65J37J01o7l64O92M6n50L3L15j83m4o2M09q26O66j24k41L32
2437G9P13p22j03l67K10R1L55j30m25L44J08l47J76J03j58L38r0p2m28r5M64J91
2459B35m62N20l31N8K3k77L67n14K38L01j46K13J5O9n37L56K02m25L67l8j73L69
2481D30n61M99j17m00k53K59K2J00o9m3L14m80K88J31k87j3j83R7O59j4j09k64
2503Fr0O1J44n88M87l39m9L02K9j18J40K06K41p20L91j21k62J90l21P04l09l4
2525e0k59L99m82L14L2o4j01L22M15j93J03k18J45r6m97M4J9N91p13J68L95m62
2547a88K76l11J45k91P25r15L61K82M82q09j00R15j56p92L44k6j04R1J19M42r4
$$ plain form
2568 396 86 193 64 -318 137 -124 -39 -99 191 -264 437 -443 132 -190 -352 439 -251 -45 -328 -76 588
2589 588 235 131 294 -328 302 -252 -153 660 -532 -22 179 -312 -228 -191 -161 171 -175 -214 -52 345 280 239
2611 239 -355 -252 139 26 136 -25 -620 491 -176 269 -91 -243 356 -164 779 -126 358 -258 -95 63
2631 63 -84 108 -47 113 -38 -120 48 -595 176 -39 6 -47 -225 163 259 -312 60 304 48 -245 -5 233
2653 233 -233 335 -368 51 27 188 -146 -337 -177 236 402 50 -314 3 366 110 -59 -454 97 112 -70
2674 -70 -109 233 0 -160 -162 86 69 -393 181 -12 -1 -354 -41 252 -200 -287 -83 -27 -256 -258 -504 64 307
2697 307 550 223 -29 -91 -160 -73 155 258 126 -366 -256 -338 198 -514 170 9 103 -45 109 -531 372 -218
2719 -218 -233 -132 -3 74 -149 60 -124 -46 64 -116 -253 -393 -21 372 -57 -265 146 21 281 52 185
$$ packed form
2568C96l10J07j29l82M55k61Q5o0K90m55P01q80N75l22j62P91o90K06k83K52O64
2589E88l53j04J63o22O30n54R9Q13j192N10K01m91Q4L7L0L32l46l9J62L97o5m1
2611B39n94J03L91j13J10j61n95J111o67M45l60j52N99n20R43r05M84o16J63J58
2631F3j47J92j55J60j51q2J68o43P71k15M5n3j78L88R6n71L72K44k56k93K40K38
2653B33m66N68p03M19k4J61l34j91J60M13J66l52l64L17L63k56j69l95N51J5j82
2674g0l9L42k33j60kK48j7m62N74j93J1l53L13K93m52q7K04N6k29kk46N68K43
2697C07K43l27k52o2o9Q7K28J03j32m92J10q2N36p12O84j61R4j48J54o40R03n90
2719b18j5J01J29P7k23K09j84P8J10j80j37j40L72L93m29k08M11j25K60k29J33
$$ plain form
2740 185 158 -51 50 -89 -421 -147 171 -275 422 309 -159 -382 -898 -124 -37 210 -46 196 99 10 -69 86
2762 86 191 -426 398 231 107 -363 -186 -119 439 279 -162 -40 -494 -26 228 -514 -219 139 -109 -115 -426
2783 -426 180 104 -437 -503 609 -92 -366 139 367 -84 -724 587 5 172 -192 -198 200 -29 321 -430 36
2804 36 8 -480 78 -140 391 -76 -73 -378 -66 -230 810 350 368 258 -27 -49 418 -228 -62 119 -107 20
2826 20 -43 421 -186 68 22 140 321 -264 1 -590 64 236 -153 -146 -23 275 23 -389 -67 433 60 31
2848 31 355 -82 -87 -483 94 -152 -119 438 243 307 112 -18 294 106 -282 36 241 -566 459 -8 -40 -260
2870 -260 314 -434 -148 186 548 327 283 120 548 243 -301 -289 -134 62 -34 248 -158 -154 250 -255 -103 -27
2892 -27 186 -99 -65 91 -474 636 -426 -421 225 -82 29 32 -287 -90 -138 -17 38 -82 248 -246 426 673
$$ packed form
2740A85k7k09J01j39l32K74L18m46O97j13m68k23n16P74Q7K47k56K42r7q9p9J55
2762H6J05o17Q24j67j24m70J77O7N58j60m41J22m54M68K54p42K95L58k48ol11
2783d26O06p6n41o6J112p01k74N05K28m51o40J311n82J67l64oL98k29L50p51M66
2804C6k8m88N58k18N31m67Ll05L12j64J040m60J8j10k85k2M67o46J66J81k26J27
2826B0o3M64o07K54m6J18J81n85K65n91O54J72l89PJ23K98k52m12L22N00l73k9
2848C1L24m37nl96N77k46L3N57j95O4j95j30L12j88l88L18K05q07J025m67l2k20
2870b60N74p48K86L34L62k21m4j63M28l05n44J2J55J96r6K82m06MM04n05J52P6
2892b7K13k85L4J56n65J110j062NO46l07J11Ll19J97m8J21N5j20L30m94O72K47
$$ plain form
2914 673 -118 -62 198 -19 -434 334 -165 82 9 29 544 123 146 42 480 -129 611 -387 -73 18 -340 -39
2936 -39 86 246 481 387 476 55 29 -44 -315 -420 71 279 140 -91 -148 -193 -390 453 -425 -382 21 225 44
2959 44 340 446 126 -286 129 -492 25 -214 65 249 121 -299 372 -231 -87 -64 -261 -95 -159 64 133
2980 133 130 22 -150 92 135 627 19 310 452 -92 -107 654 -57 132 246 308 180 -9 218 317 -246 -210
$$ packed form
2914F73p91N6K60k17m15P68m99K47p3K0N15m21K3j04M38o09P40r98L14R1l58L01
2936c9J25J60K35r4Q9m21k6p3k71j05M91K08j39k31n7m5j97Q43q78M3M03K04j81
2959D4K96J06l20m12M15o21N17k39K79J84j28m20O71o03J44K3j97J66o4K23O9
2980A33lj08j72K42M3M92o08K91J42n44j5P61p11J89J14O2j28j89K27R9n63L6
$$ [...]
8191a43
##END NTUPLES=NMR FID
##END=
