##TITLE=1H ikalashn
DE-75_oil
11.11.2024
##JCAMPDX= 6.0         $$ Bruker NMR JCAMP-DX V2.0
##DATA TYPE= NMR FID
##DATA CLASS= NTUPLES
##ORIGIN= UXNMR, Bruker Analytische Messtechnik GmbH
##OWNER= root
$$ TOPSPIN		Version 1.3
$$ 2024-11-11 16:23:46.625 +0400  Irina@DPX200
$$ Compression mode = diff/dup
##.OBSERVE FREQUENCY= 200.131300845
##.OBSERVE NUCLEUS= ^1H
##.DELAY= (6, 6)
##.ACQUISITION MODE= SIMULTANEOUS
##.ACQUISITION SCHEME= undefined
##.AVERAGES= 64
##.DIGITISER RES= 18
##SPECTROMETER/DATA SYSTEM= spect
##.PULSE SEQUENCE= zg
##.SOLVENT NAME= D2O
##.SHIFT REFERENCE= INTERNAL, D2O, 1, 17.49637
##AUDIT TRAIL= $$ (NUMBER, WHEN, WHO, WHERE, WHAT)
$$ ##TITLE= Audit trail, TOPSPIN		Version 1.3
$$ ##JCAMPDX= 5.01
$$ ##ORIGIN= Bruker BioSpin GmbH
$$ ##OWNER= Irina
$$ $$ F:/spectra/data/iren/nmr/1H/4/audita.txt
$$ ##AUDIT TRAIL=  $$ (NUMBER, WHEN, WHO, WHERE, VERSION, WHAT)
(   1,<2024-11-11 16:23:08.078 +0400>,<Irina>,<DPX200>,<TOPSPIN 1.3>,
      <created by zg
	started at 2024-11-11 16:18:55.328 +0400,
	POWCHK disabled, PULCHK disabled
       configuration hash MD5:
       BE 6D 3F 07 2A EA 11 49 91 17 2B D3 AF B3 58 0D
       data hash MD5: 16K
       0D 8D 03 5F 13 10 04 10 6B F3 8A 5E A3 47 08 32>)
$$ ##END=
$$ 
$$ $$ hash MD5
$$ $$ 85 7B F7 80 8B E3 1F C8 AE EA 2A B1 93 B0 D8 91
##$RELAX= 
##$RELAX= 
##$RELAX= 
##$RELAX= 
##$RELAX= 
##$RELAX= 
##$RELAX= 
##$RELAX= 
##$RELAX= 
$$ Bruker specific parameters
$$ --------------------------
##$DU= <F:/spectra>
##$EXPNO= 4
##$NAME= <1H>
##$PROCNO= 1
##$TYPE= <nmr>
##$USER= <iren>
##$AMP= (0..31)
100 100 100 100 100 100 100 100 100 100 100 100 100 100 100 100 100 100 
100 100 100 100 100 100 100 100 100 100 100 100 100 100 
##$ANAVPT= -1
##$AQSEQ= 0
##$AQ_mod= 1
##$AUNM= <au_zg>
##$AUTOPOS= <>
##$BF1= 200.13
##$BF2= 200.13
##$BF3= 200.13
##$BF4= 200.13
##$BF5= 200.13
##$BF6= 200.13
##$BF7= 200.13
##$BF8= 200.13
##$BYTORDA= 1
##$CFDGTYP= 0
##$CFRGTYP= 5
##$CHEMSTR= <none>
##$CNST= (0..63)
1 1 145 1 1 1 1 1 1 1 1 1 1 1 1 1 1 1 1 1 1 1 1 1 1 1 1 1 1 1 1 1 1 1 
1 1 1 1 1 1 1 1 1 1 1 1 1 1 1 1 1 1 1 1 1 1 1 1 1 1 1 1 1 1 
##$CPDPRG= <>
##$CPDPRG1= <>
##$CPDPRG2= <>
##$CPDPRG3= <>
##$CPDPRG4= <mlev>
##$CPDPRG5= <mlev>
##$CPDPRG6= <mlev>
##$CPDPRG7= <mlev>
##$CPDPRG8= <mlev>
##$CPDPRGB= <>
##$CPDPRGT= <>
##$D= (0..63)
0 2 0 0 0 0 0 0 0 0.06 0 0.03 0 0 0 0 0.0002 0 0 0 0 0 0 0 0 0 0 0 0 0 
0 0 0 0 0 0 0 0 0 0 0 0 0 0 0 0 0 0 0 0 0 0 0 0 0 0 0 0 0 0 0 0 0 0 
##$DATE= 1731327787
##$DBL= (0..7)
120 120 120 120 120 120 120 120 
##$DBP= (0..7)
150 150 150 150 150 150 150 150 
##$DBP07= 0
##$DBPNAM0= <>
##$DBPNAM1= <>
##$DBPNAM2= <>
##$DBPNAM3= <>
##$DBPNAM4= <>
##$DBPNAM5= <>
##$DBPNAM6= <>
##$DBPNAM7= <>
##$DBPOAL= (0..7)
0.5 0.5 0.5 0.5 0.5 0.5 0.5 0.5 
##$DBPOFFS= (0..7)
0 0 0 0 0 0 0 0 
##$DE= 6
##$DECBNUC= <off>
##$DECIM= 32
##$DECNUC= <off>
##$DECSTAT= 4
##$DIGMOD= 1
##$DIGTYP= 9
##$DL= (0..7)
0 120 120 120 120 120 120 120 
##$DP= (0..7)
150 150 150 150 150 150 150 150 
##$DP07= 0
##$DPNAME0= <>
$$ [...]
##$SW= 21.9926040160658
##$SWIBOX= (0..15)
0 0 2 0 0 0 0 0 0 0 0 0 0 0 0 0 
##$SW_h= 4401.40845070422
##$TD= 16384
##$TD0= 1
##$TE= 300
##$TE2= 300
##$TE3= 300
##$TEG= 300
##$TL= (0..7)
0 120 120 120 120 120 120 120 
##$TP= (0..7)
150 150 150 150 150 150 150 150 
##$TP07= 0
##$TPNAME0= <>
##$TPNAME1= <>
##$TPNAME2= <>
##$TPNAME3= <>
##$TPNAME4= <>
##$TPNAME5= <>
##$TPNAME6= <>
##$TPNAME7= <>
##$TPOAL= (0..7)
0.5 0.5 0.5 0.5 0.5 0.5 0.5 0.5 
##$TPOFFS= (0..7)
0 0 0 0 0 0 0 0 
##$TUNHIN= 0
##$TUNHOUT= 0
##$TUNXOUT= 0
##$USERA1= <user>
##$USERA2= <user>
##$USERA3= <user>
##$USERA4= <user>
##$USERA5= <user>
##$V9= 5
##$VALIST= <valist>
##$VCLIST= <CCCCCCCCCCCCCCC>
##$VD= 0
##$VDLIST= <DDDDDDDDDDDDDDD>
##$VPLIST= <PPPPPPPPPPPPPPP>
##$VTLIST= <TTTTTTTTTTTTTTT>
##$WBST= 1024
##$WBSW= 25
##$XGAIN= (0..3)
0 0 0 0 
##$XL= 0
##$YL= 0
##$YMAX_a= 1641877
##$YMIN_a= -1178854
##$ZGOPTNS= <>
##$ZL1= 120
##$ZL2= 120
##$ZL3= 120
##$ZL4= 120
##$ABSF1= 10
##$ABSF2= 0
##$ABSG= 5
##$ABSL= 3
##$ALPHA= 0
##$AQORDER= 0
##$ASSFAC= 0
##$ASSFACI= 0
##$ASSFACX= 0
##$ASSWID= 0
##$AUNMP= <proc_1d>
##$AXLEFT= 0
##$AXRIGHT= 0
##$AXTYPE= 0
##$AXUNIT= <>
##$AZFE= 0.1
##$AZFW= 0.1
##$BCFW= 1
##$BC_mod= 2
##$BYTORDP= 1
##$COROFFS= 0
##$CY= 7568.61572265625
##$DATMOD= 1
##$DC= 2
##$DFILT= <>
##$DTYPP= 0
##$F1P= 17.9538593292236
##$F2P= -4.03888763876832
##$FCOR= 0.5
##$FTSIZE= 32768
##$FT_mod= 4
##$GAMMA= 1
##$GB= 1
##$INTBC= 1
##$INTSCL= 1
##$ISEN= 128
##$LB= 0.02
##$LEV0= 0
##$LPBIN= 0
##$MAXI= 945.577
##$MC2= 0
##$MEAN= 0
##$ME_mod= 0
##$MI= -402.1523
##$NCOEF= 0
##$NC_proc= 0
##$NLEV= 6
##$NOISF1= 8.587773
##$NOISF2= 6.764455
##$NSP= 1
##$NTH_PI= 0
##$NZP= 0
##$OFFSET= 17.49637
##$PC= 1
##$PHC0= 110.6478
##$PHC1= 10.25597
##$PH_mod= 0
##$PKNL= yes
##$PPARMOD= 0
##$PPDIAG= 0
##$PPIPTYP= 0
##$PPMPNUM= 100
##$PPRESOL= 1
##$PSCAL= 0
##$PSIGN= 0
##$REVERSE= no
##$SF= 200.13
##$SI= 32768
##$SIGF1= 18.5376
##$SIGF2= -6.396296
##$SINO= 400
##$SIOLD= 32768
##$SREGLST= <1H.CDCl3>
##$SSB= 3
##$STSI= 0
##$STSR= 0
##$SW_p= 4401.40845070422
##$SYMM= 0
##$S_DEV= 0
##$TDeff= 0
##$TDoff= 0
##$TI= <>
##$TILT= no
##$TM1= 0
##$TM2= 0
##$TOPLEV= 0
##$USERP1= <user>
##$USERP2= <user>
##$USERP3= <user>
##$USERP4= <user>
##$USERP5= <user>
##$WDW= 1
##$XDIM= 8192
##$YMAX_p= 0
##$YMIN_p= 0
$$ End of Bruker specific parameters
$$ ---------------------------------
##NTUPLES= NMR FID
##VAR_NAME=  TIME,          FID/REAL,        FID/IMAG
##SYMBOL=    X,             R,               I
##VAR_TYPE=  INDEPENDENT,   DEPENDENT,       DEPENDENT
##VAR_FORM=  AFFN,          ASDF,            ASDF
##VAR_DIM=   8192,          8192,            8192
##UNITS=     SECONDS,       ARBITRARY UNITS, ARBITRARY UNITS
##FACTOR=    0.0002272,     1,               1
##FIRST=     0,             0,               0
##LAST=      1.8609952,     190,             27
##MIN=       0,             -1178854,        -1178854
##MAX=       1.8609952,     1641877,         1641877
$$ Real data points
##PAGE= N=1
##DATA TABLE= (X++(R..R)), XYDATA
$$ [...]
$$ plain form
2286 -1699 -1738 -1217 -439 1096 1633 2069 1742 1423 270 -687 -1821 -1614 -1557 -1212 -734 99 1288 1699 1651
2305 1651 1671 327 -120 -1459 -1751 -1697 -1377 -335 -90 1364 1366 1726 1262 717 149 -953 -1962 -1575 -1676
2324 -1676 -1443 -39 355 1620 1994 1598 1209 -115 -1106 -1504 -1527 -1271 -1176 299 583 855 1889 1630 1411
2343 1411 524 -608 -1588 -1568 -1272 -1373 -406 448 1087 1543 1345 1212 110 122 -860 -1841 -1776 -1222 -685 45
2363 45 795 1633 1493 1440 1240 490 -553 -1677 -1124 -1590 -876 -496 561 1384 1490 1791 1309 50 -768
2382 -768 -1608 -1556 -1446 -1362 -427 444 1065 1635 1776 1253 658 -456 -931 -1113 -1441 -1573 -724 277 693 1281
2402 1281 1755 1522 1206 -529 -1002 -1589 -2120 -946 -857 -40 762 1079 1444 1303 891 82 -826 -1395 -1252
2421 -1252 -1562 -651 -237 184 990 1270 1233 674 567 -247 -663 -1421 -1443 -970 -736 198 932 991 996 1183 799
$$ packed form
2286a699l9N21P78J535N37M36l27l19j153r57j134K07N7L45M78Q33J189M11m8
2305A651K0j344m47j339k92N4L20J042K45J454KL60m64n45n68j102j009L87j01
2324a676K33J404L94J265L74l96l89j324r91l98k3K56R5J475K84K72J034k59k19
2343A411q87j132r80K0K96j01R67Q54O39M56j98j33j102J2r82r81O5N54N37P30
2363D5P50Q38j40n3k00p50j043j124N53m66P14L80J057Q23J06L01m82j259q18
2382g68q40N2J10Q4R35Q71O21N70J41n23n95j114m75j82l28j32Q49J001M16N88
2402A281M74k33l16j735m73n87n31J174Q9Q17Q02L17L65j41m12q09r08n69J43
2421a252l10R11M14M21Q06K80l7n59j07q14m16p58k2M73K34R34P34N9NJ87l84
$$ plain form
2442 799 -12 -1068 -1407 -1142 -1339 -608 320 1099 1245 1994 1302 969 -109 -822 -1316 -1377 -1060 -1070 -76 866
2462 866 919 1449 979 802 532 -281 -576 -1185 -1302 -999 -705 327 1016 1578 1279 922 527 -526 -488 -1389
2482 -1389 -1086 -767 -604 224 1047 790 1368 931 493 0 -515 -1295 -1204 -1048 -1106 -260 201 1052 1473 1250
2502 1250 945 541 -204 -980 -1266 -1389 -1097 -414 9 1065 1283 1092 1314 579 36 -1349 -1195 -1633 -1129
2521 -1129 -1202 208 1198 1115 1586 1162 323 -103 -816 -753 -2023 -1470 -546 -420 1037 1017 1000 1005 509 119 -288
2542 -288 -1120 -1224 -1302 -775 -439 -98 814 1349 980 1305 157 -317 -745 -1212 -1478 -721 -639 222 865 1510
2562 1510 1079 1287 721 -39 -645 -946 -1368 -1282 -1075 72 887 1069 1554 1480 592 60 -587 -761 -1393 -1127
2582 -1127 -719 -495 214 1189 1169 1200 1221 455 -183 -644 -1355 -1468 -1141 -482 587 815 1255 1102 1172 682 112
$$ packed form
2442G99q11j056l39K65j97P31R28P79J46P49o92l33j078p13m94o1L17j0R94R42
2462H66N3N30m70j77k70q13k95o09j17L03K94J032O89N62k99l57l95j053L8r01
2482a389L03L19J63Q28Q23k57N78m37m38m93n15p80R1J56n8Q46M61Q51M21k23
2502A250l05m04p45p76k86j23K92O83M23J056K18j91K22p35n43j385J54m38N04
2521a129p3J410R90q3M71m24q39m26p13O3j270N53R24J26J457k0j7Nm96l90m07
2542b88q32j04p8N27L36L41R12N35l69L25j148m74m28m67k66P57Q2Q61O43O45
2562A510m31K08n66p60o06l01m22Q6K07J147Q15J82M85p4q88n32o47j74o32K66
2582a127M08K24P09R75k0L1K1p66o38m61p11j13L27O59J069K28M40j53P0m90n70
$$ plain form
2603 112 -651 -1211 -1300 -1144 -327 -175 735 759 1291 1202 1087 -33 -454 -1365 -1153 -1062 -906 -51 261 1395 1515
2624 1515 1383 776 167 -400 -1514 -1444 -1521 -1185 -387 147 678 1043 933 1182 633 224 -808 -369 -1274 -1109
2644 -1109 -664 -273 524 1005 1052 1208 1072 20 -717 -878 -1372 -1124 -620 -399 37 786 1390 1334 763 229
2664 229 226 -692 -1310 -1496 -1219 -400 95 1081 1072 1368 1144 127 -639 -1033 -539 -1036 -974 -581 -360 653 1264
2685 1264 1212 1159 639 -548 -821 -1358 -648 -1271 -1214 -247 769 1032 1188 1224 623 189 -16 -545 -1241 -1523
2705 -1523 -1102 -114 -3 404 674 1158 817 59 170 -798 -1170 -851 -1155 -417 169 699 627 1646 1045 777
2725 777 32 -565 -426 -1284 -1216 -732 -88 537 997 1116 1512 801 95 -353 -1176 -716 -633 -717 -595 178 474
2746 474 466 994 1143 396 -191 -511 -1165 -1793 -1029 -871 81 1029 1037 976 1053 325 43 -38 -889 -1196 -950 -483
$$ packed form
2603A12p63n60q9J56Q17J52R10K4N32q9j15j120m21r11K12R1J56Q55L12J134J20
2624A515j32o07o09n67j114P0p7L36P98N34N31L65j10K49n49m09j032M39r05J65
2644a109M45L91P97M81M7J56j36j052p37j61m94K48N04K21M36P49O04n6n71n34
2664B29lr18o18j86K77Q19M95R86rK96k24j017p66l94M94m97O2L93K21J013O11
2685A264n2n3n20j187k73n37P10o23N7R67J016K63J56L6o01m34k05n29o96k82
2705a523M21R88J11M07K70M84l41p58J11r68l72L19l04P38N86N30p2J019o01k68
2725G77p45n97J39q58O8M84O44O25M60J19L96p11p06m48q23M60Q3q4J22P73K96
2746D74qN28J49p47n87l20o54o28P64J58R52R48Qo1P7p28k82q1q51l07K46M67
$$ plain form
2768 -483 -221 709 1042 1278 1065 667 249 -179 -421 -1216 -1039 -1256 184 192 457 981 917 913 334 -420 -902
2789 -902 -792 -809 -951 -543 170 539 1349 1647 1559 433 95 -251 -935 -1357 -1169 -541 157 785 1227 1330
2809 1330 996 754 206 -28 -594 -1116 -802 -814 -670 -14 1046 1330 1115 991 144 -207 -640 -1263 -1115 -596
2829 -596 -420 266 232 958 1387 835 521 153 -669 -889 -933 -562 -437 -440 682 638 1013 782 333 -94 -103 -809
2851 -809 -565 -1056 -1009 -587 106 360 906 1012 987 403 163 -505 -1316 -398 -534 -411 110 857 1089 1302 208
2872 208 498 -89 -238 -1096 -827 -823 -442 -530 722 1101 811 853 -36 42 -179 -1181 -995 -1496 -608 -212 113
2893 113 301 745 921 564 322 -62 -761 -943 -1032 -543 -381 431 465 660 725 744 481 314 -194 -860 -721
2914 -721 -693 -217 -14 -142 387 973 426 674 235 -374 -674 -620 -704 -580 -255 504 1017 527 1161 78 320
$$ packed form
2768d83K62R30L33K36k13l98m18m28k42p95J77k17J440QK65N24o4mn79p54m82
2789i02J10j7j42M08P13L69Q10K98q8j126l38l46o84m22J88O28O98O28M42J03
2809A330l34k42n48k34n66n22L14j2J44O56J060K84k15j24q47l51m33o23J48N19
2829e96J76O86l4P26M29n52l14l68q22k20m4L71J25lJ122m4L75k31m49m27rp06
2851h09K44m91M7M22O93K54N46J06k5n84k40o68q11R18j36J23N21P47K32K13j094
2872B08K90n87j49q58K69ML81q8J252L79k90M2q89P8k21j002J86n01Q88L96L25
2893A13J88M44J76l57k42l84o99j82q9M89J62Q12L4J95O5J9k63j67n08o66J39
2914g21K8M76K03j28N29N86n47K48m39o09l00N4q4J24L25P59N13m90O34j083K42
$$ plain form
2935 320 -179 -168 -991 -602 -688 -461 -287 585 469 635 656 132 -324 -170 -418 -617 -537 -6 -275 -69 781
2956 781 875 1284 587 51 -175 -897 -780 -408 -472 -81 144 376 557 826 340 271 19 -533 -684 -788 -576
2977 -576 -767 -151 930 1100 495 965 220 -286 -764 -791 -903 -841 -614 -846 689 404 447 327 127 168 -67
2998 -67 -979 -302 -213 -533 -37 248 520 499 707 493 -108 434 -826 -637 -666 -197 -191 299 381 272 617 367
3020 367 207 -37 -398 -288 -276 -570 -636 317 494 362 -37 796 -139 209 76 -384 -454 -279 -463 27 430
3041 430 386 692 234 729 111 129 -190 -829 -381 -697 170 -15 -11 665 696 350 271 545 -504 -1132 -324 -597
3063 -597 -282 -24 454 530 491 348 408 -145 -436 -143 -281 -274 -445 142 363 699 927 574 417 -540 -75 -226
3085 -226 -568 -65 -233 -307 114 402 708 513 624 292 -193 -63 -41 -569 -321 -73 382 77 241 705 543
$$ packed form
2935C20m99J1q23L89q6K27J74Q72j16J66K1n24m56J54k48j99Q0N31k69K06Q50
2956G81R4M09o97n36k26p22J17L72o4L91K25K32J81K69m86o9k52n52j51j04K12
2977e76j91O16J081J70o05M70p45n06m78k7j12O2K27k32J535k85M3j20k00M1k35
2998f7r12O77Q9l20M96K85K72k1K08k14o01N42j260J89k9M69OM90Q2j09L45k50
3020C67j60k44l61J10J2k94o6R53J77j32l99Q33r35L48j33m60p0J75j84M90M03
3041D30m4L06m58M95o18J8l19o39M48l16Q67j85MO76L1l46p9K74j049o28Q08k73
3063e97L15K58M78P6l9j43O0n53k91K93j38Pj71N87K21L36K28l53j57r57M65j51
3085b26l42N03j68p4M21K88L06j95J11l32m85J30K2n28K48K48M55l05J64M64j62
$$ plain form
3106 543 504 -205 -455 -580 -635 -435 -131 -133 135 435 664 650 106 375 625 -63 -194 214 -95 -516 127 356
3128 356 397 393 14 402 -172 365 -565 -563 -141 -97 -162 -358 635 813 242 -202 77 -91 -136 -427 -349 -297 45
3151 45 36 590 -60 716 -438 299 47 -363 -199 -1013 60 -440 5 100 283 515 276 -167 94 -108 -720
3172 -720 61 -331 -27 75 60 331 497 160 -55 -305 7 -568 -387 -152 -93 -534 231 459 243 323 320 109
3194 109 144 -202 -542 -105 -318 -158 202 550 -138 -3 77 229 387 -559 -371 -696 267 -36 150 -182 149
3215 149 148 221 174 35 -454 -268 -159 -120 -330 7 177 211 637 450 -5 155 105 -286 -233 -573 -92 -391 -49
3238 -49 -211 419 740 424 -93 -107 -124 -158 -51 -412 -359 -165 96 -1 -34 7 -212 -113 -401 -177 -207 398 57
3261 57 73 135 -23 -281 367 -238 -107 152 169 -132 -253 -490 -586 -64 235 496 172 132 314 -297 -252 -375
$$ packed form
3106E43l9p09k50j25n5K00L04kK68L00K29j4n44K69K50o88j31M08l09m21O43K29
3128C56M1ml79L88n74N37r30KM22M4o5j96R93J78n71m44K79j68m5k91P8N2L42
3151D5rN54o50P76j154P37k52m10J64q14J073n00M45R5J83K32k39m43K61k02o12
3172g20P81l92L04J02j5K71J66l37k15k50L12n75J81K35N9m41P65K28k16Q0lk11
3194A09L5l46l40M37k13J60L60L48o88J35Q0J52J58r46J88l25R63l03J86l32L31
3215A49jP3m7j39m89J86J09L9k10L37J70L4M26j87m55J60n0l91N3l40M81k99L42
3238d9j62O30L21l16n17j4j7l4J07l61N3J94K61r7l3M1k19R9k88K24l0O05l41
3261E7J6O2j58k58O48o05J31K59J7l01j21k37r6N22K99K61l24m0J82o11M5j23
$$ plain form
3283 -375 -63 -209 101 159 420 197 439 167 -20 -139 88 157 -837 -392 4 -336 484 66 756 179 -58
3304 -58 68 419 -225 -689 278 -96 -32 387 345 -158 657 -199 -392 -259 119 -30 8 105 161 -187 356 228
3326 228 529 214 138 -380 9 205 -157 -185 -361 -315 198 38 -75 -89 467 234 -118 -131 -196 9 -713 -140
3348 -140 99 61 444 472 51 342 -348 -269 -315 -478 -62 -423 -233 -115 249 -151 17 130 5 55 141 -120
3370 -120 289 -268 -205 99 -209 -302 411 -84 258 341 -203 -118 -38 -37 146 71 184 146 451 351 -144 -81 -45 -252
3394 -252 -111 33 -309 320 461 372 -48 418 -111 256 -629 -611 -162 -216 -49 491 -311 288 -20 124 -19
3415 -19 -285 20 -348 -727 -167 -222 -108 137 142 355 368 -314 85 32 -541 -185 -133 -379 -43 317 191 323
3437 323 52 36 46 -339 -350 -62 -583 -345 -417 345 18 369 -98 -80 -286 -200 286 -47 -435 -264 383 -206
$$ packed form
3283c75L12j46L10N8K61k23K42k72j87j19K27O9r94M45L96l40Q20m18O90n77k37
3304e8J26L51o44m64R67l74O4M19m2n03Q15q56j93J33L78j49L8R7N6l48N43j28
3326B28L01l15p6n18L89J96l62k8j76M6N13j60j13j4N56k33l52j3o5K05p22N73
3348a40K39l8L83K8m21K91o90P9m6j63M16l61J90J18L64m00J68J13j25N0Q6k61
3370a20M09n57O3L04l08r3P13m95L42Q3n44Q5Q0JJ83p5J13l8L05j00m95O3L6k07
3394b52J41J44l42O29J41q9m20M66n29L67q85J8M49n4J67N40q02N99l08J44j43
3415a9k66L05l68l79N60n5J14K45NK13J3o82L99n3n73L56N2k46L36L60j26J32
3437C23k71j6J0l85j1K88n21K38p2P62l27L51m67J8k06Q6M86l33l88J71O47n89
$$ plain form
3459 -206 466 76 -124 138 461 -153 195 -368 -499 -116 158 -257 -55 82 346 341 214 179 170 -330 -543 -143
3481 -143 -252 -195 383 291 699 199 658 534 -137 -337 -632 217 -502 -626 69 294 -306 230 392 109 -616
3502 -616 -135 29 -386 76 42 -169 -367 -108 50 -92 148 -84 -319 297 -230 -243 -232 330 -1 -71 304
3523 304 282 506 138 -30 27 -352 -39 292 -307 281 -284 31 118 61 513 24 328 -775 -60 341 -551
3544 -551 242 -183 237 279 91 459 -112 -252 -64 -507 -90 -158 -360 -60 174 253 323 708 -79 225 -415
3565 -415 -664 -167 -488 69 177 100 205 406 292 -14 250 -332 -91 -393 -268 -129 -11 283 611 527 -83
3586 -83 161 177 -104 -54 -315 -321 -280 483 261 710 174 -71 427 163 322 -229 -99 -21 110 -461 -228 421
3608 421 -153 -31 235 177 -34 -219 378 -125 -439 181 -76 -178 371 477 -310 -448 391 -83 -292 131
$$ packed form
3459b06O72l90k00K62L23o14L48n63j31L83K74m15K02J37K64nj27l5rn00k13M00
3481a43j09N7N78r2M08n00M59j24o71k00k95Q49p19j24O95K25o00N36J62k83p25
3502f16M81J64m15M62l4k11j98K59J58j42K40k32k35O16n27j3J1N62l31p0L75
3523C04k2K24l68j68N7l79L13L31n99N88n65L15Q7n7M52m89L04j103P15M01q92
3544e51P93m25M20M2j88L68n71j40J88m43M17o8k02L00K34P9P0L85p87L04o40
3565d15k49M97l21N57J08p7J05K01j14l06K64n82K41l02J25J39J18K94L28q4o10
3586h3K44J6k81N0k61oM1P63k22M49n36k45M98k64J59n51J30P8J31n71K33O49
3608D21n74J22K66n8k11j85N97n03l14O20k57j02N49J06p87j38Q39m74k09M23
$$ plain form
3628 131 44 -93 44 -165 -108 257 150 -139 56 -319 212 417 -152 -59 -41 215 23 -424 116 -187 124
3649 124 33 603 -110 -342 30 -251 18 136 234 120 -553 168 -95 -166 256 393 -20 125 121 202 -85 -264
3671 -264 -254 -49 -445 -431 -259 -36 58 -258 -485 -273 613 56 77 239 -63 83 -103 101 -151 18 -132
3692 -132 24 88 190 -216 -46 402 204 192 -228 -386 298 -21 -67 400 72 315 -145 -293 495 176 -366
3713 -366 81 -302 79 -188 212 -48 -346 592 -281 202 223 15 259 -133 111 317 -218 71 -30 64 -218
3734 -218 50 259 64 113 115 -454 306 553 0 493 -74 -525 177 -150 -500 192 -565 85 190 -34 -306
3755 -306 -174 97 21 -68 -205 -32 -139 118 184 -47 -278 118 427 93 87 -7 324 258 261 -155 142 193 223 36
3779 36 70 183 4 228 -96 -198 -17 -48 449 -193 -314 -177 447 284 27 194 -260 -183 -400 -124 242
$$ packed form
3628A31q7j37J37k09N7L65j07k89J95l75N31K05n69R3J8K56j92m47N40l03L11
3649A24r1N70p13k32L72k81K69J18R8j14o73P21k63p1M22J37m13J45mQ1k87j79
3671b64J0K05l96J4J72K23R4l16k27K12Q86n57K1J62l02J46j86K04k52J69j50
3692a32J56O4J02m06J70M48j98j2m20j58O84l19m6M67l28K43m60j48P88l19n42
3713c66M47l83L81k67M00k60k98R38q73M83K1k08K44l92K44K06n35K89j01R4k82
3734b18K68K09j95M9Kn69P60K47n53M93n67m51P02l27l50O92p57O50J05k24k72
3755c06J32K71p6q9j37J73j07K57O6k31k31L96L09l34or4L31o6Lm16K97N1L0j87
3779C6L4J13j79K24l24j02J81l1M97o42j21J37O24j63k57J67m54P7k17K76L66
$$ plain form
3800 242 198 -504 53 152 159 -94 12 5 50 343 -165 204 116 -84 -266 246 -422 157 82 25 -163 127 -284
3823 -284 84 55 -12 -224 -79 239 278 -8 199 -199 -165 -119 244 -27 -69 -381 288 -209 -355 -48 -185 46
3845 46 -107 5 67 -157 388 1 -252 147 372 114 -18 237 -145 -521 329 265 215 61 514 606 129 0
3867 0 21 -16 -102 226 527 27 -393 -10 316 -39 221 -413 -76 165 255 59 -135 -371 -226 203 98 -354
3889 -354 82 -321 -66 106 116 347 -271 299 -243 -147 249 -407 -70 38 339 -106 240 97 -237 -224 -161
3910 -161 68 233 186 -370 165 -244 -339 181 690 147 75 -316 -233 -34 103 82 272 117 234 373 -175 -15
3932 -15 -57 -47 -37 -256 -368 145 -66 390 504 -112 126 228 -83 187 0 -224 -96 396 325 375 -626 129
3954 129 -239 -198 -35 -54 -118 643 204 9 -122 -41 -512 412 -53 -413 109 104 -149 330 252 16 326 -131
$$ packed form
3800B42m4p02N57R9Pk53J06pM5K93n08L69q8k00j82N12o68N79p5n7j88K90m11
3823b84L68k9o7k12J45L18L9k86K07l98L4M6L63k71m2l12O69m97j46L07j37K31
3845D6j53J12O2k24N45l87k53L99K25k58j32K55l82l76Q50o4n0j54M53R2m77j29
3867@K1l7q6L28L01n00m20L83L26l55K60o34L37K41R0j96j94k36J45M29j05m52
3889c54M36m03K55J72J0K31o18N70n42R6L96o56L37J08L01m45L46j43l34J3O3
3910a61K29J65m7n56N35m09r5N20N09n43p2l91Q3J99J37k1J90j55J17J39n48J60
3932a5m2J0J0k19j12N13k11M56J14o16K38J02l11K70j87k24J28M92p1N0j001P55
3954A29l68M1J63j9o4P61m39j95j31Q1m71R24m65l60N22nk53M79p8k36L10m57
$$ plain form
3976 -131 -31 -414 176 -106 22 83 -118 -38 625 -38 -95 103 -19 97 -93 89 -174 -174 -280 -528 335 -18
3998 -18 125 227 207 -198 319 486 314 -158 -94 71 287 206 412 -490 22 358 -82 -380 -205 -88 -221
4019 -221 -75 -625 150 -326 -445 139 -166 -73 98 -236 -27 38 278 326 -191 -282 210 -70 77 292 148
4040 148 417 -73 51 -493 -42 -128 -35 31 493 -142 -95 -215 131 249 -555 579 226 179 -63 -702 -220
4061 -220 146 368 337 -80 119 -289 134 -336 -174 69 -109 -254 99 184 -433 -527 536 178 -150 -20 -112
4082 -112 126 189 283 -97 -93 279 -87 -382 360 191 -56 -665 86 185 273 -89 42 -489 -166 -235 74 -12 -136
4105 -136 8 162 2 -63 -379 -136 146 18 334 -495 -642 66 203 -47 385 -287 102 32 101 61 -173
4126 -173 -349 -188 54 253 -230 -233 -484 -66 363 296 80 116 296 206 -454 37 87 -2 123 233 15 -383
$$ packed form
3976a31J00l83N90k82J28O1k01Q0O63o63n7J98j22J16j90J82k63%j06k48Q63l53
3998a8J43J02k0m05N17J67j72m72O4J65K16q1K06r02N12L36m40k98J75J17j33
4019b21J46n50P75m76j19N84l05R3J71l34K09O5K40M8n17r1M92k80J47K15j44
4040A48K69m90J24n44M51q6R3O6M62o35M7j20L46J18q04J134l53m7k42o39M82
4061b20L66K22l1m17J99m08M23m70J62K43j78j45L53Q5o17r4J063l58l28J30r2
4082a12K38O3R4l80ML72l66k95P42j69k47o09P51R9Q8l62J31n31L23o9L09q6j24
4105a36J44J54j60o5l16K43K82j28L16q29j47P08J37k50M32o72L89p0O9m0k34
4126a73j76J61K42J99m83lk51M18M29o7k16L6J80r0o60M91N0q9J25J10k18l98
$$ plain form
4148 -383 45 491 25 395 -153 410 675 -119 456 77 -302 187 -316 221 29 -123 -151 56 181 -197
4168 -197 -43 -55 233 132 -519 321 193 -325 175 -74 -83 128 270 50 31 252 275 -114 -58 -207 -140 -199 453
4191 453 265 262 84 6 154 137 138 -48 33 5 6 94 134 -147 -156 -82 93 21 418 -218 95 -218 -131 -384 1 117
4217 117 26 -274 -187 -611 -353 -156 -137 -100 -51 173 88 255 -31 302 270 418 155 95 -164 304 -42 105 -159
4240 -159 -251 -246 74 62 188 379 -320 -586 16 -190 -108 -195 -397 33 -205 107 394 -210 -66 -149 52 -363
4262 -363 42 261 249 -251 -134 157 48 -120 -12 360 -71 -213 12 -26 -312 -224 -323 -251 19 -83 -487 43
4284 43 -65 -119 -58 65 -192 -179 241 -248 277 -362 -81 179 -170 -96 -263 126 169 169 -11 88 -301 166 21
4307 21 168 -59 -360 -440 -226 -66 370 64 174 529 -181 3 -537 195 -281 99 -129 384 398 211 527
$$ packed form
4148c83M28M46m66L70n48N63K65p94N75l79l79M89n03N37j92j52k8K07J25l78
4168a97J54j2K88j01o51Q40j28n18N00k49rK11J42k20j9K21K3l89N6j49O7n9O52
4191D53j88lj78p8J48j7Jj86Q1k8JQ8M0k81rP4J75p2L97o36L13l13Q7k53L85J16
4217A17r1l00Q7m24K58J97J9L7M9K24q5J67k86L33l2J48k63o0k59M68l46J47k64
4240a59r2NL20j2J26J91o99k66O02k06Q2q7k02M30k38L12K87o04J44q3K01m15
4262c63M05K19j2n00J17K91j09j68J08L72m31j42K25l8k86Q8r9P2K70j02m04N30
4284D3j08n4O1J23k57J3M20m89N25o39K81K60l49P4j67L89M3%j80R9l89M67j45
4307B1J47k27l01q0K14J60M36l06J10L55p10J84n40P32m76L80k28N13J4j87L16
$$ plain form
4328 527 10 -397 -438 -121 -211 -124 -175 273 444 -335 136 186 -159 433 159 402 26 -225 -9 -36 14 74 -74
4351 -74 -117 -103 -34 -21 -286 -370 -175 -447 -384 221 167 187 -285 -210 200 316 -202 -87 -511 284 -220 -278 -125 -58
4375 -58 -412 -94 56 140 351 13 -59 -40 -354 -87 174 257 57 44 104 -45 -437 -45 -202 -296 19 -254 87
4398 87 -333 -226 -283 -47 -15 -263 -223 -31 -19 -52 48 -249 -434 163 183 -300 -169 -423 282 293 -252 -146 -239
4421 -239 72 52 17 -117 262 -49 224 26 -378 -578 -37 195 -530 58 40 2 67 -163 265 47 6 -579
4443 -579 494 -389 -118 -4 371 103 448 325 297 10 111 181 -841 482 493 -259 627 -75 95 202
4463 202 -175 460 59 103 59 -317 -207 -482 -282 -354 -116 285 -40 331 176 -70 329 -145 -215 60 304
4484 304 13 -148 91 -26 -354 117 348 -157 -13 -138 -243 -250 62 107 166 228 11 104 -395 218 -300 -475
$$ packed form
4328E27n17m07m1L17r0Q7n1M48J71p79M71N0l45N92k74K43l76k51K16k7N0O0j48
4351g4m3J4O9J3k65q4J95k72O3O05n4K0m72P5M10J16n18J15m24P95n04n8J53O7
4375e8l54L18J50Q4K11l38p2J9l14K67K61Q3k00j3O0j49l92L92j57r4L15k73L41
4398H7m20J07n7K36L2k48M0J92J2l3J00k97j85N97K0m83J31k54P05J1n45J06r3
4421b39L11k0l5j34L79l11K73j98m04k00N41K32p25N88j8l8O5k30M28k18m1n85
4443e79J073q83K71J14L75k68L45j23k8k87J01P0j022J323J1p52Q86p02J70J07
4463B02l77O35m01M4m4l76J10k75K00p2K38M01l25L71j55k46L99m74p0K75K44
4484C04k91j61K39j17l28M71K31n05J44j25j05pL12M5N9O2k17R3m99O13n18j75
$$ plain form
4506 -475 -191 -222 -559 419 19 -325 -21 164 -127 21 78 -159 115 12 -58 8 -231 135 141 -79 231 84
4528 84 -242 -230 -211 61 3 -54 451 48 -512 -145 -274 13 59 -174 190 281 -158 387 581 139 -208 -227 316
4551 316 -381 333 293 -177 -261 -213 559 -165 -46 126 -74 224 -289 -149 -92 -391 -145 135 362 48 102 246
4573 246 -124 208 169 21 -74 -534 55 345 -108 116 -208 62 -88 217 159 -135 -112 -112 195 -149 -281 100
4595 100 380 156 108 -52 -106 -38 62 226 -23 -184 141 14 264 153 229 138 121 248 9 -166 40 -340
4617 -340 -126 211 564 559 353 28 144 236 -524 -506 415 162 -109 -298 -241 91 -89 -232 -184 54 -54 -269
4639 -269 16 318 210 405 -115 81 -449 41 -191 46 -174 -422 -264 -310 -102 -31 -101 -452 -561 389 -499
4660 -499 -383 63 239 131 -56 -13 270 48 -155 -9 134 85 57 -203 -344 -197 -290 54 -224 268 -246
$$ packed form
4506d75K84l1l37R78m00l44L04J85k91J48N7k37K74j03p0O6k39L66Ok20L10j47
4528H4l26J2J9K72n8n7N05m03n60L67j29K87M6k33L64R1m39N45J94m42l47j9N43
4551C16o97P14m0m70q4M8P72p24J19J72k00K98n13J40N7k99K46K80K27l14N4J44
4573B46l70L32l9j48r5m60N89K90m53K24l24K70j50L05n8k94K3%L07l44j32L81
4595A00K80k24m8j60n4O8J00J64k49j61L25j27K50j11P6r1j7J27k39j75K06l80
4617c40K14L37L53nk06l25J16R2p60J8R21k53k71j89N7L32j80j43M8K38j08k15
4639b69K85L02j08J95n20J96n30M90k32K37k20k48J58m6K08P1p0l51j09R50q88
4660d99J16M46J76j08j87M3K83k22k03J46J43m9k8k60j41J47r3L44k78M92n14
$$ plain form
4681 -246 158 -75 -236 -451 182 0 37 -17 -309 529 -85 -80 -37 -350 452 139 156 16 -41 308 -91 -122 145
4704 145 145 260 238 -193 135 -161 -304 -127 32 -54 -121 -188 84 -59 -494 -97 55 140 -217 -613 -320 -434
4726 -434 -308 338 114 -177 -161 -204 -398 406 -282 -193 -107 -268 177 -252 -444 229 -259 302 -11 73 133 -206
4748 -206 458 -5 -345 -471 -25 278 57 271 0 439 -186 41 0 41 -52 -186 23 445 -304 179 -199
4769 -199 -59 -23 -20 -318 -493 260 -176 -143 348 -269 244 -118 -46 -143 -438 -265 -142 -502 216 -2 -166 75
4791 75 204 -191 280 114 203 45 295 -100 -506 200 183 207 2 -194 56 665 -64 127 290 54 -392
4812 -392 274 -367 -206 35 -135 109 -47 -271 -12 -175 -100 -130 102 384 -143 219 -223 177 304 -278 -44
4833 -44 257 -28 -177 206 -2 199 335 75 -609 78 44 -214 221 20 6 501 129 -27 396 561 -108
$$ packed form
4681b46M04k33j61k15O33j82L7n4k92Q38o14NM3l13Q02l13J7j40n7L49l99l1K67
4704A45%J15k2m31L28k96j43J77J59q6o7o7K72j43m35L97J52Q5l57l96K93j14
4726d34J26O46k24k91J6m3j94Q04o88Q9Q6j61M45m29j92O73m88N61l13Q4O0l39
4748b06O64m63l40j26M46L03k21K14k71M39o25K27m1M1r3j34K09M22p49M83l78
4769a99J40L6Lk98j75P53m36L3M91o17N13l62P2r7k95J73J23l60P18k18j64K41
4791G5J29l95M71j66Q9j58K50l95m06P06j7K4k05j96K50O09p29J91J63k36m46
4812c92O66o41J61K41j70K44j56k24K59j63P5l0K32K82n27L62m42M00J27n82K34
4833d4L01k85j49L83k08K01J36k60o84O87l4k58M35k01j4M95l72j56M23J65o69
$$ plain form
4854 -108 -580 -177 199 -156 -14 68 -94 -375 9 -102 277 432 -80 -17 101 210 79 107 -191 134 29
4875 29 76 38 207 628 508 -258 355 -50 73 -395 -178 97 -479 -46 335 341 345 -358 -392 -208 55 222 -21
4898 -21 34 -256 -85 -68 523 -304 281 180 -116 269 -225 -267 280 245 61 -208 260 134 -291 -27 -232 -233
4920 -233 -80 291 222 -132 68 328 -55 8 169 -244 207 -423 -488 230 -154 89 -68 -137 -92 59 -191 -193
4942 -193 -96 394 -17 -388 354 47 -49 -38 59 544 374 207 -113 78 -668 -197 -137 169 -385 60 -138 40
4964 40 -19 305 -568 394 -243 76 -393 -47 57 -539 -222 -210 -22 120 -164 191 -233 -99 -372 63 171
4985 171 -215 -207 -25 10 189 386 -308 132 381 -227 217 58 306 -260 -8 314 43 -287 112 582 9
5006 9 -252 -81 -223 -300 396 -586 -250 21 -241 -45 638 285 -99 354 88 -66 -360 -267 -188 45 91 -198
$$ packed form
4854a08m72M03L76l55J42Q2j62k81L84j11L79J55n12O3J18J09j31K8k98L25j05
4875B9M7l8J69M21j20p66O13m05J23m68K17K75n76M33L81OMp03l4J84K63J67k43
4898b1N5k90J71J7N91q27N85j01k96L85m94m2N47l5j84k69M68j26m25K64k05j
4920b33J53L71o9l54K00K60l83O3J61m13M51o30o5P18l84K43j57o9M5J51k50k
4942a93R7M90m11l71P42l07r6J1R7M85j70j67l20J91p46M71O0L06n54M45j98J78
4964D0n9L24q73R62o37L19m69L46J04n96L17J2J88J42k84L55m24J34k73M35J08
4985A71l86QJ82L5J79J97o94M40K49o08M44j59K48n66K52L22k71l30L99M70n73
5006Ik61J71j42p7O96r82L36K71k62J96O83l53l84M53k66j54k94R3P9K33M6k89
$$ plain form
5028 -198 -507 134 45 -331 182 -233 55 -29 -145 -199 178 257 -29 188 -457 -535 51 -257 -224 -166 -62 -33 4
5051 4 -493 -101 -343 -501 336 -4 -234 77 -179 -510 135 102 -67 178 131 -42 244 194 -71 -369 394 333
5073 333 13 -10 -67 -411 96 -131 650 -459 225 311 476 -81 -302 94 140 152 -167 -174 225 -13 -44 -250
5095 -250 -178 241 -596 -79 -193 -286 -143 -127 -37 -67 238 322 253 202 -244 -419 -821 -197 -228 193 251 30 54 -315
5119 -315 -2 159 173 76 244 113 67 268 248 -226 -13 581 -202 -2 -180 -159 -166 170 56 -80 -45 13 -180
5142 -180 75 -46 -296 -292 -380 8 -279 491 -321 13 203 -483 398 50 198 1 216 -60 -123 547 -23
5163 -23 -192 -178 297 -2 -13 233 -301 -344 -42 25 -210 -211 172 52 215 581 -438 381 382 292 520 5 -184
5186 -184 203 -330 151 -184 111 -214 27 -12 259 -519 304 -230 143 612 88 -6 -138 -344 163 -301 -170
$$ packed form
5028a98l09O41q9l76N13m15K88q4j16n4L77P9k86K17o45p8N86l08L3N8J04K9L7
5051Dm97L92k42j58Q37l40k30L11k56l31O45l3j69K45m7j73K86n0k65k98P63o1
5073C33l20k3n7l44N07k27P81j109O84Q6J65n57k21L96M6J2l19pL99k38l1k06
5095b50P2M19q37N17j14r3J43J6R0l0L05Q4o9n1m46j75m02O24l1M21N8k21K4l69
5119c15L13J61J4r7J68j31m6K01k0m74K13N94p83K00j78K1pL36j14j36L5N8j93
5142a80K55j21k50Mq8L88k87P70q12L34J90o86Q81l48J48j97K15k76o3O70n70
5163b3j69J4M75k99j1K46n34m3L02O7k35jL83j20J63L66j019Q19Jr0K28n15j89
5186a84L87n33M81l35K95l25K41l9K71p78Q23n34L73M69n24r4j32k06N07m64J31
$$ plain form
5207 -170 -417 19 355 327 358 -209 392 429 77 -478 162 107 -68 -65 32 480 -333 -231 -333 -44 -220 121
5229 121 -39 67 386 -53 51 -454 -272 252 236 199 -173 -71 -245 -28 180 127 355 -192 -355 -287 -325 74
5251 74 -50 -117 -293 296 -4 -33 96 -178 34 -194 510 -779 -101 70 73 89 -236 -229 200 -409 -114 427
5273 427 36 468 -82 167 -334 -374 -242 -339 -244 -21 -248 199 56 298 -87 229 -191 51 33 -256 34
5294 34 -103 -162 81 -31 -26 383 388 179 -15 -263 169 215 264 -321 -72 0 -183 24 -620 14 109 38 -195 569
5318 569 5 264 -393 -348 -44 39 124 -24 161 -505 -98 142 -363 31 -378 -585 -147 -207 229 525 81
5339 81 60 -198 -30 125 112 105 164 -16 402 -286 133 38 -120 220 101 -142 288 -370 -457 139 -86 -322 98
5362 98 -24 111 375 -61 -177 -643 -166 -187 33 257 -25 71 425 346 502 98 -90 355 -1 -130 390
$$ packed form
5207a70k47M36L36k8L1n67O01L7l52n55O40n5j75LR7M48q13J02j02K89j76L41
5229A21j60J06L19m39J04n05J82N24j6l7l72J02j74K17K08n3K28n47j63O8l8L99
5251G4j24o7j76N89l00k9J29k74K12k28P04j289O78J71LJ6l25PM29o09K95N41
5273D27l91M32n50K49n01m0J32r7R5K23k27M47j43K42l85L16m20K42j8k89K90
5294C4j37n9K43j12NM09Nk09j94k48M32M6M9n85K49P2j83K07o44O34R5p1k33P64
5318E69n64K59o57M5L04Q3Q5j48J85o66M07K40n05L94m09k07M38o0M36K96m44
5339H1k1k58J68J55j3pN9j80M18o88M19r5j58L40j19k43M30o58q7N96k25k36M20
5362I8j22J35K64m36j16m66M77k1K20K24k82R6L54p9J56m04j88M45l56j29N20
$$ plain form
5383 390 -195 502 38 418 -77 -519 148 346 115 184 -199 18 -71 252 29 18 -813 253 223 502 -420
5404 -420 -118 -186 -25 322 -501 -248 341 127 203 -444 165 7 673 673 -108 310 -505 54 649 335 -136
5425 -136 342 53 112 7 127 -137 300 -259 229 292 -42 93 180 201 132 53 -171 376 216 216 -322 209 -187
5448 -187 -254 -99 -52 384 -180 -60 316 275 93 -640 -342 576 -226 222 -114 374 88 83 -7 -42 285 -127
5470 -127 179 -248 76 -260 -55 116 -81 169 2 178 -7 93 -378 381 -190 -60 259 89 153 293
5490 293 -78 105 247 -80 -383 -356 91 -84 -523 -21 -308 -140 83 118 -162 -379 190 78 -39 76 -250
5511 -250 101 -98 115 -298 197 72 -493 92 -520 59 -229 284 392 -90 -71 575 -219 30 -209 -165 -36
5532 -36 -344 -558 -497 33 -268 77 -47 256 -172 438 -331 -7 -26 -122 -28 -306 423 325 -317 -121 34 44
$$ packed form
5383C90n85O97m64L80m95m42O67J98k31O9l83K17q9L23k23j1q31J066l0K79r22
5404d20L02o8J61L47q23K53N89k14P6o47O09j58O66%p81M18q15N59N95l14m71
5425a36M78k89N9j05J20k64M37n59M88O3l34J35Q7K1o9p9k24N47j60%n38N31l96
5448a87o7J55M7M36n64J20L76m1j82p33K98R18q02M48l36M88k86nr0l5L27m12
5470a27L06m27L24l36K05J71j97K50j67J76j85J00m71P59n71J30L19j70O4J40
5490B93l71J83J42l27l03K7M47j75m39N02k87J68K23L5k80k17N69j12j17J15l26
5511b50L51j99K13m13M95j25n65N85o12N79k88N13J08m82J9O46p94K49k39M4J29
5532c6l08k14O1N30l01L45j24L03m28O10p69L24j9r6R4k78P29r8o42J96J55J0
$$ plain form
5554 44 -311 -341 42 -412 341 -37 -97 143 -649 211 -140 76 241 266 25 -219 132 -62 105 -250 260
5575 260 117 -112 -185 -170 455 -94 -33 65 210 -297 -231 -576 -145 304 100 -360 575 -463 -277 -44 -313
5596 -313 -83 156 -121 -203 -346 -393 -59 6 -125 27 21 181 193 -618 -157 -415 117 -43 16 -200 -270 309 -415
5619 -415 566 -362 255 58 -96 -163 653 283 185 270 -493 -125 -542 133 -77 27 487 111 -73 591 143
5640 143 -46 35 -394 132 225 183 -208 212 94 -295 -59 -26 20 106 -228 -390 -177 -309 -468 62 -317 525
5662 525 18 -226 -300 -68 38 26 -240 -339 87 504 284 461 315 438 -124 492 -59 231 496 30 56
5683 56 8 -158 72 364 -182 -351 -406 -69 -390 -604 -618 194 36 71 -331 303 73 -278 117 -47 -347 -220
5705 -220 138 -64 70 659 185 -144 -132 -64 -295 182 -239 -49 389 -165 126 68 576 13 177 178 -193 26
$$ packed form
5554D4l55l0L83m54P53l78o0K40p92Q60l51K16J65K5k41k44L51j94J67l55N10
5575B60j43k29p3J5O25n49O1R8J45n07O6l45M31M49k04m60R35j038J86K33k69
5596c13K30K39k77q2j43m7L34O5j31J52oJ60J2q11M61k58N32j60N9k16p0N79p24
5619d15R81r28O17j97j54o7Q16l70r8Q5p63L68m17O75k10J04M60l76j84O64m48
5640A43j89Q1m29N26R3m2l91M20j18l89K36L3M6Q6l34j62K13j32j59N30l79Q42
5662E25n07k44p4K32J06j2k66r9M26M17k20J77j46J23n62O16n51K90K65m66K6
5683E6m8j66K30K92n46j69n5L37l21k14j4Q12j58L5m02O34k30l51L95j64l00J27
5705b20L58k02J34N89m74l29J2O8k31M77m21J90M38n54K91n8N08n63J64Jl71K19
$$ plain form
5727 26 -124 -15 35 77 230 -76 162 466 36 0 -297 -111 113 -422 -20 -410 329 137 273 202 -27 371
5749 371 -456 -11 -340 157 -82 -76 -524 -337 26 -239 -628 -3 244 -280 -552 -181 406 -671 -431 -451 -329
5770 -329 23 370 74 -407 -194 4 231 -166 -169 -131 -312 -89 -10 -111 -287 54 -9 48 146 -127 5 199
5792 199 180 -12 457 86 -37 83 550 68 -470 415 -46 -229 -151 -62 36 83 255 -64 -468 78 212 534
5814 534 -241 -11 -263 -17 219 42 -65 -285 -54 -133 288 105 179 685 -79 88 -86 12 328 -169 -115
5835 -115 -115 23 -200 -85 237 76 -590 218 474 43 257 -83 -408 218 -317 361 171 203 -157 -85 25
5856 25 -80 217 -140 100 -114 75 65 -2 165 -173 -199 123 -291 49 -386 0 70 22 360 84 -504 -289
5878 -289 -12 241 377 146 51 312 124 3 -230 -121 193 3 277 -254 -274 -594 391 43 46 -126 -814
$$ packed form
5727B6j50J09N0M2J53l06K38L04m30l6k97J86K24n35M02l90P39j92J36p1k29L98
5749C71q27M45l29M97k39Om48J87L63k65l89O25K47n24k72L71N87j077K40k0J22
5770c29L52L47k96m81K13J98K27l97lL8j81K23P9j01j76L41o3N7R8k73J32J94
5792A99j9j92M69l71j23J20M67m82n38Q85m61j83P8Q9R8M7J72l19m04N46J34L22
5814E34p75K30k52K46K36j77j07k20K31p9M21j83P4N06p64J67j74R8L16m97N4
5835a15%J38k23J15L22j61o66Q08K56m31K14l40l25O26n35O78j90L2l60P2J10
5856B5j05K97l57K40k14J89j0o7J67l38k6L22m14L40m35L86P0m8L38k76n88K15
5878b89K77K53J36k31r5K61j88j21k33J09L14j90K74n31k0l20R85l48Lj72o88
$$ plain form
5899 -814 17 -279 -150 -190 412 -187 -217 178 172 131 279 -435 103 95 26 335 -78 221 298 691 -53 199 349
5922 349 4 219 11 -20 -10 292 151 37 327 202 -246 17 -84 -405 10 9 361 7 -622 123 505
5943 505 187 -129 377 292 492 86 -339 186 100 163 377 -45 -124 -165 208 -270 -287 93 91 42 93 -13 101
5966 101 -109 13 229 211 105 -183 -79 105 -237 -199 -133 -482 403 413 -182 -18 13 -346 -295 -134 200 -299
5988 -299 72 -27 339 -323 -257 -116 93 -149 355 62 407 501 404 170 -99 -95 136 -19 132 97 40 509 -96
6011 -96 232 -98 19 -58 231 -184 339 -26 -3 -143 224 152 -17 -409 236 45 -130 -734 87 -99 358
6032 358 -75 -193 -207 -31 236 -265 -364 -176 524 31 -47 297 -34 -578 -417 -404 -220 65 -239 -24 -319
6053 -319 0 -83 239 -259 -79 243 -24 -145 -43 -380 -465 -133 -469 -629 616 -88 -229 158 -150 -63 -249
$$ packed form
5899h14Q31k96J29m0O02n99l0L95om1J48p14N38qo9L09m13K99P7L93p44K52J50
5922C49l45K15k08l1J0L02j41j14K90j25m48K63j01l21M15jL52l54o29P45L82
5943E05l18l16N06q5K00m06m25N25q6O3K14m22p9m1L73m78j7L80km9N1j06J14
5966A01k10J22K16j8j06k88J04J84l42L8O6l49Q85J0n95J64L1l59N1J61L34m99
5988b99L71r9L66o62O6J41K09k42N04k93L45R4r7k34k69MK31j55J51l5n7M69o05
6011i6L28l30J17p7K89m15N23l65K3j40L67p2j69l92O45j91j75o04Q21j86M57
6032C58m33j18j4J76K67n01r9J88P00m93p8L44l31n44J61J3J84K85l04K15k95
6053c19L19q3L22m98J80L22k67j21J02l37q5L32l36j60J245p04j41L87l08Q7j86
$$ plain form
6074 -249 -78 87 -54 714 131 51 -279 194 -424 73 154 -214 227 -246 -393 -109 8 -37 156 175 -392
6095 -392 322 535 -268 -63 171 159 -174 -425 -337 -115 -171 125 190 -40 -88 657 72 -313 68 288 -26 -114
6117 -114 0 293 349 237 137 215 -177 15 -98 137 323 -378 -54 -118 -26 -31 536 498 170 82 -55 -128 -158
6140 -158 -123 13 371 -175 -65 19 10 -223 -321 -195 609 653 27 -94 32 -161 220 37 22 -120 -338 301
6162 301 -175 143 -333 157 197 43 0 -160 -117 206 -55 -347 109 -257 -172 -135 14 65 -134 -406 162 441
6184 441 170 258 -497 -238 226 10 466 156 -359 353 -22 -390 -156 -69 0 -586 -124 300 238 165 -515 660
6206 660 91 -572 340 -176 573 363 47 -433 157 -176 -191 638 -447 623 -284 22 -259 257 355 6
6226 6 -115 30 -464 -538 -322 -53 621 -211 218 -242 33 -4 368 -482 307 -281 -2 -122 128 -411 266
$$ packed form
6074b49J71J65j41P68n83q0l30M73o18M97Q1l68M41m73j47K84J17m5J93J9n67
6095c92P14K13q03K05K34j2l33k51Q8K22n6K96O5k30m8P45n85l85L81K20l14q8
6117a14J14K93N6j12j00P8l92J92j13K35J86p01L24o4R2nN67l8l28q8j37p3l0
6140a58L5J36L58n46J10Q4rk33r8J26Q04M4o26j21J26j93L81j83j5j42k18O39
6162C01m76L18m76M90M0j54m3j60M3L23k61k92M56l66Q5L7J49N1j99k72N68K79
6184D41k71Q8p55K59M64k16M56l10n15P12l75l68K34Q7O9n86M62M24o2p3o80J175
6206F60n69o63R12n16P49k10l16m80N90l33j5Q29j085J070r07L06k81N16R8l49
6226Fj21J45m94p4K16K69O74q32M29m60K75l7L72q50P89n88K79j20K50n39O77
$$ plain form
6247 266 715 -70 -177 292 -344 -137 68 61 665 174 325 -287 -214 -373 375 312 -40 151 -120 -193 268 -192
6269 -192 -4 -314 93 -27 80 83 124 230 35 27 49 179 -634 139 41 143 92 -138 51 422 89 146 -231
6292 -231 -98 192 -143 -3 -570 -111 -151 33 55 655 -407 45 335 142 -435 161 75 431 -62 -440 207
6313 207 -76 -66 235 261 -260 -206 36 56 -583 -75 257 -78 -277 291 311 -632 -99 -25 -108 77 128 -27 -268
6336 -268 -299 -259 -399 574 -452 197 484 -273 -96 30 -167 93 -262 151 -261 -359 -260 414 242 -694 -290
6357 -290 322 31 164 -564 -313 11 -192 129 -680 112 311 77 -64 228 449 261 -674 -198 420 -248
6377 -248 -117 249 -127 96 -93 55 432 36 -150 -152 2 75 367 -259 -380 -54 -64 -614 -6 77 211 80
6399 80 -241 136 105 -74 -112 -548 29 256 -434 424 107 231 -35 -348 765 -297 117 -243 -309 -132 -90
$$ packed form
6247B66M49p85j07M69o36K07K05pO04m91J51o12P3j59P48o3l52J91k71p3M61m60
6269a92J88l10M07j20J07LM1J06j95qK2J30q13P73r8J02n1k30J89L71l33N7l77
6292b31J33K90l35J40n67M59m0J84K2O00j062M52K90j93n77N96q6L56m93l78O47
6313B07k83J0L01K6n21N4K42K0o39N08L32l35j99N68K0r43N33P4q3J85N1j55k41
6336b68l1M0j40R73j026O49K87p57J77J26j97K60l55M13m12r8R9O74j72r36M04
6357b90O12k91J33p28K51L24k03L21q09P92J99k34j41K92K21j88r35M76O18o68
6377b48J31L66l76K23j89J48L77l96j86kJ54P3K92o26j21L26j0n50O08Q3J34j31
6399H0l21L77l1j79l8m36N77K27o90Q58l17J24k66l13J113j062M14l60o6J77M2
$$ plain form
6420 -90 -263 114 21 -190 -526 -181 207 185 12 -341 122 -2 -108 789 -61 65 -119 396 -71 -430 72
6441 72 -341 343 -218 -308 199 82 -317 -99 92 69 777 27 294 427 -226 -342 148 -89 -199 -161 180
6462 180 214 -192 161 21 -212 -69 58 361 -147 91 -35 358 -211 217 -105 -202 85 -51 -135 212 -190
6483 -190 -359 227 339 369 -371 204 -250 -181 -178 -101 480 -285 -48 -40 615 12 55 -141 254 161 260 -126 -497
6506 -497 251 394 -164 128 133 55 72 838 280 -100 -400 -295 -306 5 298 -226 174 29 384 250 230 199
6528 199 -205 -306 192 144 80 10 219 -60 278 -3 -136 226 163 50 118 -732 -332 256 153 -1 341 -152
6550 -152 324 -167 -243 162 87 11 -279 95 357 544 -227 264 381 76 394 -388 -130 8 203 -18 -115
6571 -115 325 -38 544 -15 440 -60 474 -70 -79 49 -400 221 -295 -440 -51 70 343 -563 350 -410 -109
$$ packed form
6420i0j73L77r3k11l36L45L88k2j73l53M63j24j06Q97q50J26j84N15m67l59N02
6441G2m13O84n61r0N07j17l99K18J91k3P08p50K67J33o53j16M90k37j10L8L41
6462A80L4m06L53j40k33J43J27L03n08K38j26L93n69M28l22r7K87j36q4L47m02
6483a90j69N86J12L0p40N75m54O9LP7N81p65K37QO55o03M3j96L95r3R9l86l71
6506d97P48J43n58K92Np8J7P66n58l80l00J05j1L11K93n24M00j45L55j34k0l1
6528A99m04j01M98m8o4p0K09k79L38k81j33L62o3j13O8q50M00N88j03j54L42m93
6550a52M76m91p6M05p5p6k90L74K62J87p71M91J17l05L18p82K58J38J95k21r7
6571a15M40l63N82n59M55n00N34n44rJ28m49O21n16j45L89J21K73r06R13p60L01
$$ plain form
6592 -109 173 -254 -309 30 -196 -112 656 -260 520 -122 -66 186 -133 303 17 -53 -163 -185 -110 119 -127 -107
6614 -107 367 -55 117 270 -39 -137 150 -628 -127 -155 -89 -130 -182 -212 435 270 -185 245 -359 -234 205 -17
6636 -17 -123 66 -382 157 324 -396 -223 36 128 9 -61 -551 -316 178 168 -267 -392 54 -123 -276 31
6657 31 666 -158 162 -229 -169 -116 29 -240 -345 -438 -66 -151 279 427 -618 -355 226 37 474 -157 458
6678 458 313 15 61 -479 -400 -136 512 -451 348 -724 295 142 114 -26 -367 385 318 -19 -55 430 157
6699 157 -530 163 93 1 -361 -151 -412 15 596 -7 -42 -138 76 -211 168 -727 -253 -382 43 -388 68
6720 68 124 287 -246 -242 193 -445 -100 -59 112 416 -242 -43 342 490 149 38 77 -472 -50 209 -206 39
6742 39 96 -560 113 140 275 -39 -243 179 -295 -8 -68 -147 552 63 -417 148 286 -158 16 226 -36 -46
$$ packed form
6592a09K82m27n5L39k26Q4P68r16P80o42N6K52l19M36k86p0j10k2P5K29k46K0
6614a07M74m22J72J53l09r8K87p78N01k8O6m1n2l0O47j65m55M30o04J25M39k22
6636a7j06J89m48N39J67p20J73K59R2j19p0m90K35M94j0m35j25M46j77j53L07
6657C1O35q24L20l91O0N3J45k69j05r3L72q5M30J48j045K63N81j89M37o31O15
6678D58j45k98M6n40P9K64O48r63P99j072J019j53k8j40l41P52o7l37l6M85k73
6699A57o87O93p0r2l62K10k61M27N81o03l5r6K14k87L79q95M74j29M25m31M56
6720F8N6J63n33MM35o38L45M1J71L04o58J99L85J48l41j11L9n49M22K59m15K45
6742C9N7o56O73K7J35l14k04M22m74K87o0p9O99m89m80N65J38m44J74K10k62j0
$$ plain form
6764 -46 110 328 588 484 444 532 -71 184 413 -153 -102 -41 -86 326 -13 -9 100 -151 -228 20 -60 323 96
6787 96 -54 -435 113 -70 479 130 291 -182 -654 288 229 -63 -32 -181 -466 -115 113 -60 -512 27 -438
6808 -438 -115 120 -73 35 -163 309 88 48 -429 -24 -207 171 1 -157 -131 89 -228 -209 -19 103 38
6829 38 -175 25 506 83 -60 -250 -79 -260 175 519 -287 108 148 1 122 -111 -149 -276 -157 13 60
6850 60 27 -419 182 -216 184 245 -255 384 7 262 -125 -90 -440 -77 -151 277 482 -260 -63 282 91 -414
6872 -414 163 -140 55 -424 268 -265 -366 -313 -313 275 153 -175 330 -172 156 114 236 -177 -57 31 26 -231
6894 -231 -55 20 35 276 62 29 -172 94 -205 294 -237 -61 768 67 -173 27 -112 158 -110 280 -295
6915 -295 440 136 219 155 -51 92 202 553 71 254 -193 -221 877 -37 181 229 -784 -408 229 -227 252
$$ packed form
6764d6J56K18K60j04m0Q8o03K55K29n66N1O1m5M12l39MJ09k51p7K48q0L83k27
6787I6j50l81N48j83N49l49J61m73m72R42n9k92L1j49k85L51K28j73m52N39m65
6808d38L23K35j93J08j98M72k21m0m77M05j83L78j70j58K6K20l17J9J90J22o5
6829C8k13K00M81m23j43j90J71j81M35L44q06L95M0j47J21k33l8j27J19J70M7
6850F0l3m46O01l98M00O1n00O39l77K55l87L5l50L63p4M28K05p42J97L45j91n05
6872d14N77l03J95m79O92n33j01N3%N88j22l28N05n02L28m2J22m13J20Q8nk57
6894b31J76P5J5K41k14l3k01K66k99M99n31J76Q29p01k40K00j39K70k68L90n75
6915b95P35l04Q3o4k06J43J10L51m82J83m47k8J098r14K18M8j013L76O37m56M79
$$ plain form
6936 252 -106 -79 -138 90 -191 143 5 173 202 116 -217 521 -378 -150 -31 222 -165 -221 30 531 -362 -289
6958 -289 75 92 -61 297 115 -227 476 220 190 53 143 307 -246 52 -82 507 362 -68 225 -223 495
6979 495 487 438 681 -296 290 332 422 -308 54 170 278 30 115 -196 158 -298 -483 -14 334 -414 430 245
7001 245 -360 217 -516 -57 108 275 149 -56 57 -118 -376 273 83 -182 167 194 -17 140 -66 -11 67
7022 67 145 206 346 170 407 81 -8 -387 -138 -242 215 -32 -294 -107 42 188 64 30 -197 452 138 115
7044 115 245 -170 -32 109 -107 -172 -155 -264 86 15 -191 455 49 326 -334 13 140 -229 63 277 380
7065 380 41 7 22 82 -177 677 29 6 -628 -167 -168 372 84 343 164 -275 -265 272 -66 58 475 241
7087 241 -89 123 -20 104 187 45 -513 -479 -114 -151 -78 99 -187 350 297 197 517 -218 141 272 -56 319
$$ packed form
6936B52l58K7n9K28k81L34j38J68K9q6l33P38q99K28J19K53l87n6K51N01q93P3
6958b89L64J7j53L58j82l42P03k56l0j37R0J64n53K98j34N89j45m30K93m48P18
6979D95qm9K43r77N86M2R0p30L62J16J08k48Q5l11L54m56j85M69L48p48Q44j85
7001B45o05N77p33M59J65J67j26k05J13j75k58O49j90k65L49K7k11J57k06N5P8
7022F7P8O1J40j76K37l26q9l79K49j04M57k47k62J87J49J46j24l4k27O49l14k3
7044A15J30m15J38J41k16o5J7j09L50p1k06O46m06K77o60L47J27l69K92K14J03
7065C80l39l4J5O0k59Q54o48k3o34M61jN40k88K59j79m39J0N37l38J24M17k34
7087B41l30K12j43J24Q3j42n58L4L65l7P3J77k86N37n3j00L20p35L59J31l28L75
$$ plain form
7109 319 281 -129 -351 -35 -347 -193 -106 -25 279 134 387 -107 -216 -54 -126 -38 209 139 292 -120 0 -87
7131 -87 -90 179 165 -474 94 -80 71 -258 18 -9 -303 37 351 83 66 83 349 -502 318 476 238 400
7153 400 -87 200 197 77 189 -78 -430 -511 46 -24 -246 260 -60 72 -252 98 -410 32 -206 -24 283
7174 283 -315 -678 305 240 142 -119 376 267 27 -195 -438 -106 111 31 -199 75 526 -349 -130 255 -103
7195 -103 219 -168 -519 -238 -143 72 -45 535 -145 301 26 -193 -399 283 -539 -187 241 633 -329 -31
7215 -31 -70 29 211 189 117 401 605 -130 -180 394 140 425 138 -139 -141 -343 198 -283 318 -234 -304 -67 -425
7238 -425 -424 -187 0 136 -109 -159 -305 -122 188 491 321 -299 -4 22 -26 -150 -462 -105 10 -116 307 -187
7260 -187 198 -336 155 -377 -99 719 254 -19 254 -180 -284 190 -17 146 -43 44 150 181 314 38 -49
$$ packed form
7109C19l8m10k22L16l12J54Q7Q1L04j45K53m94j09J62p2Q8K47p0J53m12J20q7
7131h7lK69j4o39N68j74J51l29K76k7k94L40L14k68j7J7K66q51Q20J58k38J62
7153D00m87K87lj20J12k67l52q1N57p0k22N06l20J32l24L50n08M42k38J82L07
7174B83n98l63R83o5r8k61M95j09k40k22k43L32K17q0k30K74M51q75K19L85l58
7195a03L22l87l51K81R5K15j17N80o80M46k75k19k06O82q22L52M28L92r62K98
7215c1l9R9J82k2p2K84K04p35n0N74k54K85k87k77kk02N41m81O01n52p0K37l58
7238d25JK37J87J36k45n0j46J83L10L03j70o20K95K6m8j24l12L57J15j26M23m94
7260a87L85n34M91n32K78Q18m65k73K73m34j04M74k07J63j89Q7J06L1J33k76q7
$$ plain form
7281 -49 577 -75 355 194 -379 70 -372 411 -23 -425 186 -101 135 -96 398 118 -298 258 -310 135
7301 135 -20 85 349 296 -7 -650 113 -187 371 119 424 -152 58 165 -79 -100 9 80 104 294 -131
7322 -131 328 -113 478 -52 -205 300 65 157 34 17 -299 -15 -6 -116 -273 -453 -266 378 528 -275 -200 -7
7344 -7 -365 124 -2 633 -266 -231 -108 169 -43 -450 -96 59 139 -234 -91 -32 78 98 807 -179 -327 134
7366 134 -38 -160 -294 75 -437 73 -55 -222 129 31 -123 -265 92 48 69 512 12 -9 -375 272 -103
7387 -103 -106 -124 -307 -262 -66 -233 -24 -81 36 66 -327 -134 177 -116 39 -189 41 -227 189 191 -201 344 -57
7410 -57 100 -39 184 -276 268 0 80 -11 390 -92 265 278 11 -229 5 94 273 -138 192 315 239 204
7432 204 -111 389 -96 -40 -302 -58 470 660 319 -276 -107 43 -95 -92 -371 -615 57 497 -158 -276 26
$$ packed form
7281d9O26o52M30j61n73M49m42P83m34m02O11k87K36k31M94k80m16N56n68M45
7301A35j55J05K64n3l03o43P63l00N58k52L05n76K10J07k44k1J09P1K4J90m25
7322a31M59m41N91n30j53N05k35R2j23j7l16K84Rj10j57j80J87O44J50q03P5J93
7344gl58M89j26O35q99L5J23K77k12m07L54J55Q0l73J43N9J10K0P09r86j48M61
7366A34j72j22j34L69n12N10j28j67L51r8j54j42L57m4K1M43n00k1l66O47l75
7387a03lj8j83M5J96j67K09n7J17L0l93J93L11k93J55k28K30k68M16Kl92N45m01
7410e7J57j39K23m60N44k68Q0r1M01m82L57J3k67k40K34Q9J79m11L30J23p6l5
7432B04l15N00m85N6k62K44N28J90l41n95J69J50j38Lk79k44O72M40o55j18L02
$$ plain form
7453 26 126 40 533 -59 -485 377 -265 39 224 169 258 -289 433 80 -15 -121 -48 -126 -157 334 -508 -107 -77
7476 -77 393 -67 -289 201 343 473 38 -290 121 -6 -346 141 90 209 -326 -295 114 12 -834 137 391
7497 391 217 251 -408 108 154 99 -667 58 505 444 -249 24 -313 9 113 104 -115 205 -357 60 402 -73
7519 -73 127 116 5 197 106 80 135 311 -4 -143 -71 -10 -281 -169 69 -155 -183 -89 -330 115 -155 -85 -298
7542 -298 118 -166 172 255 11 -35 -117 53 175 312 22 252 563 -200 -315 255 -124 -354 -163 343 270
7563 270 -77 124 -232 -58 -264 -206 491 264 -93 176 288 -280 -265 82 236 -88 -167 176 -61 296 381
7584 381 -71 -156 -198 213 726 52 -124 -138 90 -199 -246 -210 274 -297 -37 -330 14 -680 106 -98 44 55
7606 55 149 -175 49 280 51 319 -146 11 -349 388 -142 220 -354 10 -24 -236 -28 -149 -18 -91 153
$$ packed form
7453B6J00q6M93n92m26Q62o42L04J85n5Q9n47P22l53r5j06P3p8l1M91q42M01L0
7476g7M70m60k22M90J42J30m35l28M11j27l40M87n1J19n35L1M09j02q46R71K54
7497C91j74L4o59N16M6n5p66P25M47o1o93K73l37L22J04rk19L20n62M17L42m75
7519g3K00j1j11J92r1k6N5J76l15j39P2O1k71J12K38k24k8R4k41M45k70P0k13
7542b98M16k84L38Q3k44m6q2J70J22J37k90K30L11p63j15N70l79k30J91N06p3
7563B70l47K01l56J74k06N8O97k27l57K69J12n68J5L47J54l24p9L43k37L57Q5
7584C81m52q5m2M11N13o74j76j4K28k89m7L6M84n71K60k93L44o94P86k04J42J1
7606E5R4l24K24K31k29K68m65J57l60P37n30L62n74L64l4k12K08j21J31p3K44
$$ plain form
7627 153 -35 -82 -101 340 221 162 -33 101 32 -88 -113 -25 162 -172 64 15 241 -86 306 -104 168 92 -51
7650 -51 23 441 -107 -87 186 -92 -8 421 -33 118 -254 238 380 -233 -160 332 442 -6 47 299 -115 374
7672 374 332 -162 -10 10 239 241 186 -207 113 -19 42 438 51 -49 320 252 346 -73 171 62 547 -228 -118
7695 -118 83 -74 -28 536 -82 307 -268 -160 -205 -134 -119 -164 -119 535 -104 -174 -171 -156 -104 -861 491 285 14
7718 14 -49 257 -669 -114 235 -18 173 -324 329 26 -22 100 -26 204 -102 291 5 26 -4 -446 -502 58
7740 58 440 168 96 376 259 90 109 391 381 222 40 294 46 -378 220 217 -210 267 428 -301 242 87
7762 87 53 -67 -129 -61 -601 -245 286 432 161 428 -128 -312 -201 -123 71 -470 6 27 -13 -213 341 -500
7784 -500 -216 -407 -183 56 -109 254 368 534 -116 -181 -420 235 201 -16 -85 229 55 -181 -276 28 104 -49
$$ packed form
7627A53j88m7j9M41j19n9j95J34o9j20k5Q8J87l34K36m9K26l27L92m10K72p6j43
7650e1P4M18n48K0K73k78Q4M29m54J51l72M92J42o13P3M92J10m48N3K52m14M89
7672C74m2m94J52K0K29Kn5l93L20j32O1L96l87j00L69o8R4m19K44j09M85p75J10
7695a18K01j57M6N64o18L89n75J08m5P1J5m5M5O54o39p0LJ5N2p57J352k06k71
7718A4o3L06r26N55L49k53J91m97O53l03m8J22j26K30l06L93k86K1l0m42n6N60
7740E8L82k72p2K80j17j69J9K82j0j59j82K54k48m24N98lm27M77J61p29N43j55
7762H7l4j20o2O8n40L56N31J46k71K67n56j84J11P8J94n41M76K1m0k00N54q41
7784e00K84j91K24K39j65L63J14J66o50o5k39O55l4k17o9L14j74k36r5L04P6j53
$$ plain form
7806 -49 18 302 -52 73 111 133 -101 22 26 -192 -136 -23 -204 -280 -41 -121 112 522 -194 -307 -238 -461 177
7829 177 -113 233 20 124 699 385 312 -180 -195 -429 204 96 11 140 107 21 48 302 -151 136 326 62
7851 62 206 -94 156 -168 -75 -28 358 86 264 928 59 80 -201 -372 291 165 171 163 112 -220 -91 45 -344
7874 -344 -104 -170 206 309 -200 -185 132 -142 264 197 -64 172 -487 135 236 -215 -1 282 -108 -100 -55 9
7896 9 -187 -115 -289 -198 172 433 -22 432 -77 144 13 -172 332 147 -83 -386 -213 25 245 -365 -130
7917 -130 -27 414 -498 134 78 -418 -47 -8 163 72 -501 -143 -127 -595 316 106 405 -3 173 325 485
7938 485 -127 95 426 -45 107 57 -56 490 340 -609 -150 119 103 -173 -132 -123 -200 -215 -201 -227 -279 -127 38
7961 38 -60 305 -62 -80 413 -32 -151 383 191 87 -239 332 257 -115 6 -82 87 -28 433 154 -184 14
$$ packed form
7806d9O7K84l54J25L8K2k34J23Mk18N6J13j81p6K39q0K33M10p16j13O9k23O38
7829A77k90L46k13J04N75l14p3m92j5k34O33j08q5J29l3q6K7K54m53K87J90k64
7851F2J44l00K50l24R3M7L86k72J78O64q69K1k81j71O63j26Oqn1l32J29J36l89
7874c44K40o6L76J03n09J5L17k74M06o7k61K36o59O22J01m51K14K83l90QM5O4
7896Ij96P2j74R1L70K61m55M54n09K21j31j85N04j85k30l03J73K38K20o10K35
7917a30J03M41r12O32n6m96L71L9J71r1n73L58J6m68R11k10K99m08J76J52J60
7938D85o12K22L31m71J52n0j13N46j50r49M59K69j6k76M1Rp7j5J4k6n2J52J65
7961C8r8L65l67j8M93m45j19N34j92j04l26N71p5l72J21q8J69j15M61k79l38J98
$$ plain form
7983 14 329 -69 -73 187 45 -169 -90 211 307 -419 222 -150 -114 -462 -82 246 162 -200 -168 -164 -134 -244 -16 -109
8007 -109 165 288 -41 849 -30 384 141 -266 -4 52 -177 315 91 -315 196 -653 19 137 821 -32
8027 -32 -306 -299 -143 233 94 84 -1 255 55 -234 137 -133 183 485 -140 689 36 164 310 -282 160 -18
8049 -18 21 55 -174 350 248 525 239 80 -12 208 -197 -22 -24 -261 -138 -397 128 -268 318 -32 -25 672 135
8072 135 4 -475 -196 -147 130 80 60 -31 63 -85 -466 214 -350 36 216 -60 367 -487 -426 138 337 -214
8094 -214 -259 285 28 -61 159 249 137 -25 252 -336 165 222 -83 161 -286 145 -95 -441 53 62 -97 190
8116 190 217 -325 -262 -214 31 69 212 -269 619 -485 490 -272 54 -152 -77 -405 202 193 -340 271 153 -178
8138 -178 -263 -137 -229 153 -253 -382 -103 218 57 9 -26 23 24 226 -71 197 -34 251 -332 -516 268 -409
$$ packed form
7983A4L15l98mK60j42k14P9L01R6p26O41l72L6l48L80L28q4l62L2ML0j10K28r3
8007a09K74J23l29Q90q79M14k43m07K62N6k29M92k24m06N11q49O72J18O84q53
8027c2k74PJ56L76j39j0q5K56k00k89L71k70L16L02o25Q29o53J28J46n92M42j78
8049a8L9L4k29N24j02K77k86j59r2K20m05J75kk37J23k59N25l96N86l50PO97n37
8072A35j31m79K79M9K77n0k0r1R4j48l81O80n64L86J80k76M27q54O1N64J99n51
8094b14m5N44k57q9K20R0j12j62K77n88N01N7l05K44m47M31k40l46M94Rj59K87
8116A90K7n42O3M8K45L8J43m81Q88j104R75p62L26k06P5l28O07rn33O11j18l31
8138a78q5J26r2L82m06j29K79L21j61m8l5M9JK02k97K68k31K85n83j84P84o77
$$ plain form
8160 -409 185 -286 460 402 -93 -44 -400 -349 163 -41 -139 -59 340 -143 -131 268 -165 -257 295 2 -30 129 -29
8183 -29 -165 -59 7 -108 -78 364 -249 190
$$ packed form
8160d09N94m71P46n8m95M9l56N1N12k04r8Q0L99m83J2L99m33r2N52k93l2J59j58
8183b9j36J06O6j15L0M42o13M39
8191A90
$$ Imaginary data points
##PAGE= N=2
##DATA TABLE= (X++(I..I)), XYDATA
$$ plain form
0 0 0 0 0 0 0 0 0 0 0 0 0 0 0 64 -64 64 -64 64 -65 128 -129 129 -192 193 -257 321 -322 386 -450 514 -589
31 -589 692 -771 886 -987 1111 -1252 1411 -1564 1747 -1946 2164 -2403 2655 -2944 3247 -3584
47 -3584 3955 -4353 4800 -5282 5820 -6414 7082 -7828 8666 -9633 10727 -12018 13536
60 13536 -15366 17619 -20472 24223 -29399 37022 -49433 73179 -135507 656294 1641877
71 1641877 992922 539081 -20087 -447353 -989171 -1178854 -1076194 -655206 -186824 356311
81 356311 735881 933398 892781 711636 254662 -362933 -895479 -1067616 -999723 -782629
91 -782629 -387442 243021 822180 1088784 1018688 786390 413126 -81368 -572626 -858100
101 -858100 -891429 -699669 -344718 95369 493933 792340 946319 870246 486223 -72560
$$ packed form
0@%%%%%%%%%%%%%O4j28J28j28J28j29J93k57K58l21L85m50N78o43P08q36R64j103
31e89J281j463J657j873K098k363K663k975L311l693M110m567N058n599O191o831
47c584P539q308R153j0082J1102j2234J3496j4910J6494j8299K0360k2745K5554
60A3536k8902L2985l8091M4695n3622O6421q6455J22612k08686P91801R85583
71A641877o48955m53841n59168m27266n41818j89683J02660M20988M68382N43135
81C56311L79570J97517m0617j81145m56974o17595n32546j72137O7893K17094
91g82629L95187O30463N79159K66604p0096k32298l73264m94494m91258k85474
101h58100l3329J91760L54951M40087L98564K98407J53979p6073l84023n58783
$$ plain form
111 -72560 -554981 -830367 -936309 -870920 -572298 -90410 373598 668584 782350 736585
121 736585 513135 137661 -284736 -629887 -804912 -756698 -508813 -156916 218268 582387
131 582387 853860 889905 645877 251326 -134811 -463097 -716243 -798796 -630766 -275637
141 -275637 111409 427154 634954 699051 589762 326712 -35130 -416515 -696794 -773344
151 -773344 -645881 -395975 -75968 293684 617149 745776 640264 399681 117162 -195754
161 -195754 -501986 -675143 -627082 -403542 -104065 208797 487396 654517 655422 495270 208136
172 208136 -144958 -457336 -623202 -624164 -504958 -277604 51228 382990 571843 572024 453601
183 453601 262424 -12464 -329652 -563062 -617939 -511197 -299984 -19966 275701 503949
$$ packed form
111g2560m82421k75386j05942O5389K98622M81888M64008K94986J13766m5765
121G36585k23450l75474m22397l45151j75025M8214K47885L51897L75184L64119
131E82387K71473L6045k44028l94551l86137l28286k53146q2553J68030L55129
141b75637L87046L15745K07800O4097j09289k63050l61842l81385k80279p6550
151g73344J27463K49906L20007L69652L23465J28627j05512k40583k82519l12916
161a95754l06232j73157M8061K23540K99477L12862K78599J67121R05j60152k87134
172B08136l53094l12378j65866r62J19206K27354L28832L31762J88853J81j18423
183D53601j91177k74888l17188k33410n4877J06742K11213K80018K95667K28248
$$ plain form
193 503949 600940 549988 359091 71083 -217499 -419292 -513953 -510535 -379000 -112275 196928
204 196928 419384 511388 502105 393252 164566 -136520 -396002 -530555 -530065 -410680 -197321
215 -197321 63040 305362 471611 514190 409887 195922 -45585 -254764 -414870 -496097
225 -496097 -442683 -244056 17804 248239 410266 491657 461594 300504 50125 -202989
235 -202989 -386084 -462031 -423271 -289161 -90564 138438 343392 452135 424743 288072
245 288072 101867 -101076 -303497 -448447 -462773 -338926 -136507 76272 264770 399450
255 399450 437798 356155 175034 -48670 -246734 -367708 -396702 -338664 -201218 3062 220438
266 220438 371149 409469 350023 225228 46163 -164175 -342278 -417202 -369795 -233880 -55970
$$ packed form
193E03949R6991n0952j90897k88008k88582k01793r4661L418J31535K66725L09203
204A96928K22456R2004r283j08853k28686l01086k59482j34553M90J19385K13359
215a97321K60361K42322J66249M2579j04303k13965k41507k09179j60106q1227
225d96097N3414J98627K61860K30435J62027Q1391l0063j61090k50379k53114
235b02989j83095p5947L8760J34110J98597K29002K04954J08743k7392j36671
245B88072j86205k02943k02421j44950j4326J23847K02419K12779J88498J34680
255C99450L8348q1643j81121k23704j98064j20974k8994N8038J37446K04280K17376
266B20438J50711L8320n9446j24795j79065k10338j78103p4924M7407J35915J77910
$$ plain form
277 -55970 129887 288458 376859 364078 248466 68390 -118926 -266710 -351442 -364274 -286586
288 -286586 -120423 87141 259749 350923 357264 289999 150129 -39283 -220801 -333459 -348142
299 -348142 -278429 -149385 13418 181518 309893 355073 300231 166260 1681 -154323
309 -154323 -278357 -344396 -323608 -207428 -33625 137020 259936 319105 306870 215427 59913
320 59913 -112512 -247304 -308507 -294629 -217332 -88301 71384 220822 313065 316166 237686
331 237686 106641 -44285 -187921 -289533 -312437 -246292 -116761 32031 163366 258519
341 258519 294798 255187 141706 -11260 -154300 -251843 -288372 -261092 -169289 -28631 123260
352 123260 239575 287061 261047 176103 48836 -94038 -215977 -276448 -258263 -174760 -54913
$$ packed form
277e5970J85857J58571Q8401j2781j15612j80076j87316j47784q4732j2832P7688
288b86586J66163K07564J72608R1174O341o7265j39870j89412j81518j12658j4683
299c48142O9713J29044J62803J68100J28375M5180n4842j33971j64579j56004
309a54323j24034o6039K0788J16180J73803J70645J22916N9169j2235r1443j55514
320E9913j72425j34792o1203J3878P7297J29031J59685J49438R2243L101p8480
331B37686j31045j50926j43636j01612k2904O6145J29531J48792J31335R5153
341B58519L6279l9611j13481j52966j43040r7543l6529K7280R1803J40658J51891
352A23260J16315M7486k6014q4944j27267j42874j21939o0471J8185Q3503J19847
$$ plain form
363 -54913 73897 189008 263821 269414 202430 81437 -53268 -171855 -250304 -269418 -219022
374 -219022 -105260 34471 158608 233968 250516 209823 117008 -10601 -138997 -226607 -251193
385 -251193 -214315 -130055 -15162 109418 211015 254569 229591 145812 32050 -85942 -185770
396 -185770 -241819 -232110 -155822 -39785 78905 171689 223737 225866 170015 65018 -58917
407 -58917 -161861 -220214 -225849 -182181 -91635 27985 142295 214631 224855 179023 93703 -11621
419 -11621 -118651 -199148 -224531 -186398 -99918 4231 103184 180057 218781 201418 126170 17906
431 17906 -87759 -167006 -207375 -199550 -140366 -39587 72594 160984 201708 190567 137080 51529
443 51529 -51511 -145559 -200256 -198155 -146546 -64746 29609 122291 188612 204682 161599 77757
$$ packed form
363e4913J28810J15111P4813N593o6984j20993j34705j18587p8449j9114N0396
374b19022J13762J39731J24137P5360J6548m0693r2815j27609j28396q7610k4586
385b51193L6878Q4260J14893J24580J01597M3554k4978q3779j13762j17992r9828
396a85770n6049R709P6288J16037J18690R2784N2048K129n5851j04997j23935
407e8917j02944n8353n635M3668R0546J19620J14310P2336J0224m5832q5320j05324
419a1621j07030q0497k5383L8133Q6480J04149R8953P6873L8724j7363p5248j08264
431A7906j05665p9247m0369P825N9184J00779J12181Q8390M0724j1141n3487q5551
443E1529j03040r4048n4697K101N1609Q1800R4355R2682O6321J6070m3083q3842
$$ plain form
455 77757 -20000 -108407 -170774 -193341 -166001 -91162 8781 102589 164629 185030 165085 105431
467 105431 15507 -83569 -157421 -185177 -168306 -114945 -34096 59453 141060 182600 173076 117450
479 117450 36625 -50671 -126563 -172277 -174820 -129597 -49050 40578 114329 160732 172919 142361
491 142361 70742 -22352 -104083 -154098 -165674 -139973 -79485 6297 90765 148917 166241 140534
503 140534 82581 5300 -74014 -137634 -167499 -151706 -94610 -16722 59070 120934 157561 154764
515 154764 106567 29126 -51236 -113824 -149057 -149860 -110594 -40287 39722 107447 146412 148745
527 148745 116139 55488 -19487 -91773 -140926 -151620 -120895 -61906 8412 77930 131036 149426
539 149426 124455 66938 -3024 -69383 -120917 -144430 -130541 -80885 -11049 58774 113771 138645
$$ packed form
455G7757r7757q8407o2367k2567K7340P4839R9943R3808O2040K0401j9945n9654
467A05431q9924r9076p3852k7756J6871N3361Q0849R3549Q1607M1540r524n5626
479A17450q0825q7296p5892m5714k543M5223Q0547Q9628P3751M6403J2187l0558
491A42361p1619r3094q1731n0015j1576K5701O0488Q5782Q4468N8152J7324k5707
503A40534n7953p7281p9314o3620k9865J5793N7096P7888P5792O1864L6627k797
515A54764m8197p7441q0362o2588l5233q03L9266P0307Q0009O7725L8965K333
527A48745l2606o0651p4975p2286m9153j0694L0725N8989P0318O9518N3106J8390
539A49426k4971n7517o9962o6359n1534k3513J3889M9656O9836O9823N4997K4874
$$ plain form
551 138645 130557 91112 26891 -45684 -105840 -135544 -129102 -92947 -34439 35232 97965 133393
563 133393 131474 96770 41413 -23667 -84964 -125372 -132956 -105715 -53011 12143 73220 115214
575 115214 129271 111524 62110 -6008 -69329 -110453 -124030 -110999 -70307 -6795 59043 105136
587 105136 123228 113103 77117 19963 -43200 -94363 -121319 -116834 -81181 -24483 34883 84400
599 84400 116083 119426 87574 30495 -30375 -77972 -109251 -117261 -94056 -42941 18140 69182
611 69182 102855 113311 95697 51919 -4873 -60220 -101325 -115307 -97369 -54854 -2432 51122
623 51122 95347 116273 102623 60773 8852 -41314 -84014 -109599 -104532 -69095 -17613 34133
635 34133 78176 103906 102220 74409 28144 -26689 -75144 -103028 -102100 -77491 -35466 15886 66405
$$ packed form
551A38645q088l9445o4221p2575o0156k9704O442L6155N8508O9671O2733L5428
563A33393j919l4704n5357o5080o1297m0408p584K7241N2704O5154O1077M1994
575A15214J4057j7747m9414o8118o3321m1124j3577J3031M0692O3512O5838M6093
587A05136J8092j0125l5986n7154o3163n1163k6956M485L5653N6698N9366M9517
599H4400L1683L343l1852n7079o0870m7597l1279q010K3205N1115O1081N1042
611F9182L3673J0456j7614m3778n6792n5347m1105j3982J7938M2515N2422N3554
623E1122M4225K0926j3650m1850n1921n0166m2700k5585N067L5437N1482N1746
635C4133M4043K5730j686k7811m6265n4833m8455k7884R28K4609M2025N1352N0519
$$ plain form
648 66405 99991 103123 80397 40688 -6998 -55193 -91828 -102845 -86090 -47397 1548 50352
660 50352 85772 100780 89982 55896 5672 -45343 -81815 -96561 -89009 -61221 -15751 35760
672 35760 76221 94212 88947 63070 22519 -25667 -67774 -92609 -92587 -68418 -27402 18973 59626
685 59626 87272 94294 74959 34462 -13257 -54089 -80810 -90875 -77728 -41812 5931 49913
697 49913 78864 89145 77634 46873 3194 -40933 -74291 -89421 -79996 -50541 -10383 31488
709 31488 66776 87185 82383 55031 15154 -25860 -61051 -83125 -83556 -60360 -21637 20120 56511
722 56511 79962 82714 64035 29217 -12269 -50864 -76392 -82009 -65559 -34470 4150 44051
734 44051 73028 81834 67510 38510 1236 -37624 -68520 -80963 -70568 -43015 -7196 31304
$$ packed form
648F6405L3586L132k2726l9709m7686m8195l6635j1017J6755L8693M8945M8804
660E0352L5420J5008j0798l4086n0224n1015l6472j4746P552K7788M5470N1511
672C5760M0461J7991n265k5877m0551m8186m2107k4835K2K4169M1016M6375M0653
685E9626K7646P022j9335m0497m7719m0832k6721j0065J3147L5916M7743M3982
697D9913K8951J0281j1511l0761m3679m4127l3358j5130R425K9455M0158M1871
709C1488L5288K0409m802k7352l9877m1014l5191k2074m31K3196L8723M1757L6391
722E6511K3451K752j8679l4818m1486l8595k5528n617J6450L1089L8620L9901
734D4051K8977Q806j4324k9000l7274l8860l0896j2443J0395K7553L5819L8500
$$ plain form
746 31304 62171 77632 72823 48843 13614 -25415 -57309 -74789 -73126 -52800 -20024 20300
758 20300 54241 72864 72267 55272 25278 -12493 -48515 -70401 -73076 -57320 -29092 6592 40918
771 40918 65060 72152 60646 33791 -1686 -35575 -60616 -70966 -64201 -39117 -4296 31324
783 31324 56916 68978 64252 43609 10170 -24911 -53212 -66937 -63849 -45162 -15834 18319
795 18319 48329 66022 65750 48541 18905 -13588 -42608 -62324 -66595 -52027 -24243 8502 38008
808 38008 58070 64934 54280 29420 -2823 -33755 -55700 -62649 -54884 -33834 -3820 28141 52738
821 52738 63436 56141 36147 8144 -22409 -47938 -61043 -57856 -39150 -12262 17570 42799
833 42799 58056 58536 42530 16755 -13750 -39765 -54746 -57474 -45593 -22240 7505 35562 52659
$$ packed form
746C1304L0867J5461m809k3980l5229l9029l1894j7480J663K0326L2776M0324
758B0300L3941J8623n97j6995k9994l7771l6022k1886k675J5756K8228L5684L4326
771D0918K4142P092j1506k6855l5477l3889k5041j0350O765K5084L4821L5620
783C1324K5592J2062m726k0643l3439l5081k8301j3725L088J8687K9328L4153
795A8319L0010J7693k72j7209k9636l2493k9020j9716m271J4568K7784L2745K9506
808C8008K0062O864j0654k4860l2243l0932k1945o949P765K1050L0014L1961K4597
821E2738J0698p295j9994k8003l0553k5529j3105L187J8706K6888K9832K5229
833D2799J5257M80j6006k5775l0505k6015j4981k728J1881K3353K9745K8057J7097
$$ plain form
846 52659 56420 46780 26487 -2175 -30376 -50911 -57031 -47980 -28192 -1883 25541 46183 55425
859 55425 50105 31617 5644 -21110 -41850 -53218 -50764 -35011 -10052 17136 38916 50568
871 50568 50561 37159 14889 -12613 -35723 -49393 -50406 -39061 -18636 7415 31687 46433 50816
884 50816 41177 20775 -3572 -26930 -43970 -49711 -41940 -24782 -613 23554 40764 48492 43945
897 43945 28086 5301 -19220 -38294 -46837 -43834 -30343 -8579 15281 34824 45721 44112 32103
910 32103 12122 -11267 -31732 -43839 -44456 -33978 -15127 6980 27670 41139 44308 36144 18379
923 18379 -3689 -24601 -39172 -43716 -37308 -21396 8 21385 36976 42832 38186 24483 4009
936 4009 -17621 -33967 -42265 -38773 -26113 -7228 13806 31405 40592 39231 28029 9404 -10310
$$ packed form
846E2659L761r640k0293k8662k8201k0535o120R051J9788K6309K7424K0642R242
859E5425n320j8488k5973k6754k0740j1368K454J5753K4959K7188K1780J1652
871E0568pj3402k2270k7502k3110j3670j013J1345K0425K6051K4272J4746M383
884E0816r639k0402k4347k3358j7040n741P771J7158K4169K4167J7210P728m547
897D3945j5859k2785k4521j9074q543L003J3491K1764K3860J9543J0897j609j2009
910C2103j9981k3389k0465j2107o17J0478J8851K2107K0690J3469L169q164j7765
923A8379k2068k0912j4571m544O408J5912K1404K1377J5591N856m646j3703k0474
936D009k1630j6346q298L492J2660J8885K1034J7599R187j361j1202j8625j9714
$$ plain form
949 -10310 -28291 -38834 -38854 -29940 -13805 7259 25756 36776 39305 32011 15949 -3764 -22823
962 -22823 -34862 -38800 -32206 -19057 1001 19304 33252 38236 32969 20670 3075 -16391 -31026
975 -31026 -37169 -34251 -22887 -5602 13108 28352 36166 34974 24652 8511 -10608 -25739 -34352
988 -34352 -35477 -25996 -11072 7651 23391 33027 34374 27302 14214 -3769 -20413 -31453 -34607
1001 -34607 -28207 -14770 1491 17599 29577 33978 29802 17803 1183 -15688 -27300 -33009 -30300
1014 -30300 -19668 -4010 13051 25948 32148 30640 21525 6666 -9888 -23940 -30909 -30516 -22340
1027 -22340 -8662 7181 21277 30525 30934 23477 10674 -4022 -19108 -28143 -30484 -25376 -13372
1040 -13372 2023 16677 26313 29894 26302 15226 106 -14614 -25824 -29024 -26279 -16822 -2510
$$ packed form
949a0310j7981j0543k0Q914J6135K1064J8497J1020K529p294j6062j9713j9059
962b2823j2039l938O594J3149K0058J8303J3948M984n267j2299j7595j9466j4635
975c1026o143K918J1364J7285J8710J5244P814j192j0322j6141j9119j5131q613
988c4352j125R481J4924J8723J5740R636J347p072j3088j7983j6644j1040l154
1001c4607O400J3437J6261J6108J1978M401m176j1999j6620j6871j1612n709K709
1014c0300J0632J5658J7061J2897O200j508r115j4859j6554j4052o969L93Q176
1027b2340J3678J5843J4096R248M09p457j2803j4696j5086r035k341N108J2004
1040a3372J5395J4654R636L581l592j1076j5120j4720j1210l200K745R457J4312
$$ plain form
1053 -2510 11768 24033 28839 26797 18795 4965 -9113 -21452 -27979 -27051 -19606 -6595 6959
1066 6959 19333 26597 27513 21216 8675 -5573 -17776 -25073 -26654 -21907 -11549 2692 15833
1079 15833 23989 27057 22380 13110 -155 -13418 -22821 -27061 -23361 -14814 -1736 11102 21285
1092 21285 25449 23875 15499 3847 -9439 -19200 -25074 -24667 -17036 -5547 7271 17620 23469 24512
1106 24512 18329 7818 -4728 -16526 -23117 -24226 -19258 -9516 2973 14598 22209 24528 20541
1119 20541 10962 -885 -12461 -21215 -24307 -20620 -12407 -1155 10318 19428 23565 21868 14285 3067
1133 3067 -9501 -18158 -23020 -21974 -15455 -4760 7181 16525 22063 21800 16541 6602 -5088 -15233
1147 -15233 -21658 -22172 -16955 -8143 3561 13308 20270 22209 18499 9863 -1597 -11689 -19133 -21539
$$ packed form
1053b510J4278J2265M806k042q002j3830j4078j2339o527R28P445J3011J3554
1066F959J2374P264R16o297j2541j4248j2203p297j581M747J0358J4241J3141
1079A5833Q156L068m677r270j3265j3263r403m240L700Q547J3078J2838J0183
1092B1285M164j574q376j1652j3286r761n874M07P631J1489J2818J0349N849J043
1106B4512o183j0511j2546j1798o591j109M968R742J2489J1625P611K319l987
1119B0541r579j1847j1576q754l092L687Q213J1252J1473R110M137j697p583j1218
1133C067j2568q657m862J046O519J0695J1941R344N538k63n259r939j1690j0145
1147a5233o425n14N217Q812J1704R747O962J939l710q636j1460j0092p444k406
$$ plain form
1161 -21539 -18943 -10643 -78 10105 18151 21275 19234 12258 1989 -8330 -16956 -20694 -19455 -13430
1175 -13430 -3714 6258 15420 20485 20027 14598 5407 -4577 -13439 -19612 -19994 -15239 -6777 3105 12600
1190 12600 18487 19861 16123 9125 -1398 -10892 -17223 -19743 -16934 -10114 -243 10053 16732 19984
1204 19984 17046 10967 2026 -7644 -15484 -19073 -17799 -12595 -3137 6380 13931 18203 17841 13380 5103
1219 5103 -4753 -12550 -17165 -17748 -13805 -6495 2967 11352 17334 18089 14015 7635 -1476 -9948 -15195
1234 -15195 -18003 -15283 -8605 -461 8561 15519 17200 15586 10319 1453 -7043 -13934 -16835 -16059 -10412
1249 -10412 -3079 5706 13139 16043 15822 11663 4213 -4216 -11563 -16366 -16320 -12100 -5738 3265 10392
1264 10392 15260 16511 13190 5969 -1735 -9121 -14167 -15863 -13668 -7467 -340 7996 13636 15356 13905
$$ packed form
1161b1539K596Q300J0565J0183Q046L124k041o976j0269j0319q626l738J239O025
1175a3430R716R972R162N065m58n429r191r984q862o173l82M755Q462R882R495
1190A2600N887J374l738o998j0523r494o331k520K809O820R871J0296O679L252
1204A9984k938o079q941r670p840l589J274N204R458R517P551M272l62m461q277
1219E103r856p797m615n83L943P310R462Q385N982P55m074o380r111q472n247
1234a5195k808K720O678Q144R022O958J681j614n267q866q496o891k901P76N647
1249a0412P333Q785P433K904k21m159p450q429p347m803M6M220O362R003P127
1264A0392M868J251l321p221p704p386n046j696K195O201P127Q336N640J720j451
$$ plain form
1279 13905 8528 1268 -6067 -12690 -15536 -14355 -9508 -2575 5069 11504 14987 14659 10171 3799 -4273
1294 -4273 -10308 -14001 -14178 -11217 -4536 2711 8872 13777 14578 12237 6030 -1729 -8506 -12819 -14171
1309 -14171 -12178 -6603 -131 7556 12763 14285 12552 7426 1352 -6367 -10861 -13826 -13105 -8053 -2209
1324 -2209 4823 10273 13539 12838 9417 3421 -3396 -9348 -12775 -13109 -10020 -4225 2302 8268 12502
1339 12502 12819 10496 5173 -1364 -7514 -11974 -12813 -10937 -5969 109 6454 11274 13224 11397 6976
1354 6976 1027 -5445 -10125 -12357 -11919 -7128 -1770 4540 9878 12119 11699 8474 3104 -3602 -8575
1369 -8575 -11421 -12152 -9199 -3987 2082 8230 11468 12123 9792 4489 -1370 -6807 -11108 -11528 -9779 -5314
1385 -5314 929 5988 9982 11945 10273 6313 567 -5852 -9419 -11658 -10204 -7302 -1668 4002 8953
$$ packed form
1279A3905n377p260p335o623k846J181M847O933P644O435L483l28m488o372q072
1294d273o035l693j77K961O681P247O161M905Q01k341o207p759o777m313j352
1309a4171J993N575O472P687N207J522j733n126o074p719m494k965P21N052N844
1324b209P032N450L266p01l421n996o817n952l427l34L089N795O527N966M234
1339A2502L17k323n323o537o150m460q39J876M968O078O345M820J950j827m421
1354F976n949o472m680k232M38M791N358O310N338K241m20l225n370o706m973
1369h575k846p31K953N212O069O148L238O55k331n303n859n437m301m20J749M465
1385e314O243N059L994J963j672l960n746o419l567k239J454K902N634N670M951
$$ plain form
1400 8953 11368 11133 7888 2767 -3343 -8145 -11061 -11013 -7858 -3212 3006 6922 10719 11156 8286 4534
1416 4534 -1421 -5982 -9567 -10898 -9427 -4448 573 5720 9339 10474 9695 5964 -107 -4675 -8385
1431 -8385 -10982 -9699 -6437 -1161 4034 7984 9808 9449 6329 1818 -3606 -7534 -9926 -10092 -7090
1446 -7090 -3191 2089 6470 9164 9883 7726 3268 -1611 -6546 -9090 -10129 -7968 -3837 688 5474
1461 5474 8708 9805 8717 5068 37 -4388 -8438 -9643 -8713 -5332 -1142 3475 7687 9315 9099
1476 9099 6346 1613 -3168 -6902 -9074 -8985 -6814 -2383 2397 6970 8749 9484 7347 3285 -1354 -5806
1492 -5806 -8394 -9499 -7498 -3928 819 4769 8250 8798 8025 4135 -49 -4663 -7857 -9052 -7858
1507 -7858 -4822 -1519 4028 7680 8951 8200 5611 1277 -3143 -6719 -8834 -8257 -5952 -2473 2093
$$ packed form
1400H953K415k35l245n121o110m802k916M8L155M646O218L916L797M37k870l752
1416D534n955m561l585j331J471M979N021N147L619J135p79l731o071m568l710
1431h385k597J283L262N276N195L950J824l59l120m511n424l928k392j66L002
1446g090L899N280M381K694P19k157m458m879m935k544j039K161M131M525M786
1461E474L234J097j088l649n031m425m050j205R30L381M190M617M212J628k16
1476I099k753m733m781l734k172Q9K171M431M780M573J779P35k137m062m639m452
1492e806k588j105K001L570M747L950L481N48p73l890m184m614l194j195J194
1507g858L036L303N547L652J271p51k589m334m420l576k115N77K305L479M566
$$ plain form
1522 2093 6047 8382 9040 6703 3304 -1598 -5556 -8075 -8264 -7247 -3367 904 4336 8010 8534 7627
1538 7627 4334 271 -4350 -7316 -8640 -7269 -4936 -873 3403 6643 8437 8748 5447 1492 -3006
1553 -3006 -6674 -8397 -7944 -5801 -2380 2132 5970 7931 7897 6236 2996 -1545 -4653 -7823 -8004 -6447
1569 -6447 -3130 933 4068 6866 8317 6743 3859 479 -3779 -6998 -7761 -7269 -4124 -796 2844
1584 2844 6765 7761 6949 4526 1354 -2308 -5984 -7500 -7654 -5135 -1955 2110 5420 7427 7615 5382
1600 5382 2647 -1523 -4643 -7220 -7630 -6313 -3698 502 4274 7048 7289 6307 3838 -109 -3423 -5975
1616 -5975 -7330 -6528 -4243 -700 2836 5532 7516 6653 4913 1225 -1584 -5012 -7234 -6591 -5444 -1871
1632 -1871 1309 4718 7100 6855 5588 2770 -1452 -4639 -6644 -7187 -5890 -2983 163 4160 6197
$$ packed form
1522B093L954K335O58k337l399m902l958k519j89J017L880M271L432L674N24r07
1538G627l293m063m621k966j324J371K333M063M276L240J794L11l301l955m498
1553c006l668j723M53K143L421M512L838J961l4j661l240m541l108l170j81J557
1569f447L317M063L135K798J451j574k884l380m258l219p63M92L145L328L640
1584B844L921R96q12k423l172l662l676j516j54K519L180M065L310K007J88k233
1600E382k735m170l120k577m10J317K615M200L772K774K41r82k469l947l314k552
1616e975j355Q02K285L543L536K696J984q63j740l688k809l428k222O43J147L573
1632a871L180L409K382k45j267k818m222l187k005n43J297K907L146L997K037
$$ plain form
1647 6197 7331 5654 3595 78 -2991 -6114 -7225 -6418 -4147 -605 2997 5411 6733 6344 4211
1662 4211 1028 -2447 -4749 -6428 -6531 -4670 -2421 1123 4571 6567 6708 4816 2435 -835 -3923
1677 -3923 -6192 -6938 -5674 -3192 102 3272 5135 6203 5275 3446 682 -3519 -5137 -6201 -5723 -3811
1693 -3811 -826 2184 4729 6414 6170 4136 1039 -1769 -4599 -5957 -6197 -4335 -1486 1104 4189
1708 4189 5686 6083 4713 2038 -761 -3544 -5987 -5997 -4713 -2101 470 3120 4558 5768 5602 3530
1724 3530 125 -2783 -5160 -5596 -5310 -2992 -705 2180 4330 5716 4970 4002 1680 -1960 -4167 -5392
1740 -5392 -5468 -4088 -1598 1337 3693 5329 5859 4017 2281 -1181 -3644 -5125 -5732 -4574 -2629 637
1756 637 2346 5100 5878 4933 3012 516 -2116 -4421 -5106 -4450 -2994 -950 1997 4263 5275 5316 3557
$$ packed form
1647F197J134j677k059l517l069l123j111Q07K271L542L602K414J322l89k133
1662D211l183l475k302j679j03J861K249L544L448J996J41j892k381l270l088
1677c923k269p46J264K482L294L170J863J068r28j829k764m201j618j064M78J912
1693c811K985L010K545J685k44k034l097k808k830j358k40J862K849K590L085
1708D189J497L97j370k675k799k783k443j0J284K612K571K650J438J210j66k072
1724C530l405k908k377m36K86K318K287K885K150J386p46r68k322l640k207j225
1740e392p6J380K490K935K356J636N30j842j736l462k463j481o07J158J945L266
1756F37J709K754P78r45j921k496k632k305o85O56J456K044K947K266J012M1j759
$$ plain form
1773 3557 1391 -1472 -3560 -4845 -5175 -4099 -1545 1003 2875 5070 4984 4161 2137 -258 -2510 -4369
1789 -4369 -5586 -4394 -2131 332 2208 4922 4742 4267 2854 280 -2041 -3760 -4358 -4428 -2674 -553
1805 -553 1350 3615 4597 4695 3431 926 -1330 -3343 -4731 -4476 -3603 -1343 558 2930 4561 5080 3261
1822 3261 1885 -611 -3002 -3914 -4536 -3780 -1973 297 2250 3951 4525 4089 2373 -154 -2203 -3698
1838 -3698 -4878 -3814 -2579 -892 1481 3422 4291 3829 2970 982 -1187 -3227 -4484 -4079 -3249 -1415
1854 -1415 765 2628 3956 4569 3533 1134 -301 -2554 -3915 -4910 -3618 -1725 -132 2390 3539
1869 3539 4572 3344 2563 -170 -1547 -2866 -4029 -3517 -2642 -680 1179 3402 3867 4113 2522 1085
1885 1085 -1534 -2826 -4438 -3717 -2942 -1261 1321 2125 3557 3880 3111 1247 -610 -2267 -3998 -3868
$$ packed form
1773C557k166k863k088j285l30J076K554K548J872K195q6q23k024k395k252j859
1789d369j217J192K263K463J876K714j80m75j413k574k321j719n98p0J754K121
1805e53J903K265R82R8j264k505k256k013j388K55Q73K260J901K372J631N19j819
1822C261j376k496k391r12o22P56J807K270J953J701N74m36j716k527k049j495
1838c698j180J064J235J687K373J941Q69m62q59j988k169k040j257M05Q30J834
1854a415K180J863J328O13j036k399j435k253j361r95J292J893J593K522J149
1869C539J033j228p81k733j377j319j163N12Q75J962J859K223M65K46j591j437
1885A085k619j292j612P21P75J681K582Q04J432L23p69j864j857j657j731J30
$$ plain form
1901 -3868 -3652 -1978 -153 1575 3132 4041 3107 1771 -41 -1535 -3336 -3960 -3515 -2037 -914 1204
1917 1204 2830 3700 3773 2707 608 -1386 -2712 -3663 -3954 -2788 -981 832 2290 3568 3541 3193 1081
1934 1081 -204 -1938 -3073 -3455 -3133 -1787 -83 1811 2906 3639 3247 1949 -19 -1400 -2729 -4097
1950 -4097 -2932 -2145 -421 1184 3059 3330 3132 2723 833 -979 -2262 -3058 -3498 -2332 -1259 735
1966 735 2142 3169 3071 3274 1627 -844 -1462 -2851 -2863 -2657 -1792 83 2145 3017 3356 2851 1724 -203
1984 -203 -1200 -3289 -3591 -3024 -2310 -186 1071 2787 3421 2889 2930 936 -547 -2331 -3806 -3457 -2128
2001 -2128 -1260 437 2053 3243 3395 2515 1082 -501 -2073 -2582 -3141 -2619 -1568 190 1841 2914
2017 2914 3293 2638 2161 503 -1202 -2213 -2856 -2418 -1577 -272 1099 2331 2401 3249 2127 915 -232
$$ packed form
1901c868K16J674J825J728J557R09r34j336j812j494j801o24M45J478J123K118
1917A204J626Q70P3j066k099j994j326r51k91J166J807J813J458J278k7l48k112
1934A081j285j734j135l82L22J346J704J894J095P33l92j298j968j381j329j368
1950d097J165P87J724J605J875K71j98m09j890j812j283p96m40J166J073J994
1966G35J407J027r8K03j647k471o18j389j2K06Q65J875K062Q72L39n05j127j927
1984b03r97k089l02N67P14K124J257J716O34n32M1j994j483j784j475L49J329
2001b128Q68J697J616J190J52q80j433j583j572n09n59N22J051J758J651J073
2017B914L79o55m77j658j705j011o43M38Q41J305J371J232P0Q48j122j212j147
$$ plain form
2034 -232 -1716 -3040 -2911 -2240 -1253 753 1808 2349 2757 2853 1184 139 -1709 -2881 -2692 -2687 -1815 -23
2052 -23 739 2556 2494 2449 1558 94 -1340 -1971 -3035 -3073 -2077 54 820 1899 2825 2820 1807 1030 -1048
2071 -1048 -2050 -2710 -3268 -2265 -832 492 2173 2846 2363 2259 1240 98 -986 -2368 -2809 -2167 -883
2088 -883 326 1198 2279 2726 2083 1857 697 -1167 -2037 -2979 -2142 -1798 -322 642 2266 2005 2456 1861
2106 1861 376 -645 -1673 -2434 -2908 -2019 -1021 881 1748 1935 2438 2044 994 -396 -1318 -2431 -2686
2123 -2686 -2452 -1258 105 1534 2011 3028 1975 1447 155 -752 -1725 -2525 -2250 -1271 25 757 2201
2140 2201 2723 2945 1543 1173 -767 -1840 -2065 -2378 -2087 -1222 531 1655 1705 2552 1706 988 131 -1293
2158 -1293 -2050 -1947 -1492 -1301 8 1431 1881 2467 1999 1130 634 -1359 -2077 -2712 -1965 -1986 -731 1042
$$ packed form
2034b32j484j324J29O71R87K006J055N41M08R6j669j045j848j172J89NQ72J792
2052b3P62J817o2m5q91j464j434o31j064l8R96K131P66J079R26nj013p77k078
2071a048j002o60n58J003J433J324J681O73m83j04j019j142j084j382m41O42J284
2088h83J209Q72J081M47o43k26j160j864q70r42Q37L44J476R64J624k61M51n95
2106A861j485j021j028p61m74Q89R98J902Q67J87N03l94j050j390r22j113k55
2123b686K34J194J363J429M77J017j053n28j292r07r73q00K75R79J296P32J444
2140B201N22K22j402l70j940j073k25l13K91Q65J753J124N0Q47q46p18q57j424
2158a293p57J03M55J91J309J423M50N86m68q69m96j993p18o35P47k1J255J773
$$ plain form
2176 1042 1342 2385 1942 2009 540 -641 -1821 -1819 -2390 -2040 -575 712 1368 2063 2496 2012 1270 -160
2194 -160 -791 -2198 -1997 -1978 -1047 -93 1440 1585 1782 1811 1374 -77 -684 -2112 -2538 -1956 -1603 -599 1007
2213 1007 2018 1836 2263 1124 569 -589 -1398 -2054 -2214 -1474 -1106 672 1527 2344 2018 1696 701 -326
2231 -326 -1378 -1972 -1754 -1811 -842 -253 879 1996 1605 1411 1219 -75 -1264 -2000 -2484 -1975 -882 -673
2249 -673 1061 1804 1705 2433 1440 361 -225 -1483 -2095 -2239 -1360 -1159 1004 1239 1602 2206 1178 518 -373
2268 -373 -1025 -1688 -2056 -1684 -168 -74 1315 2000 1719 1843 931 -178 -914 -1351 -2012 -1454 -800 -233 897
2287 897 1693 1647 1959 714 14 -750 -1576 -2038 -1464 -593 -470 707 1329 2263 1706 1151 612 -350 -887 -1698
2307 -1698 -1774 -1214 -995 198 1306 1651 1658 1470 376 -812 -655 -1439 -1744 -983 -1111 -115 938 1611 1862
$$ packed form
2176A042L00J043m43O7j469j181j180Kn71L50J465J287O56O95M33m84p42j430
2194a60o31j407K01J9R31R54J533J45J97K9m37j451o07j428m26N82L53J004J606
2213A007J011j82M27j139n55j158q09o56j60P40L68J778Q55Q17l26l22r95j027
2231c26j052n94K18n7R69N89J132J117l91j94j92j294j189p36m84N09J093K09
2249f73J734P43r9P28r93j079n86j258o12j44Q79K01K163K35L63O04j028o60q91
2268c73o52o63l68L72J516R4J389O85k81J24r12j109p36m37o61N58O54N67J130
2287H97P96m6L12j245p00p64q26m62N74Q71J23J177O22R34n57n55n39r62n37q11
2307a698p6N60K19J193J108L45Pj88j094j188J57p84l05P61j28R96J053O73K51
$$ plain form
2326 1862 1492 826 505 -828 -719 -1999 -1241 -911 -710 766 1256 1562 1548 1062 -85 -198 -1349 -1186
2344 -1186 -1370 -1255 -134 362 1121 2075 1963 1657 649 -565 -1048 -1920 -1844 -1654 -1039 -232 1049 1338 1341
2363 1341 1293 730 276 -911 -1313 -1412 -1758 -740 -667 1343 1279 1666 1517 816 246 -515 -1066 -1823 -1431 -819
2383 -819 -312 270 901 1609 1017 1019 754 146 -967 -1556 -1518 -1109 -375 146 1011 2003 1239 1493 1283 26
2403 26 -714 -1298 -1728 -1231 -1012 198 1176 1218 1354 1074 940 31 -461 -1290 -1340 -1501 -670 -528 660 1016
2423 1016 1452 1169 888 578 -255 -1192 -1299 -1265 -770 -597 733 1019 1390 1410 1055 596 -139 -479 -1558 -1427
2443 -1427 -1193 -148 102 623 945 1398 992 573 319 -687 -1129 -1670 -1235 -913 -150 592 891 1522 1263
2462 1263 531 -96 -600 -1143 -1585 -1949 -1407 -485 370 842 1049 1309 1234 -57 -520 -1411 -1234 -1428 -1325 -762
$$ packed form
2326A862l70o66l21j333J09j280P58L30K01J476M90L06j4m86j147j13j151J63
2344a186j84J15J121M96P59R54j12l06j008j214m83q72P6J90O15Q07J281K89L
2363A341m8n63m54j187m02r9l46J018P3K010o4L87j49p01n70p61n51p57L92O12
2383h19N07N82O31P08n92Kk65o08j113n89L8M09P34N21Q65R92p64K54k10j257
2403B6p40n84m30M97K19J210R78M2J36k80j34r09m92q29n0j61Q31J42J188L56
2423A016M36k83k81l10q33r37j07L4M95J73J330K86L71K0l55m59p35l40j079J31
2443a427K34J045K50N21L22M53m06m19k54j006m42n41M35L22P63P42K99O31k59
2462A263p32o27n04n43m42l64N42R22Q55M72K07K60p5j291m63q91J77j94J03N63
$$ plain form
2482 -762 149 1131 989 1419 1045 472 -407 -749 -607 -1132 -1535 -435 -293 145 1084 1701 1146 600 73 -36
2502 -36 -1016 -1396 -1211 -1168 -201 486 577 1204 1275 762 288 -9 -685 -1605 -1424 -1150 -578 218 928 1173 997
2523 997 506 807 -126 -631 -989 -1256 -1068 -680 -23 444 962 1923 1384 244 602 -577 -1012 -1524 -1452 -972
2543 -972 -480 398 991 1702 1806 1164 658 -174 -996 -1519 -1205 -878 -734 639 691 1069 1338 1065 436 -67
2563 -67 -994 -1481 -1125 -1218 -1494 -323 689 1476 925 1301 692 -130 -789 -941 -1452 -1035 -951 -285 591 949
2583 949 1415 1158 1143 328 -508 -884 -799 -1597 -961 -339 173 882 1373 1876 1807 715 -488 -972 -1105 -1428
2603 -1428 -1627 -216 -77 615 926 1213 943 563 -290 -489 -1292 -1219 -1543 -682 -12 543 1482 1307 1572 971
2623 971 29 -377 -669 -1332 -1113 -702 -96 329 530 1157 1275 1116 570 28 -711 -1506 -1129 -954 -930 -359
$$ packed form
2482g62R11R82j42M30l74n73q79l42J42n25m03J100J42M38R39O17n55n46n27j09
2502c6r80l80J85M3R67O87R1O27P1n13m74k97o76r20J81K74N72P96P10K45j76
2523I97m91L01r33n05l58k67J88L88O57M67N18R61n39j140L58j179m35n12P2M80
2543i72M92Q78N93P11J04o42n06q32q22n23L14L27J44J373N2L78K69k73o29n03
2563f7r27m87L56r3k76J171J012P87n51L76o09q22o59j52n11M17Q4O66Q76L58
2583I49M66k57j5q15q36l76Q5p98O36O22N12P09M91N03o9j092j203m84j33l23
2603a428j99J411J39O92L11K87k70l80q53j99q03P3l24Q61O70N55R39j75K65o01
2623I71r42m06k92o63K19M11O06M25K01O27J18j59n46n42p39p95L77J75K4N71
$$ plain form
2643 -359 596 1243 1259 868 1032 207 -555 -916 -676 -779 -1021 -172 791 517 1368 1159 873 94 -208 -691
2663 -691 -1329 -785 -884 -579 190 812 1406 1124 1384 254 36 -662 -1111 -1619 -843 -500 -144 940 1302 1362
2683 1362 1173 538 160 -633 -586 -1377 -1233 -605 92 276 1047 1424 643 679 5 -157 -537 -933 -1321 -426
2703 -426 -913 -51 413 677 1315 919 532 -85 -1143 -1399 -1452 -1450 -877 -98 637 873 1315 1362 784 20 -333
2724 -333 -673 -1406 -1114 -501 -540 442 785 1167 1154 606 100 -572 -1003 -1077 -1131 -632 -202 37 703 1106 749
2745 749 1221 584 -482 -1056 -726 -1361 -1146 -675 -16 329 876 1015 877 896 -82 -898 -647 -748 -1033 -920
2765 -920 56 241 823 826 660 784 66 -454 -891 -1275 -1206 -893 53 686 942 763 884 1078 793 -342 -780
2786 -780 -1004 -670 -649 -349 393 361 1021 759 972 442 -28 -669 -438 -1313 -1399 -524 -63 291 1283 1343 1481
$$ packed form
2643c59R55O47J6l91J64q25p62l61K40j03k42Q49R63k74Q51k09k86p79l02m83
2663f91o38N44r9L05P69O22N94k82K60j130k18o98m49n08P76L43L56J084L62O0
2683A362j89o35l78p93M7p91J44O28O97J84P71L77p81L6o74j62l80l96l88Q95
2703d26m87Q62M64K64O38l96l87o17j058k56n3KN73P79P35K36M42M7n78p64l53
2724c33l40p33K92O13l9R82L43L82j3n48n06o72m31p4n4M99M30K39O66M03l57
2745G49M72o37j066n74L30o35K15M71O59L45N47J39j38J9r78q16K51j01k85J13
2765i20R76J85N82Lj66J24p18n20m37l84O9L13R46O33K56j79J21J94k85j135m38
2786g80k24L34K1L00P42l2O60k62K13n30m70o41K31q75q6Q75M61L54R92O0J38
$$ plain form
2807 1481 1184 278 -215 -760 -1086 -993 -375 -401 583 441 529 1139 733 245 -45 -806 -1062 -824 -603 -400 1
2828 1 517 722 1041 1383 419 256 -916 -255 -1301 -980 -848 139 422 1188 702 1573 637 -194 -138 -984
2848 -984 -823 -820 -1155 -216 411 430 842 596 815 552 327 -417 -1335 -927 -368 -159 426 234 733 607 1139
2869 1139 360 -258 -625 -1379 -703 -847 -362 286 681 877 1062 645 631 141 -590 -547 -1086 -1031 -819 -338 306
2890 306 706 1104 934 653 178 -492 -820 -731 -977 -800 -340 316 734 474 813 1218 621 -273 -685 -971
2910 -971 -875 -906 -205 265 377 398 808 1124 590 95 -263 -498 -604 -484 -393 -74 401 500 481 894 964 -141
2932 -141 6 -573 -765 -880 -609 -56 71 449 986 1114 884 395 174 -158 -792 -528 -301 -285 -29 739
2952 739 665 978 527 509 -347 -315 -622 -1093 -932 -78 -166 -25 637 949 850 394 252 -390 -768 -127 -377 -631
$$ packed form
2807A481k97r06m93n45l26R3O18k6R84j42Q8O10m06m88k90p61k56K38K21K03M01
2828AN16K05L19L42r64j63j172O61j046L21J32R87K83P66m86Q71r36q31N6q46
2848i84J61Ll35R39O27J9M12k46K19k63k25p44r18M08N59K09N85j92M99j26N32
2869A139p79o18l67p54O76j44M85O48L95J96J85m17j4m90p31M3n39N5K12M81O44
2890C06M00L98j70k81m75o70l28Q9k46J77M60O56M18k60L39M05n97q94m12k86
2910i71R6l1P01M70J12K1M10L16n34m95l58k35j06J20R1L19M75R9j9M13P0j105
2932a41J47n79j92j15K71N53J27L78N37J28k30m89k21l32o34K64K27J6K56P68
2952G39p4L13m51j8q56L2l07m71J61Q54q8J41O62L12r9m56j42o42l78O41k50k54
$$ plain form
2974 -631 -625 614 540 633 1002 303 68 -231 189 -670 -840 -610 -155 -164 908 403 716 273 853 80 -40
2995 -40 -474 -428 -669 -43 368 360 397 925 1204 745 -87 -440 -674 -516 -341 -615 -160 47 428 442 577 452
3017 452 271 -249 -357 -599 -724 -412 -244 -602 118 93 435 400 454 553 -697 -442 -1099 -403 -307 -127 632
3038 632 297 541 843 -295 236 -330 -345 -797 -967 -133 284 324 688 269 1078 -54 131 339 -329 -67
3058 -67 -455 -500 -94 -158 232 596 763 738 349 322 -120 -794 -490 -628 -267 -243 196 258 788 431 527 585 125
3081 125 -133 -571 -340 -59 -14 -53 325 -66 35 270 252 356 -46 -572 -484 31 -147 157 245 262 584 49
3103 49 117 39 -505 -714 -632 -734 -455 -381 292 392 364 827 367 118 3 -9 -360 -138 -180 -212 26 455 -70
3126 -70 516 482 566 -50 -370 -84 -282 -83 -19 -321 351 532 338 806 36 -125 -316 -350 -597 -707 -442 -335
$$ packed form
2974f31OJ239p4R3L69o99k35k99M20q59j70K30M55rJ072n05L13m43N80p73j20
2995d0m34M6k41O26M11qL7N28K79m59q32l53k34J58J75k74M55K07L81J4J35j25
3017D52j81n20j08k42j25L12J68l58P20k5L42l5N4R9j250K55o57O96R6J80P59
3038F32l35K44L02j138N31n66j5m52j70Q34M17M0L64m19Q09j132J85K08o68K62
3058f7l88m5M06o4L90L64J67k5l89k7m42o74L04j38L61K4M39O2N30l57R6N8m60
3081A25k58m38K31K81M5l9L78l91J01K35j8J04m02n26Q8N15j78L04Q8J7L22n35
3103D9O8p8n44k09Q2j02K79P4O73J00k8M63m60k49j15j2l51K22m2l2K38M29n25
3126g0N86l4Q4o16l20K86j98J99O4l02O72J81j94M68p70j61j91l4k47j10K65J07
$$ plain form
3148 -335 150 580 613 46 494 -146 411 -233 -353 -315 -161 -205 534 346 744 278 466 485 -180 -109 -479 -724
3170 -724 -262 -124 144 84 505 454 288 291 -262 -535 -351 -489 -317 -408 -287 -296 749 -121 484 -25 52 51 358
3193 358 395 -510 -562 204 14 404 290 435 351 -9 -120 -71 13 -183 -367 45 85 34 1120 222 350 446
3215 446 -129 11 -198 -239 -514 -82 -138 -107 258 505 291 119 63 -202 58 -220 -409 -836 -270 -6 -34 492
3237 492 734 88 247 -159 -429 -149 -654 -158 -224 15 555 468 -38 75 219 -206 -28 -278 -436 -304 -231
3258 -231 302 167 376 804 156 312 -397 -142 86 289 -808 -268 370 205 348 203 223 87 644 125
3278 125 117 -290 -639 -418 11 -289 232 -313 157 -166 30 45 -263 -467 -886 -79 -657 836 -300 474
3298 474 477 296 125 -216 -371 -550 -315 -100 -55 207 -86 194 516 -60 -13 -417 -162 -351 -294 -481 -864 -65
$$ packed form
3148c35M85M30L3n67M48o40N57o44j20L8J54m4P39j88L98m66J88J9o65P1l70k45
3170g24M62J38K68o0M21n1j66Ln53k73J84j38J72r1J21rJ045q70O05n09P7jL07
3193C58L7r05n2P66j90L90j14J45q4l60j11M9Q4j96j84M12M0n1J086q98J28R6
3215D46n75J40k09m1k75M32n6L1L65K47k14j72n6k65K60k78j89m27N66K64k8N26
3237D92K42o46J59m06k70K80n05M96o6K39N40q7n06J13J44m25J78k50j58J32P3
3258b31N33j35K09M28o48J56p09K55K28K03j097N40O38j65J43j45K0j36N57n19
3278A25qm07l49K21M29l00N21n45M70l23J96J5l08k04m19Q07n78J493j136P74
3298D74Lj81j71l41j55j79K35K15M5K62k93K80L22n76M7m04K55j89N7j87l83P99
$$ plain form
3320 -65 -179 680 223 207 370 95 -270 -302 -502 -381 -276 -26 395 701 -113 239 376 98 72 30 -136 -196
3342 -196 121 -701 81 57 273 450 26 -7 332 -79 14 -67 -230 144 9 147 73 395 325 119 144 224 1
3365 1 -143 -248 -189 158 64 170 -298 94 389 -210 409 10 148 12 -476 -239 194 -72 15 235 -117 236
3387 236 -297 -412 -198 -588 -179 86 -31 182 -66 682 349 -37 502 553 -66 -167 -15 -74 -12 24 -16 254
3409 254 -49 346 283 -105 -295 -83 -258 -447 475 239 -8 472 275 280 362 121 -138 255 -15 -509 -179
3430 -179 58 -244 620 281 843 304 -179 -576 80 -794 -589 144 -307 15 416 387 17 121 283 -51
3450 -51 -272 -3 -238 -13 -163 442 183 309 328 -228 -242 39 56 -26 -113 -557 35 421 -188 215 285 666
3472 666 -198 -21 274 161 -226 -86 -32 19 117 -124 -38 159 -94 147 -146 -645 60 -268 -199 -24 -153 -340
$$ packed form
3320f5j14Q59m57j6J63k75l65l2k00J21J05K50M21L06q14L52J37k78k6m2j66o0
3342a96L17q22P82k4K16J77m24l3L39m11R3q1j63L74j35J38p4L22p0k06K5Q0k23
3365Aj44j05N9L47r4J06m68L92K95n99O19l99J38j36m88K37M33k66Q7K20l52L53
3387B36n33j15K14l90M09K65j17K13k48P48l33l86N39N1o19j01J52n9O2L6m0K70
3409B54l03L95o3l88j90K12j75j89R22k36k47M80j97NQ2k41k59L93k70m94L30
3430a79K37l02Q64l39N62n39m83l97O56q74K05P33m51L22M01k9l70J04J62l34
3450e1k21K69k35K25j50O05k59J26J9n56j4K81J7q2q7m44N92L86o09M03P0L81
3472F66q64J77K95j13l87J40N4N1R8k41Q6J97k53K41k93m99P05l28O9J75j29j87
$$ plain form
3494 -340 76 255 -53 306 -61 -537 -128 -184 -199 38 228 414 221 200 -127 238 165 277 276 -295 -383 226
3516 226 -594 418 181 424 310 295 -82 -86 210 -165 -278 236 -12 -100 150 -18 238 546 -45 74 148
3537 148 -381 120 -347 -165 52 130 209 306 312 201 297 -111 -154 -577 -508 19 -250 -94 -233 -68 -16 387 91
3560 91 -340 40 34 -391 -57 -58 -249 262 121 135 429 20 15 369 292 -24 -374 -247 -344 -308 -197 413 154 -44
3584 -44 312 138 -250 353 -122 -150 249 -425 114 32 380 33 -229 -166 187 49 -273 -78 -247 -279 597 -15
3606 -15 -64 251 -203 269 111 197 294 -155 298 -55 126 181 100 -130 410 232 53 -52 14 -433 -152 -185 -39
3629 -39 28 202 164 -206 -142 235 -238 -179 -231 69 -187 -82 111 -112 -3 -293 186 -314 -321 339 -495 -100 -152
3652 -152 -250 90 749 21 220 192 -112 -337 -125 -381 -229 -175 -448 48 238 -302 365 -175 85 -184 188
$$ packed form
3494c40M16J79l08L59l67m76M09n6j5K37J90J86j93k1l27L65p3J12jn71q8O09
3516B26q20J012k37K43j14j5l77mK96l75j13N14k48q8K50j68K56L08n91J19P4
3537A48n29N01m67J82K17P8P9R7Oj11R6m08m3m23O9N27k69J56j39J65N2M03k96
3560I1m31L80om25L34jj91N11j41J4K94m09nL54p7l16l50J27r7L6J11O10k59j98
3584d4L56j74l88O03m75k8L99o74N39q2L48l47k62O3L53j38l22J95j69l2Q76o12
3606a5m9L15m54M72j58Q6R7m49M53l53J81N5q1k30N40j78j79j05O6m47K81l3J46
3629c9O7J74l8l70O4L77m73N9n2L00k56J05J93k23J09k90M79n00pO60q34L95n2
3652a52r8L40O59p28J99k8l04k25K12k56J52N4k73M96J90n40O67n40K60k69L72
$$ plain form
3673 188 -599 90 200 -394 365 6 1 32 224 182 -398 -556 -229 -55 -128 235 501 -83 -476 -110 154 -184
3695 -184 17 378 310 -374 -62 -174 -495 457 383 251 310 272 4 -8 115 -8 43 -173 168 161 -17 -137 -263
3718 -263 -92 -158 20 -188 -193 11 -383 -249 -261 27 639 360 -127 213 -486 -83 -286 323 266 -406 338 -305
3740 -305 376 437 -201 -77 -95 -297 -109 -284 9 129 -423 -120 178 -2 -49 -584 57 28 -122 434 -140
3761 -140 46 69 -110 -168 -5 138 57 543 -67 171 -67 -211 -488 640 -259 -24 -192 -77 93 70 110
3782 110 55 -1 47 -228 164 -241 -1 587 83 236 -191 -293 -592 -339 -219 -20 66 -286 -67 -101 -273 142
3804 142 188 99 -133 11 -327 -361 -190 3 -149 133 222 -476 264 219 -138 204 -65 207 -223 -294 -45 -297
3826 -297 185 -103 13 180 -195 110 39 -285 13 21 -174 161 360 -5 -31 25 87 -226 -226 -209 351 394 -358
$$ packed form
3673A88p87O89J10n94P59l59nL1J92m2n80j58L27J74p3L63K66n84l93L66K64l38
3695a84K01L61o8o84L12j12l21R52p4j32N9l8k68j2J23j23N1k16L41pj78j20j26
3718b63J71o6J78k08nK04l94J34j2K88O12k79m87L40o99M03k03O09n7o72P44o43
3740c05O81O1o38J24j8k02J88j75K93J20n52L03K98j80m7n35O41k9j50N56n74
3761a40J86K3j79n8J63J43q1M86o10K38k38j44k77J128q99K35j68J15J70k3M0
3782A10n5n6M8k75L92m05K40N88n04J53m27j02k99K53J20J99Q6l52K19l4j72M15
3804A42M6q9k32J44l38l4J71J93j52K82Q9o98P40m5l57L42k69K72m30p1K49k52
3826b97M82k88J16J67l75L05p1l24K98Qj95L35J99l65k6N6O2l13%J7N60M3p52
$$ plain form
3849 -358 318 404 121 307 -196 -118 -209 59 -115 85 333 77 61 69 473 -364 -187 278 -312 60 82 298
3871 298 -63 124 319 -82 -386 102 24 -379 -90 -237 139 58 232 -84 228 -150 -526 -72 33 -83 267
3892 267 125 -13 -351 -154 117 108 -394 369 286 -335 131 226 361 -412 631 -241 138 546 2 -502 94
3913 94 39 65 -210 -255 313 211 105 9 7 -56 278 139 268 175 -383 -210 -116 -86 605 -11 225 176 72 12
3937 12 584 -181 604 -143 325 82 408 367 221 189 113 125 -185 134 362 146 -365 -137 -208 593 163 -190
3959 -190 245 -173 -11 -132 -82 -412 -192 48 -321 -141 417 360 -73 314 247 -199 -93 -328 -20 2 184
3980 184 -204 261 75 -38 582 -41 317 355 -11 84 -549 361 452 -487 -322 -450 122 -266 29 355 -618
4001 -618 98 409 -63 399 291 -175 1 30 -162 115 300 -476 36 15 83 -328 180 -154 268 364 -331
$$ packed form
3849c58O76Q6k83J86n03P8r1K68j74K00K48k56j6QM04q37J77M65n90L72K2K16
3871B98l61J87J95m01l04M88p8m03K89j47L76q1J74l16L12l78l76M54J05j16L50
3892B67j42j38l38J97K71rn02P63q3o21M66R5J35p73J043q72L79M08n44n04N96
3913I4n5K6k75m5N68j02j06r6ko3L34j39J29r3n58J73R4L0O91o16K36m9j04o0
3937A2N72p65P85p47M68k43L26m1j46l2p6J2l10L19K28k16n11K28p1Q01m30l53
3959a90M35m18J62j21N0l30K20K40l69J80N58n7m33L87o7m46J06k35L08K2J82
3980A84l88M65j86j13O20o23L58L8l66R5o33R10R1r39J65j28N72l88K95L26r73
4001f18P16L11m72M62j08m66J76K9j92K77J85p76N12k1O8m11N08l34M22R6o95
$$ plain form
4022 -331 139 -164 -51 -153 504 146 -85 211 -260 46 -297 98 301 288 -223 32 132 206 411 -226 163
4043 163 289 426 380 318 -50 -597 -128 -147 178 124 -114 145 174 -212 -31 174 -95 -514 -238 -244 196 72
4065 72 295 36 -9 11 -193 42 -86 82 26 -63 -342 -379 197 66 0 -241 455 391 710 129 457 -46 125
4088 125 -25 506 326 407 -155 368 208 123 137 463 434 -200 -226 258 14 -131 281 -20 91 -437 -290 -189
4110 -189 30 -151 298 -228 31 416 217 -220 -162 295 76 -229 -163 415 -602 190 -418 140 89 25 -18
4131 -18 209 414 -414 191 -514 245 -85 -7 8 97 315 -74 173 -242 -140 -594 -289 220 427 124 -115
4152 -115 46 157 -19 -199 23 139 4 -218 74 178 -344 254 -224 87 300 -99 2 -482 -276 365
4172 365 231 -123 215 97 384 134 232 -452 582 49 -220 127 175 111 -102 93 -185 217 -106 -398 119
$$ packed form
4022c31M70l03J13j02O57l58k31K96m71L06l43L95K03j3n11K55J00P4K05o37L89
4043A63J26J37m6o2l68n47M69j9L25n4k38K59K9l86J81K05k69m19K76oM40j24
4065G2K23k59m5K0k04K35j28J68n6q9k79l7N76j31o6k41O96o4L19n81L28n03J71
4088A25j50N31j80Q1n62N23j60q5J4L26k9o34k6M84k44j45M12l01J11n28J47J01
4110a89K19j81M49n26K59L85j99m37N8M57k19l05O6N78j017P92o08N58n1o4m3
4131a8K27K05q28O05p05P59l30P8J5Q9K18l89K47m15J02m54L05N09K07l03k39
4152a15J61J11j76j80K22J16j35k22K92J04n22N98m78L11K13l99J01m84K06O41
4172C65j34l54L38j18K87k50R8o84J034n33k69L47M8o4k13J95k78M02l23k92N17
$$ plain form
4193 119 161 87 279 163 255 117 112 331 -40 -247 -60 51 177 -69 -120 210 -388 -336 -162 81 -325 117
4215 117 -184 -197 -155 -351 -261 615 -114 277 52 -63 156 239 56 138 251 293 249 -210 329 66 179 107 -113
4238 -113 -429 208 70 255 430 -238 -264 -219 -442 -158 -480 118 -47 -59 -210 56 -265 -33 40 254 -128
4259 -128 -257 -306 169 250 -259 -241 58 22 -2 180 172 -465 -215 -152 280 -322 -387 511 -397 154 -191 169 156
4282 156 -185 -108 -11 149 24 -298 -4 250 -244 280 -388 485 76 -158 84 -2 65 458 -78 -144 -237 38
4304 38 -71 605 283 -282 40 -285 241 176 -120 -178 -37 -27 446 -75 -149 -17 -192 -355 -358 -518 -186 197
4326 197 -34 -82 -86 247 -272 -150 192 133 -117 72 232 -150 -149 -14 301 -114 94 -111 -138 15 -135 180
4348 180 139 79 299 95 73 -239 -217 -102 -170 -187 -170 -33 -410 521 -249 -86 -640 -119 -81 47 207 580 25
$$ packed form
4193A19M2p4J92j16R2j38nK19l71k07J87J11J26k46n1L30n98N2J74K43m06M42
4215A17l01j3M2j96R0Q76p29L91k25j15K19Q3j83Q2J13M2m4m59N39k63J13p2k20
4238a13l16O37j38J85J75o68k6M5k23K84l22N98j65j2j51K66l21K32P3K14l82
4259a28j29m9M75Q1n09J8K99l6k4J82qo37K50O3M32o02o5Q98r08N51l45L60j3
4282A56l41P7R7J60j25l22K94K54m94N24o68Q73m09k34K42q6O7L93n36o6r3K75
4304C8j09O76l22n65L22l25N26o5k96n8J41J0M73n21p4J32j75j63lj60L32L83
4326A97k31m8mL33n19J22L42n9k50J89J60l82JJ35L15m15K08k05k7J53j50L15
4348A80m1o0K20k04k2l12K2J15o8j7J7J37l77R31p70J63n54N21L8J28J60L73n55
$$ plain form
4371 25 -93 389 -8 5 -45 -347 -308 -288 98 -296 344 451 202 258 -463 209 -90 4 115 -204 -110 189 640
4394 640 36 476 319 -104 431 131 215 -160 -247 -554 -123 -390 -253 -32 -139 -176 -79 231 -13 182 298
4415 298 -610 -28 294 -44 -280 563 176 -150 47 -246 -2 45 -11 -258 -114 184 -327 -62 548 -106 28
4436 28 -80 18 -294 105 504 -156 -47 596 193 -228 315 -57 470 -131 149 113 -666 141 135 341 386 167
4458 167 -187 205 -47 -162 -73 1 -202 275 252 -288 -235 -252 156 -34 27 -59 -301 -410 -82 362 -164 -109 383
4481 383 -43 227 15 176 305 55 -9 153 -137 255 -61 119 332 -147 192 -78 -124 246 418 140 266
4502 266 -458 -343 -223 -296 228 1 -317 254 -112 -458 197 -255 30 -144 -377 -364 -1 267 465 64 -78
4523 -78 19 -243 43 22 -321 -37 -140 53 107 -169 -192 -170 293 -316 646 -186 -527 265 208 8 479 -74
$$ packed form
4371B5j18M82l97J3n0l02L9K0L86l94O40J07k49N6p21O72k99R4J11l19R4K99M51
4394F40o04M40j57m23N35l00Q4l75q7l07M31k67J37K21j07l7R7L10k44J95J16
4415B98r08N82L22l38k36Q43l87l26J97k93K44M7n6k47J44K98n11K65O10o54J34
4436B8j08R8l12L99L99o60J09O43m03m21N43l72N27o01K80l6p79Q07oK06M5k19
4458A67l54L92k52j15Q9P4k03M77k3n40N3j7M08j90O1q6k42j09L28M44n26N5M92
4481C83m26K70k12J61J29k50o4J62k90L92l16J80K13m79L39k70m6L70J72k78J26
4502B66p24J15J20p3N24k27l18N71l66l46O55m52K85j74k33J3L63K68J98m01j42
4523g8R7k62K86k1l43K84j03J93N4k76k3K2M63o09R62q32l41P92n7k00M71n53
$$ plain form
4545 -74 352 466 13 43 -98 206 189 -251 74 -427 50 120 362 -255 104 146 21 -50 -343 571 -485 131
4567 131 -173 -264 71 97 500 -303 -326 -92 172 -157 -359 -50 -140 135 -224 32 -93 48 -691 -303 -305 23
4589 23 -494 -334 47 631 -233 238 -218 113 -78 5 117 3 -148 -307 272 -680 210 -412 267 -166 1
4610 1 -13 -192 -289 -222 618 139 -48 -286 -124 528 138 220 -142 -103 166 -304 -59 -198 -2 267 -161 77
4632 77 230 -87 170 292 13 -360 391 -424 184 -308 223 -33 -52 -113 267 -50 -46 220 24 -347 30 544
4654 544 54 -164 288 -149 19 -29 -591 167 -256 -220 182 -2 89 -74 427 361 310 33 -284 -82 -257 -233
4676 -233 -183 39 -44 54 481 158 -160 251 361 -25 113 -228 256 -288 506 287 -150 -54 101 -344 -340 -209
4698 -209 120 -729 71 332 -39 70 84 283 148 -111 -58 -116 29 145 -192 -295 -14 -428 -194 176 -493
$$ packed form
4545g4M26J14m53L0j41L04j7m40L25n01M77P0K42o17L59M2j25p1k93R14j056O16
4567A31l04r1L35K6M03q03k3K34K64l29k02L09r0K75l59K56j25J41p39L88kL28
4589B3n17J60L81N84q64M71m56L31j91Q3J12j14j51j59N79r52Q90o22O79m33J67
4610Aj4j79r7O7Q40m79j87k38J62O52l90Q2l62L9K69m70K45j39J96K69m28K38
4632G7J53l17K57J22k79l73P51q15O08m92N31k56j9o1L80l17MK66j96l71L77N14
4654E44m90k18M52m37J68m8n62P58m23L6M02j84R1j63N01o6n1k77l17K02j75K4
4676b33N0K22q3R8M27l23l18M11J10l86J38l41M84n44P94k19m37R6J55m45MJ31
4698b09L29q49Q00K61l71J09J4J99j35k59N3n8J45J16l37j03K81m14K34L70o69
$$ plain form
4719 -493 -514 -403 -346 -192 17 -38 -108 -285 51 27 -51 365 411 135 160 296 -349 3 9 -48 -267 63 -99 92
4743 92 -349 -10 -52 28 242 91 -181 -78 161 142 354 148 -45 -66 438 41 -118 272 259 74 112 18 6
4766 6 139 421 177 254 330 187 -190 -184 -435 246 -360 333 -78 -399 129 411 -635 -99 -83 -640 379 -170
4788 -170 -408 -262 331 70 190 556 -82 244 321 330 476 204 374 77 315 82 -8 6 -319 414 -5 316
4810 316 197 177 363 -133 -36 -125 -448 498 306 -204 60 -87 -5 147 51 91 64 85 142 -155 -204 376 37
4833 37 61 181 -471 14 112 212 -318 196 -261 487 -233 -32 -179 228 -114 359 182 -174 -187 -217 -119 -164
4855 -164 -387 -278 -38 -134 -16 -23 417 366 89 -115 -329 237 278 -209 21 153 -168 215 -359 130 -99 239
$$ packed form
4719d93k1J11N7J54K09n5p0j77L36k4p8M16M6k76K5J36o45L52On7k19L30j62J91
4743I2m41L39m2Q0K14j51k72J03K39j9K12k06j93k1N04l97j59L90j3j85L8r4j2
4766FJ33K82k44P7P6j43l77Ok51O81o06O93m11l21N28K82j046N36J6n57J019n49
4788a70k38J46N93k61J20L66o38L26P7RJ46k72J70k97K38k33r0J4l25P33m19L21
4810C16j19k0J86m96R7q9l23R46j92n10K64j47Q2J52r6M0k7K1N7k97m9N80l39
4833C7K4J20o52M85R8J00n30N14m57P48p20K01j47M07l42M73j77l56j3l0R8m5
4855a64k23J09K40r6J18pM40n1k77k04k14N66M1m87K30J32l21L83n74M89k29L38
$$ [...]
8191B7
##END NTUPLES=NMR FID
##END=
