##TITLE=1H ikalashn
DE-75_k_TFA
13.11.2024
##JCAMPDX= 6.0         $$ Bruker NMR JCAMP-DX V2.0
##DATA TYPE= NMR FID
##DATA CLASS= NTUPLES
##ORIGIN= UXNMR, Bruker Analytische Messtechnik GmbH
##OWNER= root
$$ TOPSPIN		Version 1.3
$$ 2024-11-13 15:15:46.750 +0400  Irina@DPX200
$$ Compression mode = diff/dup
##.OBSERVE FREQUENCY= 200.131300845
##.OBSERVE NUCLEUS= ^1H
##.DELAY= (6, 6)
##.ACQUISITION MODE= SIMULTANEOUS
##.ACQUISITION SCHEME= undefined
##.AVERAGES= 64
##.DIGITISER RES= 18
##SPECTROMETER/DATA SYSTEM= spect
##.PULSE SEQUENCE= zg
##.SOLVENT NAME= CDCl3
##.SHIFT REFERENCE= INTERNAL, CDCl3, 1, 17.49637
##AUDIT TRAIL= $$ (NUMBER, WHEN, WHO, WHERE, WHAT)
$$ ##TITLE= Audit trail, TOPSPIN		Version 1.3
$$ ##JCAMPDX= 5.01
$$ ##ORIGIN= Bruker BioSpin GmbH
$$ ##OWNER= Irina
$$ $$ F:/spectra/data/iren/nmr/1H/4/audita.txt
$$ ##AUDIT TRAIL=  $$ (NUMBER, WHEN, WHO, WHERE, VERSION, WHAT)
(   1,<2024-11-13 15:15:03.890 +0400>,<Irina>,<DPX200>,<TOPSPIN 1.3>,
      <created by zg
	started at 2024-11-13 15:10:50.625 +0400,
	POWCHK disabled, PULCHK disabled
       configuration hash MD5:
       BE 6D 3F 07 2A EA 11 49 91 17 2B D3 AF B3 58 0D
       data hash MD5: 16K
       F2 38 A9 81 9F 89 DA 27 49 9D B1 34 5F C9 8E 41>)
$$ ##END=
$$ 
$$ $$ hash MD5
$$ $$ 20 35 AF 36 16 6C 27 18 B5 61 30 45 0C 30 CD 56
##$RELAX= 
##$RELAX= 
##$RELAX= 
##$RELAX= 
##$RELAX= 
##$RELAX= 
##$RELAX= 
##$RELAX= 
##$RELAX= 
$$ Bruker specific parameters
$$ --------------------------
##$DU= <F:/spectra>
##$EXPNO= 4
##$NAME= <1H>
##$PROCNO= 1
##$TYPE= <nmr>
##$USER= <iren>
##$AMP= (0..31)
100 100 100 100 100 100 100 100 100 100 100 100 100 100 100 100 100 100 
100 100 100 100 100 100 100 100 100 100 100 100 100 100 
##$ANAVPT= -1
##$AQSEQ= 0
##$AQ_mod= 1
##$AUNM= <au_zg>
##$AUTOPOS= <>
##$BF1= 200.13
##$BF2= 200.13
##$BF3= 200.13
##$BF4= 200.13
##$BF5= 200.13
##$BF6= 200.13
##$BF7= 200.13
##$BF8= 200.13
##$BYTORDA= 1
##$CFDGTYP= 0
##$CFRGTYP= 5
##$CHEMSTR= <none>
##$CNST= (0..63)
1 1 145 1 1 1 1 1 1 1 1 1 1 1 1 1 1 1 1 1 1 1 1 1 1 1 1 1 1 1 1 1 1 1 
1 1 1 1 1 1 1 1 1 1 1 1 1 1 1 1 1 1 1 1 1 1 1 1 1 1 1 1 1 1 
##$CPDPRG= <>
##$CPDPRG1= <>
##$CPDPRG2= <>
##$CPDPRG3= <>
##$CPDPRG4= <mlev>
##$CPDPRG5= <mlev>
##$CPDPRG6= <mlev>
##$CPDPRG7= <mlev>
##$CPDPRG8= <mlev>
##$CPDPRGB= <>
##$CPDPRGT= <>
##$D= (0..63)
0 2 0 0 0 0 0 0 0 0.06 0 0.03 0 0 0 0 0.0002 0 0 0 0 0 0 0 0 0 0 0 0 0 
0 0 0 0 0 0 0 0 0 0 0 0 0 0 0 0 0 0 0 0 0 0 0 0 0 0 0 0 0 0 0 0 0 0 
##$DATE= 1731496502
##$DBL= (0..7)
120 120 120 120 120 120 120 120 
##$DBP= (0..7)
150 150 150 150 150 150 150 150 
##$DBP07= 0
##$DBPNAM0= <>
##$DBPNAM1= <>
##$DBPNAM2= <>
##$DBPNAM3= <>
##$DBPNAM4= <>
##$DBPNAM5= <>
##$DBPNAM6= <>
##$DBPNAM7= <>
##$DBPOAL= (0..7)
0.5 0.5 0.5 0.5 0.5 0.5 0.5 0.5 
##$DBPOFFS= (0..7)
0 0 0 0 0 0 0 0 
##$DE= 6
##$DECBNUC= <off>
##$DECIM= 32
##$DECNUC= <off>
##$DECSTAT= 4
##$DIGMOD= 1
##$DIGTYP= 9
##$DL= (0..7)
0 120 120 120 120 120 120 120 
##$DP= (0..7)
150 150 150 150 150 150 150 150 
##$DP07= 0
##$DPNAME0= <>
$$ [...]
##$SW= 21.9926040160658
##$SWIBOX= (0..15)
0 0 2 0 0 0 0 0 0 0 0 0 0 0 0 0 
##$SW_h= 4401.40845070422
##$TD= 16384
##$TD0= 1
##$TE= 300
##$TE2= 300
##$TE3= 300
##$TEG= 300
##$TL= (0..7)
0 120 120 120 120 120 120 120 
##$TP= (0..7)
150 150 150 150 150 150 150 150 
##$TP07= 0
##$TPNAME0= <>
##$TPNAME1= <>
##$TPNAME2= <>
##$TPNAME3= <>
##$TPNAME4= <>
##$TPNAME5= <>
##$TPNAME6= <>
##$TPNAME7= <>
##$TPOAL= (0..7)
0.5 0.5 0.5 0.5 0.5 0.5 0.5 0.5 
##$TPOFFS= (0..7)
0 0 0 0 0 0 0 0 
##$TUNHIN= 0
##$TUNHOUT= 0
##$TUNXOUT= 0
##$USERA1= <user>
##$USERA2= <user>
##$USERA3= <user>
##$USERA4= <user>
##$USERA5= <user>
##$V9= 5
##$VALIST= <valist>
##$VCLIST= <CCCCCCCCCCCCCCC>
##$VD= 0
##$VDLIST= <DDDDDDDDDDDDDDD>
##$VPLIST= <PPPPPPPPPPPPPPP>
##$VTLIST= <TTTTTTTTTTTTTTT>
##$WBST= 1024
##$WBSW= 25
##$XGAIN= (0..3)
0 0 0 0 
##$XL= 0
##$YL= 0
##$YMAX_a= 1896270
##$YMIN_a= -2320185
##$ZGOPTNS= <>
##$ZL1= 120
##$ZL2= 120
##$ZL3= 120
##$ZL4= 120
##$ABSF1= 10
##$ABSF2= 0
##$ABSG= 5
##$ABSL= 3
##$ALPHA= 0
##$AQORDER= 0
##$ASSFAC= 0
##$ASSFACI= 0
##$ASSFACX= 0
##$ASSWID= 0
##$AUNMP= <proc_1d>
##$AXLEFT= 0
##$AXRIGHT= 0
##$AXTYPE= 0
##$AXUNIT= <>
##$AZFE= 0.1
##$AZFW= 0.1
##$BCFW= 1
##$BC_mod= 2
##$BYTORDP= 1
##$COROFFS= 0
##$CY= 7568.61572265625
##$DATMOD= 1
##$DC= 2
##$DFILT= <>
##$DTYPP= 0
##$F1P= 17.9538593292236
##$F2P= -4.03888763876832
##$FCOR= 0.5
##$FTSIZE= 32768
##$FT_mod= 4
##$GAMMA= 1
##$GB= 1
##$INTBC= 1
##$INTSCL= 1
##$ISEN= 128
##$LB= 0.08
##$LEV0= 0
##$LPBIN= 0
##$MAXI= 945.577
##$MC2= 0
##$MEAN= 0
##$ME_mod= 0
##$MI= -402.1523
##$NCOEF= 0
##$NC_proc= 0
##$NLEV= 6
##$NOISF1= 8.587773
##$NOISF2= 6.764455
##$NSP= 1
##$NTH_PI= 0
##$NZP= 0
##$OFFSET= 17.49637
##$PC= 1
##$PHC0= 120.5881
##$PHC1= 2.58082
##$PH_mod= 0
##$PKNL= yes
##$PPARMOD= 0
##$PPDIAG= 0
##$PPIPTYP= 0
##$PPMPNUM= 100
##$PPRESOL= 1
##$PSCAL= 0
##$PSIGN= 0
##$REVERSE= no
##$SF= 200.13
##$SI= 32768
##$SIGF1= 18.5376
##$SIGF2= -6.396296
##$SINO= 400
##$SIOLD= 32768
##$SREGLST= <1H.CDCl3>
##$SSB= 3
##$STSI= 0
##$STSR= 0
##$SW_p= 4401.40845070422
##$SYMM= 0
##$S_DEV= 0
##$TDeff= 0
##$TDoff= 0
##$TI= <>
##$TILT= no
##$TM1= 0
##$TM2= 0
##$TOPLEV= 0
##$USERP1= <user>
##$USERP2= <user>
##$USERP3= <user>
##$USERP4= <user>
##$USERP5= <user>
##$WDW= 1
##$XDIM= 8192
##$YMAX_p= 0
##$YMIN_p= 0
$$ End of Bruker specific parameters
$$ ---------------------------------
##NTUPLES= NMR FID
##VAR_NAME=  TIME,          FID/REAL,        FID/IMAG
##SYMBOL=    X,             R,               I
##VAR_TYPE=  INDEPENDENT,   DEPENDENT,       DEPENDENT
##VAR_FORM=  AFFN,          ASDF,            ASDF
##VAR_DIM=   8192,          8192,            8192
##UNITS=     SECONDS,       ARBITRARY UNITS, ARBITRARY UNITS
##FACTOR=    0.0002272,     1,               1
##FIRST=     0,             0,               0
##LAST=      1.8609952,     -57,             445
##MIN=       0,             -2320185,        -2320185
##MAX=       1.8609952,     1896270,         1896270
$$ Real data points
##PAGE= N=1
##DATA TABLE= (X++(R..R)), XYDATA
$$ [...]
2249C84k70J20M06k27n0R7l6k62N14J10m7p25O05r85R9J16J50k83J65l99l72R7
$$ 384 114 234 640 413 363 460 424 162 676 786 739 14 619 -366 -267 -151 -1 -284 -119 -518 -890 -793
2271g93J83j35k28J311j15J01j23k63O50k97J08N41J89l67om5J24l69k77m02K44
$$ -793 -610 -745 -973 338 223 324 201 -62 588 291 399 940 1129 762 756 711 835 466 189 -213 31
2292C1l86J29p07J09K31l40r4l1J009j05k72Q45m96K53k36M87L90n53O25j94j5
$$ 31 -355 -226 -933 -824 -593 -933 -1027 -1058 -49 -154 -426 419 -77 176 -60 427 817 264 889 695 680
2313F80k53k46p7n1n73j4M91j91k51m20M80r7M85k03m4J27J0L05L18j45k41L82
$$ 680 427 181 104 53 -520 -534 -43 -234 -485 -905 -425 -522 -37 -240 -284 -157 -147 158 476 331 90 472
2335D72j7rJ04j80M33rm80l50R2J0K3j68p40j64N9O09J81q1N8q05O03j99j89P22
$$ 472 455 446 550 370 803 794 314 -36 56 66 89 -79 -819 -983 -924 -315 -134 -215 -157 -962 -359 -558 -747 -25
2359b5K28J70m64M73K19l01K04n6K29k73K5o92R9N24j060O1M17j51J01k92L87
$$ -25 203 373 -91 382 601 300 504 448 677 404 429 -263 -164 360 -700 -639 -222 -373 -272 -564 -177
2380a77m71k07K49J88M13J78r5L86J12n61L07K01M7J42q0l08l38L73l06m29M17
$$ -177 -648 -855 -606 -418 -5 173 78 464 576 15 322 523 570 712 632 324 -14 359 53 -376 41
2401D1l05o9L90l10k38k06K29L13k26K42m55L22O86M12k69j16j46K04O0O3k3o89
$$ 41 -264 -333 57 -253 -491 -697 -468 -155 -381 -139 -594 -272 414 826 557 441 295 499 559 622 599 -90
2423i0M17jm9k95n0k86J88o14P20o21k18Q28j1l36J76k90J28K82k62M96M64O7
$$ -90 327 326 277 -18 -68 -354 -166 -780 -60 -681 -899 -71 -82 -418 -242 -532 -404 -122 -384 112 576 643
2445F43o02L80R7k72K49n10l8N90k18p93K55J05n7k33j05J52J8j58K10J45l59
$$ 643 41 421 518 246 495 -15 -53 537 319 -474 -219 -114 -171 -404 -509 -357 -339 -497 -287 -142 -501
2466e01L01L02J04K6K20r7l38L56l0M8m97M54J9k15j74n5J63j94k83L9N9N3J36
$$ -501 -200 102 206 232 452 355 17 373 343 391 -106 348 367 152 -22 -77 86 -108 -391 -352 -293 -240 -104
2489a04n53J25k18M11q9P66n63J22N27J18j16j22mK03l4K13o36J97j39J86p37
$$ -104 -657 -532 -750 -339 -428 338 -225 -103 424 542 426 304 300 503 469 682 46 243 104 290 -447
2510d47P1N45k99l38J42l0m79O23p6K86J5m81O44l54P20k75Q5K16j42J28K7J04
$$ -447 -376 169 -130 -468 -326 -356 -835 -212 -288 -2 13 -468 176 -178 542 267 352 568 426 554 581 685
2532F85l44k09k8l76M22Ql91J11m67O31k26l01M70l47j93N7m3Q2N25k52L51O06
$$ 685 341 132 104 -272 150 158 -233 -122 -589 42 -184 -485 -15 -362 -555 -498 -541 -459 66 -186 165 771
2554G71k67m56m1r3O96K4j84J09l33j66l36L19n01k0l57M41j38M95o3k94K87j30
$$ 771 504 48 7 -86 610 634 450 559 226 60 -276 43 -458 -478 -835 -394 -532 -37 -100 -394 -107 -237
2576b37J12K2L77J18J52k20J50k07r7L28J40l00j45l34Q1j1j94l04O82m8m18m17
$$ -237 -125 -103 274 392 544 324 474 267 170 498 638 338 193 -141 -60 -71 -265 -569 113 65 -353 -770
2598g70O12J4R1%m11K26L89j45M37k92N3L62R1l11j6O97p37M15q18M51J37n85
$$ -770 -158 -144 -53 -53 -464 -238 151 6 443 151 204 566 657 346 330 1027 290 705 -113 338 475 -110
2620a10M0m72j92M31k08J2n4q8K77K49J93l67M6J41L50P98j141K41j52K95J57
$$ -110 -70 -542 -734 -303 -511 -499 -553 -641 -364 -115 78 -289 -243 -102 248 1046 -95 146 -6 289 446
2641D46L10q1l73m2n09O49p46P07o89M4n27O35m42L19J50n31L60R8K41K75k26
$$ 446 756 675 302 260 -249 400 -346 361 -328 -284 -811 -176 -618 -299 -149 -680 -320 -222 19 294 68
2662F8o7P54o04Q4n7L69p2j98J37l22N02p23m08M03K14o04M25p11J75J89o0p09
$$ 68 1 755 151 235 178 547 475 277 414 92 594 -129 -537 -134 80 -524 -99 -810 -635 -446 -506 -1215
2684a215J117j0p15P80k3R14j52l39M18J04n17l7J2L77K7k39k27p8P8q21M27k7
$$ -1215 -98 -108 -823 -43 -66 848 696 357 775 879 362 325 337 714 741 502 275 197 275 -546 -119 -146
2706a46l8o9l05J51j63O0L24p4m4K45J18J93j41J90J22L15q0l0l80j00K64o61
$$ -146 -184 -253 -558 -407 -570 -510 -186 -260 -304 -59 59 252 111 301 423 738 658 628 248 148 412 -249
2728b49O08l84K53o27L14N3l73l23N26Lo79M90Q0M9j74O72k32k38K72K46j54N58
$$ -249 359 -25 228 -399 -85 -32 -405 -728 -202 -199 -878 -388 -308 -259 -433 239 7 -231 41 287 133 691
2750F91j89P3m18j32K54j88n21jO88n18j29O3m35K57K49O47o55L79m9r0k96L14
$$ 691 502 575 157 25 279 91 -430 -431 257 -261 -390 -327 -762 -505 -256 391 -264 115 66 -24 -320 -6
2772fR6K8M97j65m78L47L57k98l08N0jR4l08K04l91K26q8m8K60n85k05L22Q2J54
$$ -6 90 118 615 450 -28 319 676 378 70 120 119 213 -95 109 -282 -56 -144 -192 68 -517 -722 -400 -318 -164
2796a64O82j005L78J28K83K56n01M70r2l0j07j65q1J3l44k74P81m52m18N04n06
$$ -164 518 -487 -109 19 302 558 57 527 435 405 298 133 52 65 -279 -553 228 -224 -642 -138 -644
2817f44j71K51L80J55k42l34l48P05N45L40J6k58J40J10n51L70n14M45k41L3q6
$$ -644 -815 -564 -184 -29 -271 -605 -953 -248 297 637 653 395 535 645 94 464 -50 395 154 187 101
2838A01K73p15J72L2k11J25J83%%l77j17N23l32K94l17P63l96J57j07M03m98K21
$$ 101 374 -341 -169 -137 -348 -223 -40 -40 -40 -417 -534 -11 -343 -49 -366 397 1 158 51 454 -44 177
2860A77K83o0j28o5j85j43l98N68j00k42N07m18k71J37j35l41O62j51K54k73J34
$$ 177 460 400 272 207 22 -121 -519 49 -51 -293 214 -204 -475 -338 -473 -814 -152 -303 -49 -322 -188
2881a88O38n01L16K58K95n49j86K13k46K50m7j87q5K77o38m2J009r23N97q08K41
$$ -188 450 -51 265 523 818 269 83 296 50 300 253 66 -19 258 -380 -422 587 -336 261 -547 -306
2902c06L30k02K87l90Q1R0J00M6j43L95L1J01J22l22p1JK15l25J65k21n14K11
$$ -306 24 -178 109 -281 -200 -110 -10 36 -107 288 319 420 542 220 149 150 365 40 205 -16 -530 -319
2924c19K66l46k43O37n40N0KjM60j06M15m9k15j71O36p4k02N9j61l8L4K73l02
$$ -319 -53 -399 -642 -5 -545 -495 -493 -494 -34 -140 275 226 11 -160 476 402 200 259 98 60 94 367 65
2947F5j45K56l3j43j6j38L8l22K79l35K65K8m6M25j85M64l30l22M83r7K50j15
$$ 65 -80 176 143 0 -16 -154 -116 -438 -159 -494 -229 -201 -247 178 -7 457 127 -195 288 191 441 326
2969C26o27P68j72k14k93M31j51k25j16o12J266m66l45M3n5K57J60r5K47m35L78
$$ 326 -301 467 295 81 -212 219 68 -157 -273 -885 381 -85 -430 -387 -442 -185 -25 -120 127 -308 70
2990G0L44j80J0n3K14K52k66k00K27l06O97q30P30r62Q41n52j51M36m01J06q19
$$ 70 414 234 244 191 405 657 391 191 418 112 809 -21 709 -253 588 36 -115 321 -80 26 -793
3011g93L54M51j92L9l59P78k83L10R0m40N31m00K43r0pk68L67K59n51j02r9ok60
$$ -793 -439 12 -180 -141 -500 278 -5 305 395 -45 486 86 329 239 232 -36 331 590 39 -63 -162 -168 -428
3034d28j12L70K50o41K74j32L28k80L54R7k88O50j37m11J54K97o04M42K06m1j95
$$ -428 -540 -170 80 -561 -287 -419 -91 -371 -17 80 -208 442 305 -106 48 345 -259 183 389 348 153
3055A53P4J64m06l07m3L09j1j12L40q36Q10j90l21N6K34J37O7J02l18M59l97M49
$$ 153 227 391 -15 -322 -365 -56 -67 -179 161 -675 135 -55 -376 -320 -86 51 118 220 -98 361 -36 413
3077D13n1M69l53l36J69j47n6M04l73k24K19o65O05o76L45j20J97oK65l84l9J19
$$ 413 362 831 478 142 311 164 108 512 139 -85 134 -531 74 -602 -257 -377 -180 -186 79 -305 -344 -225
3099b25J28K03k45L21o1J21j63m74P57R9p60J54P46r79L08N23n28j2l90M65k02
$$ -225 -97 106 -139 182 121 242 79 -395 362 461 -299 -145 601 -378 -70 453 -75 -87 -477 -12 -214
3120b14P7m85M35l94L07j51N53l1N57l19k51K94j63k94K92K23k33P8r2j54j29
$$ -214 -137 -622 -187 -581 -274 -425 128 97 654 335 84 378 215 -79 213 436 203 281 189 35 -94
3141i4M14p00K59k99j14K21L51n10J44J09j12j04J55J69L16m57L83j06N17k18
$$ -94 320 -380 -121 -420 -534 -313 38 -472 -328 -219 -331 -435 -280 -111 205 -252 131 25 542 324
3161C24j2mL2P4k0O4n16M02l36l71q2J94p5K14m67Q43o60M94l00K98L01n58L74
$$ 324 312 308 340 414 394 458 -58 344 8 -363 -445 -251 -326 -112 -579 264 -396 98 -202 96 397 -161 213
3184B13m03L1j48P22l73M85l14M18r9m30J83l80o8J45j3m22M7M2N5p5M7M56j82
$$ 213 -190 -159 -307 415 42 527 213 631 532 102 285 -95 -163 -18 -31 -453 -406 -364 -309 -384 -337 119 -63
3207f3P8K18k68m1j38N53L08j48j04j46k97K42k7K46Kn0j1o21J96l01R1l70M08
$$ -63 15 233 -35 -76 -214 339 647 499 395 249 -48 194 167 413 415 365 354 -267 -71 -372 -281 -651 -243
3230b43M65n85QL14k25k39R90m98l60N04K59l16o3N50k89q3k42j85J62K76m29
$$ -243 222 -363 -355 -41 -266 -505 485 -13 -373 131 390 74 11 561 272 189 -53 -238 -76 200 -229
3251b29k26M65k81L77J04k71J94k82l75j45J78N18l74M78l78Q14n58j21K67L79
$$ -229 -455 10 -271 106 210 -61 133 -149 -524 -669 -491 27 -347 131 -247 567 9 -112 155 534
3271E34p78J13O39l92j0N82r86K53K11m80j00m7N4K88j34p2O19m23O4k10o2Q0
$$ 534 -244 -131 508 116 106 688 -298 -45 166 -314 -414 -461 -407 -119 -253 -325 294 -129 -65 -275 -337 -257
3293b57L96M37n1oo83J069m52l30j32j0n70J098n16K50n17j04K23K52l82N77n69
$$ -257 139 576 525 519 -164 905 453 123 -9 -19 -589 509 -7 243 -274 -378 -155 97 -285 292 -277
3314b77M02m20k46L3M98K67o0N14q17N19k21M2O1k59n2L22j04j15m1n18P65n34
$$ -277 125 -295 -541 -508 -10 257 197 711 -106 413 192 234 295 36 -16 306 202 87 46 -472 293 -241
3336b41J82k13P2L26n26J58j0R1m37K29K32L86o13O60l98J55K43m6r7k27j9N60
$$ -241 -59 -272 -200 126 -400 -242 -252 -161 -598 -369 -137 249 -364 296 -102 53 296 250 153 -74 -93 467
3358D67l90q7p3k20K09K28k99j12l40L31j09j78L08L25n1j54K39l20Q2R1L16O2
$$ 467 77 -10 -83 -303 -94 134 -165 -277 -617 -286 -395 -573 -265 60 9 -145 94 -226 -144 -53 263 325
3380C25m86O0N48l52k3k99M43j63ml74R7P87r44jK72j81J86K8k86K27j3k66O52
$$ 325 -161 -101 447 95 72 -227 216 53 49 -325 -228 559 -385 -386 -114 -295 -109 -81 -367 -140 -153 -419 233
3403B33j03m28RO88J94l56l94M58q4m08M71l50J15j81j47L68p03J81L05q8k32
$$ 233 130 -298 -289 399 593 237 -157 301 217 -191 280 -70 45 -136 -283 85 -618 -437 -132 -220 -452
3424d52M94k32Q5j61K67K62J38k06l45M04J38L35m99J91Kj9l94k37M71j00l67
$$ -452 42 -190 -105 -266 1 263 401 195 -150 254 392 727 228 419 421 402 8 -229 242 142 -225
3445b25K54k65M2j45n64N31L6J72J18P6k27K08J37J75J41l32J50k79P60m67m05
$$ -225 29 -236 -194 -339 -903 -372 -336 -164 -46 30 -197 11 148 323 464 132 282 3 763 296 -109
3466a09K32J47j81o29L13J09J40k11O2o8M50n26j72O56j39n38J30o2P23j11j7
$$ -109 123 270 89 -540 -227 -118 22 -189 -127 -195 255 -271 -443 213 74 -464 -334 -396 327 216 199
3487A99P%L8r9K48j8k23n40N9L11K21m58R0M80n60k00J110p68O72o85L8K2j80
$$ 199 206 206 244 145 393 375 152 -388 -329 -18 203 -255 -165 315 -245 -445 665 -103 569 -116 -78 -56 -236
3510b36M13K10o46M43J16j19l49M65K23n89K2p4N7l43R05m84L4O3K4l44L99n67
$$ -236 177 387 -259 184 300 181 -168 297 520 -69 -47 -121 -64 -407 498 14 48 111 135 -209 190 -377
3532c77N34j28k65N6j70o1M28r0L70l50K99n7n24L85J56%K07l95K16J60j92K4
$$ -377 157 29 -236 -180 -350 -411 17 -73 297 -53 246 189 -335 50 206 206 413 18 234 394 202 226
3554B26o31J56L45j83J04r7L63k69r1j22Q4J94l20L28k8Q6j69L29n08K19J18o8
$$ 226 -405 -249 96 -87 17 -80 283 14 -77 -199 -115 79 -241 87 59 145 -24 305 -203 16 134 66
3576F6j30r9N18n42m3K02J93j46l51K83k20l03L88J1P3J41Q3k33j85N9K55J84
$$ 66 -64 -163 355 -187 -230 -28 165 19 -332 -49 -269 -572 -184 -173 -100 41 124 -109 -294 -235 20 204
3598B04K42p77K78j07k27O26p57O80J23j04n73P8M20k89L42k20N1j82k15n5K72
$$ 204 446 -331 -53 -160 -387 239 -518 162 285 181 -392 -314 106 -183 159 -61 -10 -192 -407 -462 -190
3619a90L67n70J63L15r1L16j81k4k03N33q66L74O36m69L38l81j64J34J3J7k61
$$ -190 177 -393 -230 85 -6 310 129 105 -98 435 -431 -57 579 110 448 67 -97 37 50 67 -194
3640a94k91M84l34k03J06O92k88J60m49N03p3j03K86l14K34k64L41k29L3K9R8
$$ -194 -485 -1 -335 -538 -432 260 -28 132 -317 186 113 10 296 -18 216 -48 293 64 97 126 224
3661B24L1m05J45p9l01M7K39j18M63j13l39L20J74o99P85r46L33O32o05r2n30
$$ 224 255 -150 -5 -84 -385 -338 -99 -217 246 133 -206 114 288 -411 374 -572 -239 393 -212 -304 -834
3682h34P43K4m38J59P92l75M4J66J60n29J19k59M81k52L6r4l40K20M4K47K1p1
$$ -834 -91 -67 -505 -346 446 71 115 281 441 -88 31 -228 253 1 37 -57 -397 -177 -133 114 135 64
3704F4K6L53n89K25K24j90l6K61p3k08K72n65N29M84n67l47j15K14n8L2n50P38
$$ 64 90 443 -146 79 303 113 77 338 265 57 329 -236 293 777 210 -137 -252 -38 -96 -64 -614 124
3726A24j9n27M49k75K6K63L19J25p95M73M34m21J59k67L47n40M20K7k56R6j29
$$ 124 105 -422 27 -248 -222 41 360 485 -310 163 597 176 335 68 415 -125 295 322 66 162 33
3747C3kn46q6K88J22J67k69N03l99j43J99l82M27J89l54L14j91K0K31k83J080
$$ 33 31 -515 -601 -313 -191 -24 -293 210 -189 -332 -133 -515 -88 101 -253 61 -130 -110 121 -162 918
3768I18l70m17m9O8l90N0k0j08N08l7j96p6n7r4P96q40O87k18k92J46j73K92N5
$$ 918 548 131 82 150 -240 -190 -210 -318 190 153 -43 -119 -176 -270 526 -314 373 155 -137 9 -164 128 183
3791A83l73J31K50N48l73p02J18M31RN9l60r5J98j86n68N33L86l1k42J16J3k23
$$ 183 -190 -59 191 739 366 -336 -218 213 222 281 -79 -174 24 -162 -730 -197 189 158 -84 32 45 -178
3813a78K76l03J53R6L5o48J121l39r1M86o36j47j02Q5N20l34OK61l42j13j75P5
$$ -178 98 -205 -52 44 79 -569 552 213 122 608 -28 -175 -277 -192 328 -6 0 261 -81 -194 -369 -294
3835b94R2k24K94j45L92J92j9Pq06P68o08J34M62q5k40K28J10r14M52J7L08j139
$$ -294 -202 -426 -132 -277 115 307 288 295 -511 257 -351 -217 245 160 -80 148 258 -656 -204 -187 121 -1018
3857a018Q11p7J07O2j49J73k35o7M14j02K74l3j56k41P48o47J66J50N1M06l22
$$ -1018 -207 -284 -177 -115 -264 -91 -326 -393 21 -81 193 160 4 -237 511 -136 30 180 231 637 315
3878C15j77K0q4k36K82k19J82N00r76M01J7j35K28J5l88J49o3J59M2j55M9K28
$$ 315 138 158 74 -162 120 -99 83 583 -393 8 25 -110 118 133 -255 -106 -169 -10 32 -123 -74 154
3900A54M47n83J34r6K04L11o35j64k79Q72o36L92J27k31p4l91R45n49j76l23K44
$$ 154 601 18 152 56 260 571 -64 -228 -507 365 -271 121 248 17 -57 -448 497 -52 -228 -551 -307
3921c07K65L36k18P6j55j55M52l61N3m9L31l71K18L66m32l43N85j68j49l01r6
$$ -307 -42 294 76 152 -3 -158 294 -67 -14 -63 268 -103 115 481 49 -294 291 123 -26 -327 -423
3942d23Q19o8p69K60j40J42k27M34J0m84P82m43L76k26P8L9k83L92q9m32j95O56
$$ -423 396 328 -441 -181 -321 -179 -406 28 38 -446 336 -107 269 43 121 160 -123 269 180 -252 -447 209
3964B09m12p2M00j35p4n94L68l2L91l80L09n59Q65l02L24j15L90n02J80K4l98
$$ 209 -203 -275 125 -10 -84 -678 -310 -342 49 -331 -22 -581 284 -18 306 191 581 79 259 283 -115
3985a15M3L43l73P6K14l95P99p25K63l36L18k57J79J97l49K38j5n28J02L59m5
$$ -115 -72 271 -102 -26 188 -207 592 -133 130 -206 112 -145 34 231 -118 120 105 -423 -321 38 -7
4006gK7J10l14k4q9M12J41J59j00K46j366R06O6o7o21M75j57K07J38q8PRK0m75
$$ -7 20 130 -184 -208 -297 115 256 415 315 561 -805 101 167 100 -521 -46 -203 4 142 54 61 70 90 -385
4030c85P73j318Q95K46L4K76m58Q8r5n21R1O02o14L84l43N11L17k07n87j05L17
$$ -385 388 -930 -35 211 245 521 63 151 56 -465 -374 228 -386 -2 -345 166 483 276 -311 -416 -99
4051i9K52m26K24l7k97j48K49L62o02O14N8j63j67K62j85K12r8J80l0k28p1R8
$$ -99 153 -273 -49 -86 -383 -531 -282 80 -522 92 150 -13 -180 82 -103 109 11 191 161 -67 -138 -40
4073d0j13j61M55k57k29L44N23m48r9J59M21l31l30j32P8j25N25P5K87l08l38
$$ -40 -153 -314 141 -116 -345 -1 522 74 -25 134 555 224 -106 -238 -160 -285 240 315 602 294 -44
4094d4K96n7L16j163M96K78K09l04M70l19j63m74K8J86L21j79N4M9K12K27q43
$$ -44 252 195 511 -652 -156 122 331 27 497 178 15 -459 -431 -245 76 -103 -49 0 212 439 -404
4115d04J56N79l77L8m4K50j27k24M01q1l7L5nl64M02m10J95k86r1j31N37p7l77
$$ -404 -248 331 -46 -8 -52 198 71 -153 248 167 130 165 160 -204 198 -212 -17 -303 -394 -525 12 -65 -442
4138d42j57O22k26J83K46K22j84k90L96o68K49L13l22O81k08n01j1J94Q4l49K7
$$ -442 -599 23 -203 -20 226 448 264 -26 370 -298 -49 264 -58 623 415 -86 -97 97 181 -168 -141
4159a41K14J35j04n5j81L55jl69k4K8m94O11N82k63k55k29P77o37l3j09M75J51
$$ -141 73 208 104 49 -132 223 222 -147 -171 -143 -637 -26 556 293 38 -191 586 -51 -84 -193 282 433
4181D33m49K01p32P02l51K49O3j93L91J4j70n76O13k62k6r0K43J14n6j84k8J23
$$ 433 -16 185 -547 155 -196 53 116 -77 314 328 158 -418 195 -67 -93 -183 60 174 118 -66 -94 29
4203B9L57m46K29Q2l42L66j60l7L7l01L35M33m36j04n61J62J06k33J10O46l14
$$ 29 386 -60 169 251 -91 275 115 78 115 -186 149 582 146 42 -519 -357 -251 -484 -374 272 -42
4224d2N2j22K71j84K52j84R2J52l07n8J79lQ6k10k40Q49p41M08L43m15m36k46
$$ -42 10 -112 159 -25 227 43 135 287 -20 -78 101 98 184 -26 -266 583 -158 250 593 178 -258 -504
4246e04k95M24L56J56K63k38k76M30n19J92R3j16%K81r9m3j70l27R32l40p01j45
$$ -504 -799 -375 -19 137 400 162 -114 316 -203 -11 82 -34 -34 247 148 105 -65 -392 540 200 -501 -646
4268f46N19K84o5K15j93k42M44n0o61M82r6m2lM90l83l57R34j057Q09o8n30J31
$$ -646 -127 157 92 307 114 -128 316 266 -395 87 -9 -51 -54 436 53 -304 630 -427 382 314 -216 -85
4290h5M00K16o7j99k91M80m4K2m87j21J18j19J55J37o43Q44n00K8J25j12M66K42
$$ -85 315 531 464 265 -26 454 410 432 -55 -176 -58 -177 -22 115 -528 316 -184 -156 -31 -143 323 565
4312E65p51L12j80J43Mk42J76k30J81o74P07j9k37j34O5K27p9j54K51l98N49J25
$$ 565 -186 126 -54 89 93 -149 27 -203 -22 -696 11 -8 -245 -379 -314 -87 -166 -320 -69 -467 82 207
4334B07j69k62L64j29K65l38L86j04m78J59j1M6q7K51m98N72j1k88j63Q7L78j32
$$ 207 38 -224 140 11 276 -62 324 220 -258 -99 -110 -64 -151 100 -398 174 163 -125 -288 -201 177 45
4356D5l88O16K02p51N48j72m11K19M27l86j31M36o97N09ok6k18J87L32k71l39
$$ 45 -343 273 475 -276 272 100 -311 -92 335 -51 -182 254 -443 66 60 34 -184 3 335 64 -275
4377b75J09J60j55J67jj18N32m83k13J43j50L06O88p18K8J12P6j87j57L7Q3O5
$$ -275 -166 -6 -161 6 5 -113 419 -64 -277 -134 -284 22 710 -8 20 132 208 21 -136 -99 -16 49
4399D9k37l8M34n54Q5N97o93K71N59m55l40K70K22k69N0L61q05N13k20l4k53O8
$$ 49 -188 -226 208 -346 -261 336 -357 -86 473 18 -322 -52 170 -99 -49 312 -493 20 -200 -234 -487 -419
4421d19K44J55K51K78m97L30L65n83n39K03O8K24m58L17K37k29j63O25p7q13M20
$$ -419 -175 -20 231 509 12 342 707 124 -415 -212 -144 80 -378 -61 176 -53 -216 409 332 -481 -61
4442f1N5j62J22J33j65k11O33m50J98K74l34M42m37o9l86K39L37j89k46K11n6
$$ -61 -6 -168 -46 87 -78 -289 344 -106 92 366 32 474 37 -32 -418 -179 158 -31 -277 -66 -122
4463a22J10M08J37m25L37m02L3J90o51L30j35K08J92M3k23r7M47n54J80j85P02
$$ -122 -12 396 533 108 445 43 76 266 -385 -55 -190 18 210 253 30 -67 380 -174 6 -179 523
4484E23m91o6K33l16O8K60l64q6j73PO41j86j46M93n05J09R9Q7k14K13m29L31
$$ 523 32 -34 199 -117 -49 211 -153 -239 -412 -405 236 50 -96 397 -108 1 100 187 -27 186 -243 88
4506H8l34L70j11J23m5l81L41l98O27k00PL8J13n97K01Q3k12O02l63l44K54M18
$$ 88 -246 124 13 136 91 -290 51 -347 280 80 87 125 238 -359 -158 -75 -287 315 -48 -392 -138 280
4528B80Kk43k01K65J35n44J27N10k43K9m41k29J023o74OJ18o2J48o9j65N67K6
$$ 280 282 39 -162 103 238 -306 -179 331 88 117 -324 -553 470 -204 -198 -80 -142 6 -63 -228 339 365
4550C65j035J012p50N22K98l88N5K77o19N50m58m3K76K96J73m45J03j91j71l8
$$ 365 -670 342 -408 114 412 24 79 356 -263 287 -171 -214 62 358 531 86 189 -2 -173 -211
4570b11q4L34q2k72J59K00k23K29O4j04k37Q7O12l09n95P40J46m39L6j00k0j32
$$ -211 -295 39 -43 -315 -156 44 -179 50 114 10 -227 -140 472 163 -432 308 454 15 51 -49 -69 -201
4592b01J75MJ41K41p9k93n88R10o26J43J73K85n31k3L82k48k67O06m4l21L97j65
$$ -201 -26 -22 119 360 281 -12 -600 310 -316 -173 0 285 -246 -269 113 -135 -402 204 160 -161 236 71
4614G1L57p77O26k84k71K83Lr8J57o9n00O44m03K48n21P19M7j6r9k64J23M28l94
$$ 71 428 -349 277 -7 -278 5 8 -90 67 -2 -502 142 -261 -13 -534 185 232 216 117 -147 -24 404 10
4637A0o3j27L38K24n23J40k72K56K5K16K55l24J24l10r9M10k12l69RM67n48L73
$$ 10 -53 -180 158 382 -141 -1 -273 -17 8 224 479 155 279 -31 -130 280 68 -301 -292 175 -373 0
4659@l13L38r2L29K5ml74R1k83J92N96n89K05R0k06L0p3L52m25M7O1Lm19J92K09
$$ 0 -313 25 -67 262 287 283 -91 0 -283 -91 505 -84 121 211 5 35 -38 314 -111 -64 -3 0 -419 -227 -18
4684a8N5j1R4K48l57o12J007m65K6O6K20n78K44l9Q36l67k83R1Q1n06L7J57J72
$$ -18 37 26 120 368 11 -601 406 -59 -33 33 253 -325 -81 -120 716 349 66 157 238 -268 -231 -74 98
4707I8l12L07K28k36j53Q6J35l11M33m13k83j39N04Rl2K28j75o79O93kk54M15
$$ 98 -214 93 321 85 -68 18 153 -158 275 -138 -421 -560 -56 -47 -79 149 -26 -705 -12 -14 -268 147
4729A47l96J96L64k0l39K59L63k30J39l41l94M15J55j07k99l65J097q46K68k53
$$ 147 -249 -53 311 291 -48 211 574 344 483 142 -252 163 318 211 -88 -453 644 -202 66 -187
4749a87K10Q3o49N58n3J50J57l98k99M66Q4K03m00l14O07k58j96N29l86M43Lp84
$$ -187 23 106 -543 15 -38 112 269 -129 -428 38 122 325 -75 -389 218 -40 -236 293 -93 350 353 -431
4771d31M18k99q0J23O18l55J75l97J97J20K53J52n00o40O34r8J90m3l01K56M2
$$ -431 -13 -312 -392 -269 349 -6 169 -228 -31 89 342 494 -6 -646 -12 -110 80 37 -264 -8 34
4792C4k95M67o74M26k6L64l14j94M02j38j21k52Q79q20L90l6K15k06k58J52m0
$$ 34 -261 206 -468 -42 -68 296 -18 -212 190 52 -69 -321 558 -262 128 92 307 101 -157 -5 -45
4813d5K97j12r1K19j81k8J41k32j71K89J3M9M4l5J16l81Q6l1r4J13L10m9p17J020
$$ -45 252 140 49 268 87 59 200 -32 -203 86 99 148 192 157 273 -108 -22 -53 -147 -34 276 227 -490 530
4837E30n14J80J61m71L01R0m32l8K62n25oJ41m0K24J32m43O73m28N16m99M36n54
$$ 530 16 196 357 -114 187 277 -155 -193 69 -456 -462 -321 -361 -137 -5 -448 225 -203 313 -186 250 -304
4859c04L68M03Q7n04J49K53q1l01m96P84l01j79j82L31m84L04k28P7L55L95n98
$$ -304 64 467 554 50 199 452 371 70 -426 358 57 -122 -304 27 -457 -153 -381 -304 51 446 -152
4880a52L16j80K09k39m01L95l35O34p3l41J89j86M23j23l1j85JJ66k11r1L10K73
$$ -152 164 -16 193 -46 -447 -52 -387 247 174 -167 22 -164 259 136 105 -80 -79 87 -124 -215 95 368
4902C68l32l60K15j21K6L37j94J73K03n30j21R57m48j11j99k12P93m64j03N47
$$ 368 36 -324 -109 -230 -204 133 -61 112 315 -215 -336 621 173 62 -137 -349 444 -20 -123 424
4922D24l80j88N66k97k58J19k40J16Q9j49K5K6l0M05J69m94K88r5k51j74O40o6
$$ 424 44 -144 422 125 -133 -14 -254 -138 -49 -198 -173 -147 -177 228 397 -97 191 96 -155 -329 311 245
4944B45n20M70l62M16m23K81j36j26K09O6l00q4j26K21l9M66j46j02L21l20N37
$$ 245 -275 195 -167 249 -174 107 -29 -155 54 120 -180 -264 -390 -169 -208 258 112 10 331 11 548
4965E48n72J05N3J92m56m38R03j34l55J44J81n03J245j084M02L26l93p92N08M24
$$ 548 -24 81 134 326 -130 -568 335 201 -154 -10 171 -332 913 -171 231 557 164 -628 -120 304
4985C04m75J60J08k16K80l56O87l74j77N7o12P80n65J59N33k34K59k68j16n2m9
$$ 304 -171 -11 97 -119 161 -195 492 118 -59 -2 -614 166 -399 -240 293 59 318 50 -66 -118 -167
5006a67K31j41L39p42N89j03M55o02N04k77q89L27O94K59p1Q3j56l94J64j26r9
$$ -167 64 -77 262 -480 109 6 461 -141 363 86 -803 -476 218 477 406 489 333 -61 103 -23 -122
5027a22L95n34j51J40K53j0L63J87r69O0K33L39k07K21l57J56K82l76M56l28%
$$ -122 273 -261 -412 -272 -19 -29 334 521 -448 -388 -155 184 -23 198 -159 -3 279 -97 359 31 31
5048C1K0l30P02m53j49M51j09m3l64K00J45o5P1J14k34l26K2N99j94q37P12J69
$$ 31 51 -279 423 -30 -179 272 163 120 -244 -44 101 36 107 221 -13 -339 -317 282 88 -749 -37 132
5070A32J53m60K54J75N6j33l59o6j72M60n8R6K34k21j47L67o11N65K11k46K36
$$ 132 285 -175 79 254 310 177 -182 -248 -420 40 -18 78 312 91 -56 311 -300 265 476 230 466
5091D66k66j51j90l66O75n4p9l14L05N0m38N83j41M26l12j84N09n87j83J001j100
$$ 466 200 49 -141 -507 168 114 35 -279 26 76 -362 221 80 506 194 10 519 -68 -251 750 -350
5112c50N34M8k62J33p8j32l8k3J48J38J64q7k39j94K37K68l40K19j62K49n25J6
$$ -350 184 232 -30 103 25 -107 -145 -168 -20 118 282 195 -44 -238 -1 267 -73 146 -16 233 -292 -276
5134b76L95j26K88o36J66P7K09o25O44J59Qk0N3n04l2L80o59J47K98M69m76Q1
$$ -276 119 -7 281 -355 -189 -112 97 -528 116 275 283 263 316 -188 -220 160 -499 -352 -54 415 -61 20
5156B0o56Q03k10N86m48R2q6l11P0n2P9j67O19mk57l48M30J06L1o41N75Q2k64
$$ 20 -636 167 -43 543 95 187 101 -210 -140 -192 -113 -280 339 335 78 -270 160 266 297 -344 231 313 49
5179D9l94N34L07r49J72K39P3J18K46k98k2J51n86k19L41K64k6n89J28P93m54
$$ 49 -345 189 496 -453 -281 -42 31 149 395 97 75 226 -360 -579 -238 26 0 -589 -461 332 -122
5200a22K21m84j88O45j80K69q2j42J81J56n94J60K62j39J80K43p27M81p9J93m02
$$ -122 99 -385 -573 72 -108 161 79 -63 118 274 -320 -160 102 -37 143 386 -341 140 61 254 -148
5221a48j47P15n25K56k0l42j2l9M62m02k7j08J96k46K53J50N3n71Q67k37l21L09
$$ -148 -295 420 -105 151 131 -211 -223 -262 200 -202 -229 -337 -141 -387 -134 16 69 -502 365 128 -193 116
5243A16k93k72M90J75nm68O53l35o45O71J83m74P33n12Q5Q9k95j92P52m71M30
$$ 116 -177 -449 41 216 211 -257 396 61 -584 87 270 -204 529 17 102 191 -104 -296 456 -15 415
5264D15m85l3l07M24j3n52K06R6K26n24M21L1j54L8M83k18l41l3J93m44M02m2
$$ 415 -70 -103 -410 14 1 -551 -345 -249 -23 -547 -126 -95 -249 -211 272 54 -287 -320 -127 -571 -169 -211
5286b11L24n69j24N63M93n79j43J20J0l28L34L19Oj15k02K98J20j14n5l43J34
$$ -211 113 -456 -580 -17 476 -103 -246 -126 -116 -444 -110 209 215 100 -102 196 316 202 147 -196 -62
5307f2j81K08J14k13Q3l47k4K20K67j89R9k51K76K66l96K52p76K50N20K07o16
$$ -62 -243 -35 79 -134 -51 -398 -422 -202 65 -124 -25 -276 0 266 -130 122 -654 -404 116 323 -293
5328b93J153q29K24l24K41j39lJ28o8L63m87J23k06P0M69r13M00O02k82p6J11
$$ -293 860 31 255 -69 172 33 30 158 90 453 -34 89 -117 -47 422 -491 -91 511 229 153 264
5349B64l16K65M74m73n67N82j50J10K8o1l24L19N2j62M33o07M25j13n33N24l89
$$ 264 -52 213 687 214 -353 229 79 189 217 156 -168 151 203 41 474 -133 292 179 -354 170 -219
5370b19L55k18j80L39jJ63N0j93m4l06K57K65l06o1J43m3l29N42p17M81L37n21
$$ -219 136 -82 -262 77 76 239 289 96 52 -254 3 268 -38 -99 44 1 -328 214 -503 -22 315 -206
5392b06K67l1l32J2L6J59J68J83j35n8K09K9n40O03n24O3R8n7pJ75J68k78J36
$$ -206 61 30 -302 -290 -254 -95 73 256 121 63 272 301 -239 364 -160 -97 1 -56 -63 112 280 2 138
5415A38n0q3L20m96K23q0M2J69n29R0l01K62Q3K33m37K59J82j76j23L8J69L15
$$ 138 88 5 325 -171 52 -28 14 183 -346 -256 -557 -295 -212 21 -416 -157 25 -151 -274 -236 -67 248
5437B48rl02M21j81j64l14K16n42N19r0m6L38n72N90J21r6J31o74L62k3K66n18
$$ 248 239 -63 358 177 13 -301 -85 -627 -108 -198 -244 94 -478 112 233 137 268 -406 -44 -67 199 -319
5459c19J15Q3L1K31k20j89K63M00j53k11k91M97J7l33K18o9N5o13P63n84N30K06
$$ -319 -204 -121 -90 141 -79 -268 -5 395 242 31 -260 237 254 -79 139 70 125 -488 275 -309 221 427
5481D27k30m17k36P89l00o1pK93l83J76O8j25k33L91l6k35m40K58M30m94Q18k17
$$ 427 197 -220 -456 333 33 -28 -35 258 -125 51 119 -6 -239 152 116 -119 -559 -301 129 -365 453 236
5503B36l10J40m63K10K73R4l42J62J49l73L25P4m84N42o1R9J06m32P8J58k68j19
$$ 236 -74 66 -397 -187 86 180 -162 0 149 -224 101 175 -309 233 172 271 377 -55 23 181 -87 -206
5525b06N8K78k34kL61q0j09m36N11n8K09n0r7m55j8L96K0P8j07k88L94m62K50
$$ -206 -148 130 -104 -106 255 175 66 -370 141 83 292 242 145 -310 -328 68 88 166 59 -229 165 -297 -47
5548d7j32j14K97j12M86j76k11Q3j64J37k57k6J4J86m75N60L57m76J70j20j45
$$ -47 -179 -293 4 -108 378 202 -9 74 -90 47 -210 -236 -222 -36 -511 49 406 -70 100 -20 -165
5569a65J95K43l43k9k29K7K24K39J43k61L03o05N88j67p22O52j27k42J96J08M7
$$ -165 30 273 -70 -99 -328 -301 -77 162 305 44 347 -258 330 163 -559 93 -34 -276 -80 28 75
5590G5O7p33L37O1N39j094O21J40n1k45l82N96j87O37m94L36l38P9k33J36L20
$$ 75 142 -591 -254 -193 346 -748 -127 13 -38 -283 -665 -69 -256 381 -113 223 -115 -36 -269 -133 187
5611A87j18p3l07M25k56l8O08L3m37k30K58L94j83M9j25q9j74p0L09l54M30J11
$$ 187 69 -4 -311 114 -142 -180 428 461 24 -206 52 446 263 312 187 98 -76 -146 163 -191 239 350
5633C50j92k89l26J094m31l77J67j51K66p70O74J16M2Kn4M46n31m07Q32m61m90
$$ 350 158 -131 -457 637 206 -171 -4 -155 111 -659 15 131 173 175 121 567 36 -371 461 0 -490
5654d90P35k42J86p68R12q44M10L92o22O27m77L72m43K57Q0m08j4N96J98l85j94
$$ -490 245 3 189 -579 333 -511 -101 291 -331 296 -181 191 -252 5 85 -323 -337 259 457 72 -122
5675a22J44k16J94J70n70K50M07J39m22K06o37M01p1J78j26J59l5k64Q5j52J3
$$ -122 22 -194 0 170 -400 -150 257 396 -26 180 -457 -56 -127 51 -75 84 49 -215 -130 -282 -269
5696b69L37j98j00K35M5m48J27M63m15M87J36j82k8K0j85q7M60m02P57l76m81
$$ -269 68 -130 -230 5 50 -398 -271 192 -223 264 400 218 190 210 25 -62 398 -4 753 377 -104
5717a04J7J94PJ10N2k23l19p1J80K57l68PL24k72R4J07k54J79M62o54Q7N80j31
$$ -104 -87 107 114 224 276 53 -266 -337 -157 100 -268 -261 63 -209 -115 -8 -262 -83 379 -275 -188 392 261
5740B61n05r1j02R8O51l12j49K22oJ6k8P8J1j83L54l66k43N88m33J5L94K06l00
$$ 261 -244 -335 -437 -339 312 0 -149 73 67 83 55 133 144 -39 315 -51 -294 294 -139 -124 270 476 176
5763A76k88K61l30K67J24n14K90j04n8J36R1L7o17N18J38l22r9O12n64L11J9l5
$$ 176 -112 149 -181 86 210 -304 -14 -118 -176 -40 51 88 -529 -11 127 -195 -294 318 -246 65 84 49
5785D9N5j80K54o16P19m95O1K27j36m00P42n08O13n11K24l34R1J17j47P9M6M04
$$ 49 104 -76 178 -438 281 -214 -153 74 -62 -462 280 -228 385 -126 98 -236 -145 -28 -175 -96 -50 354
5807C54k94J80k70J10m86O13pk10N3R5n39O31j7k01K48L03n29j84j8J49%J06j66
$$ 354 60 240 -30 80 -406 207 200 -10 43 138 -401 230 213 12 260 563 34 -150 -168 -19 -19 87 -79
5830g9Q1K56j76j01rq3K23qo6k43K25k67L39O8J01j32k28Q0k1L01j27l73J6K85
$$ -79 2 258 82 -19 -28 -111 112 104 38 -205 20 -247 92 160 261 129 -99 -19 -40 261 134 -239 -223 62
5854F2%l11J26J85q9l85P84p76J23L90J66j25o3J35l9j24l81P42k46J43o5l53
$$ 62 62 -249 -123 62 -27 -412 372 -404 -281 109 275 150 87 222 183 59 -322 420 174 317 252 -101
5876a01P3j58L75kJ83o18M43o3k96k06K15L78N1k19J49q0m38o2J36K53J7k13N37
$$ -101 -28 -186 189 187 370 -248 195 132 -164 -370 -155 223 274 55 204 124 -314 -376 -240 13 30 -183 354
5899C54l17j62K05J0L15qo27P74m98N8Jj43M0j77M81n65R07p32K18n20J71R32
$$ 354 37 -125 80 90 405 397 -230 544 46 104 105 -38 2 -175 306 -259 648 -84 134 -386 -215 717
5921G17p00N96p18k20L82K44j081J416n16l4p6L23m25J26J17j86j32J29r0j14
$$ 717 17 613 -105 -325 57 301 -780 636 120 86 10 333 -92 34 151 -35 -167 -38 -128 -242
5941b42J17K14j31OJ70l89J93M53l55j55m8L45j65k92L83P7l6O1K04l46l32l72
$$ -242 -125 89 -42 -36 134 -255 -62 391 36 -119 -167 178 13 -279 104 181 145 206 410 64 -268 -640
5963f40P57j77RJ36j59j33L46o0j00m4L25J26j11m33J62P2M18p34N10n66M97o7
$$ -640 117 -60 -51 85 -74 -207 139 79 -21 -65 260 386 275 -158 4 76 494 -240 270 -296 201 134
5985A34o2M6o1r1M43m61NL74o65L96l71N83o46j26M06jJ65K20l47J37j51r3J93
$$ 134 72 118 57 -34 409 -52 -47 327 -338 58 -313 270 -376 -502 -96 -97 68 288 -59 78 -73 -166 27
6008B7j52L21k54nN3o5k40M69j00R8j3o7K22n26L91J55Q3l50l07j23O96J81Q8
$$ 27 -125 196 -58 -63 -10 -75 -315 154 54 152 139 72 294 -232 159 314 397 47 -260 -383 313 494 582
6031E82l69lk02k55L0M64m55M50j58p20P14R5o86O20L53j143N93O39o03J17L97
$$ 582 213 210 8 -247 -217 247 -208 242 84 -636 78 173 -513 107 460 -683 -90 549 -54 63 460
6052D60k0m09l66N28l01l09M12K17m48j47L26m59JJ55M57j67L58l63J90n7j14
$$ 460 440 31 -335 193 -108 -417 -5 212 -236 -383 -57 -516 -515 -360 97 -70 288 -75 115 58 -56
6073e6L22o09J61N19K12k6o64K97k0p0%o6m5LP9q6j51L34j37m6k7j00J22l0K85
$$ -56 266 -343 -182 337 549 523 -141 156 136 66 66 0 -45 -42 37 -49 -200 134 -3 -49 -76 -176 -54 -84 201
6098B01o68P39o32K27j63M27L27m13K10m47K05l1k37L53n42L92K23k16k89K28
$$ 201 -467 272 -360 -133 -296 131 458 45 255 -192 13 -18 -255 98 -444 -52 171 -45 -334 -106
6118a06P6M92p58j38J68O86j63p33K26K50M9l87O89l84L79j97m80L08J27l08L70
$$ -106 -30 462 -296 -434 -266 420 257 -476 -250 0 49 -338 351 -33 346 149 -331 -23 104 -204 166
6139A66J34o6L5k0J48k04o10M61L86p55J41J15N20n5o46J48Q91p51M71j31m99
$$ 166 300 234 269 249 397 193 -417 44 430 -325 -184 -69 451 396 -250 -102 789 38 509 378 -121
6160a21K91l58K31j5j40M49n27j99M01l07N50m74mOn0M79k18OL2j03J87l46R9
$$ -121 170 -188 43 28 -112 337 -190 -389 12 -295 255 -219 -223 -217 -267 212 -6 0 32 -71 116 -230 -131
6183a31K92m35J07M35j17J84j004L96J04M11L0p8P9O7k67lm53M69j70L17k03o9
$$ -131 161 -274 -167 268 151 335 -669 -273 -169 242 272 194 273 340 73 70 -383 86 -84 233 30 -39
6205c9J19l54N91m66r0L92k81L38n08M49j00j94K80j89jj99P39m89P4J22qK8k0
$$ -39 80 -274 317 -149 -239 153 -128 210 -298 151 51 -143 137 -52 -53 -252 487 -2 72 194 186 214 194
6228A94m22Q8K0J13K82R1m75J8L68k57o95P10r4r8M63n4M8O8m98J50l34K24J79
$$ 194 -228 -140 -120 -7 275 366 -109 -91 277 20 -675 35 -59 -157 306 252 300 368 -130 20 -314 -90 89
6251H9o08J24N71n12l65N03L26k26J16J24O8n21J27J41K37O4k35J10j41k16N86
$$ 89 -519 -395 176 -336 -701 -198 128 -98 18 142 210 -311 -184 -43 194 258 23 133 -8 -224 362
6272C62k98J67k45M12j80J56j01q9K6Km5L16l22m05K19o0K70P3j17M4k83j7r3
$$ 362 64 231 -14 398 218 374 273 184 210 212 167 483 161 -244 -25 -85 185 258 141 185 -98 -115 -208
6295b08N32n65K94L9o37Q36l94M25m58L6o1n2p6n4J26K82L8L0l14j79N35J26l36
$$ -208 324 -241 53 92 -545 291 -103 322 -136 -100 -161 -213 -289 -343 -217 65 103 133 -181 -360 175 301 -35
6318c5Qq7J83o5j76K28Q0K9P2m09J52m72N51K52k16n75M96j34L66J58k83j1l65
$$ -35 -27 -114 69 4 -172 56 136 165 237 -172 -20 -492 59 311 95 -480 16 -118 248 406 123 112 -253
6341b53J42L33P2q68J147m84k53K37J96j88j83P8no7K04l14l3J87j5Q80j065N02
$$ -253 -111 222 294 -574 573 89 -164 73 269 81 -102 -24 -29 -96 108 -206 -239 -52 -67 813 -252 250
6363B50n08N2M59m36K42J15j59J84J60n2q72L0M31j89L89l62J80Q4M2m97N33j67
$$ 250 -258 -206 253 -183 59 174 15 199 359 307 -565 -535 -104 -293 96 -266 -86 -2 40 -457 76 -91
6385i1M69o99N58k12q9L19m36Q1K17k53K19l37M42k69J72R0R8k56N61n37Q7o63
$$ -91 378 -321 237 25 -64 255 -181 -100 117 -136 83 -254 188 -81 91 181 279 23 584 47 134 -529
6407e29R25o68R1K50j3R4J08j68j87M99l10L11p9j66Q1k68qK22l8J23n95k21J71
$$ -529 396 -272 -181 69 56 150 258 90 -97 402 92 403 324 158 239 -29 -37 185 147 270 -325 -546 -375
6430c75N15j9O3n74J85Q54r24J72O44j62r33L97J50k81L26L62Mm78j52q1N08m08
$$ -375 140 121 184 -390 -205 649 -275 -103 541 379 -554 -157 -7 -288 38 400 404 -74 -226 -307 201 -207
6452b07J04n1J02J59n31J59N75l53K63m37p7OL61k66L6j75N54n68M75j83l31P02
$$ -207 -103 -154 -52 107 -424 -265 310 -43 220 -217 -294 -288 73 -193 -157 -332 222 -346 129 -54 -385 317
6474C17j04m00M9p5P5Q6K13m72N55m37q2L67n00l5L78J71N01p59J95k31K48J03
$$ 317 213 -187 -138 -213 -138 -52 161 -311 244 -193 -275 92 -408 -443 -65 106 607 -152 43 -188 60 163
6496A63m68N19m94J54J19j00L82l05r3Kj10J5N97l98l85K95K08P0l76J50L45J70
$$ 163 -305 214 -280 -126 -7 -107 275 -30 -123 -121 -231 -216 381 -17 -402 -107 101 171 -205 -55 290 460
6518D60k31o23K71L57n24M08l44n7n8K92J33k27J40j82K04j57j05M28J42j47l11
$$ 460 229 -394 -123 234 -290 118 -226 -283 -341 -49 84 -143 -3 -185 19 -138 -243 185 327 180 -131
6539a31K54J38J69n03j83L13K2l12m3q5O08q16M47J67N0J21l74J87J61q44O94
$$ -131 123 261 430 -73 -256 57 79 -233 -276 -361 247 -569 -122 45 95 216 -158 29 190 -654 40
6560D0M49o08J32R3j9K10l09r6j5K3M90p6m59j65L4n02N80M02l57K35L7J47m3
$$ 40 489 -119 13 106 87 297 -12 -108 -123 -100 390 314 -145 -310 -276 -778 -198 204 -153 82 119 266 223
6583B23k38k8L38n33j52Q51n66J89k25J80k62K3P67m94l43O09j90k01K27l31k95
$$ 223 -15 -43 295 -238 -390 461 -105 84 -141 39 -223 -200 567 73 -270 339 149 -52 175 -156 -451
6604d51P03l14k82M58o10O25J03j86M37mj032J063k75J96L1k09ol77M91m18K18
$$ -451 252 -62 -344 114 -496 129 232 46 483 479 -553 510 235 431 462 253 247 -130 361 -57 161
6625A61n30Q2P4J43J77j56j69P48k64J99m29r8l7J78k82L56k69K01QJ44l5k56
$$ 161 -369 -287 -213 -70 107 -49 -218 530 266 465 36 -62 -99 79 -203 153 -116 85 93 237 202 -54
6647e4M27l73j94J39N12p62J84Q0O41m69l13m44J049l08k45k03O51j88m6j50m81
$$ -54 373 0 -194 -55 457 -305 -121 -41 600 131 -182 -626 423 115 -130 -333 318 130 84 -66 -547
6668e47O38j14l44L1N74M96p46m62N47J21m55L48J74j81p2j84j24K16l6M29l95
$$ -547 91 -23 -367 -336 238 734 -12 -474 73 194 -261 87 261 80 8 -176 -300 -84 -120 309 -86
6689h6L93k81k12M35Q0p4k19j24J19K86j01J33m29N6J04J31j54N2K4k66L13o14
$$ -86 307 26 -186 249 329 255 36 -88 31 317 216 349 -80 -24 80 211 57 109 133 -133 180 -434
6711d34j3L37J23J99l34K23L27k31k01O1j85J05L53l96M6K39p2K31k64l73L8K64
$$ -434 -447 -110 13 212 -122 101 428 197 -4 57 -128 -23 330 -66 -20 219 147 378 114 -259 -221 43
6733D3J61k58L23m97K11o0K36j6k2N22n22Q0Ln16J51J62k47j7J47j51M68n44Q5
$$ 43 204 -54 269 -228 -17 -77 159 143 121 643 121 201 204 -312 -161 1 -246 -263 -116 -267 201 -343 -258
6756b58m4M01oK47j43j99j04j75L77k48L10l84J07O89n16k04J08N54k64j51K8
$$ -258 -302 99 93 340 197 -2 -106 -281 96 -152 158 -226 -119 570 54 -150 -42 512 248 97 125
6777A25k98j07L76J55J71l43mj40K33J07l03P8K14p4l24k89J90J85J96o4o19L55
$$ 125 -173 -280 96 251 422 79 75 -65 168 275 -28 50 264 190 -134 -423 -233 -48 148 84 -535 -180
6799a80L27l56J56J78j45j17L05q2K05J6j40k53P2K50k81m2L31j89L62o61N25
$$ -180 147 -209 -53 125 -20 -137 168 86 291 307 167 -86 -14 236 -45 -87 244 55 417 -244 281
6820B81k50l65L21J88J55p70L89L72n62m3k66J90M61l23L34j10k5L47n93J72k41
$$ 281 31 -334 -13 175 330 -440 -51 321 -241 -284 -550 -360 101 -222 112 2 -23 324 -269 -97 -338
6841c38M47K4m87J2M38j64j96N10m11N33l55l50J14K55J97j52L73m84J36J21q3
$$ -338 109 133 -354 -342 96 -68 -264 246 -165 368 13 -337 -223 32 229 77 450 -34 102 223 140
6862A40k82K02n55P36n25O21q88L50J18M51m67k6L24l28J69k2L3L85j46k17l2
$$ 140 -142 60 -495 241 -284 337 -551 -201 -83 368 -99 -125 199 -129 40 18 51 436 290 73 41
6883D1J96j49l42P6N4O56m65k17k48M67p3J13k89L42K80l81M05r3m56j08L35j08
$$ 41 237 88 -254 -178 -124 532 67 -150 -398 69 -4 109 -180 162 442 61 466 373 -83 -191 144 36
6905C6k6Q3k61J88k21J57K92n08L68n41L58m7M62m07J40j65p0M0L34K4rP2o0m13
$$ 36 10 93 -168 20 -201 -44 248 -260 108 -433 -75 -122 340 -67 73 -92 -162 -122 212 236 227 299 239 -174
6929a74L4R4N7l58J55Q8k89J14K2j30O10m85O9K83m09O33j73M97p85j28L12k05
$$ -174 -140 -46 11 -347 -192 -104 -393 -279 -257 -387 223 -262 -193 90 -319 314 141 638 -147 -275 37 -168
6951a68oL28J1j99N7j40L10k19J82j80L67k50j50M48k94M2J08q1O2m47mM89j59
$$ -168 -174 154 165 -34 23 -117 193 -26 156 -24 343 93 -57 391 97 139 247 166 228 -219 -223 266 107
6974A07j39n27K46N05j02Pq98L45K77L39n19J44K00m92R52n87j57P78m01K1R2
$$ 107 -32 -559 -313 192 90 97 -801 -456 -179 160 -359 -215 -15 -507 445 -142 -299 479 78 99 191
6995A91k59J00j52K72Q1J68n07J67j24L99l18Mk06L17j35p8K18m29J0M4L17k75
$$ 191 -68 32 -120 152 233 401 -106 61 -63 336 18 22 -184 133 -2 -80 138 -291 -281 -237 80 -195
7017a95k36P61k33k75N51k22l51M3K95j44K96k63K21k26J60K18l66l47K71N98
$$ -195 -431 330 97 -178 373 151 -200 -157 138 -6 290 27 248 22 182 400 34 -313 -42 556
7037E56o94J76l29j04P8N7J77k60P45j42j91M7k54J10m58P69jj53n3K09o16P06
$$ 556 -138 38 -291 -395 -317 -260 -83 -343 402 260 69 116 -138 -28 -486 283 282 129 76 285 -331 375
7059C75l0j67n08j02M58M60k55n37K51k62Q25l71j88k37J01lN37n43m25N86N0
$$ 375 345 178 -330 -432 26 486 231 -306 -55 -317 508 137 -51 -288 -187 -190 347 -196 -621 -35 15
7080A5L39m51P58o86R5K27k45L7M42q27l4K16J65k9J67p40M79k7M4L67m61L67
$$ 15 354 -97 661 -25 70 297 52 89 531 -296 -330 -114 51 22 189 -551 -72 -99 -55 312 -149 218
7102B18l08l85K21L06j84L66N0m91M3L70l73L19j8l52J3K54k18M48j24j72J47
$$ 218 -90 -475 -254 52 -132 234 284 -207 -164 206 -167 152 134 -218 -205 49 -169 279 155 -17 130
7123A30k10o1Q2%M14o00K6J65J3M13k45k40mK26K37o11P64q34j04K19J56k76L38
$$ 130 -80 -141 -59 -59 355 -245 -219 -54 -41 372 127 -113 -117 109 346 -265 499 -335 -439 -220 -64 -340 -2
7146bL61l46K70m77j59R0m7N64q9l12K2Q3L92l52l04j07O03J26j68l57M7J01L36
$$ -2 359 13 283 -194 -353 -263 -310 254 165 -147 -125 -42 350 -2 -306 -413 190 316 148 -209 -162 -61 275
7169B75N2m40M39j61J24r6j9O6k13K71k02J48k72J21L00k57oj3k97J89j96j37
$$ 275 327 -113 326 165 289 193 174 240 27 298 96 244 -28 93 393 136 130 117 -180 9 -187 -324
7191c24M83k73qO8L76k49l05J25l69P97m69R2R1j36O70l73k60J27p4l02N12n59
$$ -324 159 -114 -122 -54 322 73 -232 -107 -476 321 -148 -56 35 -101 569 196 -64 63 -11 -313 199 -360
7213c60J70k04j7N29P1l49J90JL74l53j8K13k78O9L35Q4m69k5J22j61j67J96Q5
$$ -360 -190 -394 -411 118 189 -160 30 31 405 52 34 247 -31 38 373 457 -12 -37 85 -76 -243 -47 38
7236C8J34Jl06J56j31k5k77M56J42j00q3J3l21O96l30q2Q5m94M16L83j79l24k62
$$ 38 172 173 -133 23 -108 -133 -410 46 188 88 5 18 -303 393 63 -19 66 -428 -12 371 192 -132 -394
7259c94M55k46Q0Q8kK62l26kL09q6k53j10N62m61k41P61q3l25P1k60m36M27k59
$$ -394 61 -185 -105 -17 -19 243 -83 -85 224 138 -115 -225 337 -124 -365 396 313 -12 59 -201 -637 -210 -469
7282d69N54j66J52K8k25k38K76J97qq4L6L37Oj2k51j75K36J31l48j43J61J26K89
$$ -469 85 -81 71 99 -126 -364 -88 109 101 17 53 390 396 384 133 -42 194 325 -23 -166 -5 121 410
7305D10n57M41l7j8l76J15J34n84P8M26q4n5j7K10M5m2n0M0j94LL65l04L26j52
$$ 410 -147 294 257 239 -137 -22 112 -472 -394 32 -52 -107 -124 86 131 89 39 79 -115 -112 253 -51 275 123
7329A23l60rK22M05l11k46J40k86K70l3N28m50j42M47M9J3l71M24m5J26p07m0
$$ 123 -237 -246 -24 381 70 -176 -36 -322 -52 -85 443 -7 -149 298 347 360 -11 413 368 494 -213 -253
7351b53K51J05k13J0J12mo19L85J029j506Q44n19M61l99Q69j78n3k41J84J76o48
$$ -253 -2 103 -110 -100 12 8 -611 -226 803 -703 141 -378 83 -316 553 375 322 81 265 441 -207
7372b07K93j93N25o33N17n32J07o21R50k65m2k4J91K60l92O87m47j70K2K69p91
$$ -207 86 -107 418 -215 302 -230 -123 -744 206 -59 -101 -125 66 326 -66 621 174 4 26 295 -496
7393d96k00O75P9M8m2l21M76j56j70K19J71l67M03m91p3K4l9L09j03K68j49m46
$$ -496 -696 -21 58 106 64 -257 219 63 -107 112 283 -84 319 -172 -245 -221 -260 49 -54 214 65 -381
7415c81K19l2K09o1m67J62K10j01J78J95j45m04O99n88N94J33m43j95J06J99o6
$$ -381 -162 -194 15 -46 -513 -351 -141 -242 -64 131 -14 -418 281 -307 287 420 -23 -218 -112 87 21
7436B1J33K16l0k6k03m02K6O90m88j95O48k17j53j71r2M73p0p14O60j41M2K08
$$ 21 154 370 340 314 111 -291 -265 425 -63 -258 390 173 20 -151 -243 230 160 -554 106 -35 7 215
7458B15k29K24n61R82n76K97m5m73J57l66P51o58O73p07O18k37K94m86j64p2M8
$$ 215 -14 210 -351 631 55 352 307 -166 -9 -375 376 -282 391 -316 302 65 359 -127 -291 -363 -315
7479c15M42o53M41l71K37m3M44P2l22M14n99M42j35l65k10J41M66j98k53J34K26
$$ -315 127 -526 -85 -456 -219 -262 182 254 -68 346 -253 189 54 -311 -521 -380 86 -112 -365 -231 -5
7500eN10m76J0j62O4L33J47l07k01R3R6Q7n15Q50p47M78J57o88j22P36k25J74
$$ -5 505 29 39 -123 -59 274 421 114 -87 6 102 189 -326 524 -223 255 412 -276 -398 338 113 287
7522B87j72O8o48M19j67M45K31j95o73O73r8l30L20k00K18j07l28J06J47k39J67
$$ 287 115 183 -465 -46 -213 232 463 268 -405 268 170 -160 160 -40 178 71 -257 -151 -4 -243 -76
7543g6N15o68m48Q56r6l30j69L44o9O3j14P3M13j62J50j04J22l29N67p92L97l95
$$ -76 439 -229 -677 179 83 -247 -416 -72 -141 -78 -192 -119 294 132 282 178 300 -29 538 -254 143 -252
7565b52N19k40k74N10j08k91K22N5l12N51m46J86k10K90l78M03p51P68M29m44
$$ -252 267 27 -247 263 155 -136 86 141 -171 380 -66 120 -90 200 -178 225 -526 242 671 227
7585B27m45L27k0J69J2l67j8m8K56O5J03j65M21l60R6j82K25J14m92j87J29J67
$$ 227 -218 109 89 258 270 -97 -115 -163 93 158 261 96 517 157 253 71 296 410 -82 -269 -140 27
7607B7j0M19k78p8m3o19O88M50j000K13N52j86l67Q3J43j18N43n13k54N90k29
$$ 27 17 436 158 80 37 -582 106 556 -444 -231 321 135 -232 -149 -6 -124 419 -94 -348 242 13
7628A3m21K36N16l2m40J69Q6K67k21k36K99j94l09J76J87m14L95l24M22j10R0
$$ 13 -408 -172 344 312 -128 41 127 394 173 -63 236 42 -267 -91 96 -318 77 -247 175 65 155
7649A55J44J08p92O69l8l47M05l97J01k02K15J49j59J5J51L85l66l4l74k68L64
$$ 155 299 407 -385 284 246 -101 304 -93 8 -194 21 170 11 26 177 562 196 162 -212 -480 -116
7670a16%K10l06K28n5K58j85k26m45J072k38o84N31p8L23L8j32m82K06L41j61
$$ -116 -116 94 -212 16 -39 219 34 -192 -637 435 197 -487 44 -34 289 327 195 -287 -81 260 99
7691I9K3l57M06n55N18k83L21k82O31m17k10K8O87m57oJ51k26J31l75L20J6K20
$$ 99 122 -235 171 -384 134 -149 172 -110 521 104 -106 -78 609 152 146 297 71 202 -173 147 163 383
7713C83j73Pj82l86P0O03l97N64k20k35M9k64J72ok87N65j41k50k0L75m93p9N73
$$ 383 210 217 35 -351 -281 322 -75 489 269 34 83 -181 -9 -15 -302 263 122 -128 -148 227 -266 -345 228
7736B28k71K2K94k89J52O3k84m42M13K26j78J80L75k74m13L50q3m9M9L40l76k08
$$ 228 -43 -21 273 -16 136 199 -85 -527 -114 112 -66 114 489 215 -198 152 69 20 69 409 33 -175
7758a75lj35j9R14n53m7J7l24P88p83RK27N9K25l60K68k60L30k5j9k38J13j16
$$ -175 -178 -313 -332 582 29 -18 -1 -325 463 -320 -311 -84 -25 200 -160 108 -152 178 153 134 -104 9 -107
7781a07J22p1j07r9j0N59M8l09N64o32j72J52J9j0M45l96L32k32K94j91l95k07
$$ -107 15 -56 -163 -262 -272 287 335 26 590 -42 -214 -62 -43 -53 392 -4 328 96 390 199 -196 -403
7803d03M41K67p17M37k93M65j06n8j22r1L81J62p97L27k08Q52m88o0k4L31j82
$$ -403 38 305 -412 25 -268 197 91 33 -89 -180 201 363 -434 -107 -315 537 49 -11 -35 296 114
7824A14J37r8l4j2j57r7M59j65k17M28l73N53j7k24J47n56K05k43L21r0J41l47
$$ 114 251 153 119 107 -50 -147 312 147 -70 358 -15 538 521 297 444 -112 93 -150 171 81 222 -125
7846a25L3N48j70J33j54n28P89o11J73J08O1K39k85k53k08n6k2M82N2j83k07K14
$$ -125 -92 456 286 419 265 -263 526 -85 88 196 257 496 211 -42 -250 -306 -328 154 206 23 -184 30
7868C0j22K30j78m19M68J34j42k28J05j40J8L50k7J53m83L88m38P2J63k57q6N97
$$ 30 -92 138 -40 -459 9 143 1 -227 -122 -262 -244 106 79 232 -251 137 -301 -229 -66 -323 -409 188
7890A88q0o00L92J03L11k54l13L93N5l15l3J96K33m29K83J65Q7k08l91M20K2J69
$$ 188 108 -492 -100 3 314 60 -253 140 195 -120 -153 43 276 -153 130 295 382 174 -217 203 225 394
7912C94J3j72K9k31j69m46O31K43k04j28J58l3J40j23j45L10j15j97n3k49PN38
$$ 394 407 235 264 33 -136 -582 49 292 88 -40 118 85 225 102 -43 267 152 -45 -98 -347 -340 198
7934A98k93J82K29J75l23m67L68K94o23N81n03K25O18l41K77o80K04M96l80o02
$$ 198 -95 87 316 491 168 -299 69 363 -260 321 -182 43 661 320 597 -83 121 617 237 -365
7954c65M50k79M37m46L6K6M63l4m24L65k50J62l32R1j83K31P1k44N00o06M83l76
$$ -365 85 -194 243 -203 -167 -141 322 288 -136 229 -21 141 -191 -100 -283 -52 19 -225 275 -331 152 -224
7976b24L28K45j60m33J39J25M87J66l88o30M18o9L29l41j1l73J47M82j20K71k70
$$ -224 104 349 189 -244 -105 20 507 673 285 -345 73 4 333 -8 -19 -392 -245 237 117 388 118
7997A18j26j51J42j57K51k68L1j30J68L75k7l39QK67k70l66P6M00L75k86q2J4
$$ 118 -8 -159 -17 -174 77 -191 -160 -290 -122 253 226 -113 -105 162 -108 -474 -398 2 377 91 9 23
8019B3j9J14j1j0l70J97j96K58m48O14l12L20n94M63J81N60q86j70M39k44k67
$$ 23 4 118 107 97 -273 -76 -272 -14 -462 152 -160 160 -434 29 210 770 -116 -286 153 -91 -358
8040c58K19n4L05j71K1J49j96l1j14L45R0m20l57L96J67k46N10k93l24j12L86
$$ -358 -139 -193 112 -59 -38 111 -85 -116 -230 115 205 -215 -572 -176 -9 -255 255 -38 -362 -474 -88
8061h8J66k51M68k83l7p3l07J66M97q59J180j18n90M53l94j37L04n61N86m88j19
$$ -88 78 -173 295 12 -25 -98 -405 -239 258 -601 579 461 -129 324 -70 -207 97 -464 122 -366 -485
8082d85P44k76j67M53m55j33M24r2n7J57J9m67Q0L03m50R1K78P8R6J47nn0k60
$$ -485 259 -17 -184 269 -186 -319 105 13 -44 113 132 -335 -255 48 -402 -311 -33 45 141 288 283 233 -27
8105b7QM1J13K84m37J40J29o9o1R9l55J41N11o47K01l21N57m73j98J16M72r35
$$ -27 -19 22 135 419 -18 122 251 182 121 220 -135 6 517 -130 71 -250 307 -166 -364 -248 224 -711
8127g11Q02o4M68q58O11j77m00M28k56K03m06M20j57k5K48m43k11O69o4J10j21
$$ -711 91 27 495 -363 248 71 -329 99 -157 46 -360 60 -97 -122 126 -317 -528 141 77 187 66
8148F6m96K0L22R7K14j87k5%n4J38Q9J98m27L88J15m11Q5k91j06L83k42K1K1M7
$$ 66 -430 -410 -88 9 223 36 11 11 -43 95 184 382 -45 343 458 47 132 -159 -265 118 -124 -103 -82 -35
8172c5n0K35K2j02m13M53K11k3m76q2L10L75o37K42J77j72J41j3k20
$$ -35 -85 150 172 70 -343 110 321 298 -178 -260 50 425 -212 30 207 35 176 163 -57
8191e7
$$ Imaginary data points
##PAGE= N=2
##DATA TABLE= (X++(I..I)), XYDATA
0@%%%%%%%%%%o4J28j28J28j28J92k56L20l84M48n68O96q32R60j088J280j473J666
$$ 0 0 0 0 0 0 0 0 0 0 0 -64 64 -64 64 -64 128 -128 192 -192 256 -312 384 -448 512 -576 704 -769 897
28H97j942K261k599K958l368L826m325M861n464O138o867P669q554R509j0550
$$ 897 -1045 1216 -1383 1575 -1793 2033 -2292 2569 -2895 3243 -3624 4045 -4509 5000 -5550
43e550J1704j2956J4315j5804J7435j9218K1170k3326K5705k8323L1236l4498
$$ -5550 6154 -6802 7513 -8291 9144 -10074 11096 -12230 13475 -14848 16388 -18110
55a8110L8152m2284M7021n2502N8899o6518P5774q7272J02040j21800J49751j92624
$$ -18110 20042 -22242 24779 -27723 31176 -35342 40432 -46840 55200 -66600 83151 -109473
67a09473K67485m35476J465205k87570k460747J581326J489017j154771k450081
$$ -109473 158012 -277464 1187741 900171 -1560576 20750 1509767 354996 -2095085
76b095085O78459K359167K37215k401596p90396J980326J464735j639462j773482
$$ -2095085 -1416626 942541 1179756 -1221840 -2012236 -31910 1432825 -206637 -1980119
85a980119J158976K437129k24124k234642m62896K053771R85331j662677j536993
$$ -1980119 -821143 1615986 1391862 -842780 -1305676 748095 1733426 70749 -1466244
94a466244J162561J896086l77198j972890l63662J649020Q28739j431884j317835
$$ -1466244 -303683 1592403 1215205 -757685 -1121347 527673 1356412 -75472 -1393307
103a393307R46067J631993m08628j799641l57353J486228P86360j094027j002551
$$ -1393307 -447240 1184753 776125 -1023516 -1380869 105359 891719 -202308 -1204859
112a204859Q46340J323497l59196j411423p0936J428485N90210j156531q52432
$$ -1204859 -358519 964978 605782 -805641 -876577 551908 1142118 -14413 -866845
121h66845R58158J161735o26934j431324O7198J374185L51945j289392q50008
$$ -866845 91313 1253048 626114 -805210 -738012 636173 988118 -301274 -1151282
130a151282R52150J161838n71561j397705M2656J377677M54682j114826p29691
$$ -1151282 -199132 962706 391145 -1006560 -963904 413773 868455 -246371 -976062
139i76062Q73426R90245n07063j084578J83113J152696K21137j057552n78172
$$ -976062 -102636 887609 380546 -704032 -520919 631777 852914 -204638 -782810
148g82810Q21275P81259o13176r75146L20792J080339K3174j072879l98500Q87218
$$ -782810 38465 819724 206548 -768598 -447806 632533 655707 -417172 -815672 71546
158G1546O63097o49964q48981L97822J018436l8770j049558l51978Q97070O44210
$$ 71546 734643 84679 -764302 -366480 651956 613186 -436372 -788350 108720 752930
168G52930o43330q02077L92807R28763n6818r17175k81620P55886N11765n47352
$$ 752930 109600 -692477 -299670 629093 572275 -344900 -626520 129366 641131 93779
178I3779o53306L38360P36097j40744q13723j45042P37156L62821o04484n18366
$$ 93779 -559527 -221167 514930 374186 -439537 -584579 152577 515398 -89086 -607452
188f07452M70256O92167k33682p79398l3517P87301L40084o33250n20981M69791
$$ -607452 -137196 554971 321289 -458109 -491626 295675 635759 2509 -518472 -48681
198d8681O62654k70376p67504j5279P15868K42099o06499m37548M12406N23473
$$ -48681 613973 343597 -423907 -439186 276682 518781 -87718 -525266 -112860 410613
208D10613k52864o08421M0224O11434J73454n13509l06689M16795M30021k67604
$$ 410613 157749 -450672 -410448 200986 374440 -139069 -445758 -28963 401058 133454
218A33454m87642J27644N44824P8878n00443k49242M13711L90655k92082n09532
$$ 133454 -354188 -226544 318280 397158 -103285 -352527 61184 451839 159757 -349775
228c49775J15029N56302P2744n46484k83936M12780L97502k80534m85568J09427
$$ -349775 -234746 321556 394300 -152184 -436120 -23340 374162 93628 -391940 -282513
238b82513N13735O9075m82823k36751L87169L54063k49849l86173J67506M50160
$$ -282513 231222 300297 -182526 -419277 -32108 321955 72106 -314067 -146561 303599
248C03599k6353m52060j16036M09487K49019l09376l29524K10460L94280j02669
$$ 303599 277246 -174814 -290850 118637 367656 58280 -271244 -60784 333496 230827
258B30827m61784q3110M15083K13570l37808l21106K22747L81395r7327m15812
$$ 230827 -230957 -314067 101016 314586 -23222 -344328 -121581 259814 162487 -253325
268b53325o1280L80030K08406k66378k65098J84521L22414p7150l42922l5223
$$ -253325 -314605 65425 273831 7453 -257645 -73124 249290 172140 -170782 -206005
278b06005L24611J47389k51949k09444J77437K41455j22827k98017J6333L10137
$$ -206005 118606 265995 14046 -195398 -17961 223494 100667 -197350 -181017 129120
288A29120R4230k78282j92792K11511K56395j37915l11255L4011L33175R6630
$$ 129120 223350 -54932 -247724 -36213 220182 82267 -228988 -194977 138198 234828
298B34828k86169j96539K05738K57587j12899k89303J8256L00314R4999k53552
$$ 234828 -51341 -247880 -42142 215445 102546 -186757 -168501 131813 226812 -26740
308b6740j75724J80263K13619j11852k33925M8149K47229K5756k43726j11781
$$ -26740 -202464 -22201 191418 79566 -154359 -106210 141019 166775 -76951 -188732
318a88732J96442J64201j48769k07873R5117K48935j4794k63620p8944K36658
$$ -188732 7710 171911 23142 -184731 -89614 159321 144527 -119093 -198037 38621
328C8621J64389j69352k12005R9062K46544j0818k53118q9782K06117J56906j38962
$$ 38621 203010 33658 -178347 -79285 167259 156441 -96677 -186459 19658 176564 37602
339C7602j89585P1965J97780j3634j98112n0780J74429J09826j23817j32739Q4981
$$ 37602 -151983 -80018 117762 104128 -93984 -144764 29665 139491 15674 -117065 -32084
350c2084J52165m6808j74131q279J78794P2275j54738j26051J09482J56980o2983
$$ -32084 120081 73273 -100858 -109137 69657 141932 -12806 -138857 -29375 127605 64622
361F4622j84538j412J90673P9766j56319j37292J00249J67199m0911j77323j9622
$$ 64622 -119916 -121328 69345 149111 -7208 -144500 -44251 122948 82037 -95286 -114908
372a14908J69014Q1012j34060j26688P8280J37543l1583j34708k495J36415M2958
$$ -114908 54106 135118 1058 -125630 -47350 90193 58610 -76098 -78593 57822 100780
383A00780j24313q2303R9475J10684o5985j28875L4324J44754Q041j54710o9759
$$ 100780 -23533 -105836 -6361 104323 38338 -90537 -56213 88541 96582 -58128 -127887
394a27887J29156J18614q2151j45223L2382J55032K0090j48670p5070J19243J19575
$$ -127887 1269 119883 37732 -107491 -75109 79923 100013 -48657 -123727 -4484 115091
405A15091o4781j28165J8834J22346J3151j17859n1750R6759Q1841o3297r2519
$$ 115091 50310 -77855 -59021 63325 76476 -41383 -93133 3626 85467 22170 -70349
416g0349L4853R4077j7060j04890j2011J09118N7165q5160q3122N5952R6367k9589
$$ -70349 -35496 58581 41521 -63369 -75380 33738 90903 5743 -77379 -21427 74940 45351
428D5351j13573j0549J15608O1049q8970r4857M5695J01602j1755j02377k1834
$$ 45351 -68222 -78771 36837 97886 8916 -85941 -40246 61356 49601 -52776 -74610
439g4610R6572O2058o7245q2962K9974Q2143n396p8972j3574P6432L7430o4469
$$ -74610 21962 84020 16775 -66187 -36213 45930 40534 -38438 -52012 24420 61850 -2619
451b619n7950M3402O6273k7101p3543J2370Q8242J9889q6799n4625O5972P8187
$$ -2619 -60569 -17167 49106 22005 -51538 -39168 49074 68963 -17836 -72461 -6489 71698
463G1698l8128r1975O458R5697K6880q7576o3791N8349Q1077k4728q0966j323
$$ 71698 33570 -58405 -51947 43750 70630 -16946 -80737 -22388 58689 33961 -47005 -48328
475d8328P8280K5364o5609m5545M9428N7635k6889o0100J2244N9326K74o3688
$$ -48328 29952 55316 -10293 -55838 -6410 51225 24336 -35764 -23520 35806 36080 -27608
487b7608k0559O0575L9590m8474n6290L1179O8312r763p4462j7442P1179M6048
$$ -27608 -48167 12408 51998 3524 -52766 -21587 46725 36962 -37500 -54942 16237 62285
499F2285m9906o3199K4751O7760k182o5867k2789N6126M2799l5233n2466J2846
$$ 62285 12379 -50820 -26069 41691 39509 -26358 -49147 6979 49778 14545 -37921 -25075
511b5075M9824J382m3612j2207M1215K4636l1838l4630J8295L5974j1360m1195
$$ -25075 24749 26131 -17481 -29688 11527 36163 4325 -30305 -12010 23964 12604 -28591
523b8591J995M8029J6140m4975l6828L0763N0097j1188n2907n591N6056K8373
$$ -28591 -26596 21433 37573 -7402 -44230 -13467 36630 25442 -27465 -33056 23000 51373
535E1373m6739m9236K3086N4328k717n1738j4340M5643K6189l8485l9115K2470
$$ 51373 4634 -44602 -21516 32812 30095 -21643 -35983 9660 35849 -2636 -41751 -19281
547a9281M3277n349l8968k01M0214R466m0820k0768L5549L3711k4388m0985J3086
$$ -19281 23996 18647 -20321 -20522 19692 29158 -11662 -32430 3119 36830 12442 -28543 -15457
560a5457M5516j541n0762j7813M5092L6975k9220m5881J0775M5666L616m5429
$$ -15457 30059 28518 -22244 -40057 5035 42010 12790 -33091 -22316 23350 26966 -18463
572a8463j8890L6978L2097k1330l5532O054K8854J277k6131l275K7238J6178k0166
$$ -18463 -37353 -375 31722 10392 -25140 -19086 9768 11045 -15086 -18361 8877 25055 4889
585D889j9671J3312K0530q777k2778M212K9067R391k8336k4902J0558K5300l194
$$ 4889 -14782 -1470 19060 10283 -12495 -8283 20784 30175 1839 -23063 -12505 12795 9601
598I601k7836o482K7239K0031k1528l2039N990L4198J0082k4145j2806K3543K1110
$$ 9601 -18235 -24717 2522 22553 1025 -31014 -25024 9174 19256 -4889 -17695 5848 26958
611B6958j6416k8752M299K8289N398k1951o336K1030Q520k3132j9797J7910K5237
$$ 26958 10542 -18210 -13911 14378 19776 -2175 -8511 12519 21039 -2093 -21890 -3980 21257
624B1257r355k7782J901K8231L027l4508j9901K6748L2285j1298l2533L1L1562
$$ 21257 11902 -15880 -13979 14252 17279 -17229 -37130 -10382 21903 10605 -21928 -21897 9665
637I665R781k6365j5979K2565K7855o397k3114j921J6904J666j9240o547J6464
$$ 9665 19446 -6919 -22898 -333 27522 21125 -1989 -3910 12994 14660 -4580 -11127 5337
650E337R939j4115j5780O686J1756p943j7773K658K2267J1493j5268j6191P993
$$ 5337 15276 1161 -14619 -7933 3823 -4120 -21893 -19235 3032 14525 -743 -16934 -8941
663h941J9465J48j9882n022K0738J9120j1296k2945q21K0562N152j7324j0184
$$ -8941 10524 10672 -9210 -14232 6506 25626 14330 -8615 -9436 11126 16278 -1046 -11230
676a1230J4336J4369j0290j8495Q10J3670p69j4467j443J4691M647j3834q557
$$ -11230 3106 17475 7185 -11310 -10500 3170 2401 -12066 -13509 1182 5829 -8005 -16562
689a6562J1729J2994q081j4021P480K0749M450j7313j0521J3543J6083o624j8692
$$ -16562 -4833 8161 80 -13941 -6461 14288 18738 1425 -9096 4447 20530 13906 -4786
702d786k972J6036P722j4447j6051L980J3988M47j3319n256R059O659l852n628
$$ -4786 -7758 8278 16000 1553 -14498 -10518 3470 3917 -9402 -14658 -5599 1060 -2792 -8420
716h420N758P301l076o729L105J0854J16j1149l001J3536R760j1356j6132L186
$$ -8420 -2662 4639 1563 -5166 -2061 8793 8909 -2240 -5241 8295 18055 6699 -9433 -6247
730f247J7231J869j6897q575J2144J2218r527j7780JJ5332N640j0179o138R021
$$ -6247 10984 12853 -4044 -12619 -475 11743 2216 -15564 -15563 -231 5409 -4770 -10908 -1887
744a887P574n559p914L878R391J026m656P60O463P11p544n162M830N358l258p958
$$ -1887 5687 128 -7786 -3908 5483 6509 1853 2613 9076 9787 2243 -2919 1911 7269 4011 -3947
760c947J160P738Q35j2241j0241N156J3605K085j0323n181J0296R023o311j0387
$$ -3947 -2787 4951 5786 -6455 -16696 -11540 2065 4150 -6173 -11354 -1058 7965 1654 -8733
774h733K189J4408N763p563o234L883N571m384p835J583O177j319o650k31O560
$$ -8733 -6544 7864 13627 6064 -170 3713 9284 4900 -2935 -1352 4825 3506 -3144 -3375 3185
789C185j321j1195n328J0022R893n742j0777L440J2961J246j2193n701J1298J1978
$$ 3185 1864 -9331 -14659 -4637 5256 -486 -11263 -7823 5138 6384 -5809 -11510 -212 11766
803A1766l579r709Q02Q390J921o627m082M234L644l992m644J24J554k440l162
$$ 11766 8187 -1522 -720 7670 9591 2964 -1118 3116 6760 2768 -1876 -1752 -198 -2638 -5800
818e800mK363L06l614J85L506M061j575l315J358P352K990l699n917K414P946
$$ -5800 -5804 -3441 -3135 -6749 -6564 -3058 1003 -572 -3887 -2529 4823 7813 4114 -1803 611 8557
834H557J704p170o144M068O612l814q958k452N706M682l592n232O67K582j115
$$ 8557 10261 3091 -3053 1015 7627 3813 -5145 -7597 -1891 2791 -801 -6033 -5366 -2784 -3899
849c899k225K374M105P8j479L45M734Q71n369j675N737O368k480p236j687P441
$$ -3899 -6124 -3750 355 433 -1046 -701 4033 4904 -465 -2140 3597 9965 7485 249 -1438 6003
865F003J457p754p397L817Q606l21r254k919N033K839m357m225M003N890J045
$$ 6003 7460 -294 -7691 -3874 4732 4411 -4843 -7762 -2729 110 -4247 -8472 -4469 1421 2466
880B466l266o83J624j29m74L168L869o12m488j677L652J569m021m301K065M785
$$ 2466 -800 -1483 141 12 -462 2706 6575 5963 1475 -202 3450 5019 998 -3303 -1238 3547
896C547J074o472n094J040N358J620m546k400K243N187M28m058k065L579L821
$$ 3547 4621 -1851 -6945 -5905 -547 1073 -3473 -5873 -3630 1557 1985 -2073 -4138 -559 3262
911C262Q18k256m62J409J295k024j124J067M07r07n35N44r34l508k159K436L401
$$ 3262 4080 1824 1362 2771 4066 2042 918 1985 2392 1485 950 1494 560 -2948 -5107 -2671 730
928G30l71l967r71M341J884m385m126L855P927J110n821l712L812M809j580l440
$$ 730 359 -3608 -4579 -238 1646 -2739 -6865 -3010 4917 6027 206 -3506 306 5115 3535 95
944I5P17L662J632l577l978K72M54q08M45P72r5l000j402K309K050k188l579J508
$$ 95 812 4474 6106 2529 -1449 -1177 -723 -1531 -1086 -314 -409 -3409 -4811 -2502 -452 -2640 -6219 -4711
962d711O626L100m193m158J467M655J498l471m80L120K410k195l785j520O65K610
$$ -4711 1915 5015 822 -3336 -1869 2786 4284 813 333 3453 5863 3668 -117 -1637 -972 1638
978A638Mj527j264r96j45j75j01m84K20J237J013o33J8j058Q99J625K277l79j579
$$ 1638 1642 115 -1149 -2145 -2290 -2465 -2566 -3050 -2830 -1593 -580 -1213 -1195 -2253 -1354 271 2548 2169 590
997E90K18L241J455k211m120j81L734J506k815m269R07K333r45l698j010K987
$$ 590 808 4049 5504 3293 -827 -1008 2726 4232 1417 -2852 -1945 388 -557 -4255 -5265 -2278
1013b278K980j666k811M36J358J814K9J093J206r86q46J447J830q56k316o21L327
$$ -2278 702 -964 -3775 -3339 -1981 -167 -138 955 2161 1175 329 1776 3606 2750 434 -187 3140
1030C140J888k907m429L81L737j64l656j998J800L058q30k943r60R93J502O53
$$ 3140 5028 2121 -2308 -1927 1810 1646 -2010 -4008 -2208 850 20 -2923 -3883 -2890 -1388 -735
1046g35R6O73N32N08P88M65p37j144J367J718R55j837j708r36j07O58j835j117
$$ -735 -639 34 566 1074 1862 2327 1590 446 1813 3531 4486 2649 941 5 -102 556 -1279 -2396
1064b396j99J564L16j488j529J53J360K396n65p04L93K131Q70j228j335K70L076
$$ -2396 -2595 -1031 -715 -2203 -3732 -3579 -2219 177 -388 -1092 -699 1432 2302 1074 -261 9 3085
1081C085N02j979j184J192nj332r23M30J41O2q34M86m38k275l17J383K318o65
$$ 3085 3587 1608 424 1616 1611 279 -644 -214 -73 -11 -845 -359 -797 -3072 -3389 -2006 312 -353
1099c53k594k09L748J536k331j765J843L988M47k486j074P70J640j338j177q79
$$ -353 -2947 -3156 592 2128 -203 -1968 -125 3863 4310 1824 750 1520 3160 1822 645 -234
1115b34P41n10j022L2j536q63p06J561K357l90j479o60K888R16j250o60J832K903
$$ -234 507 -3 -1025 -993 -2529 -3392 -4098 -2537 -180 -570 -2049 -2709 179 1095 -155 -815 1017 3920
1133C920j98k149r92J42P69m99K57r04k56J30O50r07k291q81J410K542k06k241
$$ 3920 3722 1573 581 723 1492 993 1250 346 90 220 870 -37 -2328 -3209 -1799 743 537 -1704
1151a704n75J307K11j249k59K043J195L04m48P29k5j436L38K410K15q02j235R82
$$ -1704 -2279 -972 -761 -2010 -2269 -226 969 1273 825 1554 1529 93 431 2841 3056 2254 1019 2001
1169B001L92j843l411J67K942O77k697j866P25J425j068j021J704K071Q72N19
$$ 2001 2393 550 -2861 -2694 248 925 -1772 -3638 -2913 -1488 -2556 -3577 -1873 198 1070 1589
1185A589M72l87m29q05J282J396p55j175k42P73j78k145j452J094J220Q87r49
$$ 1589 2061 1674 1245 440 1722 3118 2363 1188 946 1719 1541 -604 -2056 -962 258 1145 196
1202A96r96j181M27L02o38n7P42J464N44j462o78J59J179P44O41N72K93k03L3
$$ 196 -800 -1981 -1554 -1252 -1890 -1947 -1205 259 803 -659 -1337 -1178 1 745 1386 1958 2251 2048 2081
1221B081j45p77o57K88R82j81j895j439r09j53j65j56J05R09J324K10J64n83o9
$$ 2081 1936 1159 502 790 1772 1591 -304 -1743 -2652 -2805 -2970 -3126 -3021 -2112 -788 -578 -414 -997 -1066
1240a066J628K927j33j224n54J607p62j682r73J057N54o00n46m56r27j024q7J120
$$ -1066 562 3489 3356 2132 1578 3185 2423 741 -232 825 1379 779 233 -223 -1150 -2174 -2261 -1141
1258a141P63j057J84Q68J46j658j094Q29K040N90m11k28O4J433l37Lo1O14J499
$$ -1141 -378 -1435 -1251 -383 -237 -1895 -2989 -2160 -120 470 59 -169 -105 1328 991 994 933 1547 3046
1277C046J35l20j595j428L85j01j221j24p37L19j71j003q12L18J160J492R45J232
$$ 3046 3181 2861 1266 -162 223 122 -1099 -1223 -1960 -1641 -1812 -2815 -3627 -3309 -2149 -657 288 1520
1295A520j81p23J228R24o24p93P55M19N24k391j425ON21n80J78n53l8q5l60J73
$$ 1520 1339 616 1844 2768 2144 1351 2106 2525 3049 658 -767 -761 -240 -820 -642 -1195 -1233 -1318 -1678 -1505
1315a505j58m59J407J765k55j849k48J296P0l68J10J143J182k15k51L76r02k73
$$ -1505 -1663 -2122 -715 1050 795 -1054 -1302 -6 64 -304 -194 949 2131 1916 1665 2041 1139 866
1333H66J54J538o48k100j257Q19O14k554p46J065J322k94j328l82J468P08J266
$$ 866 1020 2558 1910 -190 -1447 -628 -14 -2568 -3314 -2249 -927 -1221 -2549 -2931 -1463 -755 511
1350E11R44N82k96L39P40n22j230r05J756N31n81k020q84j39p55R4L70PK70N68
$$ 511 1455 2037 1741 2080 2820 2298 1068 163 1919 2450 1869 -151 -1035 -1174 -1929 -1835 -1465 -1458 -1188 -620
1370f20N13m02j370j24J386J299J25k30l64J171j005l89K77Q61N97K12n04J96
$$ -620 -107 -509 -1879 -2003 -617 682 807 577 213 1384 379 -10 267 1128 1725 1937 1433 1629
1388A629j486n82P20k5q97k50M72r9j479q23N21N95N24P79K97l91M72K21O12j12
$$ 1629 143 -439 281 256 -641 -891 -419 -518 -1997 -2820 -2299 -1704 -1180 -401 -104 -495 -23 198 810 698
1408F98L83Q62J555k65j387j520k45L82l6p98o3J78k19j147o19m6K71r4J763Q96
$$ 698 1081 1943 3498 3233 1846 326 81 463 427 -371 -434 -256 -475 -1622 -2241 -2287 -2016 -2110 -347 549
1428E49m09p74K45L35J220q12J43J317L04o02n29m83L18j49J23j86k35Jj176l33
$$ 549 140 -634 -389 -54 1166 354 497 1814 2118 1516 987 504 822 673 796 610 375 376 -800 -1133
1448a133R6l85k00Q07K73K9j180o5J208J63J73L9J03J942o14m06j13L42j60M73
$$ -1133 -1037 -1422 -1622 -815 -542 -513 -1693 -1758 -550 -387 -214 -175 -72 1870 1256 850 737 1079 919 1392
1468A392O72k15q45q93m61l09l98l28N8L22J60m20j358M59R76J342J89j44O95
$$ 1392 2064 1849 1004 111 -350 -659 -1057 -1385 -1327 -1005 -845 -1265 -2623 -2164 -1188 154 343 199 894
1487H94K09o27l7P95L12J74k43N84p91j522m48J69O33k58r62R59l08o5j197n09
$$ 894 1103 476 439 1234 1546 1720 1477 2061 1270 -252 -700 -531 102 -156 -1118 -159 -467 -532 -1729 -2238
1507b238O97J094L51k52M44j16j49l43L97j15J002N67O4J73o91n81M79L08J68
$$ -2238 -1541 -447 -96 -348 96 -20 -169 -512 -115 -230 772 1339 1403 1576 885 304 783 1091 1259
1526A259m06o13K64m20j078m94j59M84m1L24J32o69J75j48J140N4J023K79N57
$$ 1259 853 240 504 84 -994 -1488 -1647 -1163 -1204 -880 -748 -1417 -1242 -1390 -250 -196 827 1106 1663
1545A663P54l56r53l05J67J040m72r21k24R9l70j476m81L01J142N41m10q29n1
$$ 1663 2417 2061 1108 803 970 2010 1538 617 393 492 122 -1354 -1835 -1534 -392 149 -261 -1090 -1141
1564a141l85M04k25R44N09N8Q60P2q62p34P08J485L41l34k69q33P23j115m06l77
$$ -1141 -1526 -1122 -1347 -403 106 164 1024 1096 234 -500 208 1693 2034 1700 1431 598 1321 206 -200 -577
1584e77j33M57L45j076q35k06j55M75J019rmO97O55K78r54k38R53J515M81p08
$$ -577 -710 -253 92 -984 -1819 -2025 -2180 -1705 -686 -695 -699 -2 653 931 -23 -261 692 2207 2688 1980
1604A980m37o32m55o48K97j23l74Q32l60p43p07o06O24K80P53l52K06L33K89m29
$$ 1980 1543 911 456 -192 105 -18 -392 440 80 -663 -1370 -1976 -1352 -1072 -319 -671 -465 -132 157 -272
1624b72o93L97J428M98K19n09j86J38n53P6L32L10k37l34q6l43j477k27M36N64
$$ -272 -965 -568 860 1358 1577 1068 882 1020 467 543 875 1185 948 614 528 185 -1292 -1519 -1083 -519
1644e19Q7r39K95O10o02M10r02R67J956N47l19p32j01K09k8J66K43k04l88l29
$$ -519 -432 -1371 -1076 -466 -1068 -658 -1560 -593 1363 1910 1591 859 758 967 939 1105 1348 1144 756 427
1664D27k00q03j122O0J256O97q67m68o63P82n5k97N44Q76O94m6p9q99L9L40N81
$$ 427 227 -576 -1698 -1638 -382 315 -552 -1020 -1683 -901 -956 -1253 -709 167 861 815 736 -163 -124 216 797
1685G97N14m18L89K25o65q7j270q26J125J027o48p94m20r68L59j80J294k96P23
$$ 797 1311 893 1282 1507 842 755 -515 -1341 -216 811 163 -631 -1051 -2019 -1660 -1840 -546 -842 -119
1704a19Q38q52L50l72j81Q46J077J50l62k48k44M39q99o96K55Q14k88r00p39m71
$$ -119 719 -133 217 -155 -336 510 1587 1737 1375 1127 883 1322 423 -273 -18 796 508 -392 -1131 -1602
1724a602L60L08k79K59J66N67J12O8n19j7m7J204R30k66p95k65M81k57l04K62
$$ -1602 -1242 -934 -1213 -954 -788 -221 -109 -41 -560 -577 -624 580 1510 1244 449 184 665 408 104 366
1744C66K37N23o2r57q76P8K67k37K50k91l33M31j68l99j36P5J083R76J70n84R1
$$ 366 603 1126 1064 107 -769 -691 -424 -661 -411 -702 -1035 -604 -772 -1171 -1307 -1232 -149 827 997 413 504
1765E04K12K87J65m68M10K37m3o85p44j063R3M19Q5m8q8K34o6k59o03K46N14N69
$$ 504 716 1003 1168 700 1110 1347 1304 619 -125 -1188 -1095 -676 -591 -639 -727 -493 -559 -818 -1421 -1175 -661 -92
1787i2N63l31k36r6J53N1Q00j23N07N39l07q62k67n90O05J32j20l83r35L63j42
$$ -92 471 140 -96 -192 -39 12 812 689 1196 1735 1428 566 299 -291 314 446 326 -57 -992 -629 -771
1808g71n45K34k60N41R32k11ml38j49R96K96m34R33q6O06m68q30m06L02m0L9R9
$$ -771 -1316 -1082 -1342 -801 131 -80 -84 -422 -571 425 721 287 1220 1134 1740 1272 442 36 338 298 337 436
1830D36k63m60m05L01p05J90k41P73L8J35p50K9L73M00L36P5q3M90J81m24p4n41
$$ 436 173 -287 -692 -391 -1096 -906 -1147 -374 -336 -201 -951 -922 -549 -149 187 262 179 669 850 426 352 -189
1852a89J264J23k00q9k93p23k34jj67l06k08P61R9p86n70m52J150O39O05K76O4
$$ -189 1075 1198 998 909 616 -107 -341 -342 -509 -815 -1023 -262 -163 -949 -1519 -1971 -821 -182 423 699 763
1873G63O8m01J3L19j87L94J69R9p46m69k57rM64n12l30M2l50P34m72j014P74O36
$$ 763 831 430 443 762 575 969 1138 1237 491 22 -235 -244 220 -292 -622 -580 -930 -196 -668 -1682 -908 -272
1895b72K22m3K41r22P18J32M99k3M84r1L33rn15o71o44J168K96m78o54N94r75
$$ -272 -50 -93 148 -774 -56 76 575 552 1036 945 1278 1269 754 83 -561 607 903 425 -229 365 -610
1916f10l58m70o2L88L6K63O31L1r21O11P35L04p2P1L65K86k45o27k56L62k45N32
$$ -610 -968 -1438 -1500 -1112 -1076 -813 -182 -151 -1072 -461 274 578 506 577 942 1228 983 356 100 462 217 749
1938G49m66J01n91p43J5k03J77k52Q30j93l06L71k22N60L10l09N62M38l75L64
$$ 749 283 384 -207 -950 -935 -1138 -961 -1213 -383 -576 -882 -511 -733 -173 137 -172 390 828 453 817
1958H17o31L16J80r5P93m88j27j142J54L10n32K19m65J3Oq4k46q23Q72N34N1J64
$$ 817 186 502 682 587 1380 892 765 -377 -223 87 -445 -226 -691 -678 -672 -756 -1002 -1825 -953 -419 -368 -204
1980b04L23K05n9K06j97M59J32M41J7l43k69l36l86J74J17k22p45Q37q59k87p4
$$ -204 119 324 265 471 274 733 865 1306 1323 980 711 375 -11 163 280 58 -687 150 -709 -996 -1070
2001a070k23L53M76m0K60r5K88R6N8P88l66K22j04Q61k48r96l19L82O02n1n25
$$ -1070 -1293 -940 -464 -504 -244 -339 -51 45 103 891 525 747 643 1504 1256 260 -59 323 925 874 349
2022C49q51L52Pr36K65l36N58J6K5J9O13o58k1M50K73j60O28P77o06k23n44O00
$$ 349 -502 -150 -143 -1079 -814 -1150 -592 -576 -551 -532 81 -577 -598 -148 125 -35 593 1370 764 541 -3 597
2044E97k24N17l19p3j90P7p76k73L2J59k03j00P24r96L61k59N20N3K79M73k29
$$ 597 373 890 571 498 308 385 -391 -664 -632 -473 -676 -776 -52 -1048 -687 -946 -426 -373 -94 379 150
2065A50K76J65k16k26M88OM02j82o52k64K69j16l47J38n74M11J12n33k35L22r8
$$ 150 426 591 375 149 637 643 1045 863 211 -53 216 100 -247 -109 -683 -272 -160 -693 -928 -606 -704
2086g04J32M31J42m45O29L9l96J60K89J12L70k30O49j027K55M0k10P8k54R1j34
$$ -704 -572 -141 1 -444 185 224 -172 -12 277 389 759 529 1178 151 406 446 236 314 60 151 17
2107A7k06k98l77K65k24O1J77j40J83j95O02q2J66N92J87M62n3k79o53J48K83
$$ 17 -189 -487 -864 -599 -823 -762 -585 -725 -542 -737 -135 -217 -51 541 728 1190 1137 858 205 353 636
2128F36J14o05j24Qk07mp14L18l04Q18m49J79k44p2K58M53j1n3P34j62j53L35
$$ 636 750 145 21 29 -178 -182 -896 -578 -882 -64 -513 -334 -578 -650 -392 61 50 -3 731 569 416 751
2150G51l77l46J8J98M4L37k01K70m40p4j30j17m03K08j05p6on15L68K0R6L55K44
$$ 751 374 28 46 244 288 625 424 694 254 180 50 -67 -470 -262 -367 -443 -449 -964 -596 -576 -480 -125 119
2173A19J12J62K4K19l85K93L51m87N7l1l67K66J66o30K78j84k87l48r1j18J15
$$ 119 231 393 417 636 251 544 895 408 465 434 67 333 499 -131 147 -37 -324 -672 -763 -881 -766
2194g66M89k65K81n7M42J65j55K27k71k64L95J038n81k44N25j69k73l39p19P63
$$ -766 -277 -542 -261 -318 124 289 134 361 90 -174 221 1259 678 434 959 790 517 178 -541 222
2214B22K8K60l88o13l29M68mJ42n75K5M59l66J78O46l63M74m3N30k8K18l11l03
$$ 222 250 510 122 -491 -820 -352 -356 -214 -789 -764 -305 -671 -493 153 -210 264 221 751 723 941 630 327
2236C27L86m5m42L6j3j96L8k45k41l03J83r9j80L19M6O7L80m04M36lM43m51J37
$$ 327 713 668 226 262 249 53 91 -154 -395 -698 -515 -614 -794 -475 -429 -362 18 -386 50 47 490 39 176
2259A76O67m55O41n28j33K95J07l20m99M58l01m49q9L57m80P4L70n23k83j0M59
$$ 176 843 388 1029 501 368 663 770 450 -49 409 108 -341 -430 -73 -553 -479 -109 -632 -915 -925 -466
2280d66O0M31K42K11o4k79N52j61m82L47R26r13J04K67o38k63m31O67n81J8j30
$$ -466 -406 25 267 478 414 135 687 526 44 391 1317 404 508 775 137 -126 -557 110 -471 -453 -583
2301e83l47M62o12O82L67j85J37K8Q3K89k85K11L36m05K99J29k69J62j7m1m71
$$ -583 -930 -468 -1080 -398 -31 -216 -79 -51 32 321 36 247 583 178 477 606 337 499 482 441 -30
2322c0K72j58J42m02j92k06k88J26p4J39j13M66n42M06M7J60O35j50M55K84o15
$$ -30 242 84 226 -176 -368 -574 -862 -736 -810 -671 -784 -318 -860 -454 -407 -247 388 238 693 977 362
2343C62k44M60L74n00M1J68m0n82op07K23m77K25J73J61Q6l86L61m08M28k4k72
$$ 362 118 578 952 452 493 661 621 39 33 -674 -451 -928 -703 -530 -369 -283 -669 -308 -716 -288 -312 -584
2365e84P30L53K27m29j79P73r3k21p6K48o5m86p3m21K70k93K49k58m17K43j13
$$ -584 146 499 726 297 118 891 798 577 501 749 684 198 125 -296 -26 -319 -70 -328 -745 -502 -615
2386f15K2R6j15J3J45N57K07m05J35N80k89P5L64K4n76k53J99K04m10J58j56J01
$$ -615 -593 -497 -612 -599 -454 103 310 -95 40 620 331 406 770 794 218 -35 164 368 -42 116 -40 61
2408F1N9o42q0K90m08L68k49M79l19J00L71k21K3L61r3O66m58Q2L68Q5o86n39
$$ 61 120 -522 -602 -312 -720 -352 -601 -122 -441 -341 30 -191 -168 193 100 766 308 390 758 843 157 -382
2430c82Q58k28o2P3p02J18k47J89K3k67N7P1Q2J61J10m08l45K09L56O15j57K62
$$ -382 476 248 186 259 -443 -325 -572 -383 -360 -627 -570 -499 -417 -256 -146 -554 -899 -690 -334 281 124 386
2452C86L31n73k2L26J11l77J16Q3o1n62k17J88mN4k20p6O6L87k16n75M88K85j36
$$ 386 717 144 122 448 559 182 298 381 320 -242 -459 -271 -275 -221 -441 -517 -451 -64 -280 -855 -367 -82 -218
2475b18M67k00M40Q9o32L43K26l43L49r1k52m0l91N23m4k77m40L00k9q1k25n13
$$ -218 249 49 489 578 -54 289 515 172 521 430 178 138 -253 270 226 -51 -491 -191 -220 -301 -526 -1039
2497a039N52K18L8K80l56L06L53n24O56q2K30k49K57l68P28n17l18p8N59p00l31
$$ -1039 -487 -269 -231 49 -307 -1 352 -172 484 402 632 383 640 272 1000 483 165 87 646 -54 -385
2518c85N9m77K07J03k74J30K94J74J33J13r3Q4P3M05p22N32J27N4j43o29N74l79
$$ -385 -326 -803 -596 -493 -767 -637 -343 -169 -36 77 -16 68 141 546 -176 356 483 537 394 -235 339 -40
2540d0L12j34j81O17o01K05q65M79k39r0Q8j12J26k49O3L87K60N52m89l5O60J52
$$ -40 272 138 -43 574 -27 178 -687 -208 -447 -537 -449 -561 -435 -684 -621 -234 26 578 89 54 714 866
2562H66p51L49l35J93P37k57n05k8J04j06p16L25n38N7J11k14N83p47L55L19N5
$$ 866 115 464 129 322 1059 802 297 269 373 267 -449 -124 -662 -605 -494 -708 -125 -872 -517 -198 -143
2583a43M86p72N01M65j67k59J42j1J78j77J76k58r6P2J82j67j85j25j31m16M14
$$ -143 343 -429 72 537 370 111 253 242 420 243 419 161 65 137 319 152 -33 -158 -289 -705 -291
2604b91j58j35J76m8M09m81M90k13j92M40o5O44k77J34N24m42J77k18J04K3m43
$$ -291 -449 -584 -408 -456 -47 -528 -38 -251 -443 -3 -68 576 299 433 957 515 692 474 578 601 158
2625A58k49K19P9o49L81j93l30K44n85Q46l56r3J40N76j38p2J76J66Q6M0L65m87
$$ 158 -91 128 207 -442 -61 -254 -584 -340 -925 -79 -435 -528 -388 188 50 -22 154 320 406 446 811 324
2647C24j18J46o6J64k14o70J43K76j32j90L43j80j4n86j0O00O7j10M2P8k08R36
$$ 324 206 352 286 450 236 -434 -291 -15 -147 -337 6 -174 -188 -774 -784 -184 -117 -227 -185 -107 -315 621
2669F21l78L07l15l7q7R11q27Q15q18Mj92N0k06o2J40k02J99k20q32N60L80k39
$$ 621 243 550 235 198 111 1022 195 1010 192 196 4 54 -152 -214 -74 -276 -77 -297 -1129 -569 -189 -428
2691d28J96p9n8J24K28L48j87OJ37K79J16m03J2p2j60k06QL7L36n20L55j27q8
$$ -428 -232 -311 -369 -245 -17 331 144 150 287 566 682 279 291 219 59 -147 -139 -102 234 -286 69 -58 -146
2714a46K45l21p8M70J25k33j54J85J87J57j37P3l14P56k07m86K81k64N85p40R5
$$ -146 99 -222 -300 170 295 62 -92 93 280 437 300 373 59 815 608 122 403 139 724 -16 79
2735G9j24k88J02O20o52j48Q8J46k37j77k78R93K69l31j28R5p5L01Q7K5n3o3J50
$$ 79 -45 -333 -231 389 -263 -411 -323 -177 -414 -591 -869 124 393 62 -66 29 -46 255 342 367 314 251 401
2758D01j2L08k70l78j88QJ98m94J33o4J68K88l74k12K65M04L24m0j63r3K05o86
$$ 401 389 697 427 49 -139 -131 67 -427 -294 -358 -190 98 -276 -488 -223 181 505 465 302 209 414 -272
2780b72M92m89O61N98o94J10m04p9L26l13l40O55l16J95l39n3J82n64M33k56J55
$$ -272 220 -269 392 990 296 406 2 -77 249 -64 -404 251 -65 130 -209 -262 -80 -644 -211 -467 -312
2801c12l16L13r8k2L52k55Q0M08L35J1N6j96n38P34n97K22k10o8j27J24q11N10
$$ -312 -628 -315 -413 -435 -83 -338 -258 150 485 496 552 356 -182 552 -45 177 -33 -101 -228 -104 -915 -405
2823d05K83J01m93M42j43l22P3L33j93N65L27M8j19m20R5K45p06L90M58j43n0
$$ -405 -122 -21 -514 -72 -215 -537 -464 -131 -324 241 568 616 497 77 172 417 -289 101 559 416 366
2844C66j04k82r2l55kK19J99J29k66o46L55J21L0K34j46L83N85n98k6M42q33N88
$$ 366 262 -20 -112 -467 -469 -250 -51 78 -188 -834 -479 -358 -328 -94 -240 143 728 130 104 546 -287 301
2866C01r9N23kL8o07n15L22m0r3Q7N48m66k52j33L9j63N11L83m64R3N2j11j19
$$ 301 202 725 723 761 154 -361 -39 -79 -172 -85 463 -3 -255 -388 -349 -512 -1 382 -82 11 63 -48 -167
2889a67K85N31l17K61j28K55k94Jpl16j36l53P17n88J63j78m83O16o46R32q45
$$ -167 118 649 332 593 465 720 426 427 420 104 -32 -385 332 -256 -93 -271 -754 -138 -784 148 -697
2910f97K89O05n20OK44J56J10k31J112m45m37K00j10j10L21j5q3P5m17o9m16N6
$$ -697 -408 197 -323 -317 -73 83 193 -38 1074 629 192 392 282 172 493 478 395 470 53 -16 -432 -376
2932c76j46O21r30M64J58m2l16J61J23L4M69P6O5L9k36k82J79O50j90Lm23L94
$$ -376 -522 99 -831 -367 -209 -251 -567 -406 -283 -249 220 296 361 400 164 -118 61 711 521 524 101 495
2954D95j85j10l36n12N60L5m91J21M3O09o85K31J89j58N36j50J52n42J77N81j75
$$ 495 310 200 -136 -648 -88 -53 -544 -423 -380 229 -456 -225 -36 -194 342 192 344 -198 -21 560 385
2975C85L14l40L0j79k91J60L27o88P3N32m07n5j65j36M64l03q0J88K33k17J41
$$ 385 699 359 389 210 -81 79 406 -282 -209 323 -84 -139 -304 -440 24 -279 -359 -171 62 -155 -14
2996a4O2L32l69K25J91l70L79n18J31J88l15J35j60K44j98l26j92P08r99K51J76
$$ -14 48 380 11 236 427 57 436 -82 49 237 -78 57 -103 141 -57 -383 -575 133 -866 -615 -439
3017d39K72o01M96L23n3k89k11M53M13m98M26M40n75k13k4J49J16O5nJ52J79r83
$$ -439 -167 -768 -272 51 -2 -291 -502 -49 364 -134 292 732 157 -56 -80 69 185 250 245 397 576 -407
3039d07N10p09L93M47l24k94L54K0n58J74o6K94K51r4M8k13K68l7K29k57J17J64
$$ -407 103 -606 -213 234 -90 -384 -30 -10 -568 -394 -460 -166 85 -9 39 -174 94 57 286 29 146 310
3061C10l17K37J8J58k10n45j88P78k80l45j85M13J55J86j163Q92K96l00j5L46
$$ 310 -7 230 248 406 196 -349 -537 241 -39 -384 -569 -156 -1 185 -978 -86 210 -90 -105 241
3081B41l12O75m44K1K88k75R6l2K5m53J45l2n6K2M66o59L34k77J27m34N73J2k25
$$ 241 -71 604 160 181 469 194 290 258 283 -170 -25 -57 -113 -91 375 -284 50 -227 -100 -534 39 51 -174
3104a74J71R6j46J81j65m79R86o4j02m02K66J54l01o3p5J44k77m8l99Q76k99m87
$$ -174 -3 93 -53 128 -37 -516 470 406 304 -98 168 322 21 -42 -117 27 -250 -298 -697 179 -120 -607
3126f07k11M81O50o63M2K72o17L36O56lo1p2j98P2K77K20Q6j28j71j88k06m43
$$ -607 -818 -337 313 -350 -308 -36 -653 -317 339 336 275 203 5 77 354 574 660 532 361 173 -33 -476
3148d76Q63m19n96O59l82L05K68n36K74j31l4K97m26O99l5l48k1L46K82j16k00
$$ -476 387 -32 -628 31 -351 -46 222 -314 -40 -171 -205 92 -334 365 330 -18 -39 307 589 473 273
3169B73Q8k25L88o78J11M88j56K0o8n4n10K48k95l9jp0M11k3j42J78p0q5N28j47
$$ 273 361 136 524 -154 -43 445 289 309 241 187 -323 -75 -370 -409 -410 -480 -69 -92 -234 -56 -126 -211 317 170
3193A70K2L02Q5l56Ql19Q2n0K41J93q83P75o26k35J07M68n17J24N23l70J09j66
$$ 170 192 494 579 223 231 -88 -6 -56 185 378 -505 270 -356 -591 -484 -16 -533 -409 114 -256 -147 -313
3215c13L11J10JK86J01j52o3l79L71J56n34JL1k01K93R7p1k48R2M67l54k81K32
$$ -313 -2 108 109 395 496 344 281 -98 273 429 -105 -104 -73 -274 19 116 45 -203 -111 356 2 -279 -47
3238d7K8o5k11J87J86j75k5N90l99R6r0k17L72K9l37J1Q8K72n98K17j28M22j90
$$ -47 -19 -84 -295 -108 78 -97 -122 468 69 165 75 -142 230 259 -78 -67 21 293 -305 -88 -216 206 16
3261A6j36N29q59K20l16N34k10P9j26l05N12K34k24Q4J74N3J10k52K39J76m48
$$ 16 -120 409 -450 -230 -546 -12 -222 -143 -269 -574 -62 172 -52 32 206 259 369 117 356 532 84
3282H4n9k03L77l81L21r5m2k67l66O15j91J09L61m42j00K98J87O7j93j72L47k14
$$ 84 25 -178 199 -182 139 44 2 -265 -631 -16 -207 -98 263 -179 -279 19 206 273 80 -92 255 41
3304D1N1m5K58k07l28mM08j52PN5l4n30j05N46K37n11K93m30K01J84J96P6j59
$$ 41 92 47 305 98 -230 -234 174 22 29 84 50 -480 -585 -39 198 -313 -20 -450 -249 -65 131 207 48
3327D8l81L35K07M42J18j112L56M10k37Q3q5k1M8k35l19M53l27M00n10L27n23
$$ 48 -333 2 209 651 769 -343 13 423 186 269 184 163 211 -24 -343 110 -217 183 -327 0 -523
3348e23K20J87L33m50m35R06N5l13j72K40j91O48j89J23k08N6j39k02o2k31K58
$$ -523 -303 -116 217 -233 -668 238 293 -20 -192 48 -143 505 316 439 231 287 148 -54 -116 -347 -89
3369h9K8l01M53k58k27j81Q8j06O1N37K21l21l71Q32j66k51L89k61R1K27K46q37
$$ -89 -61 -362 91 -167 -394 -575 -487 -593 -532 5 226 -95 -466 366 200 -51 338 77 168 395 641 -196
3391a96J36L83q2l11Q5j33J66J20r62L51J6M10k38L62k38N30j95l19J83m01M18
$$ -196 -60 323 241 -70 15 -118 48 168 -794 -443 -427 -17 -255 107 -131 399 204 -115 68 -333 85
3412H5O57n55J47j76Q9m55P13m16j45k28L01J38l50Q9j19K42J39n75j47M79P1
$$ 85 742 187 334 158 247 -208 505 89 -56 -284 17 155 -195 -106 -225 17 156 -419 -566 -87 -16
3433a6K6l02L68j41O16l92L30o4n30K71m22O18k77K61l17o84Q45om04k61L29j06
$$ -16 10 -292 76 -65 551 159 489 425 -105 166 -256 362 85 346 29 -655 190 184 -220 -481 -152 -258
3455b58K26p1j66k59L40M62m35J09n00L94Q0N45j95m24o0L97j92qj77M25l84J59
$$ -258 -32 -103 -269 -528 -188 274 -161 -52 -552 -158 -78 467 272 -152 -212 185 -7 -15 -192 233 -151 8
3477HK8j25o2l64K47N28p16j25N21L18o49L43j38L02L86l28j18k12J90N90l32
$$ 8 36 -89 -151 -515 -268 260 -456 -581 -60 258 -391 -48 -186 116 502 174 56 -156 34 624 292
3498B92J20k8o74Q73j0o79N16j34m17N49l92j21N3k50L12Q8k57o9K14J73r7n86
$$ 292 412 384 -290 583 573 -106 410 276 -141 408 16 -105 -52 -302 10 98 -159 -228 -14 159 62 -524
3520e24M95O88j128Q28j58Q5k41N42j39L8j63j84m62k63K15L57k13j26N41k75
$$ -524 -29 659 -469 359 201 286 45 587 448 486 323 139 -323 -586 -371 -14 -227 -353 188 -87
3540h7j80k7K16J16l00m1N90j22K37n42L76j76k46O47n18K47K03j28j2k46m5n25
$$ -87 -267 -294 -78 38 -262 -303 287 165 402 -140 236 60 -186 461 -57 190 393 265 253 7 -38 -563
3562e63J92J14O2K93k99l48QJ00J1l12Q71l14M53k54m08K69P5M33k20k90L72K35
$$ -563 -371 -257 -195 98 -201 -549 -541 -441 -430 -742 129 -185 268 14 -394 -125 -50 383 163 -127 245 480
3584D80n49L59n44J41k60L34L81p89M15J17N4k67o33M20P42o00J37L23J62l79
$$ 480 -69 290 -254 -113 -373 -39 342 -447 -32 85 139 -128 -761 -341 401 -199 -62 261 423 44
3604D4l32N88m04J37L59j44j79K51N5j12p5j02l6k8J74n50K98j56q5K1k27L94
$$ 44 -288 300 -104 33 392 248 69 320 375 263 188 86 50 22 196 -354 -56 -212 -297 -276 -503 -109
3626a09M54o66R92q73N52L98o94l04L98J98l30O9J2k54M03l82m11M87k28N99l24
$$ -109 345 -321 671 -202 350 748 54 -250 148 346 16 85 97 -157 246 -136 -547 -60 -288 311 -13
3647a3m55K75M94k29K50n77m1j33P20k21k38N77j32K5K48o22L20k18J48k86P3
$$ -13 -468 -193 301 72 322 -255 -296 -429 291 70 -168 409 277 302 550 -72 248 30 178 -108 -35
3668c5K61k87K82j14k38K3l7q7l80O02m16N7J13M02m19O95j57j22o6M1JN0K78
$$ -35 226 -61 221 107 -131 -108 -145 -232 -612 -10 -426 -369 -256 146 -273 422 265 143 77 118 119 169 447
3691D47q8k05j04L91j21l08p2M61k71l53j45J4L04j96J82j97J84J45j37N21j06
$$ 447 359 154 50 441 320 12 -60 401 130 -223 -368 -354 -50 -246 -64 -261 -77 68 -69 452 346
3712C46l15K42j38l9L06l53l63o9J65L83l57k34N77N6m14o4J23J15l8O4Q1k72
$$ 346 31 273 135 96 402 49 -314 -383 -218 165 -192 -426 151 207 -207 -271 -148 -33 -71 -7 74 -198
3734a98N9O2j45J05N99Kl99L85k9j78l7L3k01L4l1Q4P3l87K58l05JJ10k62r7O40
$$ -198 -139 -77 -222 -117 482 484 85 470 441 263 226 259 58 92 61 145 218 -169 89 -216 -215 -105 -367 -464 176
3759A76n43J19L79j8j74n88O06J39j28L84p31k80P99N3j78N82o05qj0k05N57l94
$$ 176 -367 -248 131 113 -61 -649 -43 96 -32 352 -379 -659 140 193 15 597 -8 -16 -26 -231 326 -68
3781f8k46L38l63M44k91M20m06M6j37p5M9M78j60m5J53M83k57j02k29J92r4j82
$$ -68 -314 24 -339 105 -186 234 -172 -126 -263 -338 -289 189 29 -16 137 620 363 261 32 224 130 -52
3803e2K18k85N47j65J66k21m60J23l09N98k35k59M20m78L41j53O06o29M36k88
$$ -52 166 -119 428 263 429 208 -252 -129 -438 160 -75 -334 86 -392 -51 -204 402 -227 209 -79
3823g9J48K55j75q1Ro7j47K75K41o08K22l00p2K49L0K63p18K36K37J23j74K19
$$ -79 69 324 149 68 77 10 -137 138 379 -229 -7 -307 -379 -130 -100 163 -555 -319 -82 41 -133 86
3845H6n14N77j04k94K4M03k42R65j90q01Q1J37Mj8k81J11K84l4J87m6j26j03K87
$$ 86 -428 149 45 -249 -225 178 -64 901 711 -90 -9 128 132 114 -167 -56 228 194 381 335 209 106 393
3868C93m48J37m83M52n52L88q7O35m94J15j15j31K55J39j03j37J5m0n9K88m75
$$ 393 -55 82 -401 51 -501 -113 -200 435 -59 56 -59 -190 65 204 101 -36 -21 -61 -120 168 -307
3889c07j98K96L8K91j97n40P48Mn22L96n02O17k62K35r6M2J80J87k11M72p08J71
$$ -307 -505 -209 -171 120 -77 -617 131 135 -387 9 -493 124 -138 97 1 43 223 410 199 671 -37 134
3911A34j70J46J23Jk03k85M31m72j02J69J18j78J84j69N45n79K16L0l26N38k24
$$ 134 -36 110 233 234 31 -254 177 -295 -397 -228 -110 -288 -104 -273 272 -307 -91 -61 -387 151 -73
3932g3L80n27K49j25P4K1K41J28n45Q74o09k69O85p95Q4K18J63l9o55O70k76L6
$$ -73 307 -220 29 -96 -22 -1 240 368 -177 697 88 -181 504 -291 -207 11 174 135 -520 150 -126 -90
3954i0L10K81o70J22J08j1l63N04j33N0k65J91j2O15p87L78j89N2m9j36J70l95
$$ -90 220 501 -169 -47 61 50 -313 191 58 108 -157 34 22 637 -150 228 39 91 42 -94 76 -319
3976c19O73l01j52l0k51K61J3P8L29j98R2J78k40J36j22k41N69k33J81l80L27
$$ -319 354 53 -99 -129 -380 -119 -106 -28 301 103 195 373 133 269 147 -94 475 242 423 43 370
3997C70o5O0k37m51P15p11K96k87L77r9M39n34M2J69K95l99L08J4L60p97L62m79
$$ 370 305 365 128 -323 392 -319 -23 -310 67 -32 407 -127 -85 84 379 -20 288 302 662 -135 227 -252
4019b52J226p63l10J47K91l34j62N6J51j45J44L12m9Pj352J048J15k74L60j95
$$ -252 974 211 -99 48 339 5 -157 -101 50 -95 49 361 312 319 -1033 15 130 -144 216 21
4039B1k92K97K7j83L70l77M79k75m64N39L13l13j46N6n74K85P18l88L82k22m40
$$ 21 -271 26 53 -130 240 -137 342 67 -397 142 455 142 -4 52 -522 -237 481 93 475 253 -187
4060a87K91m93K89J48J13o6R2l77M81l73K16M7k80Q12j99l58kq9K74r41M25jJ6
$$ -187 104 -389 -100 48 161 95 187 -190 291 -82 134 181 -99 713 514 156 154 65 339 -602 -177 -178 -162
4083a62M21m04M25l56k54j60J11J89K30m06M25r5L81k17L16k99n14N32l9M18r48
$$ -162 259 -145 280 -76 -330 -490 -379 -190 40 -366 59 -36 345 128 444 145 -369 163 124 542 -406
4104d06L81L3K38p2j99j42M82l47K20q0m22J48L30K45m88k05m2R1L02J84o64Q54
$$ -406 -25 8 246 174 -25 -167 315 -32 188 108 -314 -166 164 409 -79 -284 -326 -235 67 251 -413 441
4126D41k03J05J13n19O3l23N57r6j54K09o6n43o8j13Q83m24J00k27P87r16L11
$$ 441 238 343 456 -63 0 -323 234 138 -16 193 127 -416 -484 -597 286 -138 -38 -265 522 -394 -83
4147h3J70q4q0n6N45k42m17L71Q4k27J91n20K38n5O76k44m20L82m2M9o05L87o8
$$ -83 87 3 -77 -133 412 170 -247 124 208 -19 172 -348 -110 -165 511 267 -153 229 187 236 -369 18 -50
4170e0j3j96P7J66L06n84rJ73k30k36L91M13p1L49q0Oj69k60N9o2j92K38K49o7
$$ -50 -63 -259 -182 -16 290 -294 -303 -130 -360 -596 -205 208 137 486 406 412 243 -17 42 -20 -212 26 275 208
4194B08j38N1k7M4L0J29l04k31J73j10j89M39%k87P21l38m30J37M61j75P1J95
$$ 208 70 121 94 138 168 297 -7 -238 -65 -175 -364 75 75 -212 509 171 -259 -122 339 164 235 430
4216D30k17m27N14l91jM68m87j82M68j24j75J55j77j53J24K01k80J49j38j64L82
$$ 430 213 -214 300 -91 -92 376 -111 -293 175 51 -124 31 -146 -299 -175 26 -254 -105 -243 -407 -25
4237b5n9l72Q68p27K14J43M24p4j61j0l24L60q61R29l95J28k74J87j61L98K81
$$ -25 -84 -456 412 -315 -101 42 466 392 231 221 -103 257 -604 325 -70 58 -216 -29 -190 208 489
4258D89m84M03o60M95j91J22o3J70l41j46K8K4K48J29K06n31k89K52J13O9L81
$$ 489 5 408 -252 243 52 174 111 281 -60 -206 -178 -154 94 223 429 -102 -391 -139 -26 43 424
4279D24k21k57mJ96ml80j19M09k21K90O3K19q02L55j4L52Jj33o4J66j38K65l67
$$ 424 203 -54 -58 138 134 -246 -365 44 -177 113 176 395 -407 -52 -66 286 287 154 90 256 118 383 16
4302A6k09j04L94Mj8q5k99L65n01o2M83J23n05M08l3j16M75l08o6J34N02k90p43
$$ 16 -193 -297 97 101 83 -2 -301 64 -437 -499 -16 107 -398 10 -23 -139 336 28 -38 96 598 308 -435
4325d35M44r5K36l6Q9l10M38k63k49J39J84m19K39m38L50O60m76J28m27J62j0
$$ -435 9 -86 150 114 203 -107 331 68 -181 -42 142 -277 -38 -476 -126 534 58 186 -241 -79 -89
4346h9K66j74M16k57n67N69L34n76R7K13m79M05J46k44j77m02Q76k38n27N28j29
$$ -89 177 3 419 162 -405 164 498 -78 19 232 -247 158 304 60 -117 -519 357 119 -408 120 -9
4367ij64Oj21P90o84K92k6J53k46K43j03k70N11o13N1K60J31o62K55N40j93k76
$$ -9 -173 -167 -288 502 -182 110 84 237 -9 234 131 -139 372 -241 -190 70 201 -461 -206 334 141 -135
4389a35J48k17P9J12o04N15mM02k17K79j1l16m3j21N59n87M30k69m86M65J8j31
$$ -135 13 -204 -125 -13 -617 -102 -106 296 79 358 347 31 -12 -133 426 -161 269 0 -486 -21 -3 -134
4411a34J8M6j48N84n11l3J29k50M57L22p21K91j3L95m07R7k89N14k11j55k3l04
$$ -134 -116 -70 -218 366 -145 -178 -49 -299 158 480 -241 50 37 432 25 122 -167 347 136 -19 -42 -346
4433c46L19L52k08m79N3M14j68o3k21L84j66J81n69Q77k90l74J20n2K35J31m51
$$ -346 -27 325 117 -362 -309 105 -63 -126 -347 37 -129 52 -517 360 70 -304 -184 -236 -1 130 -321
4454c21N54k55p4K81k48N74m22j06J97k75j89N65l46k15P08j50j70j69k84K12
$$ -321 233 -22 -96 185 -63 511 89 -17 180 -95 -284 281 -65 -280 428 278 108 -61 -345 -133
4474a33M26j25Q5m05M13j034L98L25L97k12L9N2o6k18J58O06p93k15M15l42K06
$$ -133 293 168 253 -152 261 -773 -375 -50 347 135 174 226 160 -58 100 706 -87 -302 113 -229 -23
4495b3m26K32R07l35m12L77m83K19j93K41m94J33L4J90L68K28k34j84K2l88l0
$$ -23 -449 -217 690 355 -57 320 -163 56 -137 104 -390 -257 -223 -33 335 563 329 145 167 -221 -251
4516b51K27K35k61k7m58Q55J1j14k45n0L02l73K15k17k16M90m27M15L7m01r0N80
$$ -251 -24 211 -50 -77 -535 320 331 217 -28 -78 224 -149 66 -151 -367 123 -304 111 148 -253 -343 237
4538B37j2k43l3l3K00L84l89p5L27j08J97l15k37j73P2O82l22L85p71L92o7n02
$$ 237 225 -18 -51 -84 116 500 111 36 363 255 452 137 -100 -273 -201 481 159 544 -227 165 98 -404
4560d04N20k10L42n32J11K97J01K1j49j47j89M29pl14p8J18L47n91N19K10p74
$$ -404 116 -94 248 -284 -173 124 225 246 97 -50 -239 190 183 -131 -209 -91 256 -335 184 394 -380
4581c80M75l7L07p10J43J68J18l95L78K69l05O5m3l7J7k19M17n4P7j25j52m20
$$ -380 95 58 365 -345 -202 -34 84 -311 67 336 31 96 53 16 33 -186 231 177 254 129 -23 -443
4603d43k23R30k28Q0j47m90L72J13K48j99n0J5j07L70l59M53o57L44O18l61j99
$$ -443 -666 264 36 116 -31 -521 -149 -36 212 13 -37 -22 -129 241 -118 335 -322 22 640 279 80
4624H0L58n3n64J27j29L29j48o04J329j163j02L79J8J53J80p50L28K3J64L57m16
$$ 80 438 385 -179 -52 -181 148 0 -604 725 -438 -540 -161 -143 10 190 -560 -232 -209 -45 312 -104
4645a04l62L96L69l40L38j01n00r0M96o33N77J8j39L40q9j04r5p0M9K5j01k56
$$ -104 -466 -70 299 -41 297 196 -304 -394 102 -531 46 64 -75 265 176 72 -23 -93 -44 -19 -120 -376
4667c76K70J31L99n23m5M64M9j63l45m0J10l82J48L95Ok98K03n0O6O4j08L0J27
$$ -376 -106 25 424 -99 -144 320 369 206 -139 -179 -69 -451 -303 92 98 -200 3 -47 19 83 -25 5 132
4690A32n39O88m44o0M23rl66j79j42N60k5l95M94J19k4n28M56l15J94k64M61l61
$$ 132 -407 281 -163 -223 200 191 -175 -354 -496 64 39 -356 138 257 233 -295 161 -154 40 -224 237 -124
4712a24L05j03N8j85L71n04OJ7Q0p7R9K15M6j75j11j86K86j81K83J28M7lL3J25
$$ -124 181 78 136 -49 322 -182 -176 -159 -79 -156 -57 158 204 29 -82 -268 18 -163 120 248 295 292 325 450
4736D50l43k77L15l75K93R6j49r7j10K91j53j13M0L14j16O1j29m2L6j31L79m20
$$ 450 107 -170 145 -230 63 159 10 -87 -197 94 -59 -172 -132 182 66 127 -2 -44 -8 -139 240 -180
4758a80Kl47Q70j27l43M5K26L05r1Q5j40j19o91P58j97J77M0R4q9L2l13l91P45
$$ -180 -178 -525 345 218 -125 -80 146 451 360 445 305 186 -505 253 56 233 273 367 278 310 -3 -394 351
4781C51N8J36q3o38M58L6m72L45r1k2M86n51m6o7K53O7m02J16J76l75Q4k89K27
$$ 351 409 545 462 -176 282 318 -154 191 100 78 564 13 -33 -100 153 220 -182 -66 110 -265 -181 -470 -243
4804b43K61r9O31j68k37l1n68M64n60P85j83M03l32K6j39L75p67L77j30J62N1
$$ -243 18 -81 550 382 145 114 -454 10 -550 235 52 455 123 149 10 385 -382 -5 -135 27 78
4825G8k39L44j45M22l89l03J91L13l7l53K92n4j53J56K06o40O01k60K88O2r64
$$ 78 -161 183 38 460 71 -232 -41 272 235 -118 174 120 -33 123 329 -311 290 30 318 380 -584
4846e84O13K37l43j63J02N59l3l49J45m90RJ09J29M71l14K02j29m59P29j35k9
$$ -584 29 266 -77 -240 -138 421 388 39 184 -306 -297 -188 -59 412 98 300 171 -288 441 306 277
4867B77r5M5q2l84N21j34J1J23k38M3p0P2m2L23m09O13o35M49Qr9o53r6Q06o4
$$ 277 182 227 145 -239 282 148 159 282 44 87 17 89 47 370 -39 574 -61 388 396 297 -356 -452 354 290
4891B90o42K95M36Rj17k69K78n31k34J75M71k46l36j40O27l69k15O72rj92k18
$$ 290 -352 -57 379 388 271 2 280 -251 -485 -310 161 -85 -421 -561 66 -303 -518 154 145 -47 -265
4912b65L22m19N31k43J80N0k16l08K95l2K54j21K07k6P0j58L20l77n10L00j64
$$ -265 57 -362 169 -74 106 156 -60 -368 -73 -105 149 28 235 209 279 121 441 64 -446 -146 -310
4933c10J84Q38o35m40J17p1R6M0j74J32K02N91j031M22J36m40J96P5M36j096Q45
$$ -310 -126 712 77 -363 -246 -317 -221 -181 -355 -223 -21 570 -461 -39 97 -343 -147 -72 364 -732 113
4954A13K13l5l95L3n55N96K57l29L17k16o23P16l73K52J74j58Q1l33J94n4k35
$$ 113 326 291 -104 -71 -626 -30 227 -102 215 -1 -624 92 -281 -29 145 -13 68 -265 -71 -125 -360
4975c60J95L02k36K75L66n86l12M42j13K26o64L33j9M13j8n22K41l22N91n78L93
$$ -360 -165 137 -99 176 542 -44 -356 86 -27 199 -465 -132 -151 262 244 -278 -37 -359 232 -346 47
4996D7K37q9J16k29M46o89M96m08L67j27N3j67m63L29L28j20k38K00p9Q3q3L43
$$ 47 284 195 311 82 528 -161 335 -73 294 167 220 53 -410 -81 247 127 -111 89 10 93 10 353
5018C53n62L96q0n07L67j30J65l25o05O08K22L39n3J67q90O45k09K19n32O24r7
$$ 353 -209 187 107 -400 -33 -163 2 -323 -928 -320 -98 241 188 355 -535 110 -99 120 -412 212 115
5039A15k69K82l11K92l04m49L75N77m53O3K04m51J12R5k10j14k32Q44P8q5K32
$$ 115 -154 128 -183 109 -195 -644 -269 308 -145 -82 122 -329 -217 -122 -332 -446 -678 166 244 159 391
5060C91l62P6n91j63O21J86m36p4N48Kj97K58l86M52l54J70k80L30M2p4l8o69
$$ 391 29 105 -486 -649 -28 158 -278 -352 196 198 1 259 -127 325 -29 141 -139 191 233 159 121 -548
5082e48Q18k27m23Q35l31q0k94Q10p41J30q0q5PK93k64J42n7l00Q24q37R44m30
$$ -548 270 43 -380 455 124 44 -250 560 -181 -51 -131 -216 -209 84 -180 -38 -95 -395 429 -408 536 106
5104A06l92L99j99j89k27P37j39m00J96M03o45K25K88n77N42n08N19m31K91m5
$$ 106 -286 113 -86 -275 -502 235 96 -304 -108 295 -350 -125 163 -414 128 -380 139 -292 -1 -46
5124d6L23m49N58n96P80o28Q8J70K90n05r8o4l6N18l65J68j2j51j65K49J97j36
$$ -46 277 -172 386 -210 570 -58 30 200 490 -15 -113 -177 -213 305 -60 108 96 -55 -220 29 226 90
5146I0m1k38M18m80N07p15O01p8l68K43j1J3j03J75m3j9J18j8j62K84k1k29M3
$$ 90 49 -189 229 -251 256 -459 142 64 -304 -61 -72 -59 -162 13 -30 -49 69 51 -111 173 152 -77 -34
5169c4k37P6N50r52K21L95K19j67k1J69l80nL80n18L01j05m4K85N24o88o6l21
$$ -34 -271 -195 355 -597 -376 19 238 71 50 219 -161 -166 214 -304 -3 -108 -152 133 657 -31 -97 -418
5191d18O9J4M60R8L69m49n94M67p7j37N40n60k4N48m61J59p4m55J24J42Q7K63
$$ -418 -349 -335 125 223 592 143 -451 16 -61 -198 342 -218 -242 306 -155 4 -70 -525 -401 -259 -172 91
5213I1N4n58N11k66O49p98J62K28n9M6K65j20p63O74O1L9k30K43k64L36l85J30
$$ 91 145 -413 98 -168 481 -317 -155 73 14 60 325 205 -558 116 177 216 -14 229 -35 301 -84 46
5235D6j43k81M97m69L55j63M15l21k46L31m29K17L07LK27N8j27q51O83L3j84M90
$$ 46 -97 -378 119 -350 5 -158 257 -64 -310 21 -408 -191 116 119 346 404 277 -574 109 142 -42 448
5257D48o7r8k61j50L02l48K40r5P1k33k88Q01j0n16K40J15l84pO18m73r4J98J0
$$ 448 381 283 22 -128 174 -174 66 -29 42 -191 -479 322 312 -204 36 151 -233 -240 378 -95 -189 9 19
5280A9J22L0lk11j62M79r19J67M70K3M16m31J61k96J38J89k93K04l3k09O7k55
$$ 19 141 171 168 -43 -205 274 -645 -478 -8 15 431 0 161 -135 3 192 -101 103 70 -139 -72 -327
5302c27R91o65k33m6O1K84m64j59Q09l3j46l04j02K18o44Q06l34K24K36n39N54
$$ -327 664 -1 -234 -280 -219 65 -399 -558 251 218 72 -232 -334 -116 -760 46 -288 -64 172 -367 187
5323A87j26r3j93K11J76k32j86r8N02r4M25k44o82O69k73K90j71K17n98O64j169
$$ 187 61 -32 -225 -14 162 -70 -256 -354 148 54 479 235 -447 222 -51 239 68 285 -313 351 -818
5344h18Q09k85k57K97n3L37m7J28j90j16r7K15j55K78J22o55P08n01o6N08n2j83
$$ -818 -9 -294 -551 -254 -307 30 -17 111 -79 -195 -292 -77 -232 46 168 -487 221 -280 -346 162 110 -73
5366g3L86l31k06N6P76j027K92l73K8L53J04o0L44k14o2J15l79J11K07l90M6M17
$$ -73 313 -18 -224 -168 608 -419 -127 -500 -472 -119 -15 -75 269 55 -7 108 -271 -160 47 -343 -297 120
$$ [...]
8191D45
##END NTUPLES=NMR FID
##END=
