##TITLE=1H ikalashn
DE-75_k
13.11.2024
##JCAMPDX= 6.0         $$ Bruker NMR JCAMP-DX V2.0
##DATA TYPE= NMR FID
##DATA CLASS= NTUPLES
##ORIGIN= UXNMR, Bruker Analytische Messtechnik GmbH
##OWNER= root
$$ TOPSPIN		Version 1.3
$$ 2024-11-13 13:52:00.203 +0400  Irina@DPX200
$$ Compression mode = diff/dup
##.OBSERVE FREQUENCY= 200.131300845
##.OBSERVE NUCLEUS= ^1H
##.DELAY= (6, 6)
##.ACQUISITION MODE= SIMULTANEOUS
##.ACQUISITION SCHEME= undefined
##.AVERAGES= 64
##.DIGITISER RES= 18
##SPECTROMETER/DATA SYSTEM= spect
##.PULSE SEQUENCE= zg
##.SOLVENT NAME= CDCl3
##.SHIFT REFERENCE= INTERNAL, CDCl3, 1, 17.49637
##AUDIT TRAIL= $$ (NUMBER, WHEN, WHO, WHERE, WHAT)
$$ ##TITLE= Audit trail, TOPSPIN		Version 1.3
$$ ##JCAMPDX= 5.01
$$ ##ORIGIN= Bruker BioSpin GmbH
$$ ##OWNER= Irina
$$ $$ F:/spectra/data/iren/nmr/1H/4/audita.txt
$$ ##AUDIT TRAIL=  $$ (NUMBER, WHEN, WHO, WHERE, VERSION, WHAT)
(   1,<2024-11-13 13:51:09.375 +0400>,<Irina>,<DPX200>,<TOPSPIN 1.3>,
      <created by zg
	started at 2024-11-13 13:46:56.234 +0400,
	POWCHK disabled, PULCHK disabled
       configuration hash MD5:
       BE 6D 3F 07 2A EA 11 49 91 17 2B D3 AF B3 58 0D
       data hash MD5: 16K
       1C 3F 68 F1 EE 98 96 7F 7F 54 71 80 7A E0 97 BD>)
$$ ##END=
$$ 
$$ $$ hash MD5
$$ $$ 52 2E 9D 5C 9C CA 83 44 B4 E6 96 E9 DA 71 61 09
##$RELAX= 
##$RELAX= 
##$RELAX= 
##$RELAX= 
##$RELAX= 
##$RELAX= 
##$RELAX= 
##$RELAX= 
##$RELAX= 
$$ Bruker specific parameters
$$ --------------------------
##$DU= <F:/spectra>
##$EXPNO= 4
##$NAME= <1H>
##$PROCNO= 1
##$TYPE= <nmr>
##$USER= <iren>
##$AMP= (0..31)
100 100 100 100 100 100 100 100 100 100 100 100 100 100 100 100 100 100 
100 100 100 100 100 100 100 100 100 100 100 100 100 100 
##$ANAVPT= -1
##$AQSEQ= 0
##$AQ_mod= 1
##$AUNM= <au_zg>
##$AUTOPOS= <>
##$BF1= 200.13
##$BF2= 200.13
##$BF3= 200.13
##$BF4= 200.13
##$BF5= 200.13
##$BF6= 200.13
##$BF7= 200.13
##$BF8= 200.13
##$BYTORDA= 1
##$CFDGTYP= 0
##$CFRGTYP= 5
##$CHEMSTR= <none>
##$CNST= (0..63)
1 1 145 1 1 1 1 1 1 1 1 1 1 1 1 1 1 1 1 1 1 1 1 1 1 1 1 1 1 1 1 1 1 1 
1 1 1 1 1 1 1 1 1 1 1 1 1 1 1 1 1 1 1 1 1 1 1 1 1 1 1 1 1 1 
##$CPDPRG= <>
##$CPDPRG1= <>
##$CPDPRG2= <>
##$CPDPRG3= <>
##$CPDPRG4= <mlev>
##$CPDPRG5= <mlev>
##$CPDPRG6= <mlev>
##$CPDPRG7= <mlev>
##$CPDPRG8= <mlev>
##$CPDPRGB= <>
##$CPDPRGT= <>
##$D= (0..63)
0 2 0 0 0 0 0 0 0 0.06 0 0.03 0 0 0 0 0.0002 0 0 0 0 0 0 0 0 0 0 0 0 0 
0 0 0 0 0 0 0 0 0 0 0 0 0 0 0 0 0 0 0 0 0 0 0 0 0 0 0 0 0 0 0 0 0 0 
##$DATE= 1731491467
##$DBL= (0..7)
120 120 120 120 120 120 120 120 
##$DBP= (0..7)
150 150 150 150 150 150 150 150 
##$DBP07= 0
##$DBPNAM0= <>
##$DBPNAM1= <>
##$DBPNAM2= <>
##$DBPNAM3= <>
##$DBPNAM4= <>
##$DBPNAM5= <>
##$DBPNAM6= <>
##$DBPNAM7= <>
##$DBPOAL= (0..7)
0.5 0.5 0.5 0.5 0.5 0.5 0.5 0.5 
##$DBPOFFS= (0..7)
0 0 0 0 0 0 0 0 
##$DE= 6
##$DECBNUC= <off>
##$DECIM= 32
##$DECNUC= <off>
##$DECSTAT= 4
##$DIGMOD= 1
##$DIGTYP= 9
##$DL= (0..7)
0 120 120 120 120 120 120 120 
##$DP= (0..7)
150 150 150 150 150 150 150 150 
##$DP07= 0
##$DPNAME0= <>
$$ [...]
##$SW= 21.9926040160658
##$SWIBOX= (0..15)
0 0 2 0 0 0 0 0 0 0 0 0 0 0 0 0 
##$SW_h= 4401.40845070422
##$TD= 16384
##$TD0= 1
##$TE= 300
##$TE2= 300
##$TE3= 300
##$TEG= 300
##$TL= (0..7)
0 120 120 120 120 120 120 120 
##$TP= (0..7)
150 150 150 150 150 150 150 150 
##$TP07= 0
##$TPNAME0= <>
##$TPNAME1= <>
##$TPNAME2= <>
##$TPNAME3= <>
##$TPNAME4= <>
##$TPNAME5= <>
##$TPNAME6= <>
##$TPNAME7= <>
##$TPOAL= (0..7)
0.5 0.5 0.5 0.5 0.5 0.5 0.5 0.5 
##$TPOFFS= (0..7)
0 0 0 0 0 0 0 0 
##$TUNHIN= 0
##$TUNHOUT= 0
##$TUNXOUT= 0
##$USERA1= <user>
##$USERA2= <user>
##$USERA3= <user>
##$USERA4= <user>
##$USERA5= <user>
##$V9= 5
##$VALIST= <valist>
##$VCLIST= <CCCCCCCCCCCCCCC>
##$VD= 0
##$VDLIST= <DDDDDDDDDDDDDDD>
##$VPLIST= <PPPPPPPPPPPPPPP>
##$VTLIST= <TTTTTTTTTTTTTTT>
##$WBST= 1024
##$WBSW= 25
##$XGAIN= (0..3)
0 0 0 0 
##$XL= 0
##$YL= 0
##$YMAX_a= 1593603
##$YMIN_a= -675896
##$ZGOPTNS= <>
##$ZL1= 120
##$ZL2= 120
##$ZL3= 120
##$ZL4= 120
##$ABSF1= 10
##$ABSF2= 0
##$ABSG= 5
##$ABSL= 3
##$ALPHA= 0
##$AQORDER= 0
##$ASSFAC= 0
##$ASSFACI= 0
##$ASSFACX= 0
##$ASSWID= 0
##$AUNMP= <proc_1d>
##$AXLEFT= 0
##$AXRIGHT= 0
##$AXTYPE= 0
##$AXUNIT= <>
##$AZFE= 0.1
##$AZFW= 0.1
##$BCFW= 1
##$BC_mod= 2
##$BYTORDP= 1
##$COROFFS= 0
##$CY= 7568.61572265625
##$DATMOD= 1
##$DC= 2
##$DFILT= <>
##$DTYPP= 0
##$F1P= 17.9538593292236
##$F2P= -4.03888763876832
##$FCOR= 0.5
##$FTSIZE= 32768
##$FT_mod= 4
##$GAMMA= 1
##$GB= 1
##$INTBC= 1
##$INTSCL= 1
##$ISEN= 128
##$LB= 0.08
##$LEV0= 0
##$LPBIN= 0
##$MAXI= 945.577
##$MC2= 0
##$MEAN= 0
##$ME_mod= 0
##$MI= -402.1523
##$NCOEF= 0
##$NC_proc= 0
##$NLEV= 6
##$NOISF1= 8.587773
##$NOISF2= 6.764455
##$NSP= 1
##$NTH_PI= 0
##$NZP= 0
##$OFFSET= 17.49637
##$PC= 1
##$PHC0= 114.3601
##$PHC1= 14.01638
##$PH_mod= 0
##$PKNL= yes
##$PPARMOD= 0
##$PPDIAG= 0
##$PPIPTYP= 0
##$PPMPNUM= 100
##$PPRESOL= 1
##$PSCAL= 0
##$PSIGN= 0
##$REVERSE= no
##$SF= 200.13
##$SI= 32768
##$SIGF1= 18.5376
##$SIGF2= -6.396296
##$SINO= 400
##$SIOLD= 32768
##$SREGLST= <1H.CDCl3>
##$SSB= 3
##$STSI= 0
##$STSR= 0
##$SW_p= 4401.40845070422
##$SYMM= 0
##$S_DEV= 0
##$TDeff= 0
##$TDoff= 0
##$TI= <>
##$TILT= no
##$TM1= 0
##$TM2= 0
##$TOPLEV= 0
##$USERP1= <user>
##$USERP2= <user>
##$USERP3= <user>
##$USERP4= <user>
##$USERP5= <user>
##$WDW= 1
##$XDIM= 8192
##$YMAX_p= 0
##$YMIN_p= 0
$$ End of Bruker specific parameters
$$ ---------------------------------
##NTUPLES= NMR FID
##VAR_NAME=  TIME,          FID/REAL,        FID/IMAG
##SYMBOL=    X,             R,               I
##VAR_TYPE=  INDEPENDENT,   DEPENDENT,       DEPENDENT
##VAR_FORM=  AFFN,          ASDF,            ASDF
##VAR_DIM=   8192,          8192,            8192
##UNITS=     SECONDS,       ARBITRARY UNITS, ARBITRARY UNITS
##FACTOR=    0.0002272,     1,               1
##FIRST=     0,             0,               0
##LAST=      1.8609952,     -18,             -209
##MIN=       0,             -675896,         -675896
##MAX=       1.8609952,     1593603,         1593603
$$ Real data points
##PAGE= N=1
##DATA TABLE= (X++(R..R)), XYDATA
$$ [...]
2296i98K77K9L19pj12k6Q7L03K54L46J13M57l84J6l52J3Q5n9K42K5m85O3n70j005
2320a369O23o3K41J99l99j93l3N73J49R3k24Q50J64k63j45J23K86K61K30j48k91
2341F64m38J85j28p78L45j7K82Q2q37k59K89j15K16Q1j25J03O44nJ22q3m9K20
2363C99O34k32p85M42k20O70n69J75m65k7o4k90k67N5P3J66r9k0k93M41JR5o17
2386g97P20L17J51N42m64j67J57O19l64m66M30k4l2q16J66k63k00J67J02l3l15
2407e70qk26P38m53j54R61p7j40j37J09N27L50K9o44J76L12l67k45k96RJ32L4
2429F0k86p4n39J69K74l16r0N55l33P84l26k20N94J46J69j54l27L04K53K10p45
2450A08JL14k16R0n93J66l38Q30r65l0j68J50M03k67L9m5L34L43j85m6k2P65J93
$$ plain form
2296 -998 -721 -692 -373 -380 -492 -518 -431 -128 126 472 585 1042 658 674 322 335 420 361 603 628 143 206 -364 -1369
2320 -1369 -746 -809 -568 -369 -768 -961 -994 -421 -272 -179 -403 447 611 348 203 326 612 873 1103 955 664
2341 664 226 411 283 -495 -150 -167 115 197 -640 -899 -610 -725 -509 -428 -553 -450 194 189 311 228 179 399
2363 399 1033 801 16 458 238 908 339 514 49 22 -42 -332 -599 -544 -471 -305 -404 -424 -717 -276 -275 -180 -797
2386 -797 -77 240 391 933 469 302 459 1078 714 248 678 654 622 -194 -28 -291 -491 -324 -222 -255 -570
2407 -570 -578 -804 -66 -519 -673 288 211 71 -66 43 570 920 949 305 481 793 426 181 -115 -106 26 60
2429 60 -226 -300 -839 -670 -396 -712 -802 -247 -580 204 -122 -342 252 398 567 413 86 390 643 853 108
2450 108 109 423 207 297 -296 -130 -468 362 -603 -633 -801 -651 -248 -515 -476 -521 -187 156 -29 -75 -97 668 861
2473H61k5l54k88K05M35k04m79l32j51Q11j114J07N2K22k51k74M94l30q3M54l27
2494e71L4R6j58L20J108p38J86M71M25n75M6l6n67J57l6J19k11j87l15n7R4l41
2516g36J29j67K38l81O73l44P67m0m75P59j12M53k6p00K42O08n23P2k88j24Qm4
2538a1R0q07R8N23l74J79n19lP16m1j8k8L20k63K96j24K68J93K74J30K67o22k1
2561E23K9j62l44k44L05n82l25J80J02M00p7o74J69J63j23M46L73j87J24J05n5
2582A46M82j69j27O02p03L42j16k73l33J06j8r5K06k99M41q56L76K23m63K10k21
2603e39M20l35K90M67r8J72K76l91O93m84M17m34n57N72l02j96O6m83N66k66k67
2624d13Rj25J23J10l31p0K82M05K3j69M77m83P06l07N1J89k26M92j95j66k04J43
$$ plain form
2473 861 836 482 194 399 834 630 151 -181 -332 479 -635 -528 -476 -254 -505 -779 -285 -615 -698 -244 -571
2494 -571 -537 -441 -599 -279 829 91 277 748 1173 598 644 608 41 198 162 281 70 -117 -432 -489 -395 -736
2516 -736 -607 -774 -536 -917 -244 -588 179 139 -336 423 311 764 738 38 280 888 365 437 149 25 33 -11
2538 -11 79 -728 -630 -107 -481 -302 -821 -824 -108 -149 -167 -195 125 -138 158 34 302 495 769 899 1166 544 523
2561 523 552 390 46 -198 107 -475 -800 -620 -518 -118 -195 -869 -700 -537 -660 -214 159 -28 96 201 146
2582 146 628 459 332 934 231 573 457 184 -149 -43 -61 -156 50 -249 192 -664 -288 -65 -528 -318 -539
2603 -539 -119 -454 -164 303 205 377 653 262 955 471 888 454 -103 469 167 -29 37 -446 120 -146 -413
2624 -413 -404 -529 -406 -296 -627 -697 -415 -10 13 -156 321 -162 544 237 288 477 251 743 548 382 178 321
2646C21j92K3k03J40m82q6J84R4n12K22N7J68J43M6J06m0K30K57Ro89J108n01
2668D03J79j27L87q85K69L11q00J52k01j46j55M05l75K61k45J16j78L0P63m56
2688b92N29j07K85j4p42M68J02N47K63p53J12m6j98J31k73j6l67j36K35j01m52
2709h25o9J3L67P78j08k51k59L10M69n33N41L59j0j16k41k74P8m85K38M14o98
2730c02j52l74O14m01R9K01l26L02p5N77p9j37L15k31O11m61J29K36K0n23Q85
2751I28k12p32O95m59j50k96j94N34l99q4k1J45l3l60Q1j78Q09o48L73L22k80
2772a59M84j79l17M18L52m24L33L24o69q3J43J25q38m2K65M30p18Q4M41m22L41
2793a11p30Q4P74m04M39n7J32L76K6M82m70j99P50n80o5J8j37l43j9K78p32L87
$$ plain form
2646 321 129 152 -51 89 -393 -479 -295 -201 -713 -491 -434 -266 -123 -77 29 -11 219 476 485 -204 904 403
2668 403 582 455 842 -43 226 537 -263 -111 -312 -458 -613 -208 -583 -322 -567 -451 -629 -599 164 -292
2688 -292 237 130 415 401 -341 127 229 776 1039 286 398 352 154 285 12 -4 -371 -507 -272 -373 -825
2709 -825 -894 -881 -514 264 156 -95 -354 -44 425 -108 433 792 782 666 425 151 229 -256 -18 396 -302
2730 -302 -454 -828 -214 -615 -516 -315 -641 -339 -414 163 84 -53 262 31 642 181 310 546 566 43 928
2751 928 716 -16 679 220 70 -226 -420 114 -285 -369 -390 -245 -278 -638 -557 -735 74 -574 -201 121 -159
2772 -159 325 146 -171 247 599 175 508 832 163 80 223 348 -490 -532 -267 163 -555 -471 -30 -452 -111
2793 -111 -841 -757 17 -387 52 -5 127 503 529 1011 541 342 1092 512 447 465 328 -15 -34 244 -488 -101
2815a01j06o1n60N42j20r1J98R2l02o4O63L73k60l23L62L74l48J30K59j41l52
2836A64L49p02M34m7o51N73n92J49M83o69N32p42L44k47N9J75N91l0QK16L23o92
2858B8J81r1N95j9l56m74K20O60r43m96K89n57Q25k83j29j3j32K37Q7pj41K69
2880b50O2M23j71K59j52K43p3O1q7K04o05K91K59o17M66o42j52O4q45P96Qk40
2902f98L12J69j86k8O36m50J26R7M93R0l09L93j59j94L23m08j16n4L54o07J9m74
2924f71L88J14l9K2o29LK55k51O29m21M44L00M94k49j21J67o17K04J28q8J37j93
2946FL69k01n9j34m22K22K15j54J20n53L28o3J86k12j34N43o0J06o4M67K00k25
2968D81k17M03J00j8J50n33j88l3j78J48k92k61J41m37L07m63R58n24O08p58Q61
$$ plain form
2815 -101 -207 -268 -828 -286 -406 -497 -299 -207 -509 -573 90 463 203 -120 242 616 268 398 657 516 164
2836 164 513 -189 245 198 -453 120 -472 -323 160 -509 23 -719 -375 -622 -563 -388 203 173 181 397 720 28
2858 28 209 118 713 694 338 -136 84 744 -199 -695 -406 -963 -138 -421 -550 -563 -695 -458 -371 -378 -519 -250
2880 -250 -188 235 64 323 171 414 341 402 315 519 -86 205 464 -153 313 -329 -481 -417 -1262 -466 -458 -698
2902 -698 -386 -217 -403 -431 205 -245 -119 -22 471 561 252 645 486 292 615 207 91 37 391 -216 -197 -671
2924 -671 -283 -169 -208 -186 -815 -812 -557 -808 -179 -600 -156 144 638 389 268 435 -182 22 150 62 199 6
2946 6 375 174 115 -19 -441 -219 -4 -158 -38 -591 -263 -326 -140 -352 -486 57 -3 103 39 506 706 481
2968 481 264 667 767 749 899 366 178 145 -33 115 -177 -438 -297 -734 -427 -890 68 -456 152 -606 255
2989B55o31L37L49J97o66M92j70P69j67r94M30R7j15K62l30k98L6l43L7K03M5
3010b05j36l86L16l30K8O17J76L88k75k2k79M30L64l84k06J85L34l56M05l01l43
3031B0k04M7J37o32K27K57O04o21m40L9L09o3L09J06n55R47L7m59m7N32K98q60
3053a2L38J3k16k26L52R8k55Rm29j27L19j04p5K84m64L27K22o24k32O88O39j63
3075C62K26J86R3k30R4m78r4J58K45j90p12O28m79l34J94o2K19n42O79j53j33
3096c23l14J3P27P3m8J79L41l58J07O0J83j07N4q16L75Q5n56K67n9L31m95M10
3118A29m82k32l30P16l05M95j49K48j05O04p80L8J66M49l4J43j36r6K72o5j29
3139D17n34O37m11j58K79m95p1L42l91P5K4o6k56O27k40M0J15N10p15P75N8k25
$$ plain form
2989 255 -376 -39 310 507 -159 333 163 932 765 -229 201 298 183 445 115 -183 -147 -490 -453 -250 -205
3010 -205 -341 -727 -411 -741 -713 -96 80 468 193 171 -108 322 686 302 96 281 615 259 664 363 20
3031 20 -184 -137 0 -632 -405 -148 456 -165 -605 -566 -257 -320 -11 95 -460 487 524 65 18 550 848 -12
3053 -12 326 339 123 -103 249 347 92 101 -328 -455 -136 -240 -315 -31 -495 -168 54 -570 -802 -114 525 362
3075 362 588 774 867 637 731 253 159 317 562 372 -340 288 -191 -525 -331 -393 -174 -716 -37 -190 -323
3096 -323 -637 -624 103 176 128 307 648 290 397 457 640 533 587 -229 146 231 -325 -58 -117 214 -281 129
3118 129 -353 -585 -915 -199 -504 -9 -158 90 -15 589 -191 -153 13 462 428 571 435 339 611 546 417
3139 417 -117 520 109 -49 230 -265 -336 6 -385 -310 -286 -352 -608 19 -221 -181 -66 444 -271 504 562 337
3161C37N18m4n87J16n9J65j65j11l8k43p0J07J84o90M12K73n73Q2j80L81k8O28
3183D15n97r3K56J68j70M36K75l81O60m69J07l60K6p03M40j91P9l32j27M39q37
3204i59P20K57k83J95J30n8J60j93L47q5m9p6N69K44n36m83k8N06K27r18k24J32
3226d05M07j70N94j400L87K38L36J79o30j35M30L65k02j8L56Pj49J81O3j75j21
3247A38J07m43M5J94j39Nl67J87J08k4J99j55M1p7k77L42J12J9j49K5M57n47N98
3270C99n71K61K33l13m5J84k63J70j93m2n2rQ2j57k47j55L29L86k37K10p6m68
3292e74R46j83k50L62m36K78O72l44k49L60k37j55q5K05Kl19r39K78M49k13Q25
3313C93p60l87J15L38Nj32P10l3m26K86k98M64Q6n94M23j28j5p7K88J92o29j22
$$ plain form
3161 337 855 811 224 340 281 446 281 170 132 -111 -181 -74 110 -580 -168 105 -468 -386 -566 -185 -213 415
3183 415 -182 -275 -19 149 -21 415 690 309 969 500 607 247 273 -430 10 -181 -102 -434 -561 -122 -959
3204 -959 -239 18 -265 -70 60 2 162 -31 316 231 182 106 675 919 383 -100 -128 378 605 -313 -537 -405
3226 -405 2 -168 426 -974 -587 -349 -13 166 -464 -599 -169 196 -6 -24 332 339 190 371 434 259 138
3247 138 245 -198 -153 41 -98 -93 -460 -273 -165 -189 10 -145 -104 -181 -458 -116 -4 15 -134 -109 348 -199 399
3270 399 -172 89 322 9 -36 148 -115 55 -138 -180 -232 -241 -159 -316 -563 -718 -389 -3 -240 -30 -106 -574
3292 -574 372 189 -61 301 -135 143 815 471 222 582 345 190 105 310 312 -7 -946 -668 -219 -432 393
3313 393 -367 -754 -639 -301 -296 -428 282 249 -177 109 -189 275 361 -233 190 62 47 -30 258 450 -179 -301
3335c01N94l75j35p6K54p9m67P19l18l70L09L51nj76K93K1j78M04j15L79m76O1
3357C14O1k94J69m75M58l0l19m48K43L85n32K8J19M3k7J02J32j42M13O4K82J61
3379G07p39M02j28j69M93k39o02J086p70k12N7j93k47Q25k83L91n92O0J35j40
3399a58O1j45M84r9l63K58J90p4J72j51L01l76J34j95m66J42J41J69k67m54K53
3420d43N13m08M48p66J48j38K94R9n6j23N44J15j5K55l9k07k4J40J87p94J42P
3442a21M42m29J5k48PL66m05k86K72J38L88q14O26M2q6P88p23K46j86J22J39O6
3464C59j40J90M70m46m40K33J87m12QJN3j32L01j08j9n82k66K82Q2N26l66N30
3486C11o57L68l46N11K65m32P4j53K40J51l44L87j27l41R5l58r4P7K3j44K60j48
$$ plain form
3335 -301 293 -82 -217 -293 -39 -118 -585 134 -184 -554 -245 106 101 -75 218 239 61 465 350 729 253 314
3357 314 375 81 250 -225 233 203 -116 -564 -321 64 -468 -440 -321 -278 -305 -203 -71 -213 200 264 546 707
3379 707 -32 370 242 73 566 327 -275 811 41 -171 -114 -307 -554 271 -12 379 -213 -153 -18 -158
3399 -158 -97 -242 242 143 -220 38 228 154 326 175 476 100 234 39 -427 -285 -144 25 -242 -696 -443
3420 -443 70 -338 110 -656 -508 -646 -352 -253 -309 -432 112 227 212 467 428 221 197 337 524 -270 -128 -121
3442 -121 321 -108 -93 -341 -334 32 -373 -659 -387 -249 139 -675 -49 -7 -93 695 -28 218 32 154 293 359
3464 359 219 409 879 433 -7 226 413 1 9 10 63 -69 232 124 105 -477 -743 -461 -379 147 -219 311
3486 311 -346 22 -324 187 452 20 94 -59 181 332 -12 375 248 -93 2 -356 -450 -373 -350 -494 -234 -382
3508c82O59o86O82j53j04j98L26K6K98j9j90J16M0j61m3R0j07On56J46p8J23J5
3531a50j04L13l03l87Q5M99O3m48N52k06K06k57M22j22oM12o37K70o3k19K73M9
3553B42j03m51N1L26j93n0J93j86r9J98k14o8L13P5J10j08N8l39P41m5k90Q6J92
3576D39n18M81l62l79P59q99J41j73L31j23M1N3L71q79P32k35R8L1K06J61j47
3597A29j47J46J03O7J48q32Q15m72J19M21k09K1Q4l27r3j07j49n50P28j4Q7J14
3619H2k70J11J42k99M08j09J16J37L48p56m57O92R6q4k2m73M14l60N4P8J40j06
3641a18j05J17r2j68m8P29o29L53N1k8J27J84m74l62Q09l75K05l8J79m33j8k4
3663a58M3J19q2k64L42k89q9L59L1m26K1L76oMJ80J27k96J41N22l37m91L45K30
$$ plain form
3508 -382 277 -409 273 120 16 -182 144 170 468 449 259 375 415 254 211 301 194 200 -356 -210 -288 -165 -150
3531 -150 -254 59 -244 -631 -546 -47 16 -432 120 -86 120 -137 285 163 157 569 -68 202 139 -80 193 242
3553 242 139 -312 -261 65 -128 -178 15 -171 -270 -72 -286 -354 -41 34 144 36 94 -245 496 451 161 247 439
3576 439 -79 402 40 -339 420 -479 -338 -511 -180 -303 -262 -209 162 -717 15 -220 -122 -91 115 276 129
3597 129 -18 128 231 298 446 -386 429 -43 76 497 288 309 393 66 -27 -134 -283 -833 -105 -119 -32 82
3619 82 -188 -77 65 -234 174 65 181 318 666 -90 -547 145 241 157 135 -338 76 -284 -230 -152 -12 -118
3641 -118 -223 -106 -198 -366 -414 315 -314 39 90 62 189 373 -101 -463 346 -29 176 138 317 -116 -134 -158
3663 -158 -115 4 -78 -342 0 -289 -378 -19 12 -414 -393 -17 -23 -19 161 288 -8 133 655 318 -173 172 402
3686D02k05R5k79J36k32K36l64J99l01K2p5J76j43l1N05k18k11L35k58M82l5K2
3708B58P3J01M6k70j68O10pm82l21L40q8J19k50J44o4n88L40Q4j65k84J62N09
3730I9ql2Q9L66n62J21L33j93l07k44O48q0m48n2M16j91J2l07J80m66K34M2L32
3753a8l80j1K8K15K52l91N11o81O91K72l74J50P2J74m75P2o7J22P0j31l75M42
3775A68k0k79k01j04L71J17j67O5j43K21L16j67l08J93m24J74L72l21J93J80J80
3796D16k14P33q51j36o0o3m05Q08m13j61m1J83j31J79J69j13l71O40m08L26j61
3817g4J24j13K59J15l03J47n5J23j63R8k38L45l00j46K29m26J27k16L58j19l05
3838e33K94k73J44L05N79l24l26L85o53N47O8j15J95k00n3nJ3K05n96L51j60j34
$$ plain form
3686 402 197 292 13 149 -83 153 -211 -12 -313 -291 -366 -190 -333 -364 141 -77 -288 47 -211 271 236 258
3708 258 331 432 478 208 40 650 643 161 -160 180 92 211 -39 105 41 -547 -207 -123 -288 -572 -410 99
3730 99 91 59 148 514 -48 73 406 213 -94 -338 310 230 -218 -270 146 -45 -33 -340 -160 -626 -392 -350 -18
3753 -18 -398 -409 -381 -166 86 -305 206 -475 216 488 114 264 336 510 35 107 40 162 232 101 -274 168
3775 168 148 -131 -332 -436 -65 52 -115 -50 -193 28 344 177 -131 62 -362 -188 184 -137 56 236 416
3796 416 202 935 84 -52 -112 -175 -580 228 -185 -346 -387 -204 -335 -156 13 -100 -471 169 -239 87 -74
3817 -74 50 -63 196 311 8 155 100 223 60 158 -80 265 -35 -181 48 -378 -251 -467 -109 -228 -533
3838 -533 -239 -512 -368 -63 516 192 -134 251 -402 145 213 98 293 93 40 35 48 253 -343 8 -152 -286
3860b86j21M1M16j33J0J87J15j51L37j73j34K25j72l26M75n06L30J98o24K03r6
3881a85O72j71o53RK17J14m09q8K20J64l28J99j26P8K4J74k84l0M08M11k87J85
3903C14k40j38J36K05N59q95L47l77J84P4R7o38J90j46N7J77m2l0M9P9j4J25J77
3926B50n8O4j87N4l01K47j2m1L54r3r89K75K01O8m67M25J15j20L82k88K1k12J71
3949a41j3k27O39J20p08M18l49N04j01l55lJ79O5L3j51m73P10k47j07k71K70p0
3971b78R8N8J71K99P6o60J38L70n20N91l74J30k62K49n34O44K92j36m32j73M38
3992A85L77p71j47N50l87k68L85J01m95L16k48P58r12M74OL47j04K15k04K14k76
4013A16M44o92K3K13K17o09l4K47p7N37l32L12o49L92j41m43N48n22L71M70l66
$$ plain form
3860 -286 -407 -366 50 -83 -73 114 229 78 415 242 108 333 161 -165 310 -196 134 332 -292 -89 -185
3881 -185 487 316 -337 -328 -111 3 -406 -494 -274 -110 -438 -239 -365 -287 -263 -89 -373 -403 5 416 129 314
3903 314 74 -64 72 277 836 -59 288 -89 95 169 266 -372 -182 -328 -271 -94 -136 -166 -117 -38 -52 73 250
3926 250 192 256 69 123 -178 69 57 16 370 277 -712 -437 -236 -168 -635 -210 -95 -215 167 -121 -100 -312 -141
3949 -141 -154 -381 258 378 -330 88 -261 243 142 -213 -216 -37 28 61 -90 -563 147 -100 -207 -478 -208 -278
3971 -278 -180 -122 49 348 424 -236 -98 272 -248 343 -31 99 -163 86 -448 196 488 352 -80 -253 185
3992 185 562 -209 -356 194 -193 -461 -76 25 -470 -154 -402 356 -556 -82 -76 271 167 382 178 392 116
4013 116 560 -132 -109 104 321 -288 -322 -75 -152 385 53 365 -284 108 -33 -476 72 -450 -79 391 25
4034B5j75N95j17j23p3k2m63M10M52m79K48m22L87l18OJ70l76L3n9k16J61J89
4056a67P9J9Op4K07J68l2J6Q6j20p3n0J70om10L55l26k7L26l03k03j15K79j21
4080c16M24L2n87K65l71O05l58N39r6m31J36N47o38N56J38l89J89k49K0J99o1
4101A54n08n2O16k70M87o54J31j00L27m55o7J93k83P52j68J55j21j10L31p3r0
4122A95j64k84K51M0j67L42KJ41m26O7p89P67j80k22J69N05R0j10j17m63R4K27
4144c2j77K2K23O5K70k52j43k48M0q4J05O1N84p23l87P08l92K14j34L43l59J72
4166a24M77l98J90k12l44J11L70m34Q93O8O3q90L11l42l0J14O52q50K37l08M63
4187A7q1l01O60q58O19n62k95P34J38J52o08M44K64l82J2J23K07q9j47K7j79n
$$ plain form
4034 25 -150 445 328 205 132 110 -353 57 509 30 278 -144 243 -75 -69 101 -275 -242 -301 -517 -356 -167
4056 -167 -88 -69 -63 -137 70 238 206 222 308 188 115 65 235 229 -181 174 -152 -179 147 -156 -359 -474 -195 -316
4080 -316 108 140 -447 -182 -553 52 -306 233 137 -294 -158 389 -249 307 445 56 245 -4 16 215 154
4101 154 -354 -406 210 -60 427 -227 -96 -196 131 -324 -391 -198 -481 271 103 258 137 27 358 285 195
4122 195 31 -253 -2 38 -129 213 215 356 -70 -3 -792 -25 -205 -427 -258 247 337 227 110 -353 -259 -32
4144 -32 -209 -187 36 101 371 119 -24 -272 -232 -316 -211 -150 434 -289 -676 32 -360 -146 -280 63 -296 -124
4166 -124 353 -45 145 -67 -411 -300 70 -364 529 597 660 -230 81 -261 -291 -177 475 -375 -138 -446 17
4187 17 -64 -365 295 -563 56 -506 -801 -67 71 223 -385 59 323 -59 -47 76 283 194 47 74 -105 -110
4209a10J23J33J38o35J11J01L62l59ml84O30l72J9M99nk7l52M71q36N42L80l95
4231C0J59l14N45n97L10k4l53L78j57k79O69l27j42K74m15L92m34L49kn51K03
4252b86O5K24k92l42N73J32J32k96K1M08L09n71n9m1j90k80O56J25o8j86L0mm04
4275c44K45L0J11J42j80l08N42K1K19n66Q8L9K79j07K65m09R4j33L00n08J20j61
4297b21K42P7j43m33M3M48m0J35k79n6J26Q7l8L98m36J76k45k75N67j40J22L6
4319A51K23q55R75p66K36l15N64n60l3P48n00K81k80L88k96M0L82k42j06K90k75
4340E0j88N49p11N40o11O60j06J43j7n75L54k98J14l68k08Q93k61j2J68k74M87
4361C29j96l89M56k65j52K07L36k58K40l42k0K85J45j62l26q8N08n60K35O45j105
$$ plain form
4209 -110 13 146 284 -351 -240 -139 223 -136 -140 -524 106 -266 -247 252 247 220 -132 339 -497 45 425 30
4231 30 189 -125 420 -177 133 109 -244 134 -23 -302 367 40 -102 172 -243 149 -285 64 62 -489 -286
4252 -286 -221 3 -289 -631 -58 74 206 -90 -69 339 648 77 18 -23 -213 -493 163 288 220 34 64 60 -344
4275 -344 -99 -69 42 184 4 -304 238 259 478 -88 0 39 318 211 476 67 161 28 328 -180 -60 -221
4297 -221 21 98 -45 -478 -435 13 -27 108 -171 -227 -101 -14 -52 346 -90 86 -159 -434 133 -7 115 151
4319 151 374 -481 494 -272 -36 -351 213 -347 -380 368 -132 149 -131 257 -39 1 383 141 35 325 50
4340 50 -138 411 -300 240 -371 289 183 326 309 -266 88 -210 -96 -464 -672 221 -40 -52 116 -158 329
4361 329 133 -256 200 -65 -217 -10 326 68 308 -34 -54 231 376 214 -112 -200 308 -252 -17 628 -477
4382d77P59j89j40j57K7Q4J27jqj59M65n34L71j70N3m64P22k60M10l62k99K97
4404I5J39k07k94j65P32j70O6n23K00M6k84K55j8M48P0j91o9k31J0L0L34l46J06
4427C3L22m50N34m30k92l12O51j12L48o09J76J85K77q17P83r34J55O91k58j76
4447b35N86O8k61L8K61m48K85R9k17o10R69l48m82J88k28L28p4N85q71K00J74
4468GK28p86K45m58P16k73M73J05l26j28J24K49l5J92r0J59m33K01n68K59L33
4489A94J0rr64M10K30l62N06k27k34M60l83M42j51N50j22l33k46L10r6R2l77M94
4511A94k53P1j06K06l88j61M87k76k79M41N75k21m12j43J53M9j65L94n5Jk9K28
4533C11m80L16m87N84p9k16J72n59O90k19m1l87K74M02k74l37N01j46j88L2M3
$$ plain form
4382 -477 282 93 -47 -204 -177 -93 34 33 25 -134 331 -203 168 -2 51 -413 309 49 459 97 -202 95
4404 95 234 27 -267 -432 300 130 196 -327 -127 -81 -365 -110 -128 320 390 199 130 -101 -91 -61 273 -73 33
4427 33 355 -95 439 9 -283 -595 56 -56 292 -317 -141 44 321 -496 287 -647 -492 199 -59 -235
4447 -235 351 419 158 196 457 9 294 393 176 -434 535 187 -295 -107 -335 -7 -81 504 -367 -167 7
4468 7 235 -551 -306 -764 -48 -321 152 257 -69 -197 -73 176 141 333 243 402 -31 170 -398 -139 194
4489 194 204 195 -769 -359 -129 -491 15 -212 -446 14 -369 73 -78 472 350 17 -229 81 -15 77 -300 194
4511 194 -59 12 -94 112 -276 -437 50 -226 -505 -64 511 290 -122 -265 -112 -63 -228 166 111 112 83 311
4533 311 -169 147 -340 244 165 -51 121 -438 252 33 -8 -395 -121 281 7 -330 171 25 -163 -131 -88
4554h8L36n81K37K44n6R0m54j10M07K24j82r5J04l00K5K79j73K59J01l87j71P05
4576D14q88N38k48K38J67o5k35K49k10J16K16o11N10m8m44J55k03P16l13N19q15
4597b42N19m23j39M58m79J86K59l71j19M60J74o42L0L71l09N03J07k86j8J95j31
4618A03l38J095r33O25n36m68J66L69P7l4n43M78J81m8j42j00K60m4K00n63kN95
4640C98o40N72k65O1m30O56n23J78l7l18Q80n25K5P1k42M45O9j57j22o3Nk25J01
4663h6j2K82n5j88M78l57J74k62m89L54M42j07j83j41N28m41k97J6M49Q2n6J72
4685C03l10n31O36m60J69M90oJ58k23J47j41j19q5QJ14N32m87k0k61N65k59l87
4707a67J39r5L81q09M56k99J79K62n7j0K83m10k27J6J96K13m15K08M3P51l00j73
$$ plain form
4554 -88 248 -333 -96 148 92 182 -272 -382 25 249 67 -28 76 -224 -199 80 -93 166 267 -120 -291 414
4576 414 -474 64 -184 54 221 156 -79 170 -40 76 292 -319 191 143 -301 -146 -349 367 54 573 -242
4597 -242 277 -146 -285 173 -306 -120 139 -232 -351 109 283 -359 -329 42 -267 236 343 57 39 234 103
4618 103 -235 860 -73 552 16 -452 -286 83 160 126 -417 61 242 194 52 -48 212 168 368 -195 -197 398
4640 398 -242 330 65 126 -304 352 -171 7 -30 -348 532 7 32 103 -139 306 375 218 96 33 38 -187 -86
4663 -86 -98 184 129 -59 419 62 236 -26 -515 -161 281 174 -9 -150 378 -63 -360 -344 105 187 131 303
4685 303 -7 -538 98 -362 -193 297 291 449 226 373 232 113 28 36 150 682 195 175 -86 479 220 -167
4707 -167 -28 -123 258 -551 -95 -394 -215 47 -10 -20 263 -147 -374 -358 -162 51 -364 -156 -113 638 338 165
4729A65K90o21j08N42k42k46N52k97l77r2N18k77N2k46Q84l66k77M53o09O55m55
4750a02K22k25K05L75J23n96K99k89J70J4j35l71J30j12P34L40j093N65m15j49
4770c10O05p26K71o24J275n63N3l21L92O1J2p8j70j3L68jp26M12M1j95K42J70
4792A75k33j49Q5K66m33l13N88n1m04J98J087j041K74o0K45n34L44K07l35L7l60
4813d07M76n97O99k49K50n05N69j82J34k88L95o13J3K59K12L12k15j85l14L02
4833F6K41l49J58K71m53r3N10o6k33P1n8K04Q3k42O9n8n3l49N73n41K65R4k29
4856a19j63J25N2J54Q6K13m01K08l28K76j45O02j052M00K26J74Q2Rl31M66p85
4877b51J29k34L94N97n79J03l45L71K54n39m54M37J07l2P73m20l28k47M4k0L00
$$ plain form
4729 165 455 -166 -274 268 26 -220 332 35 -342 -434 84 -193 -141 -387 497 131 -146 307 -302 353 -102
4750 -102 120 -105 100 475 598 2 301 12 182 196 61 -310 -180 -292 442 782 -311 254 -161 -310
4770 -310 295 -431 -160 -784 491 -72 -19 -340 52 113 125 47 -123 -136 232 231 -495 -83 -42 -237 5 175
4792 175 -58 -207 -122 144 -289 -602 -14 -65 -469 -271 816 -225 49 -11 234 -300 44 251 -84 -47 -407
4813 -407 69 -528 171 -78 172 -333 236 54 188 -100 295 -318 -305 -46 166 478 263 78 -236 66
4833 66 307 -42 116 387 -66 -159 351 285 52 123 65 269 352 110 179 121 68 -281 292 -249 16 110 -119
4856 -119 -282 -157 -105 49 135 348 -53 155 -173 103 -42 560 -492 -92 134 308 390 399 68 534 -251
4877 -251 -122 -356 38 635 56 159 -186 185 439 -100 -554 -117 -10 -42 731 311 -17 -264 -220 -240 60
4898F0n56M89L8J44j30k32M1J5j62K54Q2J39k96L07j57m22J95j60L68j25L75l05
4920c8l36o5M82l28K09J04J90j51k07K48n97J36L13l89K55J01K05l19K94n65K55
4941b03N75o92O48j28k58K01l05L39J00m03N09m88O8j81J88J46J14k23k81lK40
4962c7O26q55M82l89N01j6p88j3L14K40j96j53M83n23N89l43m14m8O49k79P2M9
4984d9l5k01N3M86r6Q5k48P2J77k90m88O15L10J33n90q2K3N80o38O49l31m78P05
5007C62l92P0q7J14l07q8O1p2M75l76q8N50n0k17k16K04K71O7M10n66m70K11L61
5030B27o9N0q29O22k30N72n80J87m0k4L12k58k22N93n62K62jK90l56K3K85l89
5052a37O05n51L48m0m97n5m0M43l14N05J01q26L48J53m89O06J9j43j42j18K08
$$ plain form
4898 60 -496 -7 31 175 45 -187 -146 -131 -293 -39 43 182 -114 193 36 -386 -191 -351 17 -108 267 -38
4920 -38 -374 -439 43 -285 -76 28 218 67 -140 108 -489 -353 -40 -429 -174 -73 132 -187 107 -458 -203
4941 -203 372 -320 328 200 -58 143 -162 177 277 -126 383 -105 -37 -218 -30 116 230 7 -274 -277 -37
4962 -37 589 -266 216 -173 328 312 -476 -489 -175 65 -131 -284 199 -324 265 -78 -492 -540 109 -170 -98 -49
4984 -49 -84 -285 -232 254 158 243 -5 67 244 -46 -534 81 391 524 -66 -148 -125 455 -183 466 135 -343 362
5007 362 -30 40 -47 67 -240 -328 -267 -339 136 -240 -328 222 172 -45 -261 -57 214 281 691 125 -345 -134 227
5030 227 158 208 -621 1 -229 343 -237 -50 -90 -114 198 -60 -282 311 -251 11 10 300 -56 -33 252 -137
5052 -137 468 -83 265 225 -272 -327 -367 76 -238 267 368 -458 -110 43 -446 160 179 36 -106 -224 -16
5073a6J66L34r28Q61m84M44m00j13J64j58n3J6K86k00K54p42K50L46j25N1j5J62
5095A00n36O14k76M53K01n71M57o81K76J48j50L79J06l59r2j23k33L62k45k75
5115d45N65R6n99N41l9l27K5n70N32L95k27L56k35K23N2n81Q9J55K06j96K25l12
5137g1N74p97L00J71j16L23n65O10k54l38N3pK42m27J3K89K5n26M83P8n67P56
5159B49J70m72j44L96K33o26K84O5r0J89K3j01j35J60l86j07P24n06l14l55N27
5180b16K78m18N79K75p9m54L65j25p1m45K37M21j93l9k99L58q3l87N27l13j64
5201b46J53J43k0NK17k22J69l26J78l71M31j35K27k71N23o61p3M60p1o1R2j80
5223c9L1L75J1m32n2M50k87J07n5n28J90K78O4r59N14J91j00N88l66J80n2K77
$$ plain form
5073 -16 150 484 -444 417 -67 377 -23 -136 28 -130 -183 -167 119 -81 173 -569 -319 27 -98 -47 -62 100
5095 100 -436 178 -98 355 556 -15 442 -239 37 185 35 414 520 161 69 -54 -287 75 -170 -445
5115 -445 120 216 -383 158 119 -208 -183 -753 -221 174 -53 303 68 291 343 -238 -149 6 212 16 241 -71
5137 -71 503 -294 6 177 61 384 -181 429 175 -163 -110 -117 125 -302 -289 0 25 -501 -18 60 -507 249
5159 249 419 -53 -197 199 432 -194 90 155 65 254 277 176 41 201 -185 -292 432 -74 -388 -743 -216
5180 -216 62 -356 223 498 419 -35 330 205 134 -311 -74 347 154 115 -184 174 91 -296 231 -82 -246
5201 -246 -93 50 30 35 252 30 199 -127 51 -320 111 -24 203 -68 455 -206 -279 181 110 49 141 -39
5223 -39 -8 367 378 -54 -106 344 57 164 109 -419 -229 49 113 -846 -332 -141 -241 347 -19 161 109 386
5245C86n23L11J6m0K5k75K2K68j19j33L58j60l07L49m15q0L20j97p5M73n01N82
5267B85n89K92Q9j10M8p6k7L5K52l27K61l15j42P1O68p58N97k74l11N64n65M76
5289A44j20l64M39J03k41L21m54K42k96M22J97l29L51p86L68lM48J61m92j27N5
5310C9L68m94K24j85K88R6l63K80n02L71r8L50n58J42L38Q1l10j62J44J50K02
5331D01n32n6k22N62p62J31L53M30k27k53J43J87M04l05k00j98l10j38N73k7l1
5352g7J90n30P96m43L20k07j38M20l80L46o88K81j38P02j90m95MM09j15k2j22
5373g7k37L17k85K16k37K68j06L92j43j53j61L19O3j71M3M05k97o94N38k76M92
5394B16j04j41J55m85N61p9m89L83J4m98N90k17K00l39j50K48M08n04L30nm62
$$ plain form
5245 386 -137 174 190 150 175 -100 -78 190 71 -62 296 136 -171 178 -237 -317 3 -194 -269 204 -297 285
5267 285 -304 -12 77 -33 15 -61 -88 -53 199 -128 133 -182 -324 -253 415 -343 254 -20 -331 233 -332 144
5289 144 24 -340 99 202 -39 282 -172 70 -226 196 393 64 415 -371 -3 -6 442 603 111 -16 39
5310 39 407 -87 137 -48 240 336 -27 253 -249 122 24 374 -184 -42 296 377 67 -95 49 199 401
5331 401 -131 -187 -409 153 -609 -478 -125 305 78 -175 -32 155 559 254 54 -144 -454 -592 -19 -46 -77
5352 -77 113 -417 379 -64 256 49 -89 331 -49 297 -391 -110 -248 454 264 -231 -227 182 67 45 -77
5373 -77 -314 3 -282 -66 -303 -35 -141 251 108 -45 -206 113 176 5 48 453 156 -538 0 -276 216
5394 216 112 -29 126 -359 202 123 -366 17 31 -467 123 -94 106 -233 -383 -135 273 -231 99 94 -368
5415c68K42J79j79QK60l45j4k69Q21p14M91k94nK48q4n6J15n17O03k15k3j14j54
5438c84R86m30k37n5J10l14M56k45r7M14O9J43p31K48O69k52k65l01M98K60j026
5459d84K74K67k55K60j86J21L9n25N55m45K90K54m42N35n29N73n01n2k20Q53r69
5480e87J09K1L31k48L19L60m5k32j79O32l84nJ45m40M0k41Q33q13j94N45q9K30
5502A08Q7O3p63Q71p4m23j30K62j36J08M59P7o12m31N56Q2L3m23M6J77j86L76
5524A27j69l08O19k65k36J06j60L75M85l23o36P24l00L27m18m22O38k95K71l7
5544A03k01P2L6J3j90O31l09p3n2O0qJ5j47K45l16N77p06K75K5k96j5l1L50o77
5568f19P02k65K02m14K28N90m33oj37j61L51J97L6M6r7J17o95P43l81l41N23j19
$$ plain form
5415 -368 -126 53 -126 -118 142 -203 -217 -486 335 -379 112 -182 -187 61 -23 -79 36 -481 122 -93 -116 -230 -384
5438 -384 602 172 -65 -120 -10 -324 132 -113 -210 204 273 416 -315 -67 602 350 85 -216 282 542 -484
5459 -484 -210 57 -198 62 -124 -3 36 -489 66 -379 -89 165 -277 258 -271 302 -199 -251 -471 382 -587
5480 -587 -478 -457 -126 -374 -55 305 260 28 -151 481 97 92 237 -203 -163 -404 429 -384 -578 -33 -122 108
5502 108 195 258 -505 366 292 -131 -261 1 -135 -27 432 509 -103 -534 22 104 137 -286 -240 -63 -249 127
5524 127 -42 -350 269 4 -232 -126 -286 89 574 251 -385 339 39 366 -52 -474 164 -131 140 103
5544 103 -98 -26 10 23 -167 464 155 82 30 90 82 97 -50 195 -121 456 -250 25 50 -246 -261 -292 58 -619
5568 -619 83 -182 20 -394 -166 424 -9 -15 -152 -313 38 235 271 317 220 337 -358 385 4 -337 186 67
5590F7n2q1M19k88K79k36j69Q12p79j42K36k45n3M6l6P1Q13o91o4M11n34j03O0
5613b59K76j07J36n95N43KL60m08k20L73J24k6k63M05k02l14L96J85l74J24m25
5634b69P09k71l44j02J33M4q37P36mo8K40M87l18N1k71K48R4k30k06J95k9o00
5656f12N55J22n6j26j30M49M1m94M12m41L06k94K61oL5L80l26p7l94M74J30N8
5678B67k41k43L85R0j64k44K49l75K50k50K0O12l24j38M42p73K36M82k97k59M58
5699A83k67k78K52K89k91k86M03K63j52P9K1o79N59Kj53k54j54O13L50l69k52
5720a21L07j01N5n07N68m20N72p53L37J52J48k54K57J30o19L69j97m4k60J72k9
5741b38L56m68j3j9O9P4lK98p4q9J78R2k3o93K37Q16k90k04J38l39q1K94L32R
$$ plain form
5590 67 15 -66 353 65 344 108 -61 751 -28 -170 66 -179 -232 -186 -222 -151 662 -29 -93 318 -216 -319 -259
5613 -259 17 -90 46 -549 -6 -4 356 -52 -272 101 225 199 -64 341 139 -175 221 406 32 156 -269
5634 -269 440 169 -175 -277 -144 -100 -937 -201 -205 -273 -33 454 136 187 -84 164 258 28 -178 17 -12 -612
5656 -612 -57 65 9 -117 -247 202 243 -251 161 -280 26 -268 -7 -13 22 402 76 -1 -395 79 209 267
5678 267 26 -217 168 258 94 -150 99 -276 -26 -276 -256 356 32 -106 336 -437 -201 281 -16 -275 183
5699 183 -84 -362 -110 179 -112 -398 5 268 116 195 216 -463 96 98 -55 -309 -463 150 500 131 -121
5720 -121 186 85 140 -367 201 -219 353 -400 -63 89 237 -17 240 370 -249 120 -77 -121 -381 -209 -238
5741 -238 118 -350 -363 -382 -313 -239 -242 56 -18 -107 71 163 140 -553 -316 500 210 6 144 -195 -276 18 350 359
5765C59j26J44k57j17k23K19J93p31M36L86j10o28L43M21m24O17l01j70j0k8O8
5786F1Rn0L02j66J02o42O15n30O17j86q76J085k96j17l0M8j78k3M22K59o4l79
5808a7M32n32K92m55j63O9J78L43k64L74m80L06m21M23J00o79N21J8n90Q0Q70
5829D05k93j11J40J21m82N08K5l04L78m51L2k52P3L49K5k43p8K15m40O77l76J92
5851A10k41l14L71N73o11K72p8k10J81n59O4P95n4k68N3n18N19k12L30l48K90
5872A45R9n61L4n3K13K88m05j03M62q5l1k65J45k01J99l1M13j93n0l21M38M15
5894E52l32m49j9L20j46L37j51L68l87j61o07J094r3l59J89L45j20j43p4l96J28
5915a04M37k46m33J29L2J80j02q6J77R4j4K30k06j34N64l25n5k61m88K56K99Q1
$$ plain form
5765 359 233 377 120 3 -220 -1 192 -539 -103 283 173 -455 -112 309 -115 502 201 31 21 -7 61
5786 61 70 20 322 156 258 -384 231 -299 318 132 -744 341 45 -72 -102 -54 -232 -255 167 426 362 -17
5808 -17 415 -117 175 -280 -443 -374 -196 147 -117 257 -223 83 -338 85 185 -494 27 45 -545 -465 405
5829 405 112 1 141 262 -220 288 313 9 387 -64 -32 -284 -211 138 163 -80 -158 57 -383 294 -82 110
5851 110 -131 -445 -74 499 -112 160 82 -128 53 -506 -442 353 299 31 84 -434 85 -127 203 -145 145
5872 145 244 -317 -283 -336 -123 165 -240 -343 119 34 3 -262 -117 -318 -119 -150 263 70 20 -301 137 552
5894 552 220 -229 -248 72 -74 263 112 480 93 -68 -675 419 326 -33 156 501 381 238 164 -232 -104
5915 -104 333 87 -346 -217 -185 -5 -107 -193 -16 78 64 294 88 -46 518 193 138 -123 -611 -355 -56 25
5937B5L8o9l65j32O55k41r5L06j64l07N12k7J83q71L44J90L76l44r7L11l90k8
5959a90M20p8l57K80k9N5k28K78K36Rk69n00K27K20K64l23k0j67J74j58L33l68
5981a91R4J77o0J71l39J56K44k9n67M84P0M8R2l7k85mJ30k84Q79q29N7M84p81
6004c20N0K31K37j93k92K33L24J49o28J09j29M84k05k51j69N1K54L61j97M6j46
6025an1j81k38p3M82P7J11m27M16Q0q41O98K26m55J92j06J71L29p42K46N2M03
6047C68k67J22l37m4L74p7L9j35J27m05M30k93K02J7Q2L3k39L29k39n45j5Q82
6069D09k97P3m14N35l51J28j04M5j75M14j46l13M39j18J46l52J60J70m07k74N37
6090A05k98L82l86j00L14m6j76J72K3k33j63N18m81O11o18J061m14l01L99j39
$$ plain form
5937 25 63 -6 -371 -503 152 -89 -184 122 -42 -349 163 136 319 -552 -208 -18 358 14 -83 228 -162 -190
5959 -190 230 152 -205 75 46 101 -127 151 387 396 127 -373 -146 74 338 15 -5 -172 2 -156 177 -191
5981 -191 -97 80 20 191 -148 8 252 223 -344 140 210 258 350 313 28 24 154 -130 749 -80 -23 461 -320
6004 -320 -270 -39 198 5 -287 -54 270 419 -209 -100 -229 255 50 -201 -370 -319 -65 296 99 145 -1
6025 -1 -52 -233 -471 -544 -62 15 126 -301 115 195 -646 52 278 -177 15 -91 80 409 -333 -87 -35 368
6047 368 101 223 -114 -158 216 139 178 43 170 -235 195 -98 104 121 203 236 -3 326 87 -458 -473 409
6069 409 112 185 -229 306 -45 83 -21 24 -151 263 117 -196 243 125 271 -81 79 249 -158 -432 105
6090 105 -193 189 -197 -297 17 -29 -205 -33 -10 -243 -406 112 -369 242 -376 685 271 -30 369 230
6110B30n18L33K41n20N07n29K53L08k29j39J4j04K8k84L22o6J48J30k05J56l75
6131b99N51K74n26L59o81J81L86O2k36K35p25k39N08M24j72j77k44K23R1J92m38
6152b51J28K63l50K22K32j03n37N11l58N22m6k61O9l8K0k14l9J12L34n48M54P5
6174A97k7l77K62L69m43K91l58j82N36N0n29%J50K9k7l01R6L66m6k6m09P10m47
6197a16R0J38l53N53m78p4K13M4j92k6N59l49l13J70J63J84L14K72n54l73K92
6218A64j9K85j036P18j36K28m44K44J98j15J20O2m4q4n43o6J28L32O7kl10M68
6240B15j97m42J47J50L00Q3J07l82j90L67N5K3l07l12Q16l99j46p9J51J38k57
6261a59j02K30r8K68k80M38p4M1k66K98m31M74m33M02l78L70K60r85J87M20n9
$$ plain form
6110 230 -288 45 286 -234 273 -256 -3 305 76 -63 -49 -153 -125 -409 -87 -153 -5 125 -80 76 -299
6131 -299 252 526 0 359 -322 -141 245 307 71 306 -419 -658 -150 274 102 -75 -319 -96 -5 187 -251
6152 -251 -123 140 -210 12 244 141 -396 115 -243 279 233 -28 41 3 23 -191 -230 -118 216 -332 122 197
6174 197 170 -207 55 424 -19 272 -86 -268 268 318 -211 -211 -61 -32 -59 -360 -264 102 56 30 -379 331 -116
6197 -116 -26 112 -241 312 -166 -240 -27 17 -175 -201 358 9 -304 -134 29 213 527 799 245 -128 164
6218 164 145 430 -606 112 -24 204 -240 4 202 87 207 269 225 141 -402 -468 -340 -8 59 57 -253 215
6240 215 18 -424 -277 -127 173 256 363 -19 -209 158 213 236 -71 -383 433 34 -112 -191 -40 98 -159
6261 -159 -261 -31 -129 139 -141 297 223 264 -2 296 -135 339 -94 308 -70 300 560 -425 -238 182 123
6282A23j76N56m13n70L64J66k5J98j11m27Q4M13j80J37l07R23j267J52K78K37
6302A55m72Q3P79m52J80l1n04P23k47k09o33M77L0O2J38m12Q6j96O34n19J75K0
6324a33m92O60j78N32l60l99L83J65o90M67J64j43k24M93l33L87J4j29k63K11
6344A32p4k29J8q4J89M33n75L74m09k07q0k40P98N01l69j98k7J33o2O69r39M04
6366A58k06M76o10J26L26k31L07j48j0m0l5l22P9N2K20L40n26k72q1N73j56K89
6388C09k96P8K55l89R6l56K24L39n77K44k21O12n32M3K21j02rJ07K27q51Q55J44
6410D21m32K06p00K04N07Q9m07k91O56J74n43k34j97N81Q7k82M91%r18N38L14
6431B64j20m19J75J38J86m30K95l61M08j45J34M3j96J29l0n9j12O9k99K53j28
$$ plain form
6282 123 -53 503 90 -480 -116 50 25 223 112 -315 -231 182 2 139 -168 755 -512 -360 -82 155
6302 155 -317 -234 545 93 273 242 -262 461 214 5 -628 -151 -121 -59 79 -333 -247 -443 191 -328 -153 -133
6324 -133 -625 35 -143 389 29 -370 13 178 -512 -45 119 -24 -248 245 -88 299 313 184 -79 132
6344 132 58 -171 -153 -237 -48 385 -190 184 -225 -432 -512 -752 46 547 178 -20 -47 86 24 693 -246 158
6366 158 -48 428 -182 -56 270 39 346 198 188 148 113 -209 -130 -78 142 482 -44 -316 -397 176 20 309
6388 309 13 91 346 -43 53 -303 -79 260 -317 -73 -294 318 -214 -171 50 -52 -61 46 273 -578 277 421
6410 421 -11 195 -505 -301 206 295 -112 -403 253 427 -116 -350 -547 34 121 -161 330 330 -588 -50 264
6431 264 144 -275 -100 38 224 -206 89 -272 136 -9 125 168 -28 101 71 12 -100 -31 -330 -77 -205
6452b05J45p3L83l15R1m2j05K73o31N64K7j10K06m08k41M42Q9j54L8j5L6N44j50
6475C89k00j61Q6m30K74l8J22J86n97M24J55l25R8k68L42m12N54q8j0M10l28l28
6497a45L28k33k17J77K8L2K40l75L84k07R2k2j75N04m99J12n09Q96n94J83n42
6518e42L86L41j41L90k16m4M0j70j39L69n91J75K64j84M3k5M9K52o17N29n7n02
6540c90K03K91P0j30p5K91j26j95K32m70J053o59j51p1p8K83l65L35m5J86m35
6561b46n9N71L61m13L11k08Kn10N46L80j077L33o2L76m51j48K16J05m9R6J10k52
6583f8j8l96R27n86J74qJ49n37L97j94K64l60M0P7m84O42P3K77l45l92J25O69
6605D26p55L61L56n79j92M18N5K60m39J92Nn0o6M13l52l04L82J03j47K17l37L0
$$ plain form
6452 -205 -60 -133 250 -65 26 -16 -121 152 -479 85 112 2 208 -200 -441 1 90 -64 -26 -41 -5 539 389
6475 389 189 28 114 -316 -42 -80 42 228 -369 55 210 -115 -17 -285 57 -355 199 111 101 511 183 -145
6497 -145 183 -50 -267 -90 -62 -30 210 -165 219 12 104 82 -93 411 -88 24 -485 411 -183 0 -542
6518 -542 -156 185 44 434 218 174 214 44 -95 274 -317 -142 122 -62 -19 -44 5 257 -360 169 112 -390
6540 -390 -187 104 174 44 -31 260 134 -61 171 -299 754 95 -56 -127 -205 78 -287 48 3 189 -246
6561 -246 -305 266 627 214 525 317 319 -191 355 735 -342 -9 -71 305 -146 -294 -78 27 -22 74 184 -68
6583 -68 -86 -482 445 -141 33 25 174 -363 34 -160 104 -256 -216 -139 -623 19 92 369 24 -368 -243 426
6605 426 -329 32 388 -191 -383 35 90 350 -89 103 108 58 -8 405 53 -251 131 234 87 304 -33 -3
6627ck30O8nl2O15n95j38K70N7O5j41L53q7j49n30R09k35l34R0k48M69l67L10
6650A12mj23m8K02k98K51m4q7K0j30L38n9k42o1j52L14K1J56j24J07k43J19k72
6673b47j31P43m75J30j81L02L58k68l69K05m80O39%l55k5L30n47O55k89l31Q80
6694E44o07K80k54PP98j143n1M38J05n27m3K69j01K72k03j32P34o40L28k64r7
6715b87P20l20m3J33k73K53p4m4j91M52k8k40j62j9j1L3K99mk14L53n48J05j68
6738b78K78K53p06P01k76l4M0n7O02k65m75K32O9n27L34J08K31p51N17j15M36
6759C17n57N09m7k80N97o90j37L40J39r8j09n32N45r1J55n55M41L76k68J70k39
6780a4j69k05M91l38O23r46J145k29p07K94k14J64k0J11J57k77K76rM89q29N62
$$ plain form
6627 -3 -233 -165 -170 -202 413 -182 -320 -50 7 72 -69 284 197 48 -482 427 192 -142 -52 -300 169 -198 112
6650 112 108 -15 -63 139 -159 92 48 -39 -19 -149 189 130 -112 -173 -325 -11 10 166 42 149 -94 25 -247
6673 -247 -378 365 -110 20 -161 141 499 231 -138 67 -413 226 226 -129 -154 176 -371 284 -5 -336 544
6694 544 -63 217 -37 -30 768 -375 -426 12 117 -410 -453 -184 -285 -13 -216 -348 386 -254 74 -190 -287
6715 -287 433 113 70 203 -70 183 109 65 -126 326 298 58 -104 -123 -134 -101 198 194 -20 333 -215 -110 -278
6738 -278 0 253 -453 248 -28 -62 -22 -79 523 258 -217 15 84 -443 -109 -1 230 -521 -4 -119 317
6759 317 -240 269 222 -58 539 -151 -288 52 191 93 -16 -548 -3 -94 61 -494 -53 323 55 225 -14
6780 -14 -183 -388 103 -235 388 -558 587 358 -349 -55 -269 -105 -125 -14 143 -134 142 133 622 -207 355
6801C55k65Nl46L69l28J89l2L10o52K93m9%M63J94m52k93L83m42L04Q8o29O10
6823G5j2LK03k61n0j36N39k69R3n9k73O1M7K87l70J20m94M37J18K28j34r2k39
6846a78J56n22N19J84L19l65l66J05j00N84m41J0j70l93R51j61J03l92J10L65
6866C18p26J28J56k62N94K00o08k28K73L06R1l54K64J8j10j25K77n9m24N66j87
6887A08j35K86r83O38L0K97j87N9K03o76P09l76L36m11j01m6P5N06n74L02j28
6908f8n84M53L49J0r2Q1j12k40K53j92q1K37L48N2l61L3L32n62k27O41l94k42
6930c66O92k20l94K19r5K46j61N5j79M15r4J82N5m65m3L98l81K34L05r78O72L86
6952D83o27L91k79j25J56q9L41m56L36k45j24L74j01k96M44r7N38m41m02K35L82
$$ plain form
6801 355 90 95 -251 118 -210 -21 -53 257 -395 -102 -151 -151 312 506 54 -239 144 -298 6 94 -535 75
6823 75 63 66 269 8 -42 -178 361 92 185 126 -147 -86 -39 248 -122 -2 -496 -59 59 287 153 61 -178
6846 -178 -22 -544 -25 159 478 113 -253 -148 -248 336 -105 -95 -265 -658 293 132 235 -157 -47 318
6866 318 -408 -280 -124 -386 208 408 -200 -428 -155 151 242 -112 152 170 60 -65 212 153 -271 295 108
6887 108 -27 259 -724 -86 -56 241 54 113 316 -360 349 -27 309 -102 -203 -249 -174 332 -242 60 -68
6908 -68 -652 -199 150 160 68 149 37 -203 50 -142 -223 14 362 414 53 86 418 -144 -371 270 -124 -366
6930 -366 326 106 -288 -69 -164 82 -79 -24 -203 212 118 300 355 -110 -153 245 -136 98 403 -575 97 483
6952 483 -144 247 -32 -157 -1 -90 251 -205 131 -114 -238 136 35 -261 183 86 624 183 -219 16 398
6973C98l32LQ5j56J37N3l65L35j70K27j30m44O26j31n05M94J5J04n18N23j10J22
6995B61j43P0k86ML39k58R0l40K84j04J75k43K79o56M00N75p53Q0O52m18l4J82
7017A56J11M68m33J1k64L45n27M83j74j59l66J083r11P5Jlj65K61j35J84l97K41
7039a15J1k05M46n64N59Q9j99R5k60L02o76K58J26k35L82l8q5p8O6L3M02j9j69
7062A26k5M6n27R11p08j97L28j19p8K66K95m13J32J29k60K64Lp22N38Q8m11K46
7084h8l4j94O01j60N64j183P7M63r1J85n29j2M86l40M63j46PJ25k38L52M40r04
7106a56L57J92n02K23Q0o7J98j70m4L00l21J09k85m39O80p1q4M11K3p49L21J89
7128A95m37O35o22P40l54j72j71M26k06K61j85k67K74m24P07m02J25k74J37j87
$$ plain form
6973 398 66 69 154 -2 135 188 -177 158 -12 215 85 -359 267 136 -369 125 140 244 -274 249 139 261
6995 261 118 188 -98 -94 245 -13 77 -263 21 -83 92 -151 128 -528 -128 447 -306 -226 426 8 -26 156
7017 156 267 735 302 313 49 394 -133 350 176 17 -349 734 -177 -102 -101 -104 -269 -8 -143 41 -356 -115
7039 -115 -104 -309 137 -427 132 221 22 117 -143 159 -517 -259 -133 -368 14 -24 -109 -187 -121 -88 314 295 126
7062 126 101 147 -380 531 -177 -374 -46 -165 -243 23 318 -95 37 166 -94 170 173 -549 -11 77 -334 -88
7084 -88 -122 -316 285 125 689 -494 -417 46 -45 140 -389 -401 85 -255 208 62 69 194 -44 308 748 -156
7106 -156 201 393 -109 114 194 127 325 155 111 411 90 199 -86 -525 155 84 0 411 434 -315 6 195
7128 195 -242 393 -229 511 157 -15 -186 240 34 295 110 -157 117 -307 400 -2 123 -151 -14 -201
7148b01q2ON3J17k48M26K8n29L07r3O09q15M52m42J52K03J89k4k84L41m66L58
7170E7l01N78n97K72L82l11l27P41p91N89k45k85L68j51L1Q8k89m7N32m05p3L49
7192A65n94J70O26m21j13m9L34Jl86L54m15K87J36O10q95J88p0P5N85n87r5K97
7214B03j83K28Oj30k96J32L55l05M16l39n55N89p51Q39j12R1n00J41j15j04M57
7235F7K11n77q9K04J89k10J3N8J90o8o67M64J48M49J10l39k3J87n77l94O70L00
7257C16k96N5j71N76m02J5j75J95J94m59K72l99L18K17K0j77k75L64n94Q41o33
7278a98m3K18N5k20M99m38O6M94m31K29j58k29j28M20J66p52P85l54J79J20n20
7299b40K71o3l4k37L54j08R5j42L5j01M59l38M5K27j69j69J57K5q01J059k54K09
$$ plain form
7148 -201 -283 -277 -224 -107 -355 71 99 -430 -123 -216 393 -422 30 -412 -260 -57 132 108 -176 165 -301 57
7170 57 -244 334 -263 9 391 80 -247 494 -297 292 47 -238 130 -21 10 98 -191 -238 294 -111 -184 165
7192 165 -429 -259 367 -54 -167 -216 118 119 -267 87 -328 -41 95 705 -190 -2 -72 3 588 1 -94 203
7214 203 20 248 254 124 -172 -40 315 10 426 87 -468 121 -630 209 97 188 -312 -171 -286 -390 67
7235 67 278 -299 -388 -184 5 -205 -192 -134 56 -12 -679 -215 -67 382 492 153 130 317 -260 -654 16 316
7257 316 20 75 -96 480 78 93 -82 113 307 -152 120 -279 39 256 276 99 -176 188 -406 435 -198
7278 -198 -241 -23 32 -188 311 -127 -61 433 2 231 73 -156 -284 136 302 -450 335 -19 160 280 -240
7299 -240 31 -32 -66 -303 51 -57 38 -104 -69 -170 289 -49 -4 223 54 -115 42 67 -734 325 71 280
7321B80K3l95l15O14M5l35K75l70L19m73M53K14l71q5R5m00O31m62K25P07o75
7342@k75L59L61n66K12Q8n0p9J80m21K86k21J23J89MMm23j11J70L61o19N77k48
7365i9k47K76k09o2K63n2m0j53O84l67k24J08j06M37l27j89K05l31K5L45O3l68
7387c68K34L76n23J50J42K08k04L44m86O56p52J75K89l56P3p5K1J80l14l33P91
7408B28q49J052l19q2m45L57L75n17M86l68m6K67J08M0k41j81L68r1m27K17M8
7429b0NN57n81M39n07M76m4o93J12K85m22j2Q46l10M6K72m71m99L28J7J68j3j40
7452a61N20o32J08J60L16k16J44l26L6Q7J79l73nJ44J01M2o31P39p35l29Q98R8
7474A64Kj60k97M17m89L76N70p61K72j93J65j28pk8m14Q61m39J58j07n71N66p8
$$ plain form
7321 280 303 -92 -407 207 252 -83 192 -178 141 -332 121 335 -36 -121 -26 -426 205 -257 -32 675 0
7342 0 -275 84 445 -121 91 179 129 50 230 -191 95 -126 -3 186 190 194 -229 -340 -170 191 -428 149 -99
7365 -99 -346 -70 -279 -341 -78 -130 -170 -323 361 -6 -230 -122 -228 209 -118 -307 -102 -433 -408 -63 0 -368
7387 -368 -134 242 -281 -131 11 219 15 359 -127 529 -223 -48 241 -115 -42 -117 -96 84 -230 -563 228
7408 228 -621 431 112 30 -415 -58 317 -200 286 -82 -128 139 247 287 46 -135 233 142 -285 -68 -20
7429 -20 -15 542 -39 400 -107 369 325 -368 -256 29 -393 -405 441 131 177 449 -22 -521 -193 -176 -8 -21 -161
7452 -161 359 -273 -165 -5 311 95 239 -87 -51 36 215 -158 -163 -19 82 124 -507 232 -503 -832 66 164
7474 164 166 6 -291 126 -363 13 583 -178 94 -99 66 -62 -69 -97 -511 350 -89 69 -38 -609 -43 -121
7496a21M24o26L25l40k4J052m34j3k57k53O05r4k52J45l33K73j78J15j42K04l77
7517c01J72rJ51R9j80l23J68O7K20k97K91k36L0j60L72n6L15q0r7l45N0L39JJ19
7541C10K93m85r2K86j92M03m59k29J72J80p4k98M56Mm53k70Q13j74j26r0L55m90
7563a60J40L63n4l67L20j16n4J55q0k1j60K58J85l19j5n1k66N4N27j83J73j5j
7586C13j93L10n83l38P59o23O39L61o97J35J59l47J00N67l43l75j83L28m00j25
7606e36L19Q2L59l37j03M37j74N35m03j25r8M57r17K60M68l1o38J83L42K09l41
7627e2L7j85p6O13j95j96k17N67l83K36l01K72J14j68j84j44k49N11J89N5j1n43
7649c10J95J15l06N69m80k42M02j90K98l01L81K71J4n79m02N43J50K35l15m17
$$ plain form
7496 -121 303 -323 2 -338 -362 690 256 243 -14 -267 338 244 -8 137 -196 77 -101 14 -128 76 -301
7517 -301 -129 -138 13 112 -68 -391 -223 -156 64 -233 58 -178 -148 -308 64 8 323 243 146 -199 -149 190 191 310
7541 310 603 118 26 312 120 523 64 -165 7 187 113 -185 271 275 -178 -448 365 191 65 -25 330 -160
7563 -160 -20 343 289 -78 242 126 72 227 147 126 -34 224 409 90 75 24 -242 -188 339 156 329 314 313
7586 313 120 430 -153 -491 268 -355 284 645 -52 83 242 -105 -5 562 219 -156 -339 -11 -411 -536
7606 -536 -217 -135 224 -113 -216 221 47 582 179 54 -44 413 -504 -244 224 193 -445 -262 80 289 -52
7627 -52 -15 -200 -276 337 142 -54 -271 296 -87 149 -152 120 234 66 -118 -262 -511 0 189 244 233 -310
7649 -310 -115 0 -306 263 -217 -459 -57 -247 51 -250 131 402 416 -163 -565 -22 128 363 48 -369
7669c69L33o3m1O07j90j79K8j28L20k48K42n14m4N01q0j98m4M36p21k05P02K9
7691A74m57O3o24J124l88qM50j1p46N4L64l2j2j63K22L19o90K98j48M66k71Q8
7713G2l49L37K40q44R09j64n4M64n70n4n06L09O7k01J08k12M38l38L18l00N93
7734B63n57J33K5L47l93q8N42l62J02o1lK30m70Km5k60Q64k74j50K07K32m08J64
7757D0O0l92R0M88j35p3l45K69K91l58o7q4K42o1j93N29k95j97q9J0m26J038p26
7780c84L33J13j38k9J72m10P48m55l4J90n93Q35j97l39L29j27L24k64l21O65k44
7801A74J2k37r3m12M82L9J24j02l0J4K31p6j45L73n23J44J07N0J10l09m64P94
7823B63n64L30k68K24P9m0p5K90l06O8J27K59l85o9J64j96j51k76O18k0r4K70
$$ plain form
7669 -369 -36 -99 -140 467 277 98 126 -2 318 70 312 -202 -246 255 175 -23 -67 369 -352 -557 145 174
7691 174 -283 -220 -844 280 -108 -116 334 323 -423 -369 -5 -37 -49 -212 10 329 -361 -63 -211 255 -16 72
7713 72 -277 60 300 -544 365 201 147 611 41 -13 -519 -210 -143 -344 -236 -448 -10 -348 -30 -330 263
7734 263 -294 -161 -136 211 -182 -270 272 -90 12 -49 -52 178 -292 -290 -335 -595 269 -5 -155 52 284 -124 40
7757 40 100 -292 -202 286 151 78 -267 2 293 -65 -132 -216 26 -35 -228 301 6 -191 -280 -270 -696 342 -384
7780 -384 -51 62 -76 -105 67 -343 405 -50 -84 106 -487 348 151 -188 141 14 338 74 -247 418 174
7801 174 186 -51 -144 -556 -74 -35 89 -13 -43 -29 202 126 -19 354 -169 -25 82 132 242 -67 -531 263
7823 263 -301 29 -239 -15 64 24 -51 239 -67 1 128 387 2 -67 97 -99 -250 -526 92 72 -22 248
7845B48k73j05k81N82J82j94k97L79j4k00j90N50n79J66LO0l2l31L12l05N04J25
7867C10Oj90j98j51N4L56j7k12L18k54l00J40M64m44J74l55L16PJ40l42O8k45
7889c55M99J7k76lM67j44k97m0P2L09Q1O3k79l14M20o85O59o12k47P48m68N52
7911A67k54M53l0k15n62L53P51l99l3m7l0k40O20k86n18j08M52jo58L76O9q8M23
7934A95p87M75K09R4q77M52J33r3K67o02R07o22K18k68o5M18J16J63m80%L66l41
7956a22P7J83J82l24k09L75k12j46j04L00K45n09O31l98j59M26j11J99o03L58
7976G9K46k98J8n9j36K4J33r7j02O4k75P10p77Q16m03R2k6J47n87j3O07K31m43
7999d9J05L4J16p8p58P73j75K06n32K72l09K81M94r7l81J41K11m99K41q2K07m6
$$ plain form
7845 248 -25 -130 -411 171 353 159 -138 241 227 27 -163 387 -192 -26 -23 37 5 -326 -14 -319 185 310
7867 310 316 126 -72 -223 -169 187 170 -42 276 22 -278 -138 326 -118 56 -299 17 24 164 -178 -110 -355
7889 -355 144 161 -115 -118 349 205 -92 -132 -60 249 330 393 114 -200 220 -465 194 -418 -665 83 -385 167
7911 167 -87 366 336 121 -441 -88 663 264 231 184 154 -86 534 248 -270 -378 74 73 -585 -209 -140 -228 195
7934 195 -592 -117 92 186 -691 -239 -106 -199 68 -534 373 -249 -31 -299 -364 54 170 333 -147 -147 219 -122
7956 -122 -45 138 320 -4 -213 162 -50 -196 -300 0 245 -264 367 -31 -190 236 125 324 -279 79
7976 79 325 27 45 -14 -150 -126 7 -90 -192 -128 -403 307 -470 346 -57 35 9 156 -431 -444 163 394 -49
7999 -49 56 90 206 128 -630 143 -32 174 -358 -86 -395 -114 380 283 -98 43 254 -245 -4 -86 121 75
8021G5p88M30N24l13N06k34k36q8N59O8l67j19M32m06J14m1k56K51o1l9R3q8k34
8044b18o9K81J34m1k03K26l10M01m98M61j21J37o62L78m2qj72L65J21k07R5O06
8066F54n98P9l07O6j23K44l72M44j28%p2M44r9l24J44O2J72m47K17J55m24L97
8088A84l18J28j51M85k73l82J55J74K92l56K34j87L3p8j62j8m98L36N87l59N13
8109C39k75j96K49k0j58L35l62L2Q7n07K49o6J054r76N33n76p5M67L11J67m42
8130A70J57l50j21o1M47l28Q0j74K50J25k53L42n6m13J1K06Qk51J37R09l85m19
8152C1J56n03j05P7M30L1J8O3j08m27l3O76p13J70L94m52L84j10n37M59p5L59
8174A85J5k44j50K86l43J36Q3k84P3N9O1Q01l57n78m55P86r2
$$ plain form
8021 75 -713 -283 241 -72 434 200 -36 -124 435 503 136 17 449 43 157 116 -140 111 50 11 104 16 -218
8044 -218 -287 -6 128 87 -116 110 -200 201 -297 164 43 180 -482 -104 -146 -154 -326 39 160 -47 48 654
8066 654 56 135 -172 -106 -229 15 -357 87 -41 -41 -113 331 232 -92 52 114 286 -161 56 211 -213 184
8088 184 -134 -6 -157 328 55 -327 -172 2 294 -62 172 -15 18 -60 -222 -240 -738 -402 185 -174 339
8109 339 64 -132 117 97 -61 274 -88 -56 31 -476 -227 -293 761 -215 318 -258 -333 134 445 612 170
8130 170 327 -23 -144 -205 242 -86 -6 -180 70 195 -58 284 228 -185 -174 32 40 -211 -74 835 450 31
8152 31 187 -316 -421 -344 86 117 135 198 90 -337 -370 306 -407 -237 157 -295 89 -21 -558 -99 -174 185
8174 185 200 -44 -194 92 -251 -115 -32 -316 -243 -184 -123 678 321 -257 -712 74 -18
8191a8
$$ Imaginary data points
##PAGE= N=2
##DATA TABLE= (X++(I..I)), XYDATA
0@%%%%%%%%%%%%%O4j28J28j28J28j92K56k56L20l85M49n76O43p08Q34r66J153
30F36j340J515j708J922k179K471k789L128l505L900m341M835n361N940o572P268
46C820q029Q858r767J0759j1854J3058j4393J5876j7534J9399k1517K3947k6758
59a4135L0057l3991L8786m4786N2546o3018P8021j01472J43615k43057R03279
70G45845Q47758j268362n50878l5117J31667l24009l6406J86589J42888k03162
80c63187r3315J6464Q59j23795J52021L77105K23250j78921q4161K36597J81584
91C44501k30345j73486K39156L12952q3419k29947l3713Q0128p3033j39373l3865
102b0444O6233M548j01218j24857m5706n962p391M3791J06943K4527q6307k8864
$$ plain form
0 0 0 0 0 0 0 0 0 0 0 0 0 0 0 64 -64 64 -64 64 -128 128 -128 192 -193 256 -320 323 -385 449 -517 636
30 636 -704 811 -897 1025 -1154 1317 -1472 1656 -1849 2051 -2290 2545 -2816 3124 -3448 3820
46 3820 -4209 4649 -5118 5641 -6213 6845 -7548 8328 -9206 10193 -11324 12623 -14135
59 -14135 15922 -18069 20717 -24069 28477 -34541 43480 -57992 85623 -157434 745845
70 745845 1593603 325241 -225637 -260754 -129087 -453096 -489502 -302913 -160025 -363187
80 -363187 -456502 -440038 -439179 -562974 -410953 -33848 189402 10481 -73680 162917 344501
91 344501 114156 -59330 179826 492778 409359 179412 145699 225827 152794 13421 -20444
102 -20444 45789 50337 -50881 -175738 -221444 -227406 -234797 -191006 -84063 -59536 -145843 -174707
114a74707P8084K2947l8241P6830J82557O5870j02548r6547L9825J33732R3075
125B80877m6672j19723m1803L3938l1314j11366o8582J3256L6183K2050k2842
136e5998q5696o5535M2404Q0840J5477m805N2258P0131J7812l9157n6015p671
148c5955P8481R6797J4956m5408k9312r759k6991l4959k7462k247M5539M9398
160G3078l9991j04980m5747L3541J8923o822K5121M3673J3518j2241j9769k5571
172d7267l985M2314M9796J4289j1330j4148m249Q026l101l3382j3302M6212L6739
185F6612l8450n5760K204K8654R02j5094l462M256Q539K195k0179k3381L895K1554
199a7515J3598P441n63j6194l786K8282J6135j9861o666L4604K3975k4849l8976
$$ plain form
114 -174707 -96623 -73676 -111917 -35087 147470 213340 110792 14245 54070 187802 280877
125 280877 234205 114482 72679 106617 75303 -36063 -104645 -91389 -55206 -33156 -55998
136 -55998 -141694 -207229 -164825 -83985 -68508 -73313 -21055 49076 66888 27731 -28284 -35955
148 -35955 42526 139323 154279 108871 79559 69800 42809 7850 -19612 -21859 23680 73078
160 73078 33087 -71893 -117640 -84099 -65176 -71998 -46877 -3204 10314 -1927 -21696 -47267
172 -47267 -51252 -8938 40858 55147 43817 29669 25420 33446 30345 -3037 -16339 29873 66612
185 66612 28162 -27598 -25394 3260 4162 -10932 -14394 -10138 -1599 596 -19583 -42964 -39069 -17515
199 -17515 -3917 3524 2961 -13233 -17019 11263 27398 7537 871 35475 59450 34601 -4375
212d375q107J9239J5193j4385k7673l938J4415p613k6149O40K5892J3295P085
225C519J5579r05k5824o544K9665J6664j5858p147K3646J7811k4655n1067k3801
238d8917K3348K7092q202j5795J3407J7303j5116k2209L805J5373J2421J9601
250B2111J5442j2693k9568j0542J3965R066o815m872J3315J8351j1802l9115j5843
263c9000K7884K8564l622j1345P523N494j4236j7119k364P502R999Q108r3j2038
277d743j2788l211J2064J5773J329p285P541J8007o346k8936o563K7838K2311
290C4991j0381k1763r376n3n087j1518m583J1506J8001M921r760j4529j0474L798
304b4307K0585K1683J493j1146J859J1247n057j8900m040J9485J9801k529k3845
$$ plain form
212 -4375 -12482 6757 21950 7565 -20108 -24046 -9631 -17244 -43393 -42753 -16861 -3566 3519
225 3519 19098 18193 -7631 -14175 15490 32154 16296 9149 32795 50606 25951 -25116 -48917
238 -48917 -25569 1523 -6679 -22474 -9067 8236 -6880 -29089 -25284 -9911 2510 22111
250 22111 37553 24860 -4708 -15250 -1285 7781 966 -3906 9409 27760 15958 -23157 -39000
263 -39000 -11116 17448 13826 2481 10004 15498 1262 -15857 -18221 -10719 -720 7388 7295 -4743
277 -4743 -17531 -20742 -8678 7095 8424 1139 8680 26687 20341 -8595 -15158 12680 34991
290 34991 24610 2847 -6529 -6582 -11669 -23187 -27770 -16264 1737 6658 -3102 -17631 -28105 -24307
304 -24307 -3722 17961 19454 8308 10167 21414 16357 -2543 -6583 12902 32703 30174 6329
317F329j8557q5O521l223n970O585J0901J114j1177j2130p270K997J4192J4849
331E076M384l981j708K433k098p245j446J4853J8683M28k0278j5651N917J0645
345A0012m622q978K190Q611k376j6072j3725J102J2357J0972J122m852n303j036
359a0598L437K869j914l74J2619J8034Q12j9344j4634Q209J7775K514j0226n834
373C345O829Q98j3295j5376j365J1963Q899j280o996r085m816J579P205N025L131
388c339Q302J0510M3j2779j1961O652J7309P617p849o500L702J379j1823j3712
402a2449J112J1317O313n663q849n639j374J308K473M241N081M675L947k315j0603
417f425p667Q989J9126P548r368r600K833N095o213j1447J339J2723P884o781
$$ plain form
317 6329 -12228 -12313 -5792 -9015 -14985 -8400 2501 3615 -7562 -19692 -26962 -23965 -9773 5076
331 5076 9460 5479 3771 6204 4106 -3139 -4585 10268 28951 29379 9101 -6550 -633 10012
345 10012 5390 -3588 -1398 7213 4837 -11235 -24960 -23858 -11501 -529 593 -4259 -9562 -10598
359 -10598 -7161 -4292 -6206 -6580 6039 24073 24885 5541 -9093 -884 16891 19405 9179 3345
373 3345 10174 11072 -2223 -17599 -18964 -7001 1898 618 -6378 -15463 -20279 -18700 -11495 -6470 -3339
388 -3339 4963 15473 15516 2737 -9224 -2572 14737 22354 14505 8005 11707 13086 1263 -12449
402 -12449 -11337 -20 6293 630 -8219 -13858 -15232 -13924 -11451 -7210 -2129 2546 6493 4178 -6425
417 -6425 -14092 -5103 14023 21571 12203 2603 5436 10531 4318 -7129 -5790 6933 14817 8036
431H036j2418o131J044K432L083K965P83l141k798j483l597k520O914J4908Q210
446A6287p967j1817j096Q099K210l049K115J0617M810r824j4498n389L676L527
460b299J877J163j92m187o066l785r4K285O516J0178M537p436j0689J542J0501
475C851M792k223J29P996L230j0551j3445l427P876O853j465k949j892m047l327
490h599j194J232J882K677N352L429m973q449K75J0201O647k315l432L341L508
505I582m605p356k09P177M973k130m888l611j833l396p52K041K203m70M37J523
521a314l032m225j59O805O383K23l347N11N035p11n269j228O416N667k848o067
537B840l745l70j538j274K56J774K61m87o54j949m136k112L985Q147J071l136
$$ plain form
431 8036 -4382 -10513 -9469 -7037 -3954 -989 -206 -3347 -6145 -7628 -11225 -13745 -6831 8077 16287
446 16287 8320 -3497 -4593 3506 5716 2667 4782 15399 20209 10385 -4113 -9502 -5826 -2299
460 -2299 -422 741 549 -3638 -9704 -13489 -13583 -11298 -4782 5396 9933 2497 -8192 -6650 3851
475 3851 8643 6420 6549 14545 17775 7224 -6221 -9648 -1772 5081 3616 667 -1225 -5272 -8599
490 -8599 -9793 -8561 -6679 -4002 1350 4779 -194 -8643 -8368 1833 8480 6165 2733 6074 9582
505 9582 4977 -2379 -2588 4589 9562 7432 2544 -1067 -2900 -6296 -7048 -5007 -2804 -3274 -2837 -1314
521 -1314 -4346 -8571 -8730 -1925 4458 4681 1334 1845 6880 6169 900 -328 6088 11755 8907 2840
537 2840 -905 -1275 -2813 -4087 -3831 -2057 -1796 -2283 -2937 -4886 -9022 -11134 -7149 998 2069 -1067
553a067L28N913K451l439l256L749P132J380n128n015l96L47k920k351m9n68k118
570e007k310j675j587j402K686N860L091j924j881L943M074j12k910K975Q479
585A2300L417n674p436l36K758k079l984r72K587n71m332l212j658K68J763M275
601b886L509k347m435q4L139J423j466K344Q625N027m787p616k52N399K907k405
617F095j323K334J33n227n820l680O71J642J420K84k957m086q37K589K724n93
633f631K647P119N609j953o620n05P275O792j187m054J99J617m384p742l906K766
649b958L160r97l074k339l516j996J758L450J700j051K812M598M52n219o33Q082
665D229Q310m32n646o45L093k156n365k319N115K712j986m673l991l716k656J979
$$ plain form
553 -1067 -739 5174 7625 4186 930 4679 11811 13191 8063 3048 2652 2999 79 -2272 -2321 -2889 -5007
570 -5007 -7317 -8992 -10579 -11981 -9295 -3435 -344 -2268 -4149 -206 3868 3756 846 3821 12300
585 12300 15717 10043 2607 2271 5029 2950 -1034 -2006 581 10 -4322 -7534 -9192 -8924 -7161 -2886
601 -2886 623 -1724 -6159 -6243 -3104 -1681 -3147 -803 7822 12849 8062 446 194 5593 8500 6095
617 6095 4772 7106 7239 2012 -3808 -7488 -6817 -5175 -3755 -3471 -6428 -10514 -11351 -8762 -6038 -6631
633 -6631 -3984 3135 8744 6791 171 -334 6941 13733 12546 8492 8691 10308 5924 -1818 -5724 -2958
649 -2958 202 -795 -3869 -6208 -9724 -11720 -9962 -6512 -4812 -5863 -3051 1547 1999 -3220 -3853 4229
665 4229 12539 12107 6461 5816 8909 6753 1388 -931 4184 6896 4910 237 -3754 -7470 -10126 -8147
681h147L748N22k152J72K348J84m573j817Q486R711l15m842k70M399J290m282
697D462k706M549L998j866n283k640j755k248j739K519Q97k712k520Q59J139l761
713h807l648O136Q969J12n635m7P524L437l762k259N476N478k458o056l019M13
729A854r65j409P40o71k912k275K279j276n926l442O984Q709q41o546j018O582
745a33M714k783k080M343O061O68m117l703o50L72P84O45j252l756j119J444j137
762a699m363k480L208O120p96n302l535K778L492m94o05L712N842P08l113k443
778A030M06K715K466J052L0j811j831k306l059k928k68L283L110k275n608l018
794i012R79K086k57J73L706N086K100l435l957M38N041M949O49j971p42K71j696
$$ plain form
681 -8147 -4399 -3877 -6029 -5857 -3509 -3325 -7898 -9715 -1229 8482 8167 3325 3055 7454 8744 4462
697 4462 1756 6305 10303 8437 3154 514 -1241 -3489 -5228 -2709 -1812 -4524 -7044 -6185 -5046 -8807
713 -8807 -12455 -6319 2650 2762 -2873 -2920 4604 8041 4279 2020 7496 12974 10516 4460 1441 1854
729 1854 889 -520 220 -451 -3363 -5638 -3359 -4635 -10561 -14003 -7019 1690 849 -5697 -6715 -133
745 -133 4581 1798 -282 4061 10122 10790 6673 2970 2320 2692 3476 4121 2869 -887 -2006 -562 -1699
762 -1699 -6062 -8542 -5334 786 -10 -5312 -8847 -6069 -2577 -3071 -3676 36 5878 6586 3473 1030
778 1030 1436 4151 6617 7669 7699 5888 4057 1751 -1308 -4236 -4504 -1221 1889 -386 -5994 -9012
794 -9012 -8033 -5947 -6204 -6031 -2325 2761 4861 1426 -2531 -2093 2948 7897 8546 6575 5833 6104 4408
811D408n267k362K189L515J330l522m435l497j50K240J949J50M8K534J986j928
827h12n937Q74P490N792J15m479p0J037j171k782j76L635K659p06l104m397l409
844e441q8K873K777m58k136j297J247k262l829J352P294N786j530m491n1J796
860A542N53n52O54N405J647k533m676l612n64M3J998K754j340k869k774p94j359
877f477j922J676O412M660k716n500j95M072K272j190J543M114K231l253n056
892F71j710M56J844J623L15j250l238j745m93j533j137R00N314K636k093n550
908d990q46L690L497K20Q94K282N15j577l927q97K459K780J197r50k438k616j663
925b370J76L83j12R5J208J370k849l535p55L139L048k87l63K000K027m27l087
$$ plain form
811 4408 -859 -3221 -1032 2483 3813 291 -4144 -7641 -7791 -5551 -3602 -3452 -3404 -870 1116 -812
827 -812 -6749 -5875 1615 7407 7522 3043 2973 4010 2839 57 -119 3516 6175 5469 2365 -2032 -5441
844 -5441 -5529 -2656 121 -337 -2473 -3770 -2523 -4785 -8614 -7262 32 5818 4288 -203 -254 1542
860 1542 2095 1543 2197 7602 9249 6716 2040 -1572 -2136 -2093 -95 2659 1319 -1550 -4324 -5118 -6477
877 -6477 -8399 -6723 -311 4349 1633 -3867 -4062 10 2282 1092 2635 6749 8980 5727 671
892 671 -1039 -583 1261 2884 3199 1949 -1289 -3034 -3527 -5060 -6197 -5297 17 2653 560 -4990
908 -4990 -5836 -2146 1351 1571 2465 4747 5262 3685 -242 -1139 1320 4100 5297 4347 1909 -707 -2370
925 -2370 -2194 -1811 -1923 -1828 -620 750 -2099 -5634 -6389 -3250 -202 -489 -852 1148 3175 2748 -339
942c39m86K752L233P94j603j660r02q69j455J31K39L58K97j104k371l672L35K315
960d007L088L4j282J056J679P52k725k60L654L455m44j739j291N5k7j124o84l86
978a96J004k16l51j935k163q81J652K363k92p88m62J620K81k049m89K538L326
995B962O76j960p85N96N06n57l34J044J560n35j705j817j365p16J291O69J27j508
1013a851j090P55n93m53p60K691L278J36j605j162J359P19M30J87M70J729q5j634
1031B521k215k153r6J519P87m79j050j883k67M15r82j9K463L395l73k417j813
1048b647J729J617J466k9J066J392j192k183j477P5Q18J221K32o88j724j859k74
1065b457k99K54m4R33J863l68k467j457R41K877K288m74J035J92j60k034j329
$$ plain form
942 -339 -825 1927 5160 5954 4351 2691 1789 920 -535 -404 -165 193 490 -614 -2985 -6657 -6322 -4007
960 -4007 -919 -885 -2167 -1111 568 1320 -1405 -1665 1989 5444 5000 3261 1970 2025 1998 874 190 -196
978 -196 808 592 241 -1694 -3857 -4738 -3086 -723 -1015 -1803 -2265 -645 -364 -2413 -2902 -364 2962
995 2962 3638 1678 893 1489 1995 1438 1104 2148 3708 3173 1468 -349 -1714 -2430 -1139 -470 -343 -1851
1013 -1851 -2941 -2186 -2779 -3232 -3992 -1301 1977 2113 508 -654 705 1424 1854 2041 2511 4240 4155 2521
1031 2521 306 -1847 -1943 -424 363 -116 -1166 -3049 -3316 -2901 -3883 -3902 -1439 1956 1583 -834 -2647
1048 -2647 -918 699 2165 2136 3202 4594 3402 1219 -258 -183 635 1856 2088 1400 -324 -2183 -2457
1065 -2457 -2756 -2502 -2546 -1613 250 -118 -2585 -4042 -3101 -224 2064 1590 2625 2817 2657 623 -706
1082g06J291K080J255o69j755j657j426j008P00M68P66l82K32l93k092j454J941
1099b809K933J211n90j69K29K39j219m51K297J760O18r47j584j380j024l92P44
1116e34J496K09o74j575j236j821j88J235K846J073j176o24O9N88m38P89J669
1133A708K822m59j858j764m33P42j28Q03N03j07j428j541q99j355M16N82K510
1150A14J75j413j780k00J244N70J170J806J637K70k757r94L48J321N46L06J236
1167C599m42k005k153j331L30N12J510Q90j381j241j816m58J049R33J101J535
1183F32J040L35k768j183J041K859Q93j55K94j75j386k478k80O12J502N90p76
1200E97o51j918j442j78O40J632P48O73L40p60j988o32J932K000J651J35n62Q1
$$ plain form
1082 -706 585 2665 3920 3251 1496 -161 -1587 -2595 -1895 -1427 -661 -1043 -811 -1204 -3296 -4750 -2809
1099 -2809 124 1335 745 576 805 1044 -175 -626 1671 3431 4049 3102 1518 138 -886 -1278 -534
1116 -534 962 1171 497 -1078 -2314 -4135 -4323 -3088 -242 831 -345 -969 -900 -312 -750 39 1708
1133 1708 4530 4071 2213 449 16 758 630 1433 1936 1829 401 -1140 -2039 -3394 -2978 -2396 114
1150 114 289 -1124 -2904 -3104 -1860 -1290 -120 1686 3323 3593 836 -158 190 1511 2057 2363 3599
1167 3599 3157 1152 -1001 -2332 -2002 -1490 20 910 -471 -1712 -3528 -3986 -2937 -2004 -903 632
1183 632 1672 2007 -761 -1944 -903 1956 2849 2694 2988 2813 1427 -1051 -1331 -719 783 1373 597
1200 597 -54 -1972 -3414 -3592 -2952 -1320 -572 101 441 -319 -2307 -2939 -1007 993 2644 2779 2217 2298
1218B298j008j849m04J385K368kj906j606l43o95p50N11R80J112l24p71j481k42
1236b727JJ454K752J310j099j795J05J019j155L94J890K219l14k992k921j71J251
1253g79O1P38M27P58j967k337n42M76P00J284K284J269j971k165j38J074Q23J038
1271A033J967J872p14l080k191M34P50J490m18J211l95j712l021j709P86J761
1287a936J642O94mj706j729N95J482P19Q37J639J288m70k285k197J075K242J011
1304B897j259n15J62j523j173j646O75K131J50k81r00r68j118N41J055J731L79
1321C38N66L83O0j591p03J748K269R70j210j566j31m26p13j273R33J762l50j779
1339g13j766n63k11P37R01J173P33m46l11m19K59n89Q06K985J727q50k213n06
$$ plain form
1218 2298 1290 -559 -963 422 2790 2788 882 -724 -1067 -1762 -2512 -2001 -1021 91 -233 -1004 -2485 -2727
1236 -2727 -2726 -1272 1480 2790 1691 -104 1 1020 -135 259 2149 4368 4054 1062 -1859 -2030 -779
1253 -779 -718 20 447 1205 -762 -3099 -3641 -3165 -2465 -1181 1103 2372 401 -1764 -1902 -828 -5 1033
1271 1033 3000 4872 4158 1078 -1113 -679 71 1561 1143 2354 1959 247 -2774 -4483 -3697 -1936
1287 -1936 -294 400 396 -1310 -3039 -2444 -962 -243 594 2233 3521 3051 766 -1431 -356 1886 2897
1304 2897 1638 1123 1285 -238 -1411 -3057 -2382 -251 -101 -382 -1282 -2250 -3368 -2827 -1772 -41 338
1321 338 904 1287 1347 -244 -947 801 3070 4040 2830 1264 1133 707 -6 -1279 -346 1416 1066 -713
1339 -713 -2479 -3042 -3253 -2516 -1615 -442 291 -155 -466 -885 -626 -1215 -409 2576 4303 3453 1240 734
1357G34R92q70q21L89J814N63j918k508j162K40N09j08J135O68j76q02J18j304
1375b507R54P21J949J825n88j234n51M38J023j018O84R23P04k054k550m43N47
1392a177L45p63J48K19J46r65q61J30O04R15J236J379k97n44k80P57JJ8P55J394
1412C160N92j846j843j085Q68J066j175n57J07l48j584m41J54J52Q95J338J096
1429E49q36r32J51J320M48N87J28J923j10q16k140J96R72J32k2l56p63n30j082
1448a181j530j01J131O55J300j009j078n22J03J002J140Q23M09R11L36j422j286
1465c19N90J026K310o70j334o55r31p21p16p6K08J066K25j131j305q93N33J236
1483a557N87Q26M04O74L73j235l70N72J631J578n93r38o38m25j70j030k41P26
$$ plain form
1357 734 1726 856 35 424 2238 2801 883 -1625 -2787 -2547 -2038 -2146 -1011 -343 -519 -1321 -1203 -2507
1375 -2507 -1553 -832 1117 2942 2354 1120 569 1007 2030 1012 1696 2619 3323 1269 -1281 -1724 -1177
1392 -1177 -832 -1595 -1447 -1228 -1082 -2047 -2908 -2778 -2174 -1259 -23 1356 1059 515 235 992 993 1011 1766 3160
1412 3160 3752 1906 63 -1022 -154 912 -263 -820 -713 -1061 -2645 -3086 -2932 -2780 -1885 -547 549
1429 549 -287 -1219 -1068 252 700 1287 1415 3338 3228 2412 272 468 1440 1572 1550 1194 431 -99 -1181
1448 -1181 -2711 -2812 -1681 -1026 274 -735 -1813 -2335 -2232 -1230 -90 733 1142 2053 2389 967 -319
1465 -319 271 1297 3607 2937 1603 948 17 -704 -1420 -1496 -1288 -222 3 -1128 -2433 -3326 -2793 -1557
1483 -1557 -970 -144 260 934 1307 72 -298 274 1905 3483 2890 1952 1314 889 719 -311 -552 174
1501A74J208j273j307j485l65Q09R21L61l06L28k74N58l91k81J411J656J582q96
1519B430j518o18J351N64l37p39J23M78n45j776j079l84M70R72l76l43q76N64
1537a639j3R9K80L34J470J436m21j376o6R26O73L13J15m21P69j362j278n63k31
1556i55P15k11k80k88n98k62m29n17J080L10Q03Q94k44j000O24J078J562o73p71
1575H38J033L60m2j093r09O80N25m79j497k69l12J81m83o12n55J253m4P05J06
1594f14l52j72O32J225j37P43P3O10K31p73p64L54R21o89k03j299qn53m51n89
1614a815N41j19J5K57n02r0L14N27Q9P63J30O23J30M87R8p54J228O99j78j010
1634A433q76J73m90q1q85p6k74O85p43r79N6j11Q37K60N79M3k55R22J15O8l68
$$ plain form
1501 174 1382 109 -1198 -2683 -3048 -2239 -1318 -957 -1263 -935 -1209 -651 -1042 -1323 88 1744 3326 2430
1519 2430 912 294 1645 2209 1872 1133 1256 1734 1189 -587 -1666 -2050 -1580 -608 -984 -1327 -2203 -1639
1537 -1639 -1652 -1553 -1273 -939 531 1967 1546 170 104 1030 1703 2016 2131 1710 2479 1117 -161 -724 -955
1556 -955 -240 -451 -731 -1019 -1617 -1879 -2308 -2825 -1745 -1435 -632 262 18 -982 -358 720 2282 1609 838
1575 838 1871 2231 2189 1096 187 867 1392 913 -584 -853 -1165 -984 -1467 -2079 -2634 -1381 -1425 -720 -614
1594 -614 -966 -1138 -506 719 582 1325 1398 2008 2239 1466 702 1056 1977 1288 1085 -214 -222 -775 -1226 -1815
1614 -1815 -1274 -1393 -1378 -1121 -1623 -1713 -1399 -872 -783 -20 110 733 863 1350 1448 694 1922 2621 2443 1433
1634 1433 557 730 240 159 -726 -802 -1076 -391 -1134 -2113 -2057 -2168 -1331 -1071 -492 -449 -704 218 333 401 33
1655C3J361Q68k52n25m36M94n16k38M89j028p47Q6o52k37N2j97l3O88l80n1j16
1676a337P06K5L58N30L91Q01m08R7O8k6P18p82j10l24K0K58j064n91j12K70m59
1697i71m25j4q0k87Q94K66l23J61L29P66m8K81m93Q82R01J38o06m84L6J04P9j102
1719Dnj75M1p55Q7k93q9l92O95K06j87m19J86R62M18L0J82m8Q73j29l57M99J67
1742A501O15n48q63Q1k62l56o80l72J41L01l79k09l43L7l33O86Q69n28k20oJ570
1763G02J44p35K31J282O95q46m77j64N21l11r58j66j00J70p64k99o72L65L00Q8
1783i94Q18j21o83K73J241p26M36m10J252Q17o35o68J45K61L38p64O27l86j34
1802F87r48o30K98j2R0q92M04j63j0R2K7M12J89j67J126L25m88l25N97J042m05
$$ plain form
1655 33 1394 2262 2010 1485 1049 1543 1027 789 1278 250 -497 -411 -1063 -1300 -1248 -1445 -1478 -790 -1170 -1221 -1337
1676 -1337 -631 -606 -248 282 673 1474 1066 1163 1231 1205 1923 1141 1031 707 727 985 -79 -670 -782 -512 -971
1697 -971 -1396 -1410 -1490 -1777 -883 -617 -940 -779 -450 316 268 549 56 938 1839 1977 1371 887 923 1027 1106 4
1719 4 -1 -176 -135 -890 -803 -1096 -1185 -1577 -882 -676 -863 -1282 -1096 -134 284 314 496 448 1321 1192 835 1334 1501
1742 1501 2116 1568 705 786 524 168 -512 -884 -743 -442 -821 -1030 -1373 -1336 -1669 -983 -114 -642 -862 -868 702
1763 702 846 111 342 1624 2319 1473 996 832 1353 1042 84 -82 -182 -12 -776 -1075 -1747 -1382 -1082 -994
1783 -994 -176 -297 -980 -707 534 -192 244 -166 1086 1903 1268 600 745 1006 1344 580 1207 821 687
1802 687 -261 -891 -593 -605 -515 -1407 -1003 -1166 -1176 -1084 -1057 -645 -456 -623 503 828 340 15 612 1654 1249
1823A249m69l2J4n1j16o36P9j03n95K74l53n86l64R19J17N0j04J56K42m7M85n10
1845c81J170j90N50j54l44O54p39j2K5J60r90M93j82l59n77j63M66K59j091M33
1865i72K20N60k45k99K51M42L31P6N66n3K20j6j87L17m82l87k4N55l29n92j49
1886a97P4j01o98j20k79L83O4oQ5M76m5p4P64J08k11L76N66K94k53m37j56N38
1908A151l11m63r7l45k38l60j33n2J86l83k83P6Q21q58M36M04L62O18m38N23K07
1929H23J54m59K28M6J5m13L83L66j122J84J17n46j8l77O0l74l81L6j43P24K41
1950d56m86M40L53N75p10L10P27O78n85L1Q7O1l99M56p75L14m27k68N02p93n47
1971i12l81J67L58J92p92J23Q52q4j00M22L08M96K6OL57j40l43N7K65m3j60o02
$$ plain form
1823 1249 780 748 762 711 595 -41 38 -65 -660 -386 -739 -1325 -1689 -770 -653 -603 -707 -551 -309 -356 129 -381
1845 -381 789 599 1149 995 651 1305 566 554 579 739 -251 242 60 -299 -876 -1039 -573 -314 -1405 -972
1865 -972 -752 -192 -437 -736 -485 -43 288 364 930 877 1097 1081 894 1211 729 342 318 873 544 -48 -197
1886 -197 -123 -224 -922 -1042 -1321 -938 -874 -880 -795 -319 -364 -438 326 434 223 599 1165 1459 1206 769 613 1151
1908 1151 840 377 280 -65 -303 -663 -796 -848 -662 -1045 -1328 -1252 -431 -1289 -853 -449 -87 531 93 616 823
1929 823 977 518 746 792 807 394 777 1143 21 205 322 -224 -242 -619 -559 -933 -1314 -1278 -1421 -697 -456
1950 -456 -942 -502 -149 426 -284 26 753 1431 846 877 964 1025 626 1082 307 621 194 -74 428 -365 -912
1971 -912 -1293 -1126 -768 -576 -1368 -1245 -393 -477 -577 -155 153 649 675 681 1038 898 555 612 877 834 674 72
1993G2N34j52j290n01N07L27m4m25K67r2L29q44J27N07R26Q0n5J20P4L68J52o09
2015C78O37K43n41L59n46k20q94N17J17m47n96J32P42o84q88J25Q46K35J93M7
2035b45m7M41L22n36N52L9N32M69l94l81q6j8k60pp5j119L78k47k9r73M16N08
2057g60j71L19o01L08N20K29J71j74R1O30O13m21k31N14k24K79k53n79k47l82
2077c69J40j22n30j17j16O74L9o89n56Q72L14m58L42L91%L14Q36o23L0QQ93j91
2099A082l22j68m86K11n33q9k54L14J62m08o05p25P07O30l3j79j51N84Q22l97
2119A62l51M4O19N18qk16j07L88k95l14p3o5K66l95j18o95j90j48N86k06k83o1
2141i42L71K78J45k03k59K24J448J00o92l9P83l5o08q9j77L70L75m27q29k34J14
$$ plain form
1993 72 606 454 -836 -1337 -830 -503 -547 -972 -705 -797 -468 -1312 -1185 -678 248 328 273 393 467 835 987 378
2015 378 1015 1258 717 1076 530 310 -584 -67 50 -397 -993 -861 -119 -803 -1691 -1566 -720 -485 -292 -245
2035 -245 -292 149 471 -65 487 526 1058 1527 1133 752 666 648 388 381 306 -813 -435 -682 -711 -1684 -1268 -760
2057 -760 -931 -612 -1213 -905 -385 -156 15 -159 -68 562 1175 754 523 1037 813 1092 839 260 13 -369
2077 -369 -229 -351 -881 -998 -1114 -440 -401 -1090 -1646 -774 -460 -918 -576 -185 -185 129 965 342 372 380 1273 1082
2099 1082 760 592 106 317 -216 -305 -559 -245 -83 -491 -1096 -1821 -1114 -484 -517 -696 -847 -263 559 162
2119 162 -189 -145 474 992 984 768 661 1049 754 440 367 302 568 173 55 -640 -830 -978 -392 -598 -881 -942
2141 -942 -571 -293 -148 -351 -610 -386 1062 1162 470 431 1214 1179 571 482 305 675 1050 623 -206 -440 -326
2162c26l52j96j8N00k54o1M3l9PN14N45k16L99l05J67R00q67L56L23k35M79k86
2184A078q30n23P5K78m80j7J3j84j04P7o73j27O86N24L54R8j024Q12M83p02P32
2205E46j21Q07L0k21n95j81J78l24L72j36m55j06J4k45m67l09k56J087o81o1L90
2226g34j2N86L0k5O07L52j27J05r61o6J201k93j12K5R4p24L66j026p4J3O8N64
2248a43j65k10j157Q03L40K25k01P28J05N96q58M5j6M35M27K5j17l39j5l66o2
2269H0k39j9j70J22n49q47N64J02o0K86K3L31O67k84K81l95k7R28N82o43O2n12
2291B83L80j8m55J27O32k96p74lm04m13k26J70Q09j96n05P39k51j49J49M45O88
2312G32L21l24j98j18O2L50n16P6L53o12j8m23q9L02j91K02R2o68j76L06j30j31
$$ plain form
2162 -326 -678 -874 -892 -392 -646 -707 -664 -703 -696 -182 363 147 546 241 408 1308 441 797 1120 885 1364 1078
2184 1078 248 -275 -200 78 -402 -419 -406 -590 -694 -617 -1290 -1417 -731 -207 147 245 -779 33 516 -186 546
2205 546 425 1232 1262 1041 446 265 443 119 491 355 -100 -206 -192 -437 -904 -1213 -1469 -382 -1063 -1124 -734
2226 -734 -746 -160 -130 -155 452 804 677 782 -179 -245 956 663 551 576 670 -54 312 -714 -788 -775 -707 -143
2248 -143 -308 -518 -1675 -872 -532 -307 -508 220 325 921 63 108 92 527 954 979 862 523 508 142 80
2269 80 -159 -178 -348 -226 -775 -1622 -1058 -956 -1016 -730 -707 -376 291 7 288 -107 -134 794 1376 733 795 283
2291 283 663 645 190 317 949 653 -121 -124 -528 -941 -1167 -997 -188 -384 -889 -150 -401 -550 -401 44 732
2312 732 1053 729 531 413 475 825 309 385 738 126 108 -315 -404 -102 -293 -91 1 -667 -843 -537 -667 -798
2334g98K1O82L61L33p26L94K08L28k08K62n05K11N96m52j76r03J19J47K41l44
2354b09m45n2N08k32n43k1M97L36k69P4J26K90L19J21K3q7L14K85l40j43l75J21
2376B98L57k91j87j2n20r6j76o56O72l71K74K79K75m81P5J0N27OK31M12j25J25
2398F26l57l2L70K63n9m68J36l39m16K38l24k00J01N79n11n05O4N0L10O76m02
2419b00k5O77NL90m33l75P53k84M28k75m35K08l1K37q95L09k21l08N8p30K08K25
2441g14k2J37k02M71K5k1P95p14K53O53j76Q4R3k61O75n41m59N01k35m04M41o96
2463c17J55k75k8J29l72o7L7L39j68k44M91N8l00P02K4J27p0K02L30K11n83k37
2485A44L41K72j91n61n38N67K1k52n73K83Ln2j36p15J157k02N15r6L42P2k5K49
$$ plain form
2334 -798 -777 -95 266 599 -127 267 475 803 595 857 352 563 1159 707 531 -372 -253 -106 135 -209
2354 -209 -654 -706 -198 -430 -973 -994 -497 -161 -430 -356 -230 60 379 500 523 436 750 1035 695 552 177 298
2376 298 655 364 177 165 -355 -451 -627 -1283 -611 -982 -708 -429 -154 -635 -560 -550 -23 -17 214 626 501 626
2398 626 269 237 607 870 811 343 479 140 -276 -38 -362 -562 -461 118 -393 -898 -834 -784 -474 202 -200
2419 -200 -225 452 457 847 414 39 792 508 936 661 226 434 403 640 -255 54 -167 -475 -417 -1147 -939 -714
2441 -714 -736 -599 -801 -330 -305 -326 469 -245 8 661 485 569 662 401 1076 535 76 577 342 -62 379 -317
2463 -317 -162 -437 -465 -336 -708 -775 -738 -399 -567 -811 -320 -262 -562 140 164 291 221 423 753 964 381 144
2485 144 485 757 566 5 -533 34 55 -197 -770 -487 -484 -536 -672 -1387 -230 -432 83 -13 329 401 376 625
2507F25l93L90K6n98P08m26M25j58m82N20n05j75j13J63o78l1N38o00N6L11J13
2528b84%K44M33q6J4p01M25L96K13o07K33Q7J42j74k24k6J4m55L38N6l71k21m68
2551a022O73O9m42K38O1q9N23K51l01N38M4l90O95n25N42j34k84l28K65q3j8r56
2573f73M1N06p3n11J31j63r3%N84k29J92j48M22m2J05j7J05K64P6N07l97J27q
2596G06J10j118O74K6j71j1o91k54N5J52M35k32l99J79J97j1N95J01J5j74R5J03
2618C82K34k51P4J13n75Q0L76k20l12l31r3j81m37Q22J18o32j8O25J18n05L19
2639b94K93l66M79n47R43n6J56r8L04o67J04N46m45k14j82m11N8N32n25k60J20
2660e30k19M80k75K27K93j02n9J10j33O70K66j41q4j93L28k23n7j07L7k32J56
$$ plain form
2507 625 232 622 648 50 758 332 757 599 117 637 132 -43 -156 7 -671 -702 -164 -764 -708 -397 -284
2528 -284 -284 -40 393 307 321 -380 45 441 654 47 280 367 509 335 111 85 99 -356 -18 38 -333 -554 -1022
2551 -1022 -349 -280 -722 -484 -423 -512 11 262 -39 499 543 153 848 323 865 731 447 119 384 301 283 -673
2573 -673 -632 -126 -199 -710 -579 -742 -835 -835 -251 -480 -288 -436 -14 -56 49 32 137 401 477 984 587 714 706
2596 706 816 -302 372 398 227 216 -475 -729 -674 -522 -87 -319 -718 -539 -342 -353 242 343 358 184 279 382
2618 382 616 365 439 552 -23 57 433 213 -99 -430 -523 -704 -1141 -319 -201 -833 -851 -226 -108 -613 -294
2639 -294 -1 -367 112 -435 508 452 608 510 814 147 251 797 352 138 -44 -455 -397 135 -390 -650 -530
2660 -530 -749 -269 -544 -317 -24 -126 -185 -75 -208 462 728 587 503 310 638 415 358 251 288 56 212
2681B12ll71m92k80N29J02j11J94l08K67r7M63jP3Q7K34k25j9K00M66J80q84K92
2704E08J11l05k81L73n14J6N00n32k83O2J83k31n46L18N46l92K88J59l06j0L35
2725aJ94R01k68k93P1k76J67Rl47K75q43N8K3k14J30k21L45k33J0J59j39j16M84
2748a25p7m8l90P35m4L02NO00n5q51N28m00J94J99l12J50r02L55J58n73m9J4Q71
2771B85n90k5l17O31p74O34M59m33O41m56L29l91J16L78j98K07p11L55J93k17
2791A16k28K62k94j22k9m14J41K04K1L00k77M5K95k25J10j79N92J63o3J10N1J09
2813F88j31j89l3J10n31M5RO73j010j53L44n46N68k08m4p2J83K20QJ43l7K30J33
2836D00M1M0K7L14o89M90k42k9k57K77q62P19o84jJ80l34O43n93M40k5o20M10
$$ plain form
2681 212 209 -162 -654 -934 -405 -303 -414 -220 -528 -261 -358 105 104 177 264 498 273 254 454 920 1100 216 508
2704 508 619 314 33 406 -108 -92 408 -124 -407 -345 -162 -393 -939 -621 -75 -467 -179 -20 -326 -336 -1
2725 -1 193 1094 826 533 604 328 495 504 157 432 -411 -353 -330 -544 -414 -635 -290 -523 -513 -354 -493 -609 -125
2748 -125 -202 -250 -640 95 51 353 358 958 903 52 580 180 374 573 261 411 -491 -136 22 -551 -600 -586 285
2771 285 -305 -330 -647 -16 -790 -156 303 -130 511 55 384 -7 109 487 289 496 -215 140 333 116
2791 116 -112 150 -144 -266 -295 -709 -568 -364 -343 -43 -320 -275 20 -205 -95 -274 318 481 418 528 579 688
2813 688 557 368 335 445 -86 -41 -32 641 -369 -522 -178 -724 -156 -364 -408 -480 -297 -77 -69 74 37 267 400
2836 400 441 481 508 822 133 623 381 352 95 372 -490 229 -455 -456 -276 -610 33 -560 -120 -145 -765 -355
2858c55K57n6l3M40j6P4L23j3M3l90J21L06m88J06n03J06j55k73M39n85l9o7L69
2881c89J95m71L9Q51o5l66o1O05K38Mm42N43l02j01L74l62m0k94l4N7J33l46J92
2904d2n64L37k57R7J11k69Q89p72M29m90P85J4J37m23M45L38m39K61l65L12o15
2925h1L54l97m5Q8R2k40r6o1Jk85J55k51J93K34J38KQ5M94p73R52l50k6Q2l29
2949f4P23J47m83j88K31l06J39J37m46n03L48k23K15m98j57J059m14k33K40M27
2969A51K7j05N7K96k45K82Ll19J36K29n97K18o17R64o57l54L46m59J60n0k29L55
2991d08J1J08n5M84k26j74J58N45o60N79l88Q24m84K54n32P4O73m80l03J06R0
3012A96l37k7m34N85m19K25j95J13M72n07j3J60O27j9o46M74J33k58J89l6k00
$$ plain form
2858 -355 -98 -154 -187 253 237 311 634 621 664 274 395 701 213 319 -184 -78 -233 -506 -67 -652 -691 -758 -389
2881 -389 -194 -665 -626 225 160 -206 -267 338 576 580 138 681 379 278 652 290 250 -44 -78 -21 112 -234 -42
2904 -42 -606 -269 -526 -429 -318 -587 302 -470 -41 -531 254 268 405 -18 427 765 326 587 222 534 -81
2925 -81 273 -124 -169 -81 11 -229 -325 -386 -385 -670 -515 -766 -573 -339 -201 -199 -114 380 -393 559 209 183 265 -64
2949 -64 659 806 323 135 366 60 199 336 -110 -613 -265 -488 -273 -771 -928 131 -283 -516 -276 151
2969 151 178 73 130 426 181 463 466 147 283 512 -85 133 -484 480 -177 -531 -185 -644 -484 -534 -763 -408
2991 -408 -397 -289 -344 140 -86 -260 -102 443 -217 362 -26 798 314 568 36 110 783 303 0 106 196
3012 196 -141 -168 -602 -17 -436 -211 -406 -293 179 -328 -341 -181 446 427 -219 255 388 130 319 283 83
3033H3N54n45k54J99j78k4o05Q35k42m69L63m34j5K07O82p38p4N86J32J12J6K74
3055D65Q5n1m35P4n1L65j8m01j29J71q1L99n04r3k86l18O71j66J48l19J62j30
3077d42N75n62M09k76M52k16K14J96O8l81N5l4L41M08m60m48j33J44m83M67j46
3098b52jn41M77n7J53m81L87L68j38L27k87L44J00j88J69J05N02q04ML91n11q0
3120a3k52p8N5q3N76o47M49k60R0k65p5L40l29O62m41M8N56pj24j14M76j82k19
3143A63n4N6q7k45N85n06L12k97P1l31r1j04M47k24%K84k22k8K94K4K77n12O34
3166D46J63q61N68k4L33r12L83k13P99p75j39l32N31J37l55l69L86m44L89L82
3186I3l7J2m9l04P20j42P5J55l72M29k22J2j8J71k08k42K56m51J37P9n41j91Q4
$$ plain form
3033 83 637 92 -162 37 -141 -165 -770 65 -177 -646 -283 -717 -732 -525 157 -581 -655 -69 63 175 191 465
3055 465 550 499 64 138 87 452 434 33 -96 75 -6 393 -111 -204 -490 -808 -137 -303 -155 -474 -312 -442
3077 -442 133 -429 -20 -296 156 -60 154 350 418 37 92 58 399 807 347 -101 -234 -90 -573 -106 -252
3098 -252 -253 -794 -317 -374 -221 -702 -315 53 -85 242 -45 299 399 211 380 485 987 183 187 578 67 -13
3120 -13 -265 -343 -288 -371 205 -442 7 -253 -163 -428 -503 -163 -492 170 -271 -223 333 326 202 88 564 382 163
3143 163 109 165 78 -167 418 -88 224 -73 -2 -333 -424 -528 -81 -305 -305 -21 -243 -271 23 47 324 -188 446
3166 446 609 -252 316 292 625 -287 96 -117 682 -93 -232 -564 -33 104 -251 -620 -234 -678 -289 93
3186 93 56 68 19 -285 435 293 368 523 151 580 358 370 352 523 315 73 329 -122 15 94 -447 -638 -554
3209e54p0l43P92p6p8o3O58l27n8J06N10k60N17j60l29K67Ln08N73p11L08J81
3231C78Q0p70K91k41l6l2M45o16K34j41M41l60M06l35M65j18K74k7K37m21L53
3252E07m6k12p2m05N53o02L75k31K83l44N3j84J79J61l48K7J42l59K41M06R0J20
3274C34j53j28K04J61j33k60J85J76j89m00K16L93n29o0L21l09m50J64r2L46j82
3295c85M03n69N02q4j56K30j4N19n1k53L2J72J58l70K34J13n16O3k7K41l54J19
3317Gk90J5k93l0l29P52k05L54k01M41k00l55O15J13n18O0mL06l12K33K38n73
3339a76KJ31M7J24m61K93n81L04J72l38J75k98M27o5L14j77M97m37L38j82KN5
3361A66L53K4n42K23m81M55K5j9l61l1N8m29J12k23M70m08O41o91P72l40J42J61
$$ plain form
3209 -554 -624 -967 -175 -251 -329 -392 266 -61 -119 -13 497 237 754 594 265 532 535 27 600 -111 197 378
3231 378 458 -312 -21 -262 -298 -330 115 -501 -267 -408 33 -327 79 -256 209 91 365 338 575 154 507
3252 507 461 249 177 -228 325 -277 98 -133 150 -194 -141 -325 -146 15 -333 -306 -164 -523 -282 124 214 334
3274 334 181 53 257 418 285 25 210 386 197 -203 13 406 -123 -183 138 -171 -621 -457 -549 -203 -385
3295 -385 18 -551 -49 -133 -289 -59 -73 446 395 142 174 346 504 134 368 481 -35 28 1 242 -112 7
3317 7 -283 -268 -561 -591 -920 -168 -373 -19 -220 221 21 -334 281 394 -124 -64 -68 238 -74 159 397 -176
3339 -176 -174 -43 4 128 -333 -40 -621 -317 -145 -483 -308 -606 -179 -244 70 -107 390 -47 291 109 111 166
3361 166 519 543 1 224 -257 198 223 204 -157 -188 -130 -559 -447 -670 -200 -608 33 -658 114 -226 -84 77
3383G7l44M11j35l9K52R7l74L94n93P53m96J19j20p8o45M26N18n06l62M18m04
3404f31R3N20j91J31J03o3P7r9L73k42J089j039N52l20n82L42o1l05N49j9k66
3425A1Q2n48J56k6J43j88L76p36M22N89n94M53n3J37J41m3l30J50j4k97M54J01
3447C86p54L77J08J6m40k92n8K30K01j037Q64L31M3l49M36l8J67L0j54M88m11
3468A44m14L28QL43m1R7j3n8l40l19l37M41o7N15k43l86N3N5O1R0MJ04K03j25
3492A03O4o9J55N49l76j59N48o36m3K92q7k35l02L72q0l37j35J06L12j97l72J77
3514c50K76o3N03p49K02M05M3j49P6j3K68%j0j90l6Nn08M14q8l00J88J54l28J63
3538h7m14J17R4K4L63l5n93N21J71O5k26M73m94L54m58L96j62R9L9o8l9o2O0k47
$$ plain form
3383 77 -267 144 9 -30 222 319 -55 339 -254 499 3 122 2 -76 -721 -295 223 -283 -645 -227 -631
3404 -631 -538 -18 -209 -78 25 -38 39 -60 313 71 1160 121 673 353 -229 113 52 -253 296 277 11
3425 11 93 -455 -299 -325 -182 -370 6 -730 -308 281 -313 140 87 224 365 322 -8 142 128 -169 285 386
3447 386 -368 9 117 133 -307 -599 -657 -427 -226 -1263 -399 -68 -25 -374 62 24 191 221 67 555 144
3468 144 -270 58 66 409 368 465 452 394 54 -265 -602 -161 -228 287 44 -342 -289 -234 -173 -83 -79 25 228 103
3492 103 167 98 253 802 426 267 815 179 136 428 341 106 -196 176 96 -241 -376 -270 42 -155 -527 -350
3514 -350 -74 -137 366 -383 -181 224 267 118 194 181 449 449 439 249 213 218 -290 124 36 -264 -76 78 -250 -87
3538 -87 -501 -384 -290 -266 97 62 -531 -10 161 226 0 473 -21 333 -125 271 109 208 247 179 140 78 138 -109
3562a09l24O23j5k25j14k83K56J41j22Q3l1N43m05M64k67k41J74K53n1Mo8J46
3584D32k17K10l23J5J14j12l52j33K03m56O6J35K42n6j87jJ47P47n12k78P69k14
3606B39P9l44Q6l55K06M48J37n37K59m57j90K43J38k89J21l7j87K63j44J78J82
3627C9J04O7m17M55K45k69K87q32N48j6L68j15K15o06J03m85M05l19K86m74L44
3648f7l70q8P19n32J15J40L35r1n14L64l2n5M63k63l70O03k78J7M10n79L91j24
3670A94j00k1l0k97m7K71l71K93k62M01n07J80j76O79j75J65J35j59k27L61k03
3691A04lm4K32l90m9l5J79L16p57K25J79k63m41L28N28o46J90K76k19R2M16N28
3713G46K4n0q48J32N69n44K32j61N64o52p3J28k29K35o9j62R9m52K43K53O9J71
$$ plain form
3562 -109 -433 190 175 -50 -164 -447 -191 -50 -172 -89 -120 423 18 482 215 -26 148 401 350 354 286 432
3584 432 215 425 102 117 231 119 -233 -366 -163 -619 -553 -418 -176 -232 -419 -420 -273 474 -38 -316 453 239
3606 239 318 -26 60 -295 -89 359 496 -41 218 -239 -429 -186 -48 -337 -216 -253 -440 -177 -321 -143 39
3627 39 143 210 -207 248 493 224 511 -321 227 211 579 464 679 73 176 -309 96 -223 63 -411 -67
3648 -67 -437 -525 194 -338 -223 -83 252 161 -353 11 -21 -76 387 124 -246 357 79 96 506 -73 318 194
3670 194 94 73 43 -254 -301 -30 -401 -108 -370 31 -476 -296 -472 207 32 197 332 173 -54 307 104
3691 104 101 57 289 -101 -150 -185 -6 310 -447 -222 -43 -306 -747 -419 109 -537 -347 -71 -290 -198 218 746
3713 746 770 720 -128 4 573 29 261 100 664 12 -61 67 -162 73 4 -158 -59 -511 -268 -15 54 225
3735B25n56j31J32J15J24K70J10p4r1l12O63r60O65k13L3K47k09k02o1M28k64
3756f1k7j51j46J37q0l03N72k67L04j16j81M87l37J73N44j69o20M2L89L1k3j8
3778A80O9l27L2K34l18j85J23j57J59L1Q6l22M0rL8N73m62O76l23j1P4K93j69
3801C25m81M29k73l51O12o67N56k01k12J10J21P1J04n77L24k24L34J82m53L19
3821D8l20K03K86J79l01K90j05j83oJ99k56q1M01k81k95J45O2N7k66OK68p15K24
3844d41L94l20L74k96Q2K99q9M27J43m25K25Oo34M05M39n21L55r29J12Q1k32J04
3866d41L47q7J8l61Q4K07K2L60K59l2l22L19p47O02J49O9j62j61l66M81l38M1
3888e9M70n89K28Ln62K18p1L38j09L10k64j88j41M2K30J70O7p2M0O4n20L69K91
$$ plain form
3735 225 -331 -462 -330 -215 -91 179 289 215 124 -188 475 -485 180 -33 0 247 38 -164 -225 203 -61
3756 -61 -88 -239 -385 -248 -328 -631 -59 -326 -22 -138 -319 168 -169 4 548 379 -241 -199 190 221 198 180
3778 180 249 -78 -46 188 -130 -315 -192 -349 -190 -159 -73 -395 -355 -364 -326 247 -215 461 138 127 201 494 325
3801 325 -156 273 0 -351 261 -406 150 -51 -263 -153 -32 39 143 -434 -110 -334 0 182 -271 48
3821 48 -272 -69 217 396 95 385 280 97 91 290 34 -47 354 73 -222 -77 -15 42 -224 -218 50 -665 -441
3844 -441 -47 -367 7 -289 -207 92 3 430 573 148 373 379 -255 150 589 68 423 -506 -394 -313 -545 -441
3866 -441 -94 -181 -163 -524 -440 -233 -211 149 408 376 54 373 -374 228 377 446 284 123 -243 238 -100 -59
3888 -59 411 -178 50 53 -509 -291 -362 -24 -133 177 -87 -275 -416 -374 -144 26 93 21 61 125 -395 -26 265
3911B65j29M29n34J87l14Qj1Q6K57n12L28m33N65j02m33J37M06k42k85Q28l63
3932A38m10O73mn07J09jk23L76j54L12j82j13J01m23K15q0r2P2o36P82l61L30
3954g8p51N08P0J24O3M88j69Q8J98o24N29m62N77l55J7l9p0l82M49m27K17P7r8
3977e0P6j13J78j39j24L73k82J94m40L97m95K30O59R6o54O4N68k68l16n9K00l31
3999b36P21l76k1J07k12k9J10j41J7J90l4J10P6o55P88O3n29J69m3j3K49M0m03
4022e2M18k0o71M80ql89J1m63P21j30l12l80O01M37n46J52J38j33M78O1l84M92
4044E01n47L73l34l30K99om56P84l09Q5J32m87Q59p54m12L64K22j85J8K44n5k3
4066a7M21o14O74k00n26L49J0R7j31M44Jm02Q9q2q6K56n58N57n21M53n59P0k42
$$ plain form
3911 265 136 565 31 218 -96 -88 -99 -13 244 -268 60 -373 192 90 -343 -206 200 -42 -327 501 138
3932 138 -272 401 397 -110 -1 -2 -225 151 -3 309 127 14 115 -308 -93 -173 -265 -193 -829 -47 -408 -78
3954 -78 -829 -321 -251 -127 -64 424 255 343 541 -83 446 -16 561 206 223 184 114 -268 181 -246 -29 48 -50
3977 -50 26 -87 91 -48 -172 201 -81 113 -327 70 -425 -195 464 560 -94 -30 538 270 -46 -105 95 -236
3999 -236 485 109 88 195 -17 -46 64 -77 -60 130 96 206 282 -373 415 478 -51 118 75 62 311 351 -52
4022 -52 366 346 -325 155 147 -242 -231 -694 27 -103 -415 -795 -194 243 -303 -151 -13 -146 332 393 9 501
4044 501 -46 327 -7 -337 -38 -44 -500 284 -25 60 192 -295 564 -190 -602 -238 -16 -201 -183 61 6 -17
4066 -17 404 -210 464 264 -262 87 97 194 63 507 508 106 195 113 27 283 -275 282 -239 214 -345 -275 -517
4089e17L67K13rj46N67k43j57L32n73J58k65N95m83K12j24M01Rk27l49L9q9L25
4111C6J04l86J54K06o20J30N92k53J91j99p9k09K90l26K69L20L2J92o51rN77l86
4133b5K23j23K65l22Q3p7j55n1M1J1K61kL00l51m0l25J62K59k19K96j15J76l01
4156b9m03P93J71m92L97m66O9l10J2J06l70O11J37l89j27k54J50n8J05K8N31k30
4178a8j01q3J72l3N50q4p09J10K6N70m97j48N64k36P5k39j24j78J98O27k11o29
4200c98L65j27jn3P2L87k06J81n56K22j17n5O30n17M69j75j72K28j46m01J0K16
4222a44k5kL35m70O5k5R5J49K63m4J3P9l15j5J46j80K69l77P08l89L41m22N5P0
4246A80j70k4M7j98J02l53L00o0J87K31o57K22K7n48J042mp14J030m13M88p40
$$ plain form
4089 -517 -150 63 54 -92 475 232 75 407 -166 -8 -273 322 -161 51 -73 328 337 110 -239 -200 -289 36
4111 36 140 -246 -92 114 -506 -376 216 -37 154 -45 -124 -333 -43 -369 -100 220 252 444 -207 -216 361 -25
4133 -25 198 75 340 18 101 24 -131 -182 -141 -130 131 129 429 78 38 -287 -125 134 -85 211 96 272 -29
4156 -29 -432 361 532 40 437 -29 40 -270 -258 -152 -522 89 226 -163 -290 -544 -394 -452 -347 -319 212 -18
4178 -18 -119 -202 -30 -63 487 403 -306 -196 -170 400 -97 -245 319 83 158 -81 -205 -383 -185 442 231 -398
4200 -398 -33 -160 -161 -214 -142 245 39 220 -336 -114 -231 -286 344 -173 296 121 -51 177 31 -370 -360 -144
4222 -144 -169 -171 164 -306 -241 -266 -171 -22 241 197 210 289 -26 -41 105 -75 194 -183 525 136 477 55 110 180
4246 180 10 -14 33 -165 -63 -416 -116 -176 11 242 -415 -193 -166 -714 328 324 -390 640 227 715 -25
4267b5q6M8L4m2LL94j17j70j66N50l07J97o87J42J64L68p52K89p7n7Q7J24K59
4290A73J69k35K68L7n02K66nO1o34K20l26Q28k61j90L02k65k01l19M95m12O70
4311A39K55p94O19O1l10K61p9j31k65J58R4l47J78J72J68n36r8L08J61j4J87M41
4333F28q85K20l36O25o45n4L11J59l71M51L08p48N88j68O6K9l00L70O3p95K2L81
4355h1k2J42n9J25J89n64K39n94L64O16m74K50j28l96K66J86l12J42j39P30l77
4376A03l1J65L64o33k4p2L46n23m2K64l2K7K77n22M55k12j54p5r1M24k13M16j74
4399D3j34L62l91O75m19o58N52k35R1n18J86P29ok96j67j76J1o7K03L29k14J06
4421FP7k71j41K49l83L06R4L52m26m6M64j20j07k52L09n27N10l20K97j91k3K74
$$ plain form
4267 -25 -111 -63 -29 -71 -68 326 209 39 -127 423 116 313 -374 -232 -68 300 -452 -163 -240 -297 -210 -86 173
4290 173 342 107 375 412 -90 176 171 232 -402 -182 -508 320 59 -131 171 -94 -295 -614 -119 -531 139
4311 139 394 -400 219 280 -30 231 152 21 -244 -86 8 -339 -161 11 179 -357 -455 -147 14 0 187 628
4333 628 -257 -37 -373 252 -393 -447 -136 23 -348 103 411 -337 251 83 149 178 -122 248 311 -484 -462 -81
4355 -81 -103 39 -20 105 294 -270 -31 -625 -261 355 -119 131 3 -393 -127 59 -253 -111 -250 480 103
4376 103 72 237 601 -32 -56 -128 218 -305 -347 -83 -115 -88 189 -333 122 -90 -244 -319 -410 14 -199 217 43
4399 43 -91 271 -120 555 136 -522 30 -205 -114 -632 -446 283 277 -19 -186 -362 -351 -418 -215 114 -100 6
4421 6 83 -188 -329 -80 -463 -157 -63 289 -137 -183 281 161 54 -198 111 -416 94 -226 71 -120 -143 131
4443A31o64O05N9r3R5J03J32j16q2m25L20o7P7l08K47k64N19K40l20J91m03m8
4465g1J28k86L09m92Q53m30j78J86l50M55l9J42q31P20k80j27K18L83o8pk78K57
4487B14l47k14O59j55N52n76N09m39m06K22K26l58j63Q0r5L98J0J59l58l81P67
4508C04l20M30k19M67n37K33J7m30k02N07m91K35l0j91J13k73P51j70o91N38k00
4529a59K37J40p34N54J09o4q9j45N1j78J64K25r1J09P1n21Q32o14J07J67o5m60
4551c54M77o1k1l91K86K04l37J65N36m63j11k44M25r6O24n55L02k73l71K53p1
4572g6M26j97J2J21j84l82N00o88M78Q8j34K99m36J86K16j4m08K41K80j78j69
4593a9N12k20l20L63k30J09J84l33k71L37J90j33l05k44M23m15Q53J39r96L86
$$ plain form
4443 131 -533 72 131 38 133 236 368 252 170 -255 65 -2 75 -233 14 -250 269 509 189 380 -23 -71
4465 -71 57 -229 80 -412 441 11 -167 19 -331 124 85 227 -604 116 -164 -291 -73 310 242 235 -43 214
4487 214 -133 -347 312 157 709 133 642 203 -203 19 245 -113 -276 -196 -291 107 117 276 -82 -463 304
4508 304 -16 414 195 662 125 358 375 -55 -257 250 -241 -6 -36 -227 -114 -387 364 194 -497 41 -159
4529 -159 78 218 -516 38 147 83 -6 -151 -100 -278 -114 111 20 129 200 -321 511 -103 4 171 106 -354
4551 -354 123 62 41 -350 -64 140 -197 -32 504 41 -70 -314 111 15 639 84 386 113 -258 -5 -76
4572 -76 350 153 165 286 102 -280 220 -468 10 98 -36 263 -173 13 229 215 -193 48 328 150 -19
4593 -19 493 273 -47 316 86 195 379 46 -225 112 302 169 -136 -380 43 -372 481 620 -376 10
4613A0J17l82M21L22J0m22j56L85ll39L75j97K18K40m21n89L24j81jN72k55k50
4635b02N18m46j65K98k06K51n06M40J54J77j24k3p0m9K43o20L09J98m9j45K96
4656B79p15O64j73m6K45l9k54m43K99k07L20j28k1L35J41m98Q14n61K5M4J83k6
4678B38j1J73j28k76j25l14O85l71J13k26M63j84n14K35jK07k67o2K14N09m70
4699a12L84J78j41j86k8J48j00l84o1M16l35K57n32K43J32J64k43l8M40o58K87
4720a69K01N8J07j73j95K78m96M06K6K5l47K4L07J23k29K97k74k06P0k03L63J4
4742Gl04j1L21L7q3L40k78n05O62j83L06k05l67J82k7K99j98K9j31j2P94l41m09
4765g7L26k31j89L35K26l39j50J94M7l91l57L50K90m10N56K43n52l18K11r4R88
$$ plain form
4613 10 127 -255 166 488 498 76 -80 305 302 -37 338 141 359 599 178 -411 -87 -268 -269 303 48 -202
4635 -202 316 -130 -295 3 -203 48 -458 -18 136 313 189 166 96 47 290 -330 -21 177 128 -17 279
4656 279 -436 228 55 9 254 215 -39 -482 -183 -390 -70 -198 -219 116 257 -241 573 12 37 81 264 238
4678 238 227 400 272 -4 -129 -443 242 -129 -16 -242 221 37 -477 -242 -243 -36 -303 -365 -151 358 -112
4699 -112 272 450 309 123 95 243 143 -241 -302 114 -221 36 -496 -253 -121 43 -200 -238 202 -456 -169
4720 -169 32 90 197 24 -171 107 -389 17 43 68 -279 -255 52 175 -54 243 -31 -237 -167 -370 -7 7
4742 7 -297 -308 13 50 -33 307 29 -476 186 3 309 104 -263 -81 -108 191 -7 22 -109 -121 673 332 -77
4765 -77 249 18 -171 164 390 51 -99 95 142 -249 -606 -256 34 -376 180 423 -129 -447 -236 -330 658
4786F58o11l11P68k51k37k07K51J21o08Q32m86N55j49n68K77j46j92L57j83m32
4806e62M08K66j88k25M99j77j20j5J29M15k80N6Nm9j08K00j94j33j43L39k84k15
4828c76q4O72m50k13P64l72j78L91k48l2N03Lj31o7l63M0K30J03l32J87k65n00
4850g18J431o57j37M5k63nM98l52Q7J92k18L75j7n42Q0L47j02R4k91J10L08J10
4872C75j41j21J04k28N43l79j12J79m54J94k36l00N97Lk6l07M27l92L53j23r9
4893a43N00n21P60m39J83m25L97p20K62N5J85M64L5n73O1Qm45M56j71K00K18n1
4915B96l17M11m18M68l81L3j36L8J46j25q5L07N38j065K84j66L25n99K89K9j57
4936b85N04m21K55P3q8j37Q4Q9o14O89J9J57l14M29M0m11J42l70K40l3Kj68j39
$$ plain form
4786 658 47 -264 504 253 16 -191 60 181 -427 405 -81 474 325 -243 34 -112 -304 53 -130 -562
4806 -562 -154 112 -76 -301 198 21 -99 -114 15 430 150 206 211 162 54 254 60 -73 -216 123 -161 -376
4828 -376 -460 212 -238 -451 313 -59 -237 154 -94 -126 377 380 249 182 -181 -141 89 192 -140 47 -218 -718
4850 -718 713 56 -81 -36 -299 -304 194 -158 -71 121 -97 278 261 -281 -201 146 44 138 -153 -43 265 375
4872 375 234 113 217 -11 532 153 41 220 -234 -40 -276 -576 21 24 -2 -309 118 -274 79 -44 -143
4893 -143 357 -164 596 157 340 -85 312 -408 -146 -91 94 558 593 20 81 89 -356 100 -71 129 347 296
4915 296 -21 390 -28 440 59 92 -44 -6 140 15 -70 237 775 -290 -6 -172 153 -446 -157 -128 -285
4936 -285 219 -202 53 126 38 -99 -15 74 -540 149 168 325 11 440 480 69 211 -159 81 48 50 -118 -257
4959b57O9K16n41R20o42N90o41L35ll85J31J94L81o33J12K76l46K25m7j40l62
4980e48J128n80Lk21K32k81L23j20O2L37m39Q5l13L32k40K49K74M2k59l31L36
5001G1N55l86Q5l64J52k08K43K06m31L42j95j27K80j43o00P90k88jk28M29k09
5022b7J18J28m3j77q2k8J13k32P64n37P6j72K02l9J51l08N61l38l30J3l3J31l3
5045a22j8L68Q2L3m41J87k76R3K22j88K90n47M34j05j96N61o3k98R8p0l20J88
5067h8jJ8L60j47Q8j68m8N57o37J51p1q9O25n54m2K25j55j35K11k9q8j02j32J32
5091a19k62P45n64O98m36J34l48K87k26J47k4j09K15l24J60L18o75L8K84J36j35
5112f0j06L44j74J12K99j36m83J07l0m1K36p0j5j26K0K47K23J75k77m71N14j24
$$ plain form
4959 -257 -188 28 -513 407 -235 355 -286 49 46 -339 -208 -14 367 -266 -154 122 -224 1 -46 -186 -548
4980 -548 580 0 3 -218 14 -267 56 -64 -2 335 -104 -19 -332 0 -240 9 283 325 66 -265 71
5001 71 626 240 325 -39 113 -95 148 354 -77 265 70 -57 223 80 -520 270 -18 -19 -247 182 -27
5022 -27 91 219 176 -1 -83 -111 2 -230 534 -3 73 -99 103 64 215 -93 468 130 -200 -187 -220 -89 -122
5045 -122 -140 228 310 343 -98 89 -187 -94 128 -60 230 -317 117 12 -184 377 314 16 114 44 -276 -88
5067 -88 -89 -71 289 142 230 62 14 571 -66 85 14 -75 550 -4 -46 179 24 -111 100 71 -17 -119 -251 -119
5091 -119 -381 364 -200 498 62 196 -152 135 -91 56 32 -77 138 -186 -26 292 -383 -345 -61 75 -60
5112 -60 -166 178 4 116 415 279 -204 -97 -127 -168 68 -2 -17 -143 -123 124 347 522 245 -226 288 164
5134A64k25N1L92n25k54O44k36k60J95N0m59L43O33m70n1J76l87j22J55K66o04
5155e24O50j77k36M81p8j38n10R23n40J46K4L49n99K74K35j19l28k15N87l8Km33
5177b64K36J8K08k54N2j98J92J42j03P6N7J23n65L73K41l40m66N74K00m73M49
5198B78m59Q6J14j72m29L91N89l88L0l11K68j55k19P39k28Q5l15j58K74L33j34
5219B19k49l36M7J56K42J47M2k4O9j46k4r6j27L05m20L28k38j36L62L78o63K86
5241A22l37K54j21k65K07M6O16l36l20k50L75K42Q5q2r2K36n41m11O90j86j15
5262a83J54M28Lo86j9M81N01r05N23l21P1L28k55j22k52M97j21j9k08n03J54K25
5284b29J15n9j51K00j6J62j37J31l27l7K28j71K15M99p06J82J17j02L08m73j9
$$ plain form
5134 164 -61 -10 382 -143 -397 247 11 -249 -54 -4 -463 -120 513 43 -8 168 -219 -341 -186 80 -524
5155 -524 126 -51 -287 194 116 -22 -532 391 -149 -3 21 370 -229 45 280 161 -167 -382 205 167 169 -264
5177 -264 -28 -10 198 -56 -4 -202 -10 132 29 105 162 285 -280 93 334 -6 -472 102 302 -171 278
5198 278 -181 -95 19 -153 -582 -191 398 10 40 -271 -3 -158 -377 362 134 219 -96 -254 20 353 219
5219 219 -30 -366 -319 -163 79 226 268 244 313 167 143 47 -80 225 -195 133 -105 -241 121 499 -164 122
5241 122 -215 39 -82 -347 -140 -94 522 186 -134 -384 -9 233 318 236 144 380 -161 -572 118 -68 -183
5262 -183 -29 399 402 -284 -303 178 679 -226 297 -24 47 375 120 -2 -254 243 122 103 -105 -608 -454 -229
5284 -229 -114 -173 -324 -124 -140 22 -115 16 -311 -348 -120 -291 -76 423 -283 -101 16 -86 222 -251 -270
5305b70K82J61l02j93M63o50L91M9L06n93n4P77L03r18J41K35k18J41k86L36j50
5326d9l5p2J37k6m63R71l56J59J58m58M54n8n67L06q4l25K47K25l94MK93n5K65
5349B77J14m39j0K68n24N11m99K93K33j14M5L1k67M87m28j38p1RR9j22L52N16
5371F23n38r6p4K28k46K3l1L78m21pJ70l35K08L3L94L21k99l95p4lK62j95J00
5394B6j03j45k58R64o48J54l40K39k48O33k15J64q31O44r6J6J35j93l2L03m00
5415b31QN01k81J3j55M05l6L7k35l40J71K25k84qn26R53q14J03R25n38k32j9K10
5438a48J07L7J68J17r7Qj14k71K32J6m79L25P96r50M1J87k4k36J164j065j50L95
5460E9q8L93j72p8k02J56p9q07J039K81k94n3j50J25N9n7n93K86M99m57R1j8k14
$$ plain form
5305 -270 12 173 -129 -322 141 -509 -118 -69 237 -356 -410 367 670 -248 -107 128 -90 51 -235 101 -49
5326 -49 -84 -156 -19 -45 -508 463 107 266 424 -34 420 362 -205 101 17 -308 -61 164 -230 -226 67 12 277
5349 277 391 -48 -58 210 -314 197 -302 -9 224 110 155 186 -81 406 -22 -160 -231 -222 -123 -245 107 623
5371 623 85 -11 -85 143 -103 -80 -111 267 -154 -161 9 -326 -118 -85 309 630 331 -64 -138 -141 121 -74 26
5394 26 -77 -222 -480 484 -164 -10 -350 -111 -359 274 59 223 -608 36 -60 -44 91 -102 -134 169 -231
5415 -231 -223 278 -3 10 -145 260 224 261 26 -314 -143 82 -202 -210 -736 217 -597 -494 431 -107 -339 -358 -148
5438 -148 -41 -4 164 281 184 192 78 -193 39 55 -424 -99 697 -253 -212 -25 -49 -285 879 -186 -336 59
5460 59 -29 364 192 114 -88 68 -11 -818 221 502 208 155 5 130 189 132 -461 -175 324 -133 -42 -60 -274
5483b74M89j06M8m54K17m76P22l96K74j22j37M00m23N86j47J71r0p16P94l78k16
5504b34M34m51L16j43k3J23K86o12O33k17k29n20M54J19L27l56L27k66k23M46
5524A91l34K6m29N68n13P40p67O18j92J97l94L80k72R1l5j61N02k69k69J46k83
5545d59O46m38m1P55m92J5j93N0P09q14K23J8n77Q75l85J32k69J65L64k56k59
5566b31J90N80o61P7j23N11k39m43N53j76J21J96j53k64J94o14N37m24M10n4Q9
5587G6K16L67j49m67j78j97L41k90P05r01K40M04k00k46M6J2M8L40m71L51j48
$$ plain form
5483 -274 215 109 157 -297 -80 -556 166 -230 44 -78 -215 185 -238 348 201 372 282 -434 360 -18 -234
5504 -234 200 -251 65 -78 -101 22 308 -304 329 112 -117 -637 -183 -64 263 -93 234 -32 -255 191
5524 191 -143 -117 -546 22 -491 249 -518 100 -92 105 -289 91 -181 -90 -125 -286 216 -53 -322 -176 -459
5545 -459 187 -251 -292 463 -29 -14 -207 -157 552 -262 -39 -21 -598 277 -108 24 -245 -80 284 28 -231
5566 -231 -41 539 -122 -45 -168 343 104 -339 214 38 159 355 202 -62 132 -482 55 -369 41 -13 76
5587 76 292 659 510 43 -135 -332 9 -281 424 -477 -237 167 -33 -279 -233 -221 -173 167 -304 47 -101
$$ [...]
8191b09
##END NTUPLES=NMR FID
##END=
