##TITLE=1H ikalashn
DE-63_33-35_2
18.12.2024
##JCAMPDX= 6.0         $$ Bruker NMR JCAMP-DX V2.0
##DATA TYPE= NMR FID
##DATA CLASS= NTUPLES
##ORIGIN= UXNMR, Bruker Analytische Messtechnik GmbH
##OWNER= root
$$ TOPSPIN		Version 1.3
$$ 2024-12-18 13:51:18.859 +0400  Irina@DPX200
$$ Compression mode = diff/dup
##.OBSERVE FREQUENCY= 200.131300845
##.OBSERVE NUCLEUS= ^1H
##.DELAY= (6, 6)
##.ACQUISITION MODE= SIMULTANEOUS
##.ACQUISITION SCHEME= undefined
##.AVERAGES= 32
##.DIGITISER RES= 18
##SPECTROMETER/DATA SYSTEM= spect
##.PULSE SEQUENCE= zg
##.SOLVENT NAME= D2O
##.SHIFT REFERENCE= INTERNAL, D2O, 1, 17.49637
##AUDIT TRAIL= $$ (NUMBER, WHEN, WHO, WHERE, WHAT)
$$ ##TITLE= Audit trail, TOPSPIN		Version 1.3
$$ ##JCAMPDX= 5.01
$$ ##ORIGIN= Bruker BioSpin GmbH
$$ ##OWNER= Irina
$$ $$ F:/spectra/data/iren/nmr/1H/4/audita.txt
$$ ##AUDIT TRAIL=  $$ (NUMBER, WHEN, WHO, WHERE, VERSION, WHAT)
(   1,<2024-12-18 13:51:03.125 +0400>,<Irina>,<DPX200>,<TOPSPIN 1.3>,
      <created by zg
	started at 2024-12-18 13:48:53.656 +0400,
	POWCHK disabled, PULCHK disabled
       terminated by command 'halt'
       configuration hash MD5:
       BE 6D 3F 07 2A EA 11 49 91 17 2B D3 AF B3 58 0D
       data hash MD5: 16K
       5F E9 48 78 27 F0 D6 9B 67 67 BA 9C 0A C5 46 E0>)
$$ ##END=
$$ 
$$ $$ hash MD5
$$ $$ 50 A0 A4 D6 D9 9B 33 8F 12 7A 7A 4A 95 2F 92 32
##$RELAX= 
##$RELAX= 
##$RELAX= 
##$RELAX= 
##$RELAX= 
##$RELAX= 
##$RELAX= 
##$RELAX= 
##$RELAX= 
$$ Bruker specific parameters
$$ --------------------------
##$DU= <F:/spectra>
##$EXPNO= 4
##$NAME= <1H>
##$PROCNO= 1
##$TYPE= <nmr>
##$USER= <iren>
##$AMP= (0..31)
100 100 100 100 100 100 100 100 100 100 100 100 100 100 100 100 100 100 
100 100 100 100 100 100 100 100 100 100 100 100 100 100 
##$ANAVPT= -1
##$AQSEQ= 0
##$AQ_mod= 1
##$AUNM= <au_zg>
##$AUTOPOS= <>
##$BF1= 200.13
##$BF2= 200.13
##$BF3= 200.13
##$BF4= 200.13
##$BF5= 200.13
##$BF6= 200.13
##$BF7= 200.13
##$BF8= 200.13
##$BYTORDA= 1
##$CFDGTYP= 0
##$CFRGTYP= 5
##$CHEMSTR= <none>
##$CNST= (0..63)
1 1 145 1 1 1 1 1 1 1 1 1 1 1 1 1 1 1 1 1 1 1 1 1 1 1 1 1 1 1 1 1 1 1 
1 1 1 1 1 1 1 1 1 1 1 1 1 1 1 1 1 1 1 1 1 1 1 1 1 1 1 1 1 1 
##$CPDPRG= <>
##$CPDPRG1= <>
##$CPDPRG2= <>
##$CPDPRG3= <>
##$CPDPRG4= <mlev>
##$CPDPRG5= <mlev>
##$CPDPRG6= <mlev>
##$CPDPRG7= <mlev>
##$CPDPRG8= <mlev>
##$CPDPRGB= <>
##$CPDPRGT= <>
##$D= (0..63)
0 2 0 0 0 0 0 0 0 0.06 0 0.03 0 0 0 0 0.0002 0 0 0 0 0 0 0 0 0 0 0 0 0 
0 0 0 0 0 0 0 0 0 0 0 0 0 0 0 0 0 0 0 0 0 0 0 0 0 0 0 0 0 0 0 0 0 0 
##$DATE= 1734515460
##$DBL= (0..7)
120 120 120 120 120 120 120 120 
##$DBP= (0..7)
150 150 150 150 150 150 150 150 
##$DBP07= 0
##$DBPNAM0= <>
##$DBPNAM1= <>
##$DBPNAM2= <>
##$DBPNAM3= <>
##$DBPNAM4= <>
##$DBPNAM5= <>
##$DBPNAM6= <>
##$DBPNAM7= <>
##$DBPOAL= (0..7)
0.5 0.5 0.5 0.5 0.5 0.5 0.5 0.5 
##$DBPOFFS= (0..7)
0 0 0 0 0 0 0 0 
##$DE= 6
##$DECBNUC= <off>
##$DECIM= 32
##$DECNUC= <off>
##$DECSTAT= 4
##$DIGMOD= 1
##$DIGTYP= 9
##$DL= (0..7)
0 120 120 120 120 120 120 120 
##$DP= (0..7)
$$ [...]
##$SW= 21.9926040160658
##$SWIBOX= (0..15)
0 0 2 0 0 0 0 0 0 0 0 0 0 0 0 0 
##$SW_h= 4401.40845070422
##$TD= 16384
##$TD0= 1
##$TE= 300
##$TE2= 300
##$TE3= 300
##$TEG= 300
##$TL= (0..7)
0 120 120 120 120 120 120 120 
##$TP= (0..7)
150 150 150 150 150 150 150 150 
##$TP07= 0
##$TPNAME0= <>
##$TPNAME1= <>
##$TPNAME2= <>
##$TPNAME3= <>
##$TPNAME4= <>
##$TPNAME5= <>
##$TPNAME6= <>
##$TPNAME7= <>
##$TPOAL= (0..7)
0.5 0.5 0.5 0.5 0.5 0.5 0.5 0.5 
##$TPOFFS= (0..7)
0 0 0 0 0 0 0 0 
##$TUNHIN= 0
##$TUNHOUT= 0
##$TUNXOUT= 0
##$USERA1= <user>
##$USERA2= <user>
##$USERA3= <user>
##$USERA4= <user>
##$USERA5= <user>
##$V9= 5
##$VALIST= <valist>
##$VCLIST= <CCCCCCCCCCCCCCC>
##$VD= 0
##$VDLIST= <DDDDDDDDDDDDDDD>
##$VPLIST= <PPPPPPPPPPPPPPP>
##$VTLIST= <TTTTTTTTTTTTTTT>
##$WBST= 1024
##$WBSW= 25
##$XGAIN= (0..3)
0 0 0 0 
##$XL= 0
##$YL= 0
##$YMAX_a= 387190
##$YMIN_a= -372162
##$ZGOPTNS= <>
##$ZL1= 120
##$ZL2= 120
##$ZL3= 120
##$ZL4= 120
##$ABSF1= 10
##$ABSF2= 0
##$ABSG= 5
##$ABSL= 3
##$ALPHA= 0
##$AQORDER= 0
##$ASSFAC= 0
##$ASSFACI= 0
##$ASSFACX= 0
##$ASSWID= 0
##$AUNMP= <proc_1d>
##$AXLEFT= 0
##$AXRIGHT= 0
##$AXTYPE= 0
##$AXUNIT= <>
##$AZFE= 0.1
##$AZFW= 0.1
##$BCFW= 1
##$BC_mod= 2
##$BYTORDP= 1
##$COROFFS= 0
##$CY= 7568.61572265625
##$DATMOD= 1
##$DC= 2
##$DFILT= <>
##$DTYPP= 0
##$F1P= 17.9538593292236
##$F2P= -4.03888763876832
##$FCOR= 0.5
##$FTSIZE= 32768
##$FT_mod= 4
##$GAMMA= 1
##$GB= 1
##$INTBC= 1
##$INTSCL= 1
##$ISEN= 128
##$LB= 0.02
##$LEV0= 0
##$LPBIN= 0
##$MAXI= 945.577
##$MC2= 0
##$MEAN= 0
##$ME_mod= 0
##$MI= -402.1523
##$NCOEF= 0
##$NC_proc= 0
##$NLEV= 6
##$NOISF1= 8.587773
##$NOISF2= 6.764455
##$NSP= 1
##$NTH_PI= 0
##$NZP= 0
##$OFFSET= 17.49637
##$PC= 1
##$PHC0= 81.19751
##$PHC1= 15.7699
##$PH_mod= 0
##$PKNL= yes
##$PPARMOD= 0
##$PPDIAG= 0
##$PPIPTYP= 0
##$PPMPNUM= 100
##$PPRESOL= 1
##$PSCAL= 0
##$PSIGN= 0
##$REVERSE= no
##$SF= 200.13
##$SI= 32768
##$SIGF1= 18.5376
##$SIGF2= -6.396296
##$SINO= 400
##$SIOLD= 32768
##$SREGLST= <1H.CDCl3>
##$SSB= 3
##$STSI= 0
##$STSR= 0
##$SW_p= 4401.40845070422
##$SYMM= 0
##$S_DEV= 0
##$TDeff= 0
##$TDoff= 0
##$TI= <>
##$TILT= no
##$TM1= 0
##$TM2= 0
##$TOPLEV= 0
##$USERP1= <user>
##$USERP2= <user>
##$USERP3= <user>
##$USERP4= <user>
##$USERP5= <user>
##$WDW= 1
##$XDIM= 8192
##$YMAX_p= 0
##$YMIN_p= 0
$$ End of Bruker specific parameters
$$ ---------------------------------
##NTUPLES= NMR FID
##VAR_NAME=  TIME,          FID/REAL,        FID/IMAG
##SYMBOL=    X,             R,               I
##VAR_TYPE=  INDEPENDENT,   DEPENDENT,       DEPENDENT
##VAR_FORM=  AFFN,          ASDF,            ASDF
##VAR_DIM=   8192,          8192,            8192
##UNITS=     SECONDS,       ARBITRARY UNITS, ARBITRARY UNITS
##FACTOR=    0.0002272,     1,               1
##FIRST=     0,             0,               0
##LAST=      1.8609952,     94,              -55
##MIN=       0,             -372162,         -372162
##MAX=       1.8609952,     387190,          387190
$$ Real data points
##PAGE= N=1
##DATA TABLE= (X++(R..R)), XYDATA
$$ plain form
0 0 0 0 0 0 0 0 0 0 0 0 0 0 0 0 0 0 0 0 0 0 0 0 0 0 0 0 0 0 0 0 0 -6 14 -23 28 -30 31 -31 32 -33 38 -48 54 -60 63 -74
46 -74 80 -88 98 -108 117 -130 143 -156 172 -191 209 -228 251 -280 303 -334 366 -396 425 -415 325
67 325 79 -2093 27758 299423 328183 104715 37676 168901 203934 -29959 -294132 -309358
79 -309358 -106960 47465 29433 -35908 28408 196235 266702 120921 -93536 -149909 -51558
90 -51558 -25645 -160126 -252754 -119423 104807 171966 89690 71285 164165 187491 42974
101 42974 -125302 -163622 -112995 -92621 -98962 -49061 61110 147066 151630 98430 42696 8144
113 8144 -26359 -90313 -158608 -158761 -73156 9534 15692 8299 84672 190335 176455 42026 -47967
126 -47967 -20655 -4768 -103916 -206191 -153215 9152 103142 80690 60971 116152 159884 87891
$$ packed form
0@%%%%%%%%%%%%%%%%%%%%%%%%%%%%%%%oK0l7N1n8O1o2O3o5P1q6J02j14J23j37
46g4J54j68J86k06K25k47K73k99L28l63M00m37M79n31N83o37P00p62Q21q40P40
67C25k46k172K9851K71665K8760k23468o7039J31225L5033k33893k64173j5226
79c09358K02398J54425j8032o5341O4316J67827P0467j45781k14457n6373R8351
90e1558K5913j34481r2628J33331K24230O7159q2276j8405R2880K3326j44517
101D2974j68276l8320N0627K0374o341M9901J10171Q5956M564n3200n5734l4552
113H144l4503o3954o8295j53Q5605Q2690O158p393P6373J05663j3880j34429q9993
126d7967K7312J5887r9148j02275N2976J62367R3990k2452j9719N5181M3732p1993
$$ plain form
138 87891 -65604 -172920 -166485 -101597 -69076 -74231 -33628 93655 213116 199704 76694
149 76694 -5320 9799 5200 -106521 -217110 -173953 -19688 69724 47587 41520 123777 187199
161 187199 115184 -37133 -126118 -113994 -89013 -110114 -125456 -57842 75362 170099 158672
172 158672 87797 51276 55971 16981 -98234 -189691 -152683 -37537 19213 -1789 13428 112607
184 112607 182366 117969 -11662 -68092 -44340 -49444 -119138 -156252 -82378 43567 109166 93527
196 93527 72156 93783 109690 49282 -69436 -145470 -120782 -55675 -39997 -58252 -17542 94442
208 94442 165124 114695 17133 -12071 12309 -16519 -111800 -160170 -92202 13200 49819 31796
220 31796 47790 111640 137995 70750 -35113 -88053 -74536 -60916 -86276 -101922 -42888 65680
$$ packed form
138H7891j53495j07316O435O4888L2521n155M0603J27283J19461j3412j23010
149G6694q2014J5119m599j11721j10589M3157J54265Q9412k2137o067Q2257O3422
161A87199p2015j52317q8985J2124K4981k1101j5342O7614J33204R4737j1427
172A58672p0875l6521M695l8990j15215r1457L7008J15146N6750k1002J5217R9179
184A12607O9759o4397j29631n6430K3752n104o9694l7114P3874J25945O5599j5639
196I3527k1371K1627J5907o0408j18718p6034K4688O5107J5678j8255M0710J11984
208I4442P0682n0429r7562k9204K4380k8828r5281m8370O7968J05402L6619j8023
220C1796J5994O3850K6355o7245j05863n2940J3517J3620k5360j5646N9034J08568
$$ plain form
232 65680 125554 94903 43218 42611 57341 5492 -97343 -143737 -87910 -12435 203 -12972
244 -12972 29946 113450 139021 71027 -12618 -36116 -24744 -48451 -105899 -121142 -54391 36602
256 36602 71802 51758 45541 80627 94778 29571 -69783 -106802 -65230 -28619 -46853 -59737
268 -59737 2843 100149 128105 68403 10151 11938 22076 -27979 -109531 -129376 -64435 9119
280 9119 24804 12019 37272 96267 112641 48082 -36892 -64247 -40229 -36427 -72779 -83419
292 -83419 -19182 69343 96271 59252 32478 48090 49779 -10510 -90349 -109615 -63634 -21664
304 -21664 -20850 -18494 30167 94021 104040 50887 -2956 -13320 -10174 -41140 -88641 -88760 -26093
317 -26093 38093 49658 33868 46175 79798 71353 1220 -68576 -76778 -46170 -40366 -62258 -51451
$$ packed form
232F5680N9874l0651n1685o07J4730n1849j02835m6394N5827P5475J2638j3175
244a2972M2918Q3504K5571o7994q3645k3498J1372k3707n7448j5243O6751R0993
256C6602L5200k0044o217L5086J4151o5207r9354l7019M1572L6611j8234j2884
268e9737O2580R7306K7956n9702n8252J787J0138n0055q1552j9845O4941P3554
280I119J5685j2785K5253N8995J6374o4559q4974k7355K4018L802l6352j0640
292h3419O4237Q8525K6928l7019k6774J5612J689o0289p9839j9266M5981M1970
304b1664Q14K356M8661O3854J0019n3153n3843j0364L146l0966m7501j19O2667
317b6093O4186J1565j5790J2307L3623q445p0133o9796q202L0608N804k1892J0807
$$ plain form
330 -51451 17364 85629 88386 42930 18347 30483 25205 -31711 -92617 -89382 -30443 13184 8914
343 8914 4237 43811 93895 85256 16453 -41516 -43190 -26853 -46943 -84058 -72628 -1702 61560
356 61560 64306 35521 35165 58956 47530 -16919 -76724 -75260 -33371 -13274 -24376 -16381 37105
369 37105 88273 79910 26319 -9731 -6824 -9063 -49110 -90054 -75775 -14430 30598 29875 22213
382 22213 47104 77287 59167 -4705 -52501 -48211 -26664 -34116 -54320 -34939 27281 73958
394 73958 63466 27119 17514 29486 13269 -43533 -87410 -71139 -21510 2205 -6019 2192 48831
407 48831 86851 66043 6922 -26779 -18462 -14175 -45297 -74614 -50366 13198 53115 42551
419 42551 23885 36506 55699 31510 -31040 -72889 -59591 -26661 -21393 -33309 -14171 41832
$$ packed form
330e1451O8815O8265K757m5456k4583J2136n278n6916o0906L235N8939M3627m270
343H914m677L9574N0084q639o8803n7969j674J6337k0090l7115J1430P0926O3262
356F1560K746k8785l56K3791j1426o4449n9805J464M1889K0097j1102P995N3486
369C7105N1168q363n3591l6050K907k239m0047m0944J4279O1345M5028p23p662
382B2213K4891L0183j8120o3872m7796M290K1547p452k0204J9381O2220M6677
394G3958j0492l6347r605J1972j6217n6802m3877J6271M9629K3715q224Q211M6639
407D8831L8020k0808n9121l3701Q317M287l1122k9317K4248O3564L9917j0564
419D2551j8666J2621J9193k4189o2550m1849J3298L2930N268j1916J9138N6003
$$ plain form
431 41832 81210 63599 18477 -587 7826 -2812 -47557 -79034 -55531 -1363 26283 18864
443 18864 19122 48157 69147 40989 -16382 -48981 -40403 -28267 -40666 -52194 -24636 31132 64327
456 64327 51441 25436 23174 30567 7920 -42974 -72567 -51492 -12958 -1126 -7716 9274 52216
469 52216 73440 43943 -2723 -20596 -14609 -23901 -54342 -65638 -31755 18756 41272 33057 28527
482 28527 43267 49000 16496 -34926 -58554 -41478 -19868 -23191 -29152 -981 48631 67860 39618
495 39618 6280 3562 9871 -14134 -56504 -67560 -32966 6547 15699 10704 25136 53910 58957
508 58957 24124 -20166 -36893 -27951 -25439 -40670 -44583 -11010 37744 55359 34104 14767 22281
521 22281 27169 -4652 -51418 -61476 -29606 -2666 -6349 -10150 17673 55351 58292 24929 -5765
$$ packed form
431D1832L9378j7611m5122j9064Q413j0638m4745l1477K3503N4168K7646p419
443A8864K58K9035K0990k8158n7371l2599Q578J2136j2399j1528K7558N5768L3195
456F4327j2886k6005k262P393k2647n0894k9593K1075L8534J1832o590J6990M2942
469E2216K1224k9497m6666j7873N987r292l0441j1296L3883N0511K2516q215m530
482B8527J4740N733l2504n1422k3628J7076K1610l323n961K8171M9612J9229k8242
495C9618l3338k718O309k4005m2370j1056L4594L9513R152m995J4432K8774N047
508E8957l4833m4290j6727Q942K512j5231l913L3573M8754J7615k1255j9337P514
521B2281M888l1821m6766j0058L1870K6940l683l801K7823L7678K941l3363l0694
$$ plain form
534 -5765 -10606 -8323 -24538 -49766 -52183 -19764 19349 32558 22774 21786 39167 42418 6780 -39809
548 -39809 -50219 -26136 -13036 -25765 -26268 11411 52994 52823 21474 4329 11307 8581 -21420
561 -21420 -51472 -48563 -19601 3561 6658 6605 22717 45958 47118 15573 -20483 -28557 -16973
574 -16973 -20083 -40932 -40700 -94 42085 43577 19477 15139 30734 24154 -17023 -51570 -45015
587 -45015 -17285 -6494 -12836 -6675 20999 45712 42241 16139 -5159 -6672 -3274 -17693 -42821
600 -42821 -45413 -13495 21166 24828 12482 20610 44266 40764 -1466 -38605 -37027 -19341 -21395
613 -21395 -33545 -20247 18301 45037 39394 20273 11592 10528 -353 -23713 -42092 -38096 -14808
626 -14808 5400 8708 7684 22121 42332 38155 6130 -19486 -17319 -11026 -26557 -45598 -31362
$$ packed form
534e765m841K283j6215k5228k417L2419L9113J3209r784r88J7381L251l5638m6589
548c9809j0410K4083J3100j2729n03L7679M1583j71l1349j7145O978k726l0001
561b1420l0052K909K8962K3162L097n3J6112K3241J160l1545l6056q074J1584
574a6973l110k0849K32M0606M2179J492k4100m338J5595o580m1177l4547O555
587d5015K7730J0791o342O161K7674K4713l471k6102k1298j513L398j4419k5128
600d2821k592L1918L4661L662j2346Q128K3656l502m2230l7139J578J7686k054
613b1395j2150J3298L8548K6736n643j9121q681j064j0881k3360j8379L996K3288
626a4808K0208L308j024J4437K0211m177l2025k5616K167O293j5531j9041J4236
$$ plain form
639 -31362 8799 32366 25435 17161 27017 33529 12033 -23705 -40744 -31724 -17139 -12532 -11051
652 -11051 2774 27677 44240 35002 8538 -7940 -4882 -5004 -25463 -45318 -32708 3073 20520
665 20520 9874 5095 26207 43371 24419 -12837 -28029 -18021 -13407 -25381 -30716 -10515 20713
678 20713 36514 29708 16604 12069 12304 933 -24284 -43075 -34672 -8747 4563 -512 3024
691 3024 28035 45891 29020 -4486 -15836 -6747 -9791 -31727 -40630 -17264 14010 23939 18140
704 18140 18739 28064 27123 6025 -21587 -35406 -29528 -16857 -12073 -11559 1180 27632 42985 28888
718 28888 3181 -3951 3104 -5647 -32335 -43191 -20462 8056 12854 5723 13914 33557 35464
731 35464 11423 -14487 -22315 -18314 -18854 -24893 -23175 -4562 21388 34362 26177 12374 9809 11625
$$ packed form
639c1362M0161K3567o931q274R856O512k1496l5738j7039R020J4585M607J481
652a1051J3825K4903J6563r238k6464j6478L058j22k0459j9855J2610L5781J7447
665B0520j0646m779K1112J7164j8952l7256j5192J0008M614j1974n335K0201L1228
678B0713J5801o806j3104m535K35j1371k5217j8791Q403K5925J3310n075L536
691C024K5011J7856j6871l3506j1350R089l044k1936q903K3366L1274R929n799
704A8140N99R325r41k1098k7612j3819N878J2671M784N14J2739K6452J5353j4097
718B8888k5707p132P055q751k6688j0856K2729K8518M798p131Q191J9643J907
731C5464k4041k5910p828M001n40o039J718J8613K5950J2974q185j3803k565J816
$$ plain form
745 11625 -2783 -29810 -39913 -20961 1346 2175 -3835 9137 32769 35277 12317 -7828 -7599
758 -7599 -4143 -15333 -30648 -28877 -8943 10951 17575 15672 17263 23593 22705 4347 -20749 -30825
772 -30825 -21024 -10975 -13776 -14396 5768 32215 36234 16175 930 3398 3251 -14791 -34282 -30695
786 -30695 -9137 5693 5856 6035 16906 29075 25650 6625 -11898 -17022 -13226 -14805 -23257 -22167
800 -22167 -1304 23115 27477 15320 9719 16549 14153 -9160 -32394 -31034 -12606 -2817 -6128
813 -6128 -2489 16513 32530 27760 8351 -5107 -6021 -6378 -16268 -27294 -23912 -4716 13414 16109
827 16109 10647 13639 22815 19821 -2041 -22791 -23278 -12395 -10812 -16897 -11200 11322 28908 25418
841 25418 11512 5579 6929 499 -16936 -29524 -24196 -7828 3263 4437 6799 17533 27162
$$ packed form
745A1625j4408k7027j0103J8952K2307Q29o010J2972K3632K508k2960k0145K29
758g599L456j1190j5315J771J9934J9894O624j903J591O330q88j8358k5096j0076
772c0825R801J0049k801o20K0164K6447M019k0059j5245K468j47j8042j9491L587
786c0695K1558J4830J63J79J0871J2169l425j9025j8523n124L796j579q452J090
800b2167K0863K4419M362j2157n601O830k396k3313k3234J360J8428R789l311
813f128L639J9002J6017m770j9409j3458r14l57r890j1026L382J9196J8130K695
827A6109n462K992R176k994k1862k0750m87J0883J583o085N697K2522J7586l490
841B5418j3906n933J350o430j7435j2588N328J6368J1091J174K362J0734R629
$$ plain form
854 27162 21101 1459 -13312 -13013 -9650 -15954 -23909 -16235 6179 21760 18749 10662 12727 17697
868 17697 8231 -13717 -27234 -21448 -9122 -5804 -7595 -162 17501 28564 21540 4963 -4121
881 -4121 -2920 -5202 -17797 -27158 -18983 1176 13230 10670 8064 16408 23475 13993 -7694 -20034
895 -20034 -15949 -9973 -12850 -16575 -6292 13710 24842 19172 8789 6019 6982 -1227 -17670 -26728
909 -26728 -19046 -4136 2904 2241 6517 18973 25651 15728 -2466 -11451 -9133 -9236 -17530 -21572 -9913
924 -9913 9290 18080 13726 9642 13225 14687 3346 -14655 -22851 -16205 -7294 -6190 -6653 2410 17989
939 17989 24644 15804 2500 -2041 -1098 -6702 -18921 -23255 -12404 3394 9363 7012 8870 17298
953 17298 19286 7384 -9117 -15062 -11141 -9363 -13480 -13663 -1588 14133 19442 13210 7188 7922
$$ packed form
854B7162o061j9642j4771K99L363o304p955P674K2414J5581l011q087K065M970
868A7697r466k1948j3517N786J2326L318j791P433J7663J1063p024j6577r084
881d121J201k282j2595r361Q175K0159J2054k560k606Q344P067r482k1687j2340
895b0034M085N976k877l725J0283K0002J1132n670j0383k770R63q209j6443r058
909b6728P682J4910P040o63M276J2456O678r923j8194q985K318j03q294m042J1659
924i913J9203Q790m354m084L583J462j1341j8001q196O646Q911J104m63R063J5579
939A7989O655q840j3304m541R43n604j2219m334J0851J5798N969k351J858Q428
953A7298J988j1902j6501n945L921J778m117j83J2075J5721N309o232o022P34
$$ plain form
967 7922 7251 -3637 -18032 -21851 -12712 -2696 -1025 -783 7685 19866 21674 9969 -3261 -6657
981 -6657 -5115 -10211 -19230 -19049 -5564 9813 13830 9958 10086 15229 13871 -163 -15757 -19187 -12130
996 -12130 -7115 -8594 -6907 5452 19621 21552 11203 1691 579 -180 -9280 -20456 -20439 -7473
1010 -7473 4850 7195 5806 10721 18199 16457 2569 -10926 -13177 -9130 -9353 -13660 -11103 2365
1024 2365 15674 16766 9713 5809 7592 5287 -6560 -18409 -17959 -8052 -880 -1234 15 9253 18697
1039 18697 16808 4920 -4247 -4956 -4474 -10304 -16961 -13853 -1262 9312 10170 7341 9178 13471 10144
1054 10144 -2468 -13601 -13937 -8223 -6485 -8893 -5626 6793 17237 15969 7225 2505 3191 203
1068 203 -10312 -18566 -15359 -4641 2619 3166 4670 11634 17382 12984 749 -8359 -9207 -7353 -10492
$$ packed form
967G922o71j0888j4395l819R139J0016J671K42Q468J2181J808j1705j3230l396
981f657J542n096r019J81J3485J5377M017l872J28N143j358j4034j5594l430P057
996a2130N015j479J687J2359J4169J931j0349r512j112p59r100j1176J7J2966
1010g473J2323K345j389M915P478j742j3888j3495k251M047k23m307K557J3468
1024B365J3309J092p053l904J783k305j1847j1849M50R907P172l54J249R238R444
1039A8697j889j1888r167p09M82n830o657L108J2591J0574Q58k829J837M293l327
1054A0144j2612j1133l36N714J738k408L267J2419J0444j268q744m720O86k988
1068B03j0515q254L207J0718P260N47J504O964N748m398j2235r108q48J854l139
$$ plain form
1083 -10492 -14131 -9186 4112 14306 13125 7714 7153 9459 4088 -9069 -17743 -14311 -5952 -2742
1097 -2742 -3520 1378 12022 18079 13120 3074 -2597 -3024 -5316 -12023 -16160 -10694 1011 8634 8367
1112 8367 6898 10232 13343 7430 -5719 -13862 -11281 -6317 -7338 -9280 -2499 10221 16513 11543
1126 11543 4649 3111 3502 -2312 -11986 -15994 -10676 -1995 2044 2425 4921 11491 15107 9452 -1538
1141 -1538 -7932 -6732 -5893 -10228 -13478 -6549 6391 12573 9034 5901 8526 9633 1275 -10841 -14839
1156 -14839 -9837 -4712 -4128 -3061 3664 12197 14885 9375 1664 -1921 -2378 -5018 -11446 -14425 -8092
1171 -8092 2560 7366 5346 5316 11101 13344 4668 -7503 -11014 -7004 -5853 -9615 -8937 531 11239
1186 11239 13274 8735 5190 4492 2320 -4415 -11940 -14064 -8727 -1175 2387 2216 4736 11366 13764
$$ packed form
1083a0492l639M945J3298J0194j181n411n61K306n371j3157q674L432Q359L210
1097b742p78M898J0644O057m959j0046n671m27k292o707m137N466J1705P623k67
1112H367j469L334L111n913j3149q143K581M964j021j942O781J2720O292m970
1126A1543o894j538L91n814r674m008N318Q681M039L81K496O570L616n655j0990
1141a538o394J200Q39m335l250O929J2940O182l539l133K625J107q358j2116l998
1156a4839N002N125N84J067O725Q533K688n510p711l585m57k640o428k979O333
1171h092J0652M806k020l0N785K243q676j2171l511M010J151l762O78R468J0708
1186A1239K035m539l545o98k172o735p525k124N337P552L562j71K520O630K398
$$ plain form
1201 13764 6384 -3946 -6768 -3791 -5158 -11550 -12126 -2497 7685 9043 5848 6583 9795 7425 -1714
1216 -1714 -9813 -11324 -8321 -5617 -4356 -1880 4198 11347 13600 8233 407 -1976 -1352 -5114 -12447
1231 -12447 -13317 -4170 4649 5010 2764 6538 12314 10267 395 -6956 -7060 -5647 -7626 -9280 -5615
1246 -5615 2330 9003 10603 8009 4906 3643 1921 -4148 -11704 -13091 -6491 242 916 372 6180
1261 6180 13336 11620 2226 -4113 -3275 -2861 -7645 -11845 -8054 415 5689 6181 5989 7602 8439 5052
1277 5052 -2187 -8982 -10365 -7321 -4390 -4018 -2099 5157 12521 11771 4337 -364 542 -396 -7474 -13101
1293 -13101 -9362 -687 3247 2317 3352 8262 10824 6497 -778 -5316 -5838 -5523 -6795 -8048 -5116
1308 -5116 2257 9142 9812 5984 4099 5169 2426 -6084 -12918 -10431 -3260 -200 -1189 1468 8711
$$ packed form
1201A3764p380j0330k822K977j367o392n76R629J0182J358l195P35L212k370r139
1216a714q099j511L003K704J261K476O078P149K253n367p826k383O24l762p333
1231a2447q70R147Q819L61k246L774N776k047r872p351j04J413j979j654L665
1246e615P945O673J600k594l103j263j722o069p556j387O600O733O74n44N808
1261F180P156j716r394o339Q38M14m784m200L791Q469N274M92j92J613Q37l387
1277E052p239o795j383L044K931L72J919P256P364p50p434m701R06r38p078n627
1293a3101L739Q675L934r30J035M910K562m327p275m538n22L15j272j253K932
1308e116P373O885O70l828j885J070k743q510o834K487P171L060r89K657P243
$$ plain form
1323 8711 12306 7688 335 -2606 -2471 -4226 -8239 -9443 -5520 970 5283 5938 5336 6126 7506 4586
1339 4586 -2780 -8644 -8263 -4538 -4156 -5430 -1866 6883 12019 8650 3003 1447 1474 -2504 -9283 -11297
1355 -11297 -6529 -532 2141 2628 4720 7955 8715 4867 -1390 -5400 -5439 -4390 -5617 -7080 -3530 4022
1371 4022 8384 6583 3603 4484 5615 800 -7135 -10310 -6709 -2993 -2716 -1876 3065 8995 9976 5762
1387 5762 982 -1374 -2353 -4836 -7777 -8394 -4488 1821 5343 4847 4178 6225 7190 2698 -4817 -7931
1403 -7931 -5476 -3689 -5367 -5316 500 7280 8944 5748 3173 2985 1439 -3580 -8546 -9057 -5291 -1101
1419 -1101 1284 2486 4852 7975 8343 3677 -2452 -5127 -4053 -4279 -6895 -6909 -1121 5592 6898 4400
1435 4400 3950 5652 4327 -1867 -7403 -7780 -4867 -3027 -2723 -717 3776 8027 8371 4602 577 -1215
$$ packed form
1323H711L595m618p353k941J35j755m013j204L923O490M313O55o02P90J380k920
1339D586p366n864L81L725L82j274L564Q749N136l369n647j556K7l978o779k014
1355a1297M768N997K673M87K092L235P60l848o257m010l9J049j227j463L550P552
1371D022M362j801k980Q81J131m815p935l175L601L716K77Q40M941N930R81m214
1387E762m780k356r79k483k941o17L906O309L522m96o69K047R65m492p515l114
1403g931K455J787j678N1N816O780J664l196k575j88j546n019m966n11L766M190
1419a101K385J202K366L123L68m666o129k675J074k26k616j4N788O713J306k498
1435D400m50J702j325o194n536l77K913J840L04K006M493M251L44l769m025j792
$$ plain form
1451 -1215 -1862 -4483 -7900 -7981 -2601 3012 4331 3199 4348 7056 6228 94 -5298 -5694 -3861 -4076
1467 -4076 -5386 -3575 2117 6556 6913 4760 3025 2431 712 -3502 -7576 -7867 -4165 -339 921 1623
1483 1623 4612 8131 7238 2078 -2752 -3250 -3055 -5071 -7276 -5224 611 4865 5050 3897 4559 5326
1499 5326 2658 -2643 -6397 -6395 -4226 -2730 -2429 -509 4024 7762 7028 3003 166 -369 -1424 -5135
1515 -5135 -8000 -6272 -1043 2464 2627 2995 5381 6900 4430 -945 -4532 -4664 -3819 -4454 -4778 -2190
1531 -2190 2892 6267 5796 3515 2636 2543 295 -4258 -7394 -6086 -2377 -313 -79 1612 5336 7461
1547 7461 5319 663 -1923 -2177 -3005 -5437 -6504 -3673 1309 4244 4005 3437 4409 4794 1912 -3114
1563 -3114 -6108 -5238 -3075 -2542 -2546 -51 4646 7154 5302 2032 301 258 -1774 -5352 -6987 -4505 -314
$$ packed form
1451a215o47k621l417q1N380N613J319j132J149K708q28o134n392l96J833k15
1467d076j310J811N692M439L57k153j735n94j719m214m074k91L702L826J260P02
1483A623K989L519q93n160m830m98J95k016k205K052N835M254J85j153O62P67
1499E326k668n301l754KK169J496L01J920M533L738p34m025k837n35j055l711
1515e135k865J728N229L507J63L68K386J519k470n375l587j32Q45o35l24K588
1531b190N082L375m71k281q79r3k248m553l136J308L709K064K34J691L724K125
1547G461k142m656k586k54q28k432j067K831M982K935k39n68R72L85k882n026
1563c114k994Q70K163N33mK495M697K508j852l270j731m3k032l578j635K482M191
$$ plain form
1580 -314 1893 2079 2900 5282 6009 3048 -1512 -3976 -3735 -3446 -4290 -4393 -1325 3241 5424 4518 2916
1597 2916 2710 2444 -365 -4420 -6255 -4511 -1846 -675 -392 2004 5264 6138 3785 192 -1348 -1750
1613 -1750 -2933 -5294 -5613 -2497 1552 3255 3139 3174 4419 4292 913 -3379 -4983 -3833 -2735 -2960
1629 -2960 -2528 781 4645 6021 3851 1718 1022 514 -2216 -5634 -5976 -3243 44 1093 1325 3093
1645 3093 5421 5368 1927 -1701 -3259 -2739 -3185 -4519 -4133 -514 3714 4875 3667 2620 3033 2226 -1200
1662 -1200 -4956 -5565 -3407 -1459 -1014 -291 2601 5390 5418 2656 -158 -1146 -1570 -3167 -4939 -4693 -1598
1679 -1598 1874 3082 2670 3127 4199 3422 66 -3390 -4295 -3116 -2594 -3022 -1902 1450 4464 4553 2790
1696 2790 1619 1250 -100 -2850 -5190 -4672 -2175 -213 810 1466 3151 4855 4169 1033 -1840 -2442
$$ packed form
1580c14K207J86Q21K382P27k961m560k464K41K89q44j03L068M566K183r06j602
1597B916k06k66k809m055j835J744K665J171K83K396L260Q74k353l593j540m02
1613a750j183k361l19L116M049J703j16L5J245j27l379m292j604J150J098k25
1629b960M32L309L864J376k170k133o96n08k730l418l42K733L287J049K32J768
1645C093K328n3l441l628j558N20m46j334L86L619M228J161j208j047M13q07l426
1662a200l756o09K158J948M45P23K892K789K8k762k814r88m24j597j772K46L095
1679a598L472J208m12M57J072p77l356l456r05J179N22m28J120L352L014Q9j763
1696B790j171l69j350k750k340N18K497J962J023O56J685J704o86l136k873o02
$$ plain form
1712 -2442 -2228 -3044 -4490 -3351 420 3429 3497 2578 2677 3332 1829 -1919 -4495 -4271 -2403 -1837 -1265 99
1730 99 2858 4895 4569 2244 -24 -885 -1465 -3154 -4756 -4007 -856 1921 2256 1894 3076 4240 2699
1747 2699 -753 -3199 -3165 -2397 -2778 -2902 -1180 1838 3771 3683 2515 1808 1208 -414 -2922 -4562 -4081
1764 -4081 -1935 -27 669 1406 3250 4795 3507 116 -1699 -1626 -2018 -3604 -4136 -2096 1169 2821
1780 2821 2475 2503 3035 2907 739 -2064 -3741 -3404 -2450 -1792 -1246 153 2790 4643 3777 1410 -100
1797 -100 -248 -1175 -3519 -4660 -3076 64 1538 1369 1860 3671 3832 1715 -1146 -2488 -2417 -2500 -2922 -2535
1815 -2535 -482 1948 3539 3352 2174 1599 1115 -198 -2845 -4526 -3396 -1211 -62 154 1303 3759
1831 3759 4570 2435 -327 -1255 -1180 -2225 -3602 -3256 -994 1150 1973 2201 2394 2760 2238 554 -1910
$$ packed form
1712b442K14q16j446J139L771L009O8r19R9O55j503l748k576K24J868N66N72J364
1730I9K759K037l26k325k268q61n80j689j602P49L151K777L35l62J182J164j541
1747B699l452k446L4P68l81j24J722L018J933q8j168p07o00j622k508j640M81
1764d081K146J908O96P37J844J545j288l391j815P3l92j586n32K040L265J652
1780B821l46K8N32j28k168k803j677L37R54O58N46J399K637J853q66k367j510
1797a00j48r27k344j141J584L140J474j69M91J811J61k117k861j342P1q3m22L87
1815b535K053K430J591j87j178n75m84j313k647j681J130K185J149K16J149K456
1831C759Q11k135k762r28P5j045j377L46K262K144Q23K28J93L66n22j684k464
$$ plain form
1848 -1910 -3223 -3093 -1945 -1615 -1375 248 2924 4366 2993 914 170 104 -1577 -3960 -4148 -1836 426
1865 426 974 1184 2526 3420 2778 783 -1024 -2061 -2135 -2212 -2285 -2023 -491 1850 3174 2706 1479 1599
1883 1599 1495 -417 -3118 -3859 -2298 -905 -761 -312 2009 3957 3516 1620 9 -579 -1453 -2700 -3334
1900 -3334 -2619 -829 1082 2182 2223 1933 2165 1907 134 -2177 -3003 -1904 -1298 -1776 -1445 642 3046
1917 3046 3157 1792 1063 1025 63 -2052 -3610 -3100 -1562 -387 596 1426 2413 2992 2582 1070 -1172 -2168
1935 -2168 -2082 -1802 -2307 -1969 133 2472 2772 1654 1451 1854 1156 -1280 -3066 -2424 -1605 -1449 -1139 221
1953 221 2135 3011 2687 1637 402 -670 -1529 -2131 -3028 -2601 -762 1332 2015 1554 2053 2680 1878 -630
1971 -630 -2458 -2225 -1445 -1673 -2002 -642 1634 2686 2249 1482 1233 815 -408 -1960 -2812 -2572 -1307 -58
$$ packed form
1848a910j313J30J148L30K40J623K676J442j373k079p44o6j681k383j88K312K262
1865D26N48K10J342Q94o42j995j807j037p4p7p3K62J532K341J324m68j227J20
1883A599j04j912k701p41J561J393J44M49K321J948m41j896j611n88q74j247o34
1900c334P15J790J911J100M1k90K32k58j773k311q26J099O06m78L31K087K404
1917C046J11j365p29l8r62k115j558N10J538J175R83Q30R87N79m10j512k242r96
1935b168Q6K80n05L38K102K339L00j118k03M03o98k436j786O42Q19J56L10J360
1953B21J914Q76l24j050j235j072q59o02q97M27J839K094O83m61M99O27q02k508
1971f30j828K33P80k28l29J360K276J052m37p67k49m18j223j552q52K40J265J249
$$ plain form
1989 -58 719 1101 2069 2910 2311 364 -1362 -1447 -1406 -1984 -2772 -1558 702 2118 1924 1483 1842 1853 399
2008 399 -1473 -2494 -2305 -1529 -1138 -509 355 1820 2676 2482 1113 -32 -613 -940 -1990 -2884 -2069 -161
2026 -161 1325 1241 1373 2193 2388 1097 -904 -1745 -1497 -1544 -1888 -1536 -200 1560 2296 2059 1488 1196 391
2045 391 -450 -1767 -2619 -2123 -991 19 261 929 2212 2841 1830 -14 -870 -947 -1349 -2345 -2244 -874
2063 -874 981 1633 1508 1610 1741 1349 122 -1389 -2192 -1955 -1313 -969 -505 594 1835 2596 1790 671
2081 671 26 -367 -889 -2336 -2562 -1338 105 751 844 1403 2126 2025 729 -824 -1489 -1388 -1559 -1700 -1213
2100 -1213 -154 1347 2134 1709 1191 1001 619 -396 -1772 -2421 -1614 -564 -203 33 1094 2231 2299 1038
2118 1038 -101 -689 -811 -1533 -2078 -1902 -473 722 1237 1400 1516 1645 1246 105 -1444 -1760 -1626 -1034
$$ packed form
1989e8P77L82R68Q41n99j947j726q5M1n78p88J214K260J416j94m41L59J1j454
2008C99j872j021J89P76L91O29Q64J465Q56j94j369j145n81l27j050q94Q15J908
2026a61J486q4J32Q20J95j291k001q41K48m7l44L52J336J760P36k37n71k92q05
2045C91q41j317q52M96J132J010K42O68J283O29j011j844q56p7m02r96J01J370
2063h74J855O52j25J02J31l92j227j511q03K37O42L44M64J099J241P61q06j119
2081F71o45l93n22j447k26J224J443O46R3N59P23j01j296j553o65J01j71j41M87
2100a213J059J501P87m25n18j90l82j015j376o49Q07J050L61K36J061J137O8j261
2118A038j139n88j22p22n45J76J429J195N15J63J16J29l99j141j549l16J34N92
$$ plain form
2136 -1034 -912 -561 646 1774 2250 1272 577 271 -153 -1220 -2211 -1931 -827 170 450 828 1478 1919
2154 1919 1530 379 -665 -1206 -1295 -1291 -1516 -1046 182 1353 1816 1257 973 1001 499 -650 -1838 -1953 -1116
2173 -1116 -553 -245 180 1252 2014 1921 853 -88 -417 -696 -1347 -1879 -1518 -244 830 1129 1088 1398 1525
2192 1525 913 -133 -1327 -1577 -1181 -978 -997 -388 859 1860 1852 1194 582 267 -122 -1238 -1909 -1630 -730
2211 -730 125 388 737 1332 1705 1368 166 -652 -1088 -957 -1323 -1496 -872 301 1249 1413 1166 1073 1055 303
2231 303 -824 -1716 -1482 -946 -487 -274 275 1342 1753 1420 663 -82 -385 -786 -1374 -1746 -1121 30 578
2250 578 978 1118 1346 1455 843 -559 -1202 -1249 -969 -1000 -941 -236 935 1568 1372 893 449 285 -410 -1157
2270 -1157 -1609 -1320 -460 56 268 613 1287 1639 937 84 -678 -797 -1001 -1116 -1169 -651 513 1033 1206 933
$$ packed form
2136a034J22L51J207J128M76r78o95l06m24j067r91K80J104R97K80L78O50M41
2154A919l89j151j044n41q9Mk25M70J228J171M63n59k84K8n02j149j188j15Q37
2173a116N63L08M25J072P62r3j068r41l29k79o51n32L61J274J074K99m1L10J27
2192A525o12j046j194k50L96K03j9O09J247J001qo58o12l15l89j116o71K79R00
2211g30Q55K63L49N95L73l37j202q18m36J31l66j73O24J173R48J64k47r3j8p52
2231C03j127q92K34N36M59K13N49J067M11l33p57p45l03m01n88l72O25J151N48
2250E78M00J40K28J09o12j402o43m7K80l1N9P05J171O33j96m79m44j64o95p47
2270a157m52K89Q60N16K12L45O74L52p02q53p62j19k04j15n3N18J164N20J73k73
$$ plain form
2290 933 1023 797 33 -1024 -1395 -1213 -807 -674 -219 419 1250 1614 1090 414 48 -240 -625 -1181 -1469 -886
2310 -886 176 548 739 993 1247 1248 435 -460 -1011 -898 -894 -1025 -829 6 805 1261 1151 790 630 286 -211
2331 -211 -1185 -1564 -1060 -420 -26 262 653 1324 1347 739 -95 -476 -603 -826 -1223 -1111 -236 580 901 921 960
2352 960 972 657 -62 -731 -1152 -989 -706 -520 -131 336 1161 1275 980 383 -93 -171 -618 -1274 -1347 -593 229
2373 229 562 523 892 1256 869 138 -434 -727 -779 -821 -776 -479 99 827 1059 876 671 397 208 -344 -1042
2394 -1042 -1369 -717 -270 -121 98 670 1362 1121 486 -114 -352 -650 -916 -1003 -857 -270 447 762 778 857 827
2415 827 489 -105 -782 -1027 -841 -480 -506 -304 459 1215 1059 578 194 139 -62 -724 -1221 -942 -503 142 149
2436 149 615 745 959 780 240 -386 -740 -796 -788 -710 -474 86 901 990 577 480 561 274 -598 -1025 -922 -562
$$ packed form
2290I33R0k26p64j057l71J82M06J33M55O38Q31L64n24o76l66k88l85n56k88N83
2310h86J062L72J91K54K54Jq13q95n51J13Mj31J96Q35P99M56j10l61j60l44m97
2331b11r74l79N04O40L94K88L91O71K3o08q34l81j27k23l97J12Q75Q16L21K0L9
2352I60J2l15p19o69m21J63K83J86L89M67Q25J14k95n97m76p8m47o56p3P54Q22
2373B29L33l9L69L64l87p31n72k93n2m2M5K97N78P28K32j83k05k74j89n52o98
2394a042l27O52M47J49K19N72O92k41o35o00k38k98k66q7J46N87P17L15J6P9l0
2415H27l38n94o77k45J86L61k6K02P63P56j56m81l84n5k01o62m97K79M39O45P
2436A49M66J30K14j79n40o26l54n6QP8K36N60Q15Q9m13r7Q1k87q72m27J03L60
$$ plain form
2458 -562 -309 -201 211 949 1140 960 430 12 -207 -624 -954 -925 -712 -104 452 763 681 717 791 425 -158
2479 -158 -853 -866 -472 -369 -527 -101 610 927 662 582 537 58 -291 -670 -1003 -855 -463 -5 240 484 710
2500 710 887 695 159 -412 -580 -619 -658 -799 -357 418 876 772 409 598 504 41 -537 -931 -589 -434 -382
2521 -382 -136 425 569 824 704 356 -27 -307 -586 -674 -844 -687 -18 505 562 480 637 704 333 -463 -644
2542 -644 -628 -421 -460 -385 89 649 711 565 664 363 -85 -237 -623 -787 -740 -324 201 261 473 718 989 537
2564 537 -176 -400 -413 -490 -733 -788 -231 491 506 415 518 649 368 -136 -524 -745 -604 -456 -267 48 261 623
2586 623 910 555 261 -195 -255 -310 -843 -822 -653 152 301 416 512 684 646 159 -377 -531 -479 -486 -588 -315 171
2609 171 430 869 751 448 257 49 -329 -527 -801 -468 -18 -55 87 445 853 729 274 -183 -288 -246 -583
$$ packed form
2458e62K53J08M12P38J91j80n30m18k19m17l30K9K13O08N56L11q2L6P4l66n83
2479a58o95j3L94J03j58M26P11L17k65q0m5m79l49l79l33J48L92M58K45K44K26
2500G10J77j92n36n71j68l9l9j41M42P75M58j04l63J89r4m63n78l94L42J55N2
2521c82K46N61J44K55j20l48l83k80k79q8j70J57O69N23N7q2J57O7l71p96j81
2542f44J6K07l9P5M74N60O2j46R9l01m48j52l86j64M7M16N25O0K12K45K71m52
2564E37p13k24j3p7k43n5N57P22J5r1J03J31k81n04l88k21J41J48J89L15K13L62
2586F23K87l55k94m56o0n5n33K1J69Q05J49J15R6J72l8m87n36j54N2pj02K73M86
2609A71K59M39j18l03j91k08l78j98k74L33M50l7J42L58M08j24m55m57j05M2l37
$$ plain form
2630 -583 -712 -544 -54 247 405 545 391 457 227 -78 -343 -604 -629 -448 -171 -25 348 577 823 445 163
2651 163 19 -109 -314 -686 -682 -263 176 255 363 646 729 492 166 -225 -482 -541 -475 -491 -115 158 433 655
2673 655 536 228 240 -5 -308 -551 -656 -307 -36 2 130 530 729 732 200 -15 -207 -362 -491 -663 -363
2694 -363 -119 280 477 478 521 325 242 -64 -428 -685 -409 -261 -277 -74 268 569 581 232 220 67 -122 -414
2716 -414 -567 -511 -295 194 156 425 564 566 483 145 -182 -471 -382 -353 -254 -271 106 565 615 291 318 161 -28 -326
2740 -326 -550 -605 -283 -76 -27 203 417 669 495 248 11 -105 -357 -397 -519 -220 20 347 451 521 386
2761 386 432 262 -140 -404 -446 -329 -311 -266 -18 264 554 613 198 101 74 -310 -320 -575 -397 -183 32 233 472
2784 472 449 426 343 -9 -277 -342 -305 -369 -395 -120 226 485 364 451 290 232 -11 -307 -372 -359 -324 -158 -18 354
$$ packed form
2630e83j29J68M90L01J58J40j54O6k30l05k65k61k5J81K77J46L73K29K46l78k82
2651A63j44j28k05l72MM19M39P9J08K83Q3k37l26l91k57n9O6j6L76K73K75K22
2673F55j19l08J2k45l03k43j05L49K71L8J28M00J99Ln32k15j92j55j29j72L00
2694c63K44L99J97JM3j96q3l06l64k57K76J48j6K03L42L01J2l49j2j53j89k92
2716d14j53N6K16M89l8K69J39Kq3l38l27k89Q9K9R9j7L77M59N0l24K7j57j89k98
2740c26k24n5L22K07M9K30K14K52j74k47k37j16k52m0j22K99K40L27J04P0j35
2761C86M6j70m02k64m2J17J8M5K48K82K90N9m15r7k7l84j0k55J78K14K15K01K39
2784D72k3k3q3l52k68o5L7o4k6K75L46K59j21Q7j61n8k43k96o5J3L5J66J40L72
$$ plain form
2808 354 469 519 375 205 31 -169 -387 -446 -428 -291 -21 180 310 317 588 378 146 -276 -396 -238 -254 -228
2830 -228 -85 128 318 444 360 374 41 88 -231 -335 -458 -377 -135 168 284 317 465 448 250 -40 -129 -219 -415
2853 -415 -329 -362 -57 306 345 334 347 222 181 -108 -254 -338 -378 -213 -74 -59 104 422 403 189 -17 -46 -55 -200
2877 -200 -453 -314 -185 -15 258 197 245 362 393 124 -260 -274 -242 -181 -211 -117 129 338 379 159 198 142 134 -246
2901 -246 -237 -358 -347 -16 -28 55 430 386 178 76 -121 -68 -239 -286 -426 -330 -130 97 313 278 369 356 211 -56
2925 -56 -201 -223 -302 -75 -94 -3 194 287 516 254 55 24 -82 -241 -502 -409 -175 46 230 247 396 379 173
2948 173 7 -90 -171 -244 -306 -242 -106 79 436 346 219 138 94 -80 -184 -392 -279 -107 -23 -29 21 254 261 385 207
2973 207 -73 -41 -117 -280 -322 -96 -113 169 290 296 243 154 131 -57 -473 -246 -212 -146 -109 -145 318 278 254 122 138
$$ packed form
2808C54J15N0j44j70j74k00k18n9J8J37K70K01J30PK71k10k32m22j20J58j6K6
2830b28J43K13J90J26q4J4l33M7l19j04j23Q1K42L03J16L3J48j7j98k90q9r0j96
2853d15Q6l3L05L63L9j1J3j25m1k89j46q4m0J65J39J5J63L18j9k14k06k9rj45
2877b00k53J39J29J70K73o1M8J17L1k69l84j4L2O1l0R4K46K09M1k20L9n6ql80
2901b46Rj21J1L31j2Q3L75m4k08j02j97N3j71m7j40R6K00K27K16l5R1j3j45k67
2925e6j45k2p9K27j9R1J97R3K29k62j99l1j06j59k61R3K34K21J84J7J49j7k06
2948A73j66r7q1p3o2O4J36J85L57r0j27q1m4j74j04k08J13J72Q4oN0K33PJ24j78
2973B07k80L2p6j63m2K26j7K82J21On3q9k3j88m16K27L4O6L7l6M63m0k4j32J6
$$ plain form
2998 138 -28 -143 -253 -354 -266 -72 -28 164 224 284 297 235 2 -150 -330 -234 -161 -188 -93 33 259 286 245 83
3022 83 137 3 -91 -302 -250 -64 -26 126 55 273 376 178 95 -82 -152 -262 -117 -226 -152 -24 172 134 247
3045 247 264 249 119 -22 -162 -237 -105 -65 -8 -84 209 205 222 156 73 -31 -159 -285 -286 -214 -77 97 174 208 261 256
3071 256 89 -87 -204 -199 -126 -18 -92 -65 136 263 203 187 180 109 -45 -163 -311 -285 -182 -23 -25 156 196 277 166
3096 166 4 -128 -177 -321 -263 -244 -134 -43 184 171 119 257 286 9 -257 -156 -323 -53 -127 -7 99 216 253
3119 253 257 159 54 -69 -81 -179 -169 -180 -51 109 94 96 297 220 104 -9 -137 -187 -179 -189 -226 15 225 214 259 146
3145 146 196 129 -13 -190 -292 -232 -172 -54 117 73 178 177 204 53 -150 -42 -20 -195 -156 -140 119 80 301 240
3169 240 294 106 95 -62 -122 -160 -141 -126 -51 135 110 205 186 170 136 20 -50 -135 -209 -158 1 54 69 147 175 208 178
$$ packed form
2998A38j66j15j10j01Q8J94M4J92O0O0J3o2k33j52j80R6P3k7R5J26K26K7m1j62
3022H3N4j34r4k11N2J86L8J52p1K18J03j98q3j77p0j10J45j09P4J28J96l8J13
3045B47J7j5j30j41j40p5J32M0N7p6K93mJ7o6q3j04j28j26jP2J37J74P7L4N3n
3071B56j67j76j17NP3J08p4K7K01J27o0j6pp1j54j18j48K6J03J59kJ81M0Q1j11
3096A66j62j32m9j44N8J9J10R1K27j3n2J38K9k77k66J01j67K70p4J20J06J17L7
3119B53Mr8j05j23j2r8J0j1J29J60j5KK01p7j16j13j28n0Qj0l7K41K10j1M5j13
3145A46N0o7j42j77j02O0O0J18J71m4J05jK7j51k03J08K2j75L9J6K59l9K21o1
3169B40N4j88j1j57o0l8J9J5P5J86k5R5j9j6l4j16p0q5p4N1J59N3J5P8K8L3l0
$$ plain form
3196 178 3 -139 -21 -242 -160 -33 104 154 211 240 28 92 68 -187 -75 -197 -162 -57 42 32 158 292 184
3219 184 87 8 22 -207 -268 -189 -235 -63 31 95 155 131 135 98 52 -121 -60 -152 -125 -30 -23 62 190 136 146 116 108 -30 -178
3248 -178 -147 -134 -149 -8 146 124 153 259 205 157 -36 -135 -274 -163 -167 -66 63 172 190 136 1 245 -39 -2
3272 -2 -148 -55 19 -23 -4 -70 107 151 147 48 -58 -122 -128 -159 -61 -118 -115 204 182 255 220 263 115 -48 -119 -162 -62 -180
3300 -180 -45 36 21 191 165 131 83 18 5 22 -176 -106 -9 -34 2 -29 57 124 130 11 -58 -53 -93 -163 -116 -77 -80 17 229
3329 229 167 116 82 63 87 -116 12 16 -7 27 15 195 182 138 112 92 -27 -149 -136 -116 -148 -12 195 202 84 44 30
3356 30 30 9 -86 -140 -108 -129 -139 -36 96 224 201 154 91 128 40 -152 -160 -196 -71 48 16 142 151 128 -40 32 -37 -199
3384 -199 -139 -201 -106 -95 -42 164 90 128 98 71 32 -27 -75 -43 -70 -133 -33 109 71 254 236 206 37 -22 -69 -184 -167
$$ packed form
3196A78j75j42J18k21Q2J27J37N0N7K9k12O4k4k55J12j22L5J05R9j0J26J34j08
3219A84r7p9J4k29o1P9m6J72R4O4O0k4Ml7m6j73O1r2K7R5PQ5J28n4J0l0qj38j48
3248a78L1J3j5J41J54k2K9J06n4m8j93r9j39J11mJ01J29J09J8n4j35K44k84L7
3272bj46R3P4m2J9o6J77M4mr9j06o4ol1R8n7LL19k2P3l5M3j48j63p1m3J00j18
3300a80J35Q1j5J70k6l4m8o5j3J7j98P0R7k5L6l1Q6O7Oj19o9Nm0p0M7L9lR7K12
3329B29o2n1l4j9K4k03J28Mk3L4j2J80j3m4k6k0j19j22J3K0l2J36K07Pj18m0j4
3356C0%k1r5n4L2k1j0J03J32J28k3m7o3L7q8j92ql6J25J19l2J26Rk3j68P2o9j62
3384a99O0o2R5J1N3K06p4L8l0k7l9n9m8L2k7o3J00J42l8J83j8l0j69n9m7j15J7
$$ plain form
3411 -167 -34 -84 63 56 100 246 127 150 -123 39 -132 -80 -152 -94 59 95 139 169 123 44 41 -21 -133 -186 -168 -53
3437 -53 -31 -50 96 77 67 128 -18 -33 -75 -112 -152 -140 -46 105 -44 55 95 166 179 -39 -200 -164 -174 -94 -10 -36 63
3464 63 140 138 107 118 -89 24 14 -86 -130 -101 204 70 96 4 -54 61 158 10 -48 -28 -154 -90 41 -3 143 158
3490 158 117 83 25 -46 -18 -164 -211 -76 -102 -5 6 102 104 74 59 10 -135 4 -23 -91 -151 -24 -16 97 60 183 48
3517 48 114 136 -76 -94 -120 -62 4 11 4 162 68 210 91 19 39 -43 -98 -200 -35 -33 27 123 93 172 78 39 2 -150
3545 -150 -171 -115 -53 9 -38 67 248 73 2 122 112 -104 -106 -177 -114 50 85 6 63 16 189 40 8 -13 -49 20
3571 20 -122 -101 -9 -85 139 -20 45 129 111 43 38 -85 -32 -71 -17 4 72 59 189 196 -36 36 -7 -10 -116 -103 51 101
3599 101 118 67 146 -42 204 -2 56 -159 -3 31 -118 -83 64 -4 45 213 46 69 9 -17 -110 -113 -12 -6 4 -47
$$ packed form
3411a67J33n0J47pM4J46j19K3k73J62j71N2p2N8J53L6M4L0m6p9lo2j12n3J8J15
3437e3K2j9J46j9j0O1j46j5m2l7m0J2R4J51j49R9M0P1J3k18j61L6j0Q0Q4k6R9
3464F3P7kl1J1k07J13j0j00m4K9L05j34K6r2n8J15R7j48n8K0j26O4J31m4J46J5
3490A58m1l4n8p1K8j46m7J35k6R7J1R6Kl0j5m9j45J39k7o8o0J27QJ13l7J23j35
3517D8O6K2k12j8k6N8O6PpJ58r4J42j19p2K0q2n5j02J65KO0R6l0P9r4l9l7j52
3545a50k1N6O2O2m7J05J81j75p1J20j0k16kp1O3J64L5p9N7m7J73j49l2k1l6O9
3571B0j42K1R2p6K24j59O5Q4j8o8nj23N3l9N4K1O8j3J30Pk32P2m3lj06J3J54N0
3599A01J7n1P9j88K46k06N8k15J56L4j49L5J47o8M9J68j67K3o0k6r3lJ01OJ0n1
$$ plain form
3625 -47 -76 116 60 83 -96 -125 -58 -125 -158 -59 -132 -67 137 151 170 39 -4 31 -100 17 -119 -50 -32 -111 44 47 -114
3652 -114 49 147 -17 -32 -20 -145 11 -228 86 50 64 206 100 113 26 -85 0 15 -42 -105 -78 115 50 93 34
3677 34 73 125 119 92 -44 20 -145 -10 33 -14 -20 143 2 27 46 18 166 -219 -36 -138 -77 24 66 38 53 146
3703 146 14 55 -19 -30 -96 -155 -141 -73 61 -66 182 31 -24 -19 -4 -192 -189 -220 28 45 -8 10 125 265 145 38
3729 38 -128 0 -21 -103 -33 60 94 61 69 -60 27 65 -30 -57 -80 138 59 -33 -112 -102 -79 124 79 44 -90 -5 -42 -34
3757 -34 -208 -61 -79 90 144 15 46 36 74 -62 -90 -6 158 -117 8 -128 30 -9 -29 -34 60 145 -29 -33 -30 -96
3783 -96 1 -46 -80 30 142 104 91 -89 -64 5 28 68 -31 4 106 62 78 -48 -9 30 -12 -11 10 -6 -81 58 62 47
3811 47 70 89 92 30 123 1 8 -92 -89 -27 -62 29 -22 77 -50 247 104 37 -23 -142 78 -128 -35 105 245 42
$$ packed form
3625d7k9J92n6K3j79k9O7o7l3R9p3O5K04J4J9j31m3L5j31J17j36O9J8p9J55Lj61
3652a14J63R8j64j5J2j25J56k39L14l6J4J42j06J3q7j11Q5J5n7o3K7J93o5M3n9
3677C4L9N2ok7j36O4j65J35M3m7oJ63j41K5J9k8J48l85J83j02O1J01M2k8J5R3
3703A46j32M1p4j1o6n9J4O8J34j27K48j51n5NJ5j88Ll1K48J7n3J8J15J40j20j07
3729C8j66J28k1q2P0R3L4l3Qj29Q7L8r5k7k3K18p9r2p9J0K3K03m5l5j34Q5l7Q
3757c4j74J47j8J69N4j29L1j0L8j36k8Q4J64k75J25j36J58l9k0nR4Q5j74mLo6
3783i6R7m7l4J10J12l8j3j80K5O9K3M0r9L5J02m4J6j26L9L9m2JK1j6p5J39Mj5
3811D7K3J9Lo2R3j22Pj00LO2l5R1n1R9j27K97j43o7o0j19K20k06R3J40J40k03
$$ plain form
3837 42 71 35 63 -44 -1 34 -71 57 90 68 28 -45 14 36 -12 -35 -54 70 -83 93 -46 0 -6 -94 4 79 -63
3864 -63 -61 18 -30 39 126 25 -59 -19 -109 54 37 -44 -30 -70 72 -61 28 -100 -104 -72 -108 45 125 15 50 19 -57 -17
3892 -17 -16 -43 -33 -42 -100 17 -10 97 14 18 69 67 -45 -2 -58 -44 -126 -93 60 27 165 37 8 -32 7 -28 -66 -72 -44 75
3922 75 41 19 100 98 28 63 59 -13 87 -58 -66 -94 9 20 -4 76 62 65 -15 56 -33 -77 20 -24 80 49 92 35 172 113
3952 113 -50 -23 -47 -3 -15 -82 -57 -21 31 -12 89 51 64 -50 -181 -63 140 8 38 -69 100 226 15 -53
3976 -53 -48 41 -41 -52 -42 112 149 76 19 2 -20 10 53 38 -16 92 22 -62 3 -63 47 5 116 92 129 -118 33 -97
4004 -97 -37 27 -63 33 -65 -29 63 102 68 7 -11 -20 -71 9 -105 -39 35 34 -45 -130 -2 210 96 5 109 -49 61 74
4032 74 56 -45 106 84 24 1 -34 -61 178 -42 48 -35 -113 18 96 57 -12 33 140 -100 53 2 -22 -83 -6 -19
$$ packed form
3837D2K9l6K8j07M3L5j05J28L3k2m0p3N9K2m8k3j9J24j53J76j39M6oq8R8P5j42
3864f3KP9m8O9Q7j01q4M0r0J63j7q1J4m0J42j33Q9j28mL2l6J53Q0j10L5l1p6M0
3892a7Jk7J0rn8J17k7J07q3MN1kj12M3n6J4q2L3J53l3J38j28k9m0L9l5l8oK8J19
3922G5l4k2Q1kp0L5mp2J00j45qk8J03J1k4Q0j4Lq0P1q9m4R7m4J04l1M3n7J37n9
3952A13j63K7k4M4j2o7K5L6N2m3J01l8J3j14j31J18K03j32L0j07J69J26k11o8
3976e3NQ9q2j1J0J54L7p3n7j7k2L0M3j5n4J08p0q4O5o6J10m2J11k4L7k47J51j30
4004i7O0O4r0R6r8L6R2L9l4o1j8rn1Q0j14O6P4jp9q5J28K12j14r1J04j58J10J3
4032G4j8j01J51k2o0k3l5k7K39k20R0q3p8J31P8l9o9M5J07k40J53n1k4o1P7j3
$$ plain form
4058 -19 -78 75 -14 9 42 66 56 -41 -60 13 -50 -11 -77 -39 30 -14 21 -122 -122 99 20 23 -92 15 48 160 54 41
4086 41 92 49 148 -163 49 29 48 -74 34 -44 17 50 -54 -24 -7 -6 -32 -126 -65 -116 89 10 -53 56 -16 -24 -91 48
4114 48 46 -66 -28 -7 -162 54 1 -53 16 11 33 -56 26 -81 -12 -19 -33 81 20 -12 23 142 -16 -41 -31 71 2 46
4142 46 -124 -199 3 31 -6 -40 69 98 23 -3 19 11 -7 72 22 66 -36 36 -61 10 50 155 -42 -70 -157 37 -12
4169 -12 -5 71 -20 -77 42 32 -123 -30 40 59 7 -43 -51 25 111 -15 17 8 11 -7 -44 35 3 -27 -123 -1 -8 79 20 -17 -80
4200 -80 198 43 16 -2 -79 -128 62 -61 6 -140 76 51 60 46 -12 -8 147 -10 -69 -69 71 142 19 34 1 22 39
4227 39 -59 -67 -16 84 -87 -100 60 15 76 9 91 -43 169 -23 -20 -4 84 -11 76 -2 -18 44 -14 48 -9 103 44 101
4255 101 -4 -4 -22 37 -18 0 -16 76 -11 36 40 -103 -39 49 20 -126 108 61 78 50 -55 0 -90 92 -92 54 42
$$ packed form
4058a9n9J53q9K3L3K4j0r7j9P3o3L9o6L8O9m4L5j43%K21p9Lj15J07L3J12j06j3
4086D1N1m3R9l11K12k0J9j22J08p8O1L3j04L0J7Jk6r4O1n1K05p9o3J09p2qo7J39
4114D8kj12L8K1j55K16n3n4O9nK2q9Q2j07O9pj4J14o1l2L5J19j58k5J0J02o9M4
4142D6j70p5K02K8l7l4J09K9p5k6K2qj8P9n0M4j02P2r7P1M0J05j97k8q7J94m9
4169a2PP6r1n7J19j0j55R3P0J9n2n0qP6Q6j26L2rLj8l7P9l2l0r6J22pQ7n9l7o3
4200h0K78j55k7j8p7m9J90j23O7j46K16k5Rj4n8MJ55j57n9%J40P1j23J5l3K1J7
4227C9r8qN1J00j71j3J60m5O1o7Q2j34K12j92LJ6Q8r5Q7p8j6O2n8O2n7J12n9N7
4255A01j05%j8N9n5J8j6R2q7M7Mj43O4Q8k9j46K34m7J7k8j05N5r0J82j84J46j2
$$ plain form
4282 42 43 33 24 79 46 68 39 -32 -17 39 -4 -80 -66 74 90 86 -8 -18 -32 53 16 85 55 -133 11 91 -15 59 20 110
4312 110 23 -30 -15 -54 -210 73 13 32 39 12 75 39 -6 -38 1 -203 -67 -6 0 -16 -27 30 34 -8 36 -99 2 1 -104
4341 -104 -25 -100 -17 -90 -14 -11 -22 -27 -89 -43 -22 -61 -94 27 10 -69 -149 -45 7 39 85 23 22 -22 -35 -25 96 -9 2
4370 2 -9 59 74 -43 -53 46 -154 40 78 -111 -19 -184 -54 -30 -124 3 13 104 50 -5 -46 -65 -34 -85 111 95 45
4397 45 -135 38 48 -84 42 11 -141 8 -88 166 -115 43 53 70 110 58 -124 -1 4 90 -57 68 -5 -38
4421 -38 -4 -58 -34 72 7 5 -79 -10 -92 -14 31 1 35 -11 -84 -66 27 -52 98 -65 -101 -76 -54 -49 3 -77 82 127 -7
4450 -7 -68 13 29 -163 -20 51 27 56 -24 112 -77 60 11 -14 -73 4 -108 20 -33 -78 -87 -76 -107 97 -111 -44 -74
4477 -74 -46 48 -37 -4 -5 61 38 68 -121 39 -20 -137 -18 -3 79 82 8 -25 -16 101 1 -14 -33 46 24 109 -98 -36
$$ packed form
4282D2Jj0rN5l3K2k9p1J5N6m3p6J4J40J6mr4j0j4Q5l7O9l0j88J44Q0j06P4l9R0
4312A10q7n3J5l9j56K83o0J9Pk7O3l6m5l2L9k04J36O1Oj6j1N7Mm2M4j35J01jj05
4341a04P9p5Q3p3P6Lj1no2M6K1l9l3J21j7p9q0J04N2L2M6o2jm4j3J0J21j05J1
4370Bj1O8J5j17j0R9k00J94L8j89R2j65J30K4r4J27J0R1n4n5m1j9L1n1J96j6n0
4397D5j80J73J0j32J26l1j52J49r6K54k81J58J0J7M0n2j82J23NQ6j47J25p3l3
4421c8L4n4K4J06o5kq4O9q2P8M5l0L4m6p3J8R3p9J50j63l6K5K2NN2q0J59M5j34
4450go1Q1J6j92J43P1k4K9q0J36j89J37m9k5n9P7j12J28n3m5rJ1l1K04k08O7l0
4477g4K8R4q5L3jO6k3L0j89J60n9j17J19J5Q2Lp4l3RJ17j00j5j9P9k2Q5k07O2
$$ plain form
4505 -36 66 30 42 32 95 96 -36 20 -22 -5 53 52 2 -72 73 44 -65 -4 51 -18 73 21 -52 -82 59 11 -68 -46 123
4534 123 -8 24 -125 -175 8 50 -82 -116 47 -16 0 1 75 55 9 95 -146 -87 -26 -12 -20 -37 195 85 -14 -12 -15 36
4562 36 44 11 160 -52 -83 -58 51 -6 23 62 3 -48 -52 67 4 65 50 -103 25 99 52 -23 127 69 -9 -54 33 42
4590 42 -30 -67 -2 53 31 135 89 -19 23 -79 8 -26 -28 -99 -7 38 53 -58 79 123 11 74 -83 -43 -59 -82 -37
4617 -37 -22 29 16 -19 -18 124 51 1 -51 -22 37 -26 53 50 -3 -69 -43 -83 -45 -33 -40 -154 67 -88 -134 85 2 42 -40
4646 -40 -1 -7 -44 -54 -7 -42 -65 -91 10 -24 -110 -69 111 30 46 -57 -71 36 -61 -48 -36 22 -53 -34 14 45 62 -63
4674 -63 99 -37 -89 27 101 -40 -156 -42 32 66 -47 143 84 -13 3 39 33 41 -63 24 73 -77 -58 -9 26 45
4700 45 -21 20 -63 24 57 11 32 79 62 50 109 -57 -32 -17 13 47 -45 126 25 -83 56 29 10 -38 -28 -36 45 68
$$ packed form
4505c6J02l6J2j0O3Jj32N6m2J7N8jn0p4J45k9j09O1N5o9R1n2p3l0J41m8p9K2J69
4534A23j31L2j49n0J83M2j32l4J63o3J6JP4k0m6Q6k41N9O1J4qj7K32j10r9KlN1
4562C6Ql3J49k12l1K5J09n7K9L9n9n1mJ19o3O1j5j53J28P4m7p5J50n8p8m5Q7R
4590D2p2l7O5N5k2J04m6j08M2j02Q7l4kp1R2M5J5j11J37M4j12O3j57M0j6k3M5
4617c7J5N1j3l5JJ42p3n0n2K9N9o3P9ln3o6K6m0L8J2pj14K21j55m6K19q3M0q2
4646d0L9ol7j0M7l5k3k6J01l4q6M1J80q1J6j03j4J07r7J3J2N8p5J9M8L1J7j25
4674f3J62j36n2J16P4j41j16J14P4L4j13J90n9r7J6L6oQj04Q7M9j50J9M9L5J9
4700D5o6M1q3Q7L3m6K1M7j7j2N9j66K5J5L0L4r2J71j01j08J39k7j9m8J0qQ1K3
$$ plain form
4728 68 15 -40 30 35 -12 118 34 -45 37 59 36 -91 -83 17 -78 154 62 3 44 72 128 -83 27 -58 -68 -45 61 -41
4756 -41 -14 77 -29 -36 69 84 -48 -41 57 36 -53 134 -77 126 108 7 176 -42 14 -70 -2 -160 46 -18 86
4781 86 75 -7 -130 9 102 19 -48 -75 -123 89 14 0 -94 107 -24 -40 31 -185 107 37 -23 17 36 19 182 61
4807 61 0 105 -45 -78 -57 4 -14 54 -16 8 -9 -9 99 23 -71 -75 71 62 0 -105 31 5 -43 25 -2 25 28 -29 18
4836 18 -39 39 -33 -6 -100 54 -27 21 136 -2 40 26 -42 -19 19 61 29 -70 93 -18 -13 -34 -75 129 -70 45 -47
4863 -47 -122 82 -23 12 34 55 159 44 99 -115 134 0 130 -18 -142 -81 29 50 10 3 -65 -50 -68 -125 11
4888 11 13 69 19 -20 59 -61 58 114 21 -142 103 2 69 -15 -61 -70 -71 -48 -40 175 -31 72 -5 -55 180 19 12 27
4916 27 70 42 34 -8 -118 -37 -36 38 144 -4 5 -5 46 51 59 126 75 84 -111 26 42 -104 -26 -39 -31 34 -1 -27 -57 -30 -65
$$ packed form
4728F8n3n5P0Nm7J30q4p9Q2K2k3j27QJ00r5K32r2n9M1K8N6k11J10q5j0K3J06j02
4756d1K7R1j06pJ05J5j32PR8k1q9J87k11K03j8j01J69k18N6q4O8j58K06o4J04
4781H6j1q2j23J39R3q3o7k7m8K12p5j4r4K01j31j6P1k16K92p0o0M0J9j7J63j21
4807F1o1J05j50l3K1O1j8O8p0K4j7%J08p6r4mJ46ro2j05J36k6m8O8k7K7Ln7M7
4836A8n7P8p2K7r4J54q1M8J15j38M2j4o8K3L8M2l2r9J63j11Nk1m1K04j99J15r2
4863d7p5K04j05L5K2K1J04j15N5k14K49j34J30j48j24O1J10K1m0po8J5j8n7J36
4888A1KN6n0l9P9j20J19N6r3j63K45j01O7q4m6rjK3QK15k06J03p7n0K35j61pJ5
4916B7M3k8qm2j10Q1JP4J06j48Rj0N1NQO7n1Rj95J37J6j46P8j3QO5l5k6l0K7l5
$$ plain form
4947 -65 21 -110 -21 -21 72 -43 -120 96 52 17 -70 -131 -130 74 -9 -113 -25 66 1 91 94 57 14 -10 -90 13 -75 -67 105
4976 105 -65 -164 42 -40 12 33 16 100 15 -163 -110 -57 -22 -56 -96 16 135 117 46 -29 -6 18 30 84 -49 -45 34
5003 34 -32 12 -28 -8 87 201 29 30 -33 -79 -10 86 68 -103 48 6 36 40 -92 46 -155 18 -10 59 -9 -6 86 -67
5031 -67 89 -36 -37 187 -24 -123 0 74 -42 8 22 36 -10 11 -35 146 5 10 45 -111 36 -20 106 10 33 20
5057 20 -42 -92 14 88 24 -74 29 21 70 34 -64 108 46 -94 134 30 -39 -45 2 -27 36 164 16 32 -6 6 -4
5084 -4 -7 -19 -39 -24 -41 29 45 -42 -7 36 -51 36 40 -24 -12 27 -47 -38 -58 129 38 33 16 11 1 -97 -50 8 -41 56 28 98 113
5117 113 -12 69 -6 9 86 -139 39 -76 12 -27 28 88 35 20 106 -133 72 -7 -48 114 64 131 37 100 -22 36
5143 36 -71 85 -128 33 -155 -7 -152 -42 -29 37 67 -36 54 -54 -44 38 -64 -67 64 12 -40 103 117 48
$$ packed form
4947f5Q6j31Q9%R3j15p7K16m4l5q7o1JK04q3j04Q8R1o5R0Ll7m3k4q0J03q8QJ72
4976A05j70r9K06q2N2K1j7Q4q5j78N3N3L5l4m0J12J19j8p1p5K3K4J2N4j33MP9
5003C4o6M4m0K0R5J14j72Jo3m6O9R6j8j71J51m2L0Mj32J38k01J73k8O9o8LR2j53
5031f7J56j25jK24k11r9J23P4j16N0J4J4m6K1m6J81j41NL5j56J47n6J26r6K3j3
5057B0o2n0J06P4o4r8J03qM9l6r8J72o2j40K28j04o9oM7k9O3J28j48J6l8J2j0
5084dlj2k0J5j7P0J6q7L5M3q7Q7Mo4J2L9p4Rk0J87r1nj7nj0r8M7N8m9R7k8P0J5
5117A13j25Q1p5J5P7k25J78j15Q8l9N5O0n3j5Q6k39K05p9m1J62n0O7r4O3j22N8
5143C6j07J56k13J61j88J48j45J10J3O6L0j03R0j08J0Q2j02lJ31n2n2J43J4o9
$$ plain form
5167 48 26 91 2 104 11 -101 93 -102 -17 21 120 115 22 32 58 -120 -21 78 79 -63 -94 -71 211 3 -124 -76 23
5194 23 -81 34 -46 -36 -143 -110 97 39 77 -38 65 -29 28 -61 35 87 -33 118 71 5 52 45 -41 -79 -94 -83 25
5221 25 -31 28 41 -128 -61 38 -69 70 3 18 4 -108 -42 -49 98 48 -50 -31 -45 46 -34 31 -61 -51 -126 64 -142
5248 -142 -42 24 89 1 14 24 -16 -150 -44 -44 -39 -88 7 -43 -113 1 155 -65 -49 -66 -108 92 30 94 -8 23 -2
5275 -2 -50 -57 44 -37 18 0 28 -82 -94 11 -14 -49 67 55 101 -90 -38 -11 109 0 -42 -133 48 50 -75 33 -140
5302 -140 69 129 13 -40 -45 9 35 44 59 50 -12 95 -73 -7 108 -50 -36 -85 -30 -11 -59 -35 75 -13 33 -3 34 27
5330 27 -47 -43 86 0 -5 -31 107 21 0 17 -11 65 -90 -63 -93 -126 -124 -28 -47 -17 -8 30 -28 91 60 -65 26 65 -63
5359 -63 -115 66 -16 49 25 -24 -55 38 177 50 -32 92 -32 -51 96 93 33 33 22 -37 3 -65 -72 -16 -47 -100 -39 -27 49
$$ packed form
5167D8k2O5q9J02r3j12J94j95Q5L8R9nr3J0K6j78R9R9Jj42l1K3K82k08j27M8R9
5194B3j04J15q0J0j07L3K07n8L8j15J03r4N7q9R6N2j20J51m7o6M7pq6l8j5J1J08
5221B5n6N9J3j69O7R9j07J39o7J5j4j12O6pJ47n0r8J9j4R1q0O5r2J0p5J90k06
5248a42J00O6O5q8J3J0m0j34J06%Nm9R5n0p0J14J54k20J6j7m2K00o2O4j02L1k5
5275bm8pJ01q1N5j8K8j10j2J05k5l5J16j2M6j91N2K7J20j09m2r1J81Kj25J08j73
5302a40K09O0j16n3nN4K6RJ5ro2J07j68O6J15j58J4m9N5J9m8K4J10q8M6l6L7p
5330B7p4MJ29q6nk6J38q6k1J7k8P6j55K7l0l3KR6j9L0RL8n8J19l1j25R1L9j28
5359f3n2J81q2O5k4m9l1R3J39j27q2J24j24j9J47lo0%j1n9M0o8pN6l1n3O1J2P6
$$ plain form
5388 49 -42 -37 58 92 44 -5 -70 -45 54 -26 30 39 96 -102 75 53 25 -34 -46 35 38 -97 32 -78 30 65 79 52 -3
5417 -3 141 6 -40 20 -41 -22 98 -15 13 35 34 10 -93 -131 -70 -22 -18 -21 14 27 86 93 33 -31 -92 -14 69 -18 48 -29
5447 -29 -104 65 66 -75 -28 4 -27 -123 45 95 -46 -21 -123 5 -12 -49 86 11 131 50 16 -5 17 -167 59 -60
5473 -60 32 -75 107 60 -80 14 -110 -3 107 -37 -48 95 -103 89 55 149 -160 -23 73 -90 11 29 -34
5496 -34 15 32 -18 -46 -123 -22 69 14 -55 -16 44 112 -46 19 102 -49 167 150 17 137 -28 -5 -35 -26 -47 34 -59
5523 -59 -91 19 -4 -67 34 107 -114 -35 -108 -36 42 -58 -5 -61 21 41 32 46 27 13 -32 -2 4 32 13 108 38 70 77 2
5553 2 29 47 -104 -52 -115 0 -24 -138 -49 132 82 -87 7 23 41 60 -61 124 50 -86 -102 100 61 -4 -14 55
5579 55 60 -162 -71 -164 -140 68 39 -159 -8 96 -53 -20 -19 -51 -180 45 -63 -55 -5 -43 -9 -21 22 -61 -130 26 47
$$ packed form
5388D9r1NR5L4m8m9o5K5R9q0N6RN7j98J77k2k8n9j2Q1Lj35J29j10J08L5J4k7n5
5417cJ44j35m6O0o1J9J20j13K8K2jk4j03l8O1M8MlL5J3N9Po0o4o1P8Q3q7O6p7
5447b9p5J69Jj41M7L2l1r6J68N0j41K5j02J28j7l7J35p5J20q1l4k1K2j84K26j19
5473f0R2j07J82m7j40R4j24J07J10j44j1J43j98J92l4R4l09J37R6j63J01J8o3
5496c4M9J7n0k8p7J01R1n5o9L9O0O8j58O5Q3j51K16j7j33J20j65K3l0Rk1Q1r3
5523e9l2J10k3o3J01P3k21P9p3P2P8j00N3n6Q2K0rJ4j9j4m5L0OK8j9R5p0L2Pp5
5553BK7J8j51N2o3J15k4j14Q9J81n0j69R4J6J8J9j21J85p4j36j6K02l9o5j0O9
5579E5Nk22R1r3K4K08k9j98J51J04j49L3Jl2j29K25j08QN0l8L4j2M3q3o9J56K1
$$ plain form
5606 47 -36 -25 -10 25 -39 -15 80 166 26 -60 -147 9 18 34 -14 -8 115 73 -98 14 -69 15 -66 -53 34 -110 121 73
5634 73 -41 -72 86 71 -48 36 -116 26 -6 -150 -50 75 -114 -10 18 17 67 52 -55 57 47 46 -52 -75 -46
5659 -46 144 55 7 84 103 1 -39 70 -47 -71 86 -13 162 117 27 -51 -17 -12 -137 -13 71 -32 92 12 0 -45
5685 -45 78 112 -188 -90 -54 -37 -32 -14 18 -52 9 66 -32 -7 -6 -90 -79 -68 -160 2 4 -90 -1 95 55 6 72 51 -14 12
5715 12 -113 -26 34 23 -37 -8 -101 61 122 -53 53 63 -26 -198 -13 -33 -122 50 97 -17 9 -75 -109 -16 -83 -125
5741 -125 46 -122 58 -142 -75 11 -182 -42 -86 11 -32 -86 15 12 -78 -16 -154 -71 -28 54 123 -17 171 -67 60
5766 60 10 31 -22 54 93 93 76 -54 104 -25 7 -37 -36 4 35 -33 18 30 -64 -19 -113 157 -90 -162 -88 43 -51 -16
5794 -16 -47 14 -28 -63 89 -19 4 -144 3 38 -67 -36 46 -38 110 -17 -27 -9 65 37 74 94 53 -30 -8 25 4
$$ packed form
5606D7q3J1J5L5o4K4R5Q6j40q6q7J56RJ6m8OJ23m2j71J12q3Q4q1J3Q7j44K31m8
5634G3j14l1J58j5j19Q4j52J42l2j44J00J25j89J04K8jN0j5j07J12j0jr8k3K9
5659d6J90q9m8P7J9j02m0J09j17k4J57r9J75m5r0p8L4Nj25J24Q4j03J24q0j2m5
5685d5J23L4l00R8L6J7NJ8L2p0O1N7r8K5Jq4J1J1r2J62Kr4Q9R6m0m9O6k1o5K6
5715A2j25Q7O0j1o0K9r3J62O1j75J06J0q9j72J85k0q9J72M7j14K6q4l4R3o7m2
5741a25J71j68J80k00O7Q6j93J40m4R7m3n4J01lr0O2j38Q3M3Q2O9j40J88k38J27
5766F0n0K1n3P6L9%j7j30J58j29L2m4JM0L1o8N1J2r4M5r4K70k47p2P4J31r4L5
5794a6l1O1m2l5J52j08K3j48J47L5j05L1Q2q4J48j27j0J8P4k8L7K0m1q3K2L3k1
$$ plain form
5821 4 82 30 170 127 -27 -100 55 -3 -50 56 148 72 -58 -92 -155 154 -4 -86 -33 -32 51 -42 -96 22 45 25 25 -80
5849 -80 -60 -1 -29 -117 6 -83 -9 75 27 35 -44 112 -57 126 114 2 139 -28 20 -41 29 54 5 31 112 -42 -32
5876 -32 -22 115 -35 11 194 57 91 39 114 -41 -58 42 8 53 -108 -1 -14 12 52 -5 191 -34 -91 -74 -195
5901 -195 -98 -78 -32 -47 -42 19 -35 -39 -4 60 -31 70 12 -44 -2 -23 55 61 -124 -37 54 -20 31 -4 69 -4 -13 54 55 -28 37
5932 37 -22 38 73 -67 -121 -155 -6 16 87 -59 44 -51 -34 -59 -28 -26 -7 -125 -34 -51 -63 38 -86 32 17 -12 -118
5959 -118 -40 -8 111 -10 63 41 -56 25 -37 93 139 75 31 63 -4 70 -131 -18 -148 -26 -5 86 35 80 47 -100
5985 -100 96 -34 -28 -6 -44 -27 -83 -64 -28 -27 39 61 -36 -9 36 36 -34 -94 -69 -79 -29 56 -79 24 -55 34 -100 109
6013 109 -21 121 180 109 21 59 -66 62 160 -4 93 5 -75 77 -16 40 53 105 -54 -54 5 0 84 114 -3 -56 -41
$$ packed form
5821DP8n2J40m3j54p3J55n8m7J06R2p6j30l4o3L09j58q2N3JQ3r3n4J18K3k0%j05
5849h0K0N9k8q8J23q9P4Q4m8Qp9J56j69J83j2j12J37j67M8o1P0K5m9K6Q1j54J0
5876c2J0J37j50M6J83j37L4n2P5j55j7J00l4M5j61J07j3K6M0n7J96k25n7J7j21
5901a95R7K0M6j5NO1n4mL5O4r1J01n8n6M2k1P8Oj85Q7R1p4N1l5P3p3rO7Jq3O5
5932C7n9O0L5j40n4l4J49K2P1j46J03r5J7k5L1KJ9j18R1j7j2J01j24J18j5k9j06
5959a18P8L2J19j21P3k2r7Q1o2J30M6o4m4L2o7P4k01J13j30J22K1R1n1M5l3j47
5985a00J96j30OK2l8J7n6J9L6JO6K2r7K7M5%p0o0K5j0N0Q5j35J03p9Q9j34K09
6013A09j30J42N9p1q8L8j25J28R8j64R7q8q0J52r3N6J3N2j59%N9nQ4L0j17n3J5
$$ plain form
6040 -41 -50 110 -9 -16 -118 -14 -36 -119 -34 1 -7 -63 -213 -93 136 -170 67 -9 103 3 -37 -43 -44 -41 69 42 47 14
6068 14 42 -87 -19 57 -22 3 -1 -39 -80 -35 105 16 39 -27 -78 201 24 -56 152 -65 29 54 125 51 1 72 63 12
6096 12 30 11 -18 -49 -17 15 21 66 -33 79 138 122 71 -51 -35 -109 36 0 11 104 -4 -110 34 11 51 37 -93
6123 -93 -117 -114 25 -79 23 43 2 46 -17 54 -32 -87 22 -58 -29 -25 -20 -62 4 60 -10 45 -73 23 5 -103 25 -84
6151 -84 42 51 67 41 -68 33 -6 -45 -45 52 -82 -5 86 -25 -72 -101 28 -125 -13 62 75 31 145 11 -44 48
6177 48 2 28 185 0 -84 42 -17 -35 -68 -51 -20 -89 -48 -63 40 78 25 -63 144 -80 72 -25 -47 -19 -11 -79 40
6204 40 78 -3 -18 8 -88 -17 -12 -93 -7 -8 -50 59 -37 137 43 11 -68 -77 -71 82 -167 -22 -76 62 131 -96 -38 67
6232 67 63 -56 -89 -141 -10 55 -159 45 -25 -49 53 7 20 85 -36 -23 -12 -117 -3 -54 55 -43 -102 16 -118
$$ packed form
6040d1rJ60j19pj02J04k2q3Q5L5qn6j50J20K29l06K37p6J12j00m0ojLJ10k7Nl3
6068A4K8j29O8P6p9K5ml8m1M5J40q9K3o6n1K79j77q0K08k17R4K5P1p4n0P1rn1
6096A2J8j9k9l1L2L2OM5r9J12N9j6n1j22J6p4J45l6J1R3j08j06J44k3M0j4j30
6123i3k4LJ39j04J02K0m1M4o3P1q6n5J09q0K9MNm2O6N6p0N5j18R6j8j08J28j09
6151h4J26RJ6k6j09J01l9l9%R7j34P7R1j11m7k9J29j53J12P5J3m4J14j34n5R2
6177D8m6K6J57j85q4J26n9j8l3J7L1o9M1j5J03L8n3q8K07k24J52r7k2K8Qo8J19
6204D0L8q1j5K6r6P1Nq1Q6jm2J09r6J74r4l2p9rOJ53k49J45n4J38O9k27N8J05
6232F7mj19l3n2J31O5k14K04p0k4J02m6J3O5j21J3J1j05J14n1J09r8n9J18j34
$$ plain form
6257 -118 102 8 -80 33 -51 -76 35 -163 -5 -1 4 -61 11 -68 -80 -20 -12 -48 -46 -43 -39 70 12 -32 -12 57 -13 8 -112
6286 -112 -84 93 -27 70 68 5 -126 12 114 39 11 -42 0 -74 9 -28 9 -4 -66 -49 -63 -51 31 -143 21 -2 110
6313 110 67 -97 -59 68 23 86 49 -22 123 82 120 -114 10 65 -46 -21 70 -9 -18 47 -27 -9 -42 46 -69 -15 140
6340 140 94 15 -6 -60 24 22 52 42 88 -26 -24 6 5 -100 20 -25 -89 -34 -37 -3 7 -44 -1 107 -8 -18 -70 -123 -49
6369 -49 -1 62 23 37 -40 -50 47 78 25 -114 96 -19 -13 111 20 116 -23 -119 45 51 63 19 -31 -160 21 26 -69 16
6397 16 37 31 -13 7 147 -31 -89 -6 -2 -66 -12 1 -44 79 -22 65 -13 51 -6 -75 -47 -89 34 -149 -60 -50 59 -39
6425 -39 -59 91 -39 -60 39 -105 37 48 -51 -55 -38 38 0 -32 17 145 62 62 4 45 18 65 -1 14 -35 0 15 98 -3
6454 -3 116 23 -119 -66 13 -101 110 11 -38 -40 29 -90 -93 -32 -58 -5 -16 -44 31 -7 6 18 40 93 -102 90 -7 -29
$$ packed form
6257a18K20r4q8J13q4k5J11j98J58MNo5P2p9j2O0Ql6KLMJ09n8m4K0O9p0K1j20
6286a12K8J77j20R7ko3j31J38J02p5k8n3M2p4Q3l7L7j3o2J7j4J2Q2j74J64k3J12
6313A10m3j64L8J27m5O3l7p1J45m1L8k34J24N5j11K5R1p9rO5p4J8l3Q8j15N4J55
6340A40m6p9k1n4Q4kL0j0M6j14KL0jj05J20m5o4N5lL4J0n1M3J08j15j0n2n3P4
6369d9M8O3l9J4p7j0R7L1n3j39K10j15OJ24r1R6j39r6J64OJ2m4n0j29J81Nr5Q5
6397A6K1om4K0J40j78n8Q3Mo4N4J3m5J23j01Q7p8O4n7o9K8m2J23j83Q9J0J09r8
6425c9k0J50j30k1R9j44J42J1r9mJ7P6l8l2M9J28q3%n8M1k7M7o6J5m9L5J5Q3j01
6454cJ19r3j42N3P9j14K11r9m9kO9j19lO1k6N3j1k8P5l8J3J2K2N3j95J92r7k2
$$ plain form
6482 -29 31 93 -50 -9 -41 -24 -46 37 24 17 7 -17 -105 40 -58 -101 -86 55 8 -139 61 40 -25 -13 19 46 -78 101
6510 101 -76 -23 -26 -18 -89 46 53 66 -18 69 -83 138 55 -61 147 1 2 73 -85 -2 -6 9 115 16 -15 8 9 -53
6538 -53 -2 155 -31 -10 -36 20 -13 -11 -52 55 85 -56 66 -185 0 -12 12 -34 -35 -68 -185 91 -120 -57 -93 -15
6564 -15 60 -29 10 -93 -12 -120 -108 -37 -79 8 59 -104 41 170 -47 -43 93 -72 44 38 115 -8 -58 -90 -157 -20
6590 -20 -14 118 85 -94 -54 -40 77 3 17 61 -84 30 122 3 -11 -38 -127 -60 -129 -50 6 -8 81 -26 23 77 94
6617 94 139 -71 17 -8 64 -71 93 140 113 131 -25 -48 -93 49 17 34 -6 -25 -79 19 72 -12 -131 -45 8 1 4 6 39
6646 39 -107 19 -3 105 -13 25 -12 -89 8 -14 -91 -68 -71 -95 -20 -90 -65 -197 134 -55 -61 30 -18 34 -56 -70 -70 -160
6674 -160 -14 157 66 25 -76 -165 -100 -64 85 -41 -18 -23 -108 1 -73 -26 -35 50 -46 100 127 47 175 47 69 -100
$$ packed form
6482b9O0O2j43M1l2J7k2Q3j3pj0k4q8J45r8m3J5J41m7j47K00k1o5J2L2K7j24J79
6510A01j77N3lQp1J35PJ3q4Q7j52K21q3j16K08j46JP1j58Q3mJ5J06r9l1K3Jo2
6538e3N1J57j86K1k6N6l3Km1J07L0j41J22k51J85j2K4m6jl3j17K76k11O3l6P8
6564a5P5q9L9j03Q1j08J2P1m2Q7N1j63J45J29k17MJ36j65J16oP7j23n0l2o7J37
6590b0OJ32l3j79M0J4J17p4J4M4j45J14R2j19j4k7q9O7o9P9N6j4Q9j07M9N4J7
6617I4M5k10Q8k5P2j35J64M7k7J8j56k3m5J42l2J7m0j9n4R8N3q4j19Q6N3pLKL3
6646C9j46J26k2J08j18L8l7p7R7k2p7K3lk4P5p0K5j32L31j89oR1m8N2r0j4%r0
6674a60J46J71r1m1j01q9O5L6J49j26K3nq5J09p4M7rQ5r6J46K7q0J28j28K2j69
$$ plain form
6700 -100 21 15 -9 -52 21 -22 -17 -4 -11 12 -71 54 44 48 -39 -77 7 -101 -71 -27 33 -71 -12 -137 13 4 -65 52 -68
6729 -68 44 85 -22 -93 -25 -124 94 -113 3 126 121 34 -76 -58 -73 -7 -45 75 81 117 -42 -61 -71 -27 32 -20 24
6756 24 -33 43 31 2 39 -84 -27 -59 34 -72 -126 -31 -87 -42 -5 69 8 20 29 -50 188 -93 -4 -134 18 -3 19 48
6784 48 -11 -46 -6 -89 -10 214 -66 -33 46 -68 140 65 112 33 -36 164 -2 -66 41 -69 -71 -115 78 61 -4 79
6810 79 -25 -18 -17 -85 19 0 -59 1 128 60 -62 49 9 124 35 2 48 69 -41 75 23 -48 74 15 -64 -6 33
6837 33 44 107 85 22 -77 31 -67 16 25 -173 29 56 -58 126 80 -3 -80 -20 0 83 -27 56 19 -109 1 -13 91
6864 91 -55 -107 -26 26 -19 19 -104 -40 33 13 22 -61 106 78 -32 -126 4 18 -45 92 -109 1 58 35 -26 -95 -22
6891 -22 20 48 45 99 32 133 32 -78 -63 -2 -19 -26 3 -23 -61 167 30 24 -50 98 37 66 -98 -75 11 0 43 15
$$ packed form
6700a00J21ok4m3P3m3NJ3pK3q3J25j0Mq7l8Q4j08L0M4O0j04N9j25J50ro9J17j20
6729f8J12M1j07p1O8r9K18k07J16J23nq7j10J8j5O6l8J20OL6j59j9j0M4N9n2M4
6756B4n7P6j2k9L7j23N7l2R3j06n4R5n6M5L7P4o1J2Rp9K38k81Q9j30J52k1K2K9
6784D8n9l5M0q3P9K24k80L3P9j14K08p5M7p9o9K00j66o4J07j10km4J93j7o5Q3
6810G9j04PJo8J04j9n9O0J27o8j22J11m0J15q9l3M6K1j10J16n2p1J22n9p9N8L9
6837C3J1O3k2o3r9J08r8Q3Rj98K02K7j14J84m6q3p7O0K0Q3j10Q3l7j28J10j4J04
6864I1j46n2Q1N2m5L8j23O4P3k0Rq3J67k8j10r4J30J4o3J37k01J10N7k3o1o9P3
6891b2M2K8lN4o7J01j01j10J5O1j7pK9k6l8K28j37op4J48o1K9j64K3Q6j1M3k8
$$ plain form
6919 15 -61 -3 -35 -63 -19 -20 -46 5 -98 -26 -61 -157 -29 -37 8 -51 21 -186 -188 13 45 22 94 -131 9 91 1 24 88
6948 88 50 91 50 -173 -86 38 -15 4 -32 6 -112 19 13 -85 -158 -36 55 -11 81 -147 -6 -5 -62 160 90 42 121
6975 121 18 -107 39 -9 -103 24 -64 41 -30 85 -76 -57 26 -14 -72 21 -39 43 70 -44 13 215 56 -156
6999 -156 -87 -52 74 98 24 16 19 13 -100 52 -3 16 29 24 -79 -93 91 41 37 -2 13 9 -24 -153 26 20 -12 35 122 85
7029 85 -61 -48 -15 -74 110 -57 89 -14 19 39 -39 83 -86 34 -48 9 -36 -10 37 29 -50 -102 28 -6 145 -6
7055 -6 -119 -115 -91 22 17 31 -56 -93 -58 40 -15 -47 99 -58 -25 -2 29 48 -122 -8 136 -8 -58 21 65 117 18 -138
7083 -138 51 -24 -75 68 -70 140 8 -108 -108 -2 5 73 -51 -97 42 46 91 20 31 -75 40 26 -17 11 146
7108 146 79 66 5 83 -7 -201 -63 -96 -26 31 14 -145 -43 -16 -4 -14 8 -49 -95 26 -30 29 -72 -117 22 -24
$$ packed form
6919A5p6N8l2k8M4jk6N1j03P2l5r6J28qM5n9P2k07kK01L2k3P2k25J40Q2r0K3O4
6948H8l8M1m1k23Q7J24n3J9l6L8j18J31or8p3J22R1o6R2k28J41Jn7K22p0m8P9
6975A21j03j25J46m8r4J27q8J05p1J15j61J9Q3m0n8R3o0Q2K7j14N7K02j59k12
6999a56O9L5J26K4p4qLoj13J52n5J9J3nj03j4J84n0ml9J5ml3j29J79ol2M7Q7l7
7029H5j46J3L3n9J84j67J46j03L3K0p8J22j69J20q2N7m5K6M7qp9n2J30l4J51j51
7055fj13MK4J13nJ4q7l7L5R8n5l2J46j57L3K3L1J9j70J14J44j44n0P9M4N2r9j56
7083a38J89p5n1J43j38K10j32j16%J06PO8j24m6J39MM5p1J1j06J15j4m3K8J35
7108A46o7j3o1P8r0j94J38l3P0N7j7j59J02K7J2j0K2n7m6J21n6N9j01m5J39m6
$$ plain form
7134 -24 -58 -81 0 -139 19 -39 62 31 -13 -16 29 4 35 12 33 0 48 -21 83 58 148 36 -111 24 -14 86 -11
7161 -11 -39 2 -15 -44 -11 -67 -62 -41 44 -65 -67 -134 -82 -97 63 -88 -6 -104 -19 -68 -66 -94 -45 92 -116 -12 10 -70 -34
7190 -34 108 16 27 10 89 93 76 7 19 -158 -31 -69 -3 74 234 -19 7 -8 41 190 134 28 104 32 -32 37 -5
7217 -5 28 23 -23 23 22 33 0 0 48 -49 -90 21 74 13 -53 -70 -105 89 66 87 -48 -41 -24 113 -59 -72 12 -69 -21 -45
7247 -45 -34 -71 20 -99 -11 10 -52 141 31 -3 -25 -100 24 -172 0 -41 35 9 53 -81 -32 62 -92 -80 -103 -85
7273 -85 -51 27 -16 -74 21 -34 41 -64 -71 51 21 181 28 26 1 40 107 143 80 81 19 6 42 -97 66 137 17 -9
7301 -9 39 95 -1 33 -6 -66 13 36 45 -4 -48 16 -49 -66 -19 -46 -52 22 -162 28 -64 17 -70 -65 -108 -154 -58 -36 -27 -20 -52 12
7333 12 64 -24 64 152 86 -41 -74 39 -24 -44 99 -74 0 93 6 22 -17 14 80 -59 106 28 89 100 101 29 -34 59
$$ packed form
7134b4l4k3Q1j39J58n8J01l1m4lM5k5L1k3K1l3M8o9J04k5R0j12j47J35l8J00r7
7161a1k8M1j7k9L3n6NK1Q5j09ko7N2j5J60j51Q2r8Q5m9Kk8M9J37k08J04K2q0L6
7190c4J42r2J1j7P9Mj7o9J2j77J27l8O6P7J60k53K6j5M9J49n6j06P6p2o4O9m2
7217eL3nm6M6jJ1l3%M8r7m1J11N3o1o6j7l5J94k3K1j35PJ7J37j72j3Q4q1M8k4
7247d5J1l7R1j19Q8K1o2J93j10l4k2p5J24j96J72m1P6k6M4j34M9R4j54J2k3J8
7273h5L4P8m3n8R5n5P5j05pJ22l0J60j53kk5L9O7L6o3Jo2j3L6j39J63P1j20k6
7301iM8N6r6L4l9o0P9K3Rm9m4O4o5j7M7k7oP4j84J90r2Q1q7Nm3m6R6K2RPl2O4
7333A2N2q8Q8Q8o6j27l3J13o3k0J43j73P4R3q7J6l9L1O6j39J65p8O1J1Jp2o3R3
$$ plain form
7361 59 47 -89 4 -30 -120 20 -56 -121 -46 -24 -61 11 68 -55 19 -198 -26 -99 37 -26 1 96 -63 -48 8 30 -18
7388 -18 -94 1 111 39 -104 86 63 23 -70 -123 50 46 10 -98 102 -80 22 -9 -19 -120 -86 -55 -77 40 105 -31
7414 -31 -16 -15 60 47 31 14 52 6 1 -6 -31 -64 117 30 23 -57 -25 46 -87 24 -33 -129 161 -66 -47 -48 38 12 -41 91
7444 91 52 -119 -14 165 -32 26 -39 -25 70 -17 -62 -37 45 41 -20 -1 -50 -80 -46 -115 121 -102 49 58 154 23 19 187
7472 187 -104 -42 91 -185 -55 45 -9 -62 60 -3 54 -19 82 -35 -89 21 -75 -7 -19 53 82 -5 -14 -24 34 29
7498 29 99 77 -119 -73 46 -64 52 -115 45 -34 36 -6 77 84 4 89 67 46 -3 -34 -68 -17 -49 -133 79 -53 -72
7525 -72 130 -44 -113 -110 -144 71 -7 23 -16 -16 57 111 -131 34 8 163 -51 -33 -80 -2 -4 -21 -111 38 25 42 -79
7552 -79 171 7 -49 46 -48 -111 63 104 -19 -40 21 78 -11 -30 46 72 83 81 -153 -102 16 -34 4 -2 11 23 -177 10
$$ packed form
7361E9j2j36R3l4r0J40p6o5P5K2l7P2N7j23P4k17J72p3J36o3K7R5j59J5N6K2m8
7388a8p6R5J10p2j43J90k3m0r3n3J73ml6j08K00j82J02l1j0j01L4L1k2J17O5j36
7414c1J5JP5j3j6j7L8m6npk5l3J81q7pq0L2P1j33J11n7r6K90k27J9jQ6k6n3J32
7444I1l9j71J05J79j97N8o5J4R5q7m5K5Q2mo1J9m9l0L4o9K36k23J51RR6j31mJ68
7472A87k91O2J33k76J30J00n4n3J22o3N7p3J01j17n4J10r6O8j2P2K9q7rj0N8n
7498B9P0k2j96M6J19j10J16j67J60p9P0m2Q3Pq0Q5k2k1m9l1l4N1l2q4K12j32j9
7525g2K02j74o9Ll4K15p8L0l9%P3N4k42J65k6J55k14J8m7P8kj7r0J49j3J7j21
7552g9K50j64n6R5r4o3J74M1j23k1O1N7q9j9P6K6J1kk34N1J18n0L8oJ3J2k00J87
$$ plain form
7580 10 -50 77 -128 29 65 11 75 -2 89 -20 -19 -29 17 -94 99 -7 -23 1 -108 136 40 -58 129 -26 79
7605 79 40 88 -86 163 26 -4 -56 15 92 86 -37 -95 -16 -2 49 27 -107 -99 -130 -33 -71 13 -123 29 -59 0 -61 26
7633 26 0 -72 -109 58 85 -7 39 50 -63 -78 -50 10 68 -23 69 27 -26 -27 86 11 30 92 -3 -26 -17 32 140 -34 46
7662 46 -5 12 79 69 28 105 19 42 -104 33 121 73 -21 -23 108 34 9 -12 -14 -83 -115 45 -78 -71 34 -3 -15 112
7690 112 89 -98 -31 4 -41 24 -72 44 -37 -99 13 132 70 50 62 -8 -4 6 81 -15 -58 30 80 -170 28 118 -35
7717 -35 -23 85 51 -13 -77 17 97 -117 -7 -100 87 -111 8 -66 -25 86 -96 13 -46 -79 -36 -4 -116 -40 149
7742 149 -65 -45 -117 80 72 -123 -117 -33 51 -34 -38 -15 51 41 -43 71 22 -27 63 -173 33 -103 -18 48 -36 24 22 -15
7770 -15 -77 -33 61 29 88 3 25 40 -4 -171 -54 69 24 5 -79 -87 39 25 -50 21 104 43 -61 146 27 -54 100
$$ packed form
7580A0o0J27k05J57L6n4O4p7R1j09Jj0M6j11J93j06j6K4j09K44r6r8J87j55J05
7605G9l9M8j74K49j37l0n2P1P7oj23n8P9J4N1k2j34Ql1R7l8Q4j36J52q8N9o1Q7
7633B6k6p2l7J67K7r2M6J1j13j5K8O0N8r1R2m2n3jJ13p5J9O2r5k3RM9J08j74Q0
7662D6n1J7O7j0m1P7q6K3j46J37Q8m8r4kJ31p4k5k1ko9l2J60j23PJ05l7j2J27
7690A12k3j87O7L5m5O5r6J16q1o2J12J19o2k0J2p0MJ0P5r6m3Q8N0k50J98R0j53
7717c5J2J08l4o4o4R4Q0k14J10r3J87j98J19p4M1J11j82J09n9l3M3L2j12P6J89
7742A49k14K0p2J97qj95OQ4Q4q5mK3O6j0q4J14m9m9R0k36K06j36Q5O6q4O0kl7
7770a5o2M4R4l2N9q5K2J5m4j67J17J23m5j9q4qJ26j4p5P1Q3o1j04K07j19q1J54
$$ plain form
7797 100 20 -84 -75 -93 19 58 60 -99 -5 -21 0 142 48 55 -60 74 73 160 14 86 -27 -18 -176 37 -114 -53 95
7824 95 -103 -123 67 -54 25 -84 -76 117 -18 -75 2 85 -27 -15 -53 -113 31 -3 -30 28 5 -17 -55 167 18 25
7850 25 39 34 -11 12 -97 59 90 172 26 -30 12 -20 -92 -15 70 -12 9 -5 20 36 227 -39 29 55 -121 -69 -19 42
7878 42 -123 -73 -117 -90 45 -146 -54 0 73 122 54 -19 30 -49 -88 55 49 -14 36 10 -9 -1 -11 -33 -12 14 -42 48 55 110
7908 110 43 -59 26 -26 20 -126 13 -60 23 -78 34 -84 138 -7 15 -18 -88 -51 77 -56 -64 25 9 101 -46
7933 -46 -60 -123 -40 -154 -15 -54 -33 32 76 50 -93 16 -44 5 47 139 -27 -43 111 74 -29 15 28 -20 67 -74
7959 -74 45 -25 -45 22 80 -41 33 38 -30 -24 -64 -22 -7 -10 27 6 -71 -39 59 -89 12 -41 -31 86 -68 -76 -87 -1 -80
7988 -80 93 53 -46 -43 -48 -38 9 32 98 -125 16 0 -69 -5 -49 -23 -73 92 -26 -53 -17 -143 -81 151 -34 93 -28
$$ packed form
7797A00q0j04Rj8J12L9Kj59R4j6K1J42r4Pj15J34jQ7j46P2j13Rj58K13j51O1J48
7824I5j98k0J90j21P9j09QJ93j35n7P7Q3j12J2l8o0J44l4k7N8k3k2l8K22j49P
7850B5J4nm5K3j09J56L1Q2j46n6M2l2p2P7Q5q2K1j4K5J6J91k66O8K6j76N2N0O1
7878D2j65N0m4K7J35j91R2N4P3M9o8p3M9p9l9J43oo3N0k6j9Qj0k2K1K6n6R0PN5
7908A10o7j02Q5n2M6j46J39p3Q3j01J12j18K22j45K2l3p0L7J28j33qQ9j6R2j47
7933d6j4o3Q3j14J39l9K1O5M4k6j43J09o0M9M2R2j66j6J54l7j03M4J3m8Q7j41
7959g4J19p0k0O7N8j21P4No8Om0M2J5lL7k1p7L2R8j48J01n3J0J17j54qj1Q6p9
7988h0J73m0r9LnJ0M7K3O6k23J41j6o9O4m4K6n0J65j18k7L6j26O2K32j85J27j21
$$ plain form
8015 -28 28 -48 -28 -95 90 139 56 8 82 72 -12 -42 19 -72 -12 16 26 67 -49 -56 -6 19 -68 -26 -78 -100 -19 63 58 -25
8045 -25 30 40 -33 -65 8 135 -43 -145 -5 -88 32 -38 42 -113 1 54 -5 -33 48 -35 22 37 -41 -104 -7 -62 100
8072 100 129 -26 -91 -4 -74 -17 -57 -229 55 -92 -150 20 -30 95 -90 -28 6 -39 -63 -121 12 2 25 58 34 -86
8098 -86 -68 192 28 -16 -44 135 106 -12 19 -29 60 -6 41 47 17 113 -70 27 -11 -25 -12 116 -53 79 10 -164
8124 -164 82 12 34 -38 32 99 8 -88 1 0 39 -53 48 -59 54 -99 76 -60 -55 59 20 -48 112 -30 -18 -8
8150 -8 37 6 -31 -72 17 153 -99 -47 -40 36 -66 -56 -8 -29 -88 -79 10 -89 -22 -69 -11 89 25 6 -96 9 130 71
8178 71 -20 58 -107 -83 -40 43 -27 -4 -8 -126 -55 17 94
$$ packed form
8015b8N6p6K0o7J85M9q3m8P4j0q4l0O1r1O0K8J0M1j16pN0K5q7M2n2k2Q1Q2nq3
8045b5N5J0p3l2P3J27j78j02J40q3J20p0Q0j55J14N3n9k8Q1q3N7J5p8o3R7n5J62
8072A00K9j55o5Q7p0N7m0j72K84j47n8J70n0J25j85O2L4m5k4n8J33j0K3L3k4j20
8098h6J8K60j64m4k8J79k9j18L1m8Q9o6M7Ol0R6j83R7l8j4J3J28j69J32o9j74
8124a64K46p0K2p2P0O7r1r6Q9jL9r2J01j07J13j53J75j36NJ14l9o8J60j42J2J0
8150hM5l1l7m1Q9J36k52N2PP6j02J0M8k1n9RQ9r9O7m7N8J00o4j9j02J05J21n9
8178G1r1P8j65K4M3Q3p0K3mj18P1P2P7
8191I4
$$ Imaginary data points
##PAGE= N=2
##DATA TABLE= (X++(I..I)), XYDATA
$$ plain form
0 0 0 0 0 0 0 0 0 0 0 0 0 0 0 0 -1 32 -32 32 -32 32 -64 64 -64 96 -96 109 -129 160 -161 193 -225 257 -290 323
34 323 -385 418 -482 545 -604 674 -740 830 -913 1011 -1124 1237 -1365 1508 -1658 1827
50 1827 -2012 2218 -2447 2698 -2981 3300 -3667 4084 -4574 5151 -5841 6691 -7768 9177
64 9177 -11113 13952 -18531 27167 -49288 233752 387190 -39456 -115912 -42802 -18075 -248595
76 -248595 -372162 -228011 91519 233272 172553 62784 97014 171479 126728 -96580 -280122
87 -280122 -254556 -75916 -1053 -66113 -76303 108607 294570 263254 77129 -12795 20047
98 20047 -3916 -156293 -259568 -187778 -33831 46141 63146 103431 166087 163132 71447 -45347
110 -45347 -115027 -128370 -118741 -114717 -96645 -22704 92998 159126 125771 70888 83226 107295
$$ packed form
0@%%%%%%%%%%%%%%jL3o4O4o4O4r6J28j28J60j92K05k38K89l21L54m18M82n47O13
34C23p08Q03r00J027j149J278j414J570j743J924k135K361k602K873l166L485
50A827l839M230m665N145n679O281o967P751q658R725j0992J2532j4459J6945
64I177k0290K5065l2483M5698p6455K83040J53438m26646p6456P3110K4727k30520
76b48595j23567J44151L19530J41753o0719j09769L4230P4465m4751k23308j83542
87b80122K5566J78640P4863o5060j0190J84910J85963l1316j86125q9924L2842
98B0047k3963j52377j03275P1790J53947P9972J7005M0285O2656k955r1685j16794
110d5347o9680j3343R629M024J8072P3941J15702O6128l3355n4883J2338K4069
$$ plain form
122 107295 25715 -125080 -179783 -97637 -29709 -69267 -98568 8627 164615 191610 85977
133 85977 2871 10937 12990 -74114 -183352 -191565 -82412 41333 87996 76228 90318 151813
145 151813 169645 64692 -93238 -154285 -96637 -54969 -104101 -132348 -23534 137564 176821
156 176821 87463 25194 55364 63830 -39737 -166950 -179310 -83338 -1495 9891 15203 79548
168 79548 162656 168795 73577 -38979 -78708 -60247 -71201 -129333 -140528 -39134 91156 121217
180 121217 62037 40306 91144 100157 -5757 -127888 -136892 -60740 -25822 -56562 -51188 44093
192 44093 144712 147348 68985 8537 5710 1562 -60148 -140190 -146998 -60368 32400 50444 27902
205 27902 53912 122938 129070 27613 -80571 -90173 -41439 -45402 -100189 -93922 11274 111897
$$ packed form
122A07295q1580j50795n4703Q2146O7928l9558k9301J07195J55988K6995j05633
133H5977q3106Q066K053q7104j09238q213J09153J23745M6663j1768J4090O1495
145A51813J7832j04953j57930o1047N7648M1668m9132k8247J08814J61098L9257
156A76821q9358o2269L0170Q466j03567j27213j2360R5972Q1843J1386N312O4345
168G9548Q3108O139r5218j12556l9729J8461j0954n8132j1195J01394J30290L0061
180A21217n9180k1731N0838R013j05914j22131r004P6152L4918l0740N374R5281
192D4093J00619K636p8363o0448k827m148o1710q0042o808Q6630R2768J8044k2542
205B7902K6010O9026O132j01457j08184r602M8734l963n4787O267J05196J00623
$$ plain form
217 111897 112835 55988 40741 68140 52055 -38943 -127386 -130946 -67768 -20393 -19293 -9699 55721
230 55721 133155 134751 52005 -25498 -33996 -21636 -62254 -125452 -112902 -12511 73312 73294 42637
243 42637 61838 103567 76786 -24260 -103635 -97961 -55401 -50135 -69670 -42627 45082 119337
255 119337 112841 53197 18658 26290 13116 -58657 -128609 -113832 -29606 27934 20239 15061 68770
268 68770 126771 98039 -2249 -70065 -60015 -38541 -68517 -107298 -73309 25478 96578 87557
280 87557 48761 48075 69546 43306 -42513 -112318 -100811 -40528 -11000 -21895 -7932 60994
292 60994 120530 98716 20866 -26857 -21912 -25458 -74495 -115563 -82785 1102 55137 51804 43668
305 43668 70092 93238 56378 -24656 -77248 -68593 -43061 -47246 -58518 -23099 52617 99044
$$ packed form
217A11897R38n6847j5247K7399j6085r0998q8443l560O3178M7375J100R594O5420
230E5721P7434J596q2746p7503q498J2360m0618o3198J2550J00391Q5823j8l0657
243D2637J9201M1729k6781j01046p9375N674M2560N266j9535K7043Q7709P4255
255A19337o496n9644l4539P632j3174p1773o9952J4777Q4226N7540p695n178N3709
268F8770N8001k8732j00288o7816J0050K1474k9976l8781L3989R8787P1100r021
280H7557l8796o86K1471k6240q5819o9805J1507O0283K9528j0895J3963O8926
292F0994N9536k1814p7850m7723M945l546m9037m1068L2778Q3887N4035l333q136
305D3668K6424K3146l6860q1034n2592Q655K5532m185j1272L5419P5716M6427
$$ plain form
317 99044 77306 30621 16657 22670 -7712 -76087 -113892 -77784 -13002 13384 6790 25857
329 25857 81728 110329 65623 -10134 -43564 -30754 -30819 -67763 -88348 -41988 38146 75416 53180
342 53180 29835 44883 58371 15550 -63252 -100597 -68901 -24470 -19815 -28922 5459 74864
354 74864 107477 68729 9571 -9012 44 -19681 -72296 -95854 -51731 15753 42323 28781
366 28781 29847 62255 75182 28303 -42396 -71469 -50895 -33626 -47605 -52961 -7873 60612
378 60612 86978 57569 24634 24922 28437 -9150 -68744 -88093 -49056 -2714 5872 -787 23809
391 23809 70962 82012 34394 -22508 -37109 -23684 -32846 -66790 -71941 -20307 43021 60218
403 60218 37863 30184 51657 54575 5394 -58006 -73512 -40516 -15701 -25343 -29043 12069 68840
$$ packed form
317I9044k1738m6685j3964O013l0382o8375l7805L6108O4782K6386o594J9067
329B5857N5871K8601m4706p5757l3430J2810o5l6944k0585M6360Q0134L7270k2236
342E3180k3345J5048J3488m2821p8802l7345L1696M4431M655r107L4381O9405
354G4864L2613l8748n9158j8583R056j9725n2615k3558M4123O7484K6570j3542
366B8781J066L2408J2927m6879p0699k9073K0574J7269j3979n356M5088O8485
378F0612K6366k9409l2935K88L515l7587n9594j9349L9037M6342Q586o659K4596
391B3809M7153J1050m7618n6902j4601J3425r162l3944n151N1634O3328J7197
403F0218k2355p679K1473K918m9181o3400j5506L2996K4815r642l700M1112N6771
$$ plain form
416 68840 79340 36727 -3435 -4795 1848 -26321 -72318 -78279 -29656 21791 31007 18520 30857
429 30857 64574 67408 17695 -38851 -50638 -29349 -25220 -46396 -47002 439 55162 64296 33390
442 33390 14090 23234 21876 -18521 -66299 -70644 -32319 -253 659 90 29138 67362 67718 24651
456 24651 -16822 -22481 -14526 -29658 -59027 -56354 -9801 36015 40611 22829 25741 46452 39678
469 39678 -8323 -53031 -53700 -27720 -19095 -29319 -19757 23694 63076 60116 26863 5380 6864
482 6864 1523 -31074 -64390 -58382 -16757 15928 15750 10398 31060 59253 49263 643 -36466
495 -36466 -32247 -17136 -28737 -49677 -34856 14749 50271 43935 22906 22428 32344 17609 -25235
508 -25235 -58497 -52531 -22962 -6438 -9108 -1956 31340 62613 53184 11035 -17193 -12343 -8139
$$ packed form
416F8840J0500m2613m0162j360O643k8169m5997n961M8623N1447R216j2487J2337
429C0857L3717K834m9713n6546j1787K1289M129k1176o06M7441N4723R134l0906
442C3390j9300R144j358m0397m7778m345L8325L2066R12n69K9048L8224L56m3067
456B4651m1473n659P955j5132k9369K673M6553M5816M596j7782K912K0711o774
469C9678m8001m4708o69K5980Q625j0224R562M3451L9382k960l3253k1483J484
482F864n341l2597l3316O008M1625L2685j78n352K0662K8193r990m8620l7109
495c6466M219J5111j1601k0940J4821M9605L5522o336k1029m78R916j4735m2844
508b5235l3262N966K9569J6524k670P152L3296L1273r429m2149k8228M850M204
$$ plain form
521 -8139 -33151 -59625 -43080 5981 34817 25169 15121 32209 49568 29012 -17404 -44447
533 -44447 -36763 -21955 -24979 -32198 -15292 24714 54139 47432 20533 6822 11142 2736 -32933
546 -32933 -62508 -48116 -5509 15978 7366 8915 39299 60162 35189 -11461 -30504 -19618
558 -19618 -17202 -36628 -46672 -21612 18859 38655 31419 21365 25141 29949 12569 -25657 -51979
571 -51979 -42492 -15511 -6162 -12868 -941 38337 63215 40864 -270 -13286 -3328 -12290 -45096
584 -45096 -57994 -27190 14292 26457 16947 18515 35465 40619 16421 -18818 -36352 -28381 -16599
597 -16599 -19861 -27461 -12460 25844 51221 38387 11458 6917 15818 42 -41025 -61169 -36396
610 -36396 -1070 7047 1886 17056 46281 51478 22367 -10597 -21922 -19692 -23683 -33952 -32308
$$ packed form
521h139k5012k6474J6545M9061K8836r648j0048J7088J7359k0556m6416k7043
533d4447P684J4808l024p219J6906M0006K9425o707k6899j3711M320q406l5669
546c2933k9575J4392M2607K1487q612J549L0384K0863k4973m6650j9043J0886
558a9618K416j9426j0044K5060M0471J9796p236j0054L776M808j7380l8226k6322
571e1979R487K6981R349o706J1927L9278K4878k2351m1134j3016R958q962l2806
584d5096j2898L0804M1482J2165r510J568J6950N154k4198l5239j7534P971J1782
597a6599l262p600J5001L8304K5377j2834k6929m541Q901j5776m1067k0144K4773
610c6396L5326Q117n161J5170K9225N197k9111l2964j1325K230l991j0269J644
$$ plain form
623 -32308 -9847 20389 35503 28491 17205 18629 22157 4067 -30307 -45928 -29303 -9466 -11941
636 -11941 -16197 7313 43413 50377 23783 879 919 -74 -22312 -46272 -41922 -12698 12225 17997
650 17997 17127 24185 34173 29966 4398 -25479 -34908 -22325 -12902 -20761 -23825 484 35237 41172
664 41172 17639 3313 14095 18503 -8704 -41161 -41042 -14773 646 -3541 -1873 19778 40853
677 40853 36975 12440 -9638 -15671 -14439 -20272 -32195 -31885 -7730 22555 30623 18136 13107 24959
691 24959 26293 -2271 -34488 -35709 -14802 -7783 -18267 -14353 15197 40437 35088 14000 3902
704 3902 4785 -2966 -23852 -39810 -34353 -11920 8825 15223 14464 20967 33485 30195 2560 -25229
718 -25229 -27003 -13149 -13509 -27179 -22494 9456 35410 29634 11606 10483 18765 9156 -19440 -38160
$$ packed form
623c2308K2461L0236J5114p012j1286J424L528j8090l4374j5621J6625J9837k475
636a1941m256K3510L6100O964k6594k2904M0r93k2238k3960M350K9224K4923N772
650A7997q70P058R988m207k5568k9877r429J2583R423p859l064K4309L4753N935
664D1172k3533j4326J0782M408k7207l2457J19K6269J5419m187J668K1651K1075
677D0853l878k4535k2078o033J232n833j1923L10K4155L0285Q068j2487n029J1852
691B4959J334k8564l2217j221K0907P019j0484L914K9550K5240n349k1088j0098
704C902Q83p751k0886j5958N457K2433K0745O398p59O503J2518l290k7635k7789
718b5229j774J3854l60j3670M685L1950K5954n776j8028j123Q282r609k8596j8720
$$ plain form
732 -38160 -31014 -13031 -4328 -2822 4926 22500 36739 31874 9417 -11133 -14627 -11424 -19444 -32828
746 -32828 -26221 3427 26139 21732 9408 14823 26476 15905 -13854 -30247 -21595 -9969 -13010
759 -13010 -17921 -5590 18081 31414 25821 12906 5812 4279 -3083 -20573 -34905 -29305 -7014
772 -7014 9586 9451 8719 22519 35257 22786 -7063 -22975 -16460 -10891 -20521 -26971 -10491 16562
786 16562 27408 19004 11386 14207 15676 2739 -18649 -30054 -23682 -10076 -4112 -4929 2255 21608
800 21608 34912 25038 2282 -9066 -4933 -7584 -24982 -34610 -18078 9170 19307 12859 11938
813 11938 22393 25544 7838 -16250 -25151 -18326 -11366 -13114 -14101 -1746 18839 29394 21369 7097
827 7097 2923 5292 -2868 -22752 -32832 -20133 12 6507 3237 9450 25528 30253 13594 -8191
$$ packed form
732c8160P146J7983Q703J506P748J7574J4239m865k2457k0550l494L203q020j3384
746c2828O607K9648K2712m407j2324N415J1653j0571k9759j6393Q652J1626l041
759a3010m911J2331K3671J3333n593j2915p094j533p362j7490j4332N600K2291
772g014J6600j35p32J3800J2738j2471k9849j5912O515N569r630o450J6480K7053
786A6562J0846q404p618K821J469j2937k1388j1405O372J3606N964q17P184J9353
800B1608J3304r874k2756j1348M133k651j7398r628J6532K7248J0137o448r21
813A1938J0455L151j7706k4088q901O825O960j748r87J2355K0585J0555q025j4272
827G097m174K369q160j9884j0080J2699K0145O495l270O213J6078M725j6659k1785
$$ plain form
841 -8191 -14959 -11304 -13553 -22382 -22111 -5492 14811 22068 16719 11921 13973 13255 -666 -20338 -27499
856 -27499 -17734 -6033 -5086 -5959 6321 25215 29775 15049 -1085 -3630 -1919 -11352 -26554 -27318
870 -27318 -9470 9039 12762 9271 13083 21936 20824 3273 -16066 -20682 -13720 -9995 -14224 -13628
884 -13628 2104 21650 25777 14459 4590 6074 6226 -7380 -25035 -27035 -12121 1133 2291
897 2291 1769 11848 25037 24221 7650 -8230 -11442 -9113 -13340 -21133 -18458 -1548 15525 18865
911 18865 12667 10693 14506 11700 -4592 -21435 -22867 -12292 -5507 -6856 -4411 10047 24309 23154
925 23154 9303 -1106 -1432 -2517 -13084 -23839 -20566 -4820 8406 9940 7906 12956 20151 16003
939 16003 -766 -15234 -16061 -10271 -10086 -14369 -9968 6191 19972 19101 9684 5596 7491 3407 -10603
$$ packed form
841h191o768L655k249q829K71J6619K0303P257n349m798K052p18j3921j9672p161
856b7499R765J1701R47q73J2280J8894M560j4726j6134k545J711r433j5202p64
870b7318J7848J8509L723l491L812Q853j112j7551j9339m616O962L725m229N96
884a3628J5732J9546M127j1318r869J484J52j3606j7655k000J4914J3254J158
897B291n22J0079J3189q16j6571j5880l212K329m227p793K675J6910J7073L340
911A8865o198j974L813k806j6292j6843j432J0575O785j349K445J4458J4262j155
925B3154j3851j0409l26j085j0567j0755L273J5746J3226J534k034N050P195m148
939A6003j6769j4468q27N790J85m283M401J6159J3781q71r417m088J895m084j4010
$$ plain form
954 -10603 -22200 -19320 -7209 168 -157 2541 13353 22160 17567 3371 -6502 -6780 -6778 -13767 -19983
969 -19983 -13909 1989 13209 12338 8888 11910 15862 8981 -7592 -18689 -16045 -8808 -7449 -9653
983 -9653 -3076 12327 22326 17750 6501 1040 1780 -2769 -15175 -23174 -16579 -1647 6713 6097 7166
998 7166 15363 20634 12537 -4174 -13967 -12079 -8860 -12184 -15155 -6664 9650 19039 15258 7662 6705
1013 6705 8017 630 -13748 -21224 -15366 -4456 -6 -733 4025 15298 20716 13260 -305 -6770
1027 -6770 -5346 -6721 -14385 -17976 -9198 5512 12412 9535 7472 11387 13420 4435 -10002 -16377
1041 -16377 -11864 -6493 -6978 -7739 118 12978 18357 12462 3827 1597 1898 -3756 -14422 -18813 -11395
1056 -11395 -25 4497 3163 6407 14525 17380 8049 -5127 -10294 -7713 -7937 -12994 -13674 -3503
$$ packed form
954a0603j1597K880J2111P377l25K698J0812Q807m593j4196r873k78Ko989o216
969a9983O074J5898J1220q71l450L022L952o881j6573j1097K644P237J359k204
983i653O577J5403R999m576j1249n461P40m549j2406p999O595J4932Q360o16J069
998G166Q197N271q097j6711r793J888L219l324k971Q491J6314R389l781p596r57
1013F705J312p387j4378p476N858J0910M450p27M758J1273N418p456j3565o465
1027f770J424j375p664l591Q778J4710O900k877k063L915K033q985j4437o375
1041a6377M513N371m85p61P857J2860N379n895q635k230L01n654j0666m391P418
1056a1395J1370M522j334L244Q118K855r331j3176n167K581k24n057o80J0171
$$ plain form
1070 -3503 9924 14618 10683 7401 8901 7991 -1342 -13420 -17416 -11504 -4291 -2656 -2029 5164 15647
1085 15647 18511 9815 -959 -4172 -3246 -7686 -15899 -16490 -5526 6595 9468 7090 8738 13559
1099 13559 11922 913 -10722 -13329 -9375 -7064 -8479 -6570 2969 13612 15991 9633 3191 2361
1113 2361 1798 -5877 -15730 -16686 -7405 1753 3033 2468 8201 15761 14549 3118 -6783 -7621 -5917 -8625
1129 -8625 -12910 -10074 512 9980 11304 8010 6603 8074 5968 -3168 -12929 -14481 -8166 -2707 -3196
1144 -3196 -2497 6015 15702 15406 5775 -1565 -1261 -1644 -9024 -16081 -12991 -1821 5774 6175 5941 9602
1160 9602 12456 8478 -1458 -9536 -10496 -7672 -6595 -7886 -5367 3795 13073 13358 6386 2607 4291
1175 4291 2725 -7196 -15974 -13373 -3808 1029 -264 2005 10451 15646 10888 990 -4766 -5505 -6558
$$ packed form
1070c503J3427M694l935l282J500r10r333j2078l996N912P213J635O27P193J0483
1085A5647K864q696j0774l213R26m440q213n91J0964J2121K873k378J648M821
1099A3559j637j1009j1635k607L954K311j415J909R539J0643K379o358o442q30
1113B361n63p675r853r56R281R158J280n65N733P560j212j1431r901q38J704k708
1129h625m285K836J0586R468J324l294j407J471k106r136r761j552O315N459m89
1144c196O99Q512R687k96r631p340L04l83p380p057L090J1170P595M01k34L661
1160I602K854l978r936q078r60K824J077j291K519R162R278K85o972l779J684
1175D291j566r921q778K601R565M837j293K269Q446N195m758r898n756p39j053
$$ plain form
1190 -6558 -9984 -11913 -7636 1899 9662 10499 7083 5844 7631 4920 -4755 -13451 -11815 -4689 -2453
1205 -2453 -4862 -1939 8313 15057 10872 2707 192 859 -3088 -10802 -14015 -9083 -1258 3715 5258
1220 5258 6633 9570 11161 7088 -2102 -9560 -9696 -6054 -5948 -8182 -4239 6652 13345 9605 3338
1235 3338 3521 5480 160 -9797 -13533 -8461 -2662 -1308 -653 4349 10629 12437 7950 1049 -3906
1250 -3906 -5404 -6072 -8884 -10800 -6542 3217 9568 8029 4807 6767 8805 2787 -7894 -12071 -7402
1265 -7402 -3360 -4770 -4998 1651 9870 11470 7200 3021 1693 153 -4581 -9861 -11606 -7554 -555
1280 -555 4263 4709 5337 9328 11114 5149 -4776 -8959 -6077 -4341 -7643 -8533 -713 8630 10082 5601
1296 5601 3812 5481 4293 -2692 -9240 -10119 -6434 -2944 -1483 7 3965 9388 11541 7282 -244
$$ packed form
1190f558l426j929M277R535P763Q37l416j239J787k711r675q696J636P126K236
1205b453k409K923J0252O744m185q165k515O67l947p714l213M932P825M973J543
1220E258J375K937J591m073r190p458j36L642J06k234L943J0891O693l740o267
1235C338J83J959n320r957l736N072N799J354O55N002O280J808m487o901m955
1250c906j498o68k812j916M258R759O351j539l222J960K038o018j0681m177M669
1265g402M042j410k28O649Q219J600m270m179j328j540m734n280j745M052O999
1280e55M818M46O28L991J786n965r925m183K882J736l302q90P820R343J452m481
1296E601j789J669j188o985o548q79L685L490J461J490L958N423K153m259p526
$$ plain form
1311 -244 -3769 -3379 -5067 -10095 -11288 -3882 5495 7992 5101 5206 8634 7235 -945 -8406 -8889 -5530
1327 -5530 -4493 -5067 -2909 3172 8712 9500 6249 2312 902 -38 -3506 -9047 -10812 -5576 880 2873
1343 2873 2279 5041 10374 10340 2452 -5382 -6080 -4715 -6265 -8829 -6225 1786 7905 8020 5760 4930
1359 4930 4720 2043 -3409 -8259 -9031 -5449 -1803 -838 23 3862 9285 9630 3829 -1436 -2013 -1598 -5473
1376 -5473 -10348 -8821 -1214 4483 4567 4258 6770 8744 5267 -1774 -6716 -7127 -5710 -5006 -4493 -1893
1392 -1893 3534 8444 8699 4939 1520 1189 332 -4731 -9838 -8816 -2715 1389 1003 1821 6575 10092
1408 10092 7079 364 -3595 -3798 -4367 -7023 -8028 -4402 2003 6257 6867 5494 4681 4355 1484 -4239
1424 -4239 -8803 -8085 -3886 -1454 -1501 258 5944 9793 7299 1518 -911 -533 -2392 -7149 -9113 -5342
$$ packed form
1311b44l525L90j688n028j193P406R377K497k891J05L428j399q180p461m83L359
1327e530J037n74K158O081N540P88l251l937j410r40l468n541j765N236O456J993
1343B873n94K762N333l4p888p834o98J365j550k564K604Q011O119J15k260q30
1359D930k10k677n452m850p72L582L646R65Q61L839N423L45n801n265n77M15l875
1376e473m875J527P607N697Q4l09K512J974l477p041m942m11J417P04N13K600
1392a893N427M910K55l760l419l31q57n063n107J022O101M104l86Q18M754L517
1408A0092l013o715l959k03n69k656j005L626O405M254O10j373q13l26k871n723
1424d239m564P18M199K432m7J759N686L849k494n781k429L78j859m757j964L771
$$ plain form
1440 -5342 449 3387 3502 4454 6654 7137 3502 -2177 -6152 -6172 -4571 -4241 -4457 -1546 4596 8482 6978
1457 6978 2850 1559 2241 -412 -6328 -8902 -5835 -1148 525 386 2717 6864 8080 4721 -251
1472 -251 -2795 -3204 -4082 -6100 -6655 -3326 2251 5835 5419 4057 4539 4736 1227 -4852 -7784 -5670 -2809
1489 -2809 -2441 -2215 1418 6605 8142 5110 1309 124 -472 -3290 -6902 -7545 -3963 541 2752 3067
1505 3067 4047 6161 6303 2496 -2959 -5476 -4489 -3715 -4865 -4617 -413 5338 7014 4882 2598 2868
1521 2868 2161 -1887 -6536 -7528 -4478 -1263 -239 657 3371 6751 6928 3400 -743 -2580 -2569 -3979
1537 -3979 -6166 -5996 -1803 3150 4929 3793 3685 4958 4180 -144 -5206 -6180 -4289 -2805 -2869 -1886 2249
1554 2249 6464 6826 3929 1029 266 -520 -3572 -6732 -6669 -2724 1140 2296 2189 3958 6380 5537 1119
$$ packed form
1440e342N791K938J15R52K200M83l635n679l975k0J601L30k16K911O142L886j504
1457F978m128j291O82k653n916k574L067M687J673j39K331M147J216l359m972
1472b51k544m09q78k018n55L329N577L584m16j362M82J97l509o079k932K114K861
1489b809L68K26L633N187J537l032l801j185n96k818l612o43L582M504K211L15
1505C067R80K114J42l807n455k517R87P74j150K48M204N751J676k132k284K70
1521B868p07m048m649r92L050L215J024Q96K714L380J77l528m143j837J1j410
1537c979k187J70M193M953J779j136j08J273p78m324n062r74J891J484o4R83M135
1554B249M215L62k897k900p63p86l052l160O3L945L864J156j07J769K422q43m418
$$ plain form
1571 1119 -3227 -4243 -3491 -3684 -4848 -3567 913 5087 5836 3741 2699 2718 1401 -2556 -6190 -6217 -3484
1588 -3484 -949 -324 698 3634 6444 5960 2267 -1127 -1811 -2199 -3942 -5854 -4682 -502 3016 3735
1604 3735 3194 3782 4637 3026 -1288 -4666 -4830 -3329 -2973 -2926 -1284 2736 5764 5295 2780 1194 826
1621 826 -566 -3902 -6281 -5159 -1649 903 1314 1948 4372 6093 4325 35 -3047 -3159 -2852 -3860
1637 -3860 -4781 -2702 1629 4544 4461 3129 2919 3132 1007 -3155 -5715 -4965 -2458 -1036 -866 662 4042
1654 4042 6214 4715 1263 -955 -1304 -2012 -4403 -5701 -3739 460 2928 2910 2814 3800 4408 2079 -1879
1671 -1879 -4277 -4001 -2888 -2711 -2327 -605 2995 5229 4356 2163 1011 689 -907 -3836 -5601 -4029
1687 -4029 -965 757 962 2059 4367 5337 2899 -479 -2216 -2282 -2833 -3975 -3970 -1451 1907 3643 3356
$$ packed form
1571A119m346j016P52j93j164J281M480M174P49k095j042J9j317l957l634k7K733
1588c484K535O25J022K936K810m84l693l394o84l88j743j912J172M180L518P19
1604C735n41N88Q55j611m314l378j64J501L56M7J642M020L028m69k515j586l68
1621H26j392l336k379J122L510K552M11O34K424J721j768m290l082j12L07j008
1637c860r21K079M331K915q3j332k10K13k125m162k560P50K507J422J70J528L380
1654D042K172j499l452k218l49p08k391j298J962M199K468j8r6R86O08k329l958
1671a879k398K76J113J77L84J722L600K234q73k193j152l22j596k929j765J572
1687d029L064J722K05J097K308R70k438l378j737o6n51j142NK519L358J736k87
$$ plain form
1704 3356 2772 2953 2473 228 -3148 -5038 -3796 -1940 -1186 -1115 976 4283 5370 3236 528 -392 -441
1721 -441 -2144 -4742 -5099 -2599 663 2052 2229 2734 4053 3855 1307 -1972 -3711 -3351 -2688 -2640 -2569 -232
1739 -232 3210 4995 3543 1619 1175 971 -1287 -4177 -4953 -2812 -491 163 546 2402 4326 4389 2094
1756 2094 -460 -1645 -2259 -3018 -3918 -3400 -996 1867 3408 2944 2394 2542 2350 -324 -3542 -4228 -2823
1773 -2823 -1623 -1588 -929 1679 4353 4145 2098 521 216 -655 -2667 -4214 -3691 -1719 567 1524 2049
1790 2049 2851 3745 3295 877 -2123 -3222 -2446 -2285 -2819 -2171 602 3607 3960 2238 1504 1850 804
1807 804 -1930 -4008 -3714 -1906 -698 -274 801 2636 3852 3535 1582 -448 -1548 -1897 -2552 -3534 -3226
1824 -3226 -690 2234 2951 2237 2251 2996 2065 -1108 -3745 -3270 -1973 -1598 -1826 -476 2228 3796 3184
$$ packed form
1704C356n84J81m80k245l376j890J242J856P54P1K091L307J087k134k708r20m9
1721d41j703k598l57K500L262J389J77N05J319j98k548l279j739L60O63M8P1K337
1739b32L442J785j452j924m44k04k258k890p76K141K321O54L83J856J924O3k295
1756B094k554j185o14p59r00N18K404K863J541m64n50J48j92k674l218o86J405
1773b823J200L5O59K608K674k08k047j577l05q71k012j547N23J972K286R57N25
1790B049Q02Q94m50k418l000j099P76J61n34O48K773L005L53j722p34L46j046
1807H04k734k078K94J808J208M24J075J835J216l17j953k030j100l49o55r82L08
1824c226K536K924P17p14J4P45r31l173k637M75J297L75k28J350K704J568o12
$$ plain form
1841 3184 1854 876 196 -714 -2447 -3673 -3449 -1449 564 1361 1561 2605 3769 3096 181 -2283 -2630
1858 -2630 -1917 -2459 -3063 -1808 1381 3242 2974 1941 1851 1677 -97 -2395 -3501 -2905 -1765 -717 28
1875 28 828 2135 3292 3149 1194 -695 -1152 -1179 -2497 -3813 -2811 182 2057 1863 1860 2795 3078 1206
1893 1206 -1680 -2943 -2509 -2133 -2109 -1409 470 2367 3272 3050 1684 396 -158 -777 -2166 -3396 -2890
1910 -2890 -540 733 743 985 2571 3695 2064 -473 -1626 -1407 -1974 -3027 -2868 -825 1363 2418
1926 2418 2489 2396 2018 1112 -191 -1889 -3204 -2981 -1677 -407 31 753 2513 3667 2451 150 -830
1943 -830 -665 -1161 -2924 -3317 -1545 650 1118 1290 2059 2919 2429 669 -1109 -2091 -2474 -2249 -1709 -1151
1961 -1151 311 1967 3135 2710 1118 424 401 -896 -2885 -3539 -1826 -15 323 321 1682 3062 2735
$$ packed form
1841C184j330r78o80r10j733j226K24K000K013P97K00J044J164o73k915k464l47
1858b630P13n42o04J255L189J861k68j033r0j74j774k298j106N96J140J048P45
1875B8Q00J307J157j43j955j889m57k7j318j316J002K993J875j94lR35K83j872
1893A206k886j263M34L76K4P00J879J897R05k22j366j288n54o19j389j230N06
1910b890K350J273J0K42J586J124j631k537j153K19n67j053J59K043K188J055
1926B418P1r3l78r06j303j698j315K23J304J270M38P22J760J154j216k301r80
1943h30J65m96j763l93J772K195M68J72P69Q60m90j760j778r82l83K25N40N58
1961a151J462J656J168m25j592o94k3j297j989o54J713J811L38kJ361J380l27
$$ plain form
1978 2735 889 -510 -1007 -1363 -2090 -2538 -2005 -590 1019 2297 2145 1685 1665 1303 -74 -2049 -3074
1995 -3074 -2248 -745 -675 -337 993 2878 2972 1479 246 -98 -475 -1693 -2878 -2524 -886 377 1122
2012 1122 1352 1926 2235 1870 568 -1168 -2191 -2214 -1542 -1609 -1422 184 2192 2747 1649 892 762 339
2030 339 -1182 -2771 -2708 -1368 -311 11 665 1929 2505 2153 910 -214 -1003 -1379 -1841 -2112 -1682 -343
2048 -343 1348 2005 1598 1492 1719 1226 -553 -2325 -2428 -1436 -1033 -977 -347 1458 2721 2183 1176 374
2066 374 -1 -567 -1889 -2412 -2133 -763 406 914 1203 1590 2120 1579 287 -1322 -1735 -1377 -1469 -1731 -981
2085 -981 774 2084 2158 1264 1097 1066 222 -1355 -2403 -2066 -1095 -433 14 715 1692 2390 1861 658 -446
2104 -446 -963 -1092 -1747 -2113 -1542 30 1304 1459 1279 1508 1688 800 -818 -2026 -1806 -1180 -1217 -865 155
$$ packed form
1978B735j846j399m97l56p27m48N33J415J609J278j52m60k0l62j377j975j025
1995c074Q26J503P0L38J330J885R4j493j233l44l77j218j185L54J638J263P45
2012A122K30N74L09l65j302j736j023k3O72o7J87J606K008N55j098p57j30m23
2030C39j521j589O3J340J057L22O54J264N76l52j243j124p89l76m62k71M30J339
2048c43J691O57m07j06K27m93j779j772j03R92M03N6O30J805J263n38j007q02
2066C74l75n66j322n23K79J370J169N08K89L87N30n41j292j609m13L58r2k62P50
2085i81J755J310P4q94j67l1q44j577j048L37R71O62M47P01R77O98n29j203j104
2104d46n17j29o55l66N71J572J274J55j80K29J80q88j618j208K20O26l7L52J020
$$ plain form
2123 155 1403 2169 1929 953 420 -140 -703 -1571 -2220 -1742 -390 393 723 1045 1788 2062 1268 -220 -1171
2142 -1171 -1388 -1219 -1591 -1713 -579 962 1774 1591 1257 1065 787 -145 -1489 -2035 -1854 -923 -363 -53 601
2161 601 1709 2262 1414 420 -405 -744 -1071 -1718 -1917 -1168 261 1165 1259 1040 1465 1456 512 -890 -1665 -1476
2181 -1476 -916 -1183 -842 144 1383 1832 1593 750 323 -33 -681 -1658 -2024 -1394 -255 403 574 1018 1699
2200 1699 1809 927 -303 -1079 -930 -1231 -1542 -1437 -340 947 1419 1504 1153 847 660 -298 -1313 -1859 -1462
2219 -1462 -679 -445 -76 725 1511 1777 1225 133 -212 -579 -1053 -1640 -1605 -702 334 845 1058 1160 1480
2238 1480 1042 208 -894 -1420 -1220 -1040 -1042 -525 341 1438 1605 1227 646 440 39 -684 -1591 -1729 -935 -68
2258 -68 195 443 909 1535 1476 589 -400 -937 -899 -1090 -1365 -1022 -171 819 1255 1060 968 896 571 -415 -1360 -1601
$$ packed form
2123A55J248P66k40r76n33n60n63q68o49M78J352P83L30L22P43K74p94j488r51
2142a171k17J69l72j22J134J541Q12j83l34j92k78r32j344n46J81R31N60L10O54
2161F01J108N53q48r94q25l39l27o47j99P49J429R04R4k19M25rr44j402p75J89
2181a476N60k67L41R86J239M49k39q43m27l56o48r77l66O30J139O58J71M44O81
2200A699J10q82j230p76J49l01l11J05J097J287M72Q5l51l06j87r58j015n46L97
2219a462P83K34L69Q01P86K66n52j092l45l67m74n87L5R03J036N11K13J02L20
2238A480m38q34j102n26K00J80kN17Q66J097J67l78n81k06m01p23r07j38P94Q67
2258f8K63K48M66O26n9q87r89n37L8j91k75L43Q51R90M36j95r2p2l25r86r45k41
$$ plain form
2280 -1601 -1126 -673 -466 107 775 1454 1533 834 123 -219 -396 -1104 -1611 -1364 -455 248 606 894 1189 1162
2300 1162 957 22 -801 -1069 -922 -914 -963 -493 472 1267 1256 803 696 405 163 -817 -1565 -1337 -670 -49 -79
2321 -79 464 1063 1448 1044 386 -239 -523 -743 -1052 -1308 -906 -23 726 1082 925 806 973 395 -483 -1289
2341 -1289 -1281 -769 -567 -480 12 927 1393 1122 629 165 -140 -485 -973 -1306 -1043 -228 266 599 840 1080 1276
2362 1276 884 -100 -801 -916 -741 -844 -949 -598 574 1153 1036 805 465 503 -68 -1126 -1293 -993 -517
2381 -517 -116 -50 488 911 1063 951 220 -365 -476 -628 -851 -1106 -816 53 782 687 805 902 882 183 -633
2402 -633 -957 -972 -551 -537 -318 122 853 1197 1111 590 283 -68 -531 -917 -1204 -859 -134 288 433 522 1016
2423 1016 1117 533 -297 -677 -513 -771 -957 -911 -231 553 879 870 709 748 352 -291 -679 -1069 -867 -550 -36
$$ packed form
2280a601M75M53K07N73O68O79P9o99p11l42j77p08n07K47R09P03L58K88K95k7
2300A162k05r35q23k68J47Qm9M70R65P95j1m53j07k91k42r80p48K28O67O21l0
2321g9N43N99L85m04o58o25k84k20l09k56M02Q83P49L56j57j19J67n78q78q06
2341a289QN12K02Q7M92R15M66k71m93m64l05l45m88l33K63Q15M94L33K41K40J96
2362A276l92r84p01j15J75j03j05L51J172N79j17k31l40L8n71j058j67L00M76
2381e17M01O6N38M23J52j12p31n85j11j52k23k55K90Q69P29r5J18R7k0o99q16
2402f33l24j5M21J4K19M40P31L44q6n21l07l51m63l86k87L45P25M22J45Q9M94
2423A016J01n84q30l80J64k58j86M6O80P84L26rj61L9l96o43l88l90K02L17N14
$$ plain form
2444 -36 73 449 927 1160 776 68 -355 -396 -544 -987 -1039 -372 271 609 590 763 829 796 115 -617 -728 -795
2466 -795 -737 -573 -252 163 785 1173 932 436 0 -100 -222 -927 -1213 -669 31 295 198 587 1081 901 297
2487 297 -226 -418 -639 -664 -940 -637 -114 450 572 720 738 450 206 -138 -802 -936 -817 -258 -238 -48 331
2508 331 876 1013 377 68 -124 -244 -629 -1000 -747 -150 238 442 496 739 662 411 24 -379 -645 -795 -541
2529 -541 -439 -308 224 778 982 592 381 174 -73 -416 -922 -890 -439 -67 105 402 510 778 704 80 -130
2550 -130 -269 -576 -770 -744 -563 48 524 686 848 465 430 327 -217 -626 -880 -502 -258 -259 -6 526 936
2571 936 784 291 76 -107 -348 -682 -908 -484 -224 214 427 424 671 628 553 -56 -546 -640 -673 -507 -524 -458 343
2594 343 767 806 433 402 321 -54 -501 -897 -654 -232 -82 43 343 609 664 538 159 -191 -358 -436 -556 -557
$$ packed form
2444c6J09L76M78K33l84p08m23m1j48m43n2O67O43L38j9J73O6l3o81p32j11o7
2466g95N8J64L21M15O22L88k41m96m36j00j22p05k86N44P00K64r7L89M94j80o04
2487B97n23j92k21k5k76L03N23N64J22J48J8k88k44l44o64j34J19N59K0J90L79
2508C31N45J37o36l09j92j20l85l71K53N97L88K04N4K43p7k51l87m03k66j50K54
2529e41J02J31N32N54K04l90k11k07k47l43n06L2M51L72J72K97J08K68p4o24k10
2550a30j39l07j94K6J81O11M76J62J62l83l5j03n44m09k54L78K44jK53N32M10
2571I36j52m93k15j83k41l34k26M24K60M38K13lK47m3p5o09m90r4l3J66j7O6Q01
2594C43M24L9l73l1q1l75m47l96K43M22J50J25L00K66N5j26l79l50j67p8j20j
$$ plain form
2616 -557 -542 58 552 538 539 351 557 283 -380 -770 -585 -213 -491 -238 94 544 761 397 406 139 -131 -451
2638 -451 -554 -666 -521 -183 141 342 460 423 669 371 -135 -371 -583 -341 -488 -484 -148 416 638 438 409
2659 409 393 354 -167 -471 -615 -565 -293 -92 169 350 561 722 441 81 -220 -469 -371 -644 -585 -405 121 361
2681 361 335 318 421 469 68 -385 -611 -557 -350 -270 -215 237 483 619 428 328 125 -1 -225 -589 -664 -300
2703 -300 115 231 310 339 569 546 284 -228 -303 -410 -435 -478 -334 -174 367 673 597 386 336 139 -242 -447 -607
2726 -607 -553 -253 -105 -33 293 593 686 320 66 -90 -126 -462 -548 -562 -264 133 426 343 427 337 391 -26 -325
2749 -325 -450 -557 -392 -334 -4 251 484 593 489 167 56 -46 -336 -525 -557 -318 -115 168 119 428 552
2770 552 450 193 -255 -331 -388 -488 -509 -276 35 365 392 366 449 226 -11 -248 -454 -534 -256 -238 -98 154 262
$$ packed form
2616e57J5O00M94j4Jj88K06k74o63l90J85L72k78K53L32M50K17l64Rk67k70l20
2638d51j03j12J45L38L24K01J18l7K46k98n06k36k12K42j47ML36N64K22k00k9
2659D09j6l9n21l04j44N0K72K01K61J81K11J61k81l60l01k49R8k73N9J80N26K40
2681C61k6j7J03M8m01m53k26N4K07Q0N5M52K46J36j91j00k03j26k24l64p5L64
2703c00M15J16P9K9K30k3k62n12p5j07k5m3J44J60N41L06p6k11n0j97l81k05j60
2726f07N4L00J48P2L26L00R3l66k54j56l6l36q6j4K98L97K93q3Q4r0N4m17k99
2749c25j25j07J65N8L30K55K33J09j04l22j11j02k90j89l2K39K03K83m9L09J24
2770E52j02k57m48p6n7j00k1K33L11L30K7k6Q3k23k37k37k06q0K78J8J40K52J08
$$ plain form
2793 262 407 278 168 21 -181 -304 -299 -491 -398 -33 113 316 271 396 497 309 -16 -271 -310 -290 -248 -272 -221
2816 -221 38 447 467 225 117 146 63 -290 -580 -501 -197 20 115 208 365 447 410 -29 33 -314 -365 -415 -399 -193
2840 -193 128 288 253 232 270 118 126 -303 -488 -403 -311 -81 29 -61 108 472 483 259 -19 -62 -210 -321 -597
2863 -597 -326 28 213 209 431 240 279 238 -38 -263 -276 -258 -348 -214 -41 207 292 310 369 156 18 -119 -209 -320
2887 -320 -460 -196 -7 40 219 346 383 256 -37 -88 -230 -257 -376 -208 -183 89 280 290 313 268 177 3 -275
$$ packed form
2793B62J45j29j10j47k02j23Nj92R3L65J46K03m5J25J01j88l25k55l9K0M2k4N1
2816b21K59M09K0k42j08K9q3l53k90P9L04K17R5R3J57Q2l7m39O2l47n1n0J6K06
2840a93L21J60l5k1L8j52Qm29j85Q5R2K30J10r0J69L64J1k24k78m3j48j11k76
2863e97K71L54J85mK22j91L9m1k76k25j3J8r0J34J73K48Q5J8N9k13j38j37r0j11
2887c20j40K64J89M7J79J27L7j27k93n1j42k7j19J68K5K72J91J0K3m5r1j74k78
$$ [...]
8191e5
##END NTUPLES=NMR FID
##END=
