##TITLE=1H ikalashn
DE-63_33-35_1
18.12.2024
##JCAMPDX= 6.0         $$ Bruker NMR JCAMP-DX V2.0
##DATA TYPE= NMR FID
##DATA CLASS= NTUPLES
##ORIGIN= UXNMR, Bruker Analytische Messtechnik GmbH
##OWNER= root
$$ TOPSPIN		Version 1.3
$$ 2024-12-18 14:23:27.390 +0400  Irina@DPX200
$$ Compression mode = diff/dup
##.OBSERVE FREQUENCY= 200.131300845
##.OBSERVE NUCLEUS= ^1H
##.DELAY= (6, 6)
##.ACQUISITION MODE= SIMULTANEOUS
##.ACQUISITION SCHEME= undefined
##.AVERAGES= 64
##.DIGITISER RES= 18
##SPECTROMETER/DATA SYSTEM= spect
##.PULSE SEQUENCE= zg
##.SOLVENT NAME= D2O
##.SHIFT REFERENCE= INTERNAL, D2O, 1, 17.49637
##AUDIT TRAIL= $$ (NUMBER, WHEN, WHO, WHERE, WHAT)
$$ ##TITLE= Audit trail, TOPSPIN		Version 1.3
$$ ##JCAMPDX= 5.01
$$ ##ORIGIN= Bruker BioSpin GmbH
$$ ##OWNER= Irina
$$ $$ F:/spectra/data/iren/nmr/1H/4/audita.txt
$$ ##AUDIT TRAIL=  $$ (NUMBER, WHEN, WHO, WHERE, VERSION, WHAT)
(   1,<2024-12-18 14:22:52.781 +0400>,<Irina>,<DPX200>,<TOPSPIN 1.3>,
      <created by zg
	started at 2024-12-18 14:18:39.687 +0400,
	POWCHK disabled, PULCHK disabled
       configuration hash MD5:
       BE 6D 3F 07 2A EA 11 49 91 17 2B D3 AF B3 58 0D
       data hash MD5: 16K
       A8 95 74 0F 4A 8D 1A B0 E3 A6 6C E0 BA AE BF 7B>)
$$ ##END=
$$ 
$$ $$ hash MD5
$$ $$ 30 3F 1C 69 D9 D4 DB F0 D5 49 88 11 D3 81 92 85
##$RELAX= 
##$RELAX= 
##$RELAX= 
##$RELAX= 
##$RELAX= 
##$RELAX= 
##$RELAX= 
##$RELAX= 
##$RELAX= 
$$ Bruker specific parameters
$$ --------------------------
##$DU= <F:/spectra>
##$EXPNO= 4
##$NAME= <1H>
##$PROCNO= 1
##$TYPE= <nmr>
##$USER= <iren>
##$AMP= (0..31)
100 100 100 100 100 100 100 100 100 100 100 100 100 100 100 100 100 100 
100 100 100 100 100 100 100 100 100 100 100 100 100 100 
##$ANAVPT= -1
##$AQSEQ= 0
##$AQ_mod= 1
##$AUNM= <au_zg>
##$AUTOPOS= <>
##$BF1= 200.13
##$BF2= 200.13
##$BF3= 200.13
##$BF4= 200.13
##$BF5= 200.13
##$BF6= 200.13
##$BF7= 200.13
##$BF8= 200.13
##$BYTORDA= 1
##$CFDGTYP= 0
##$CFRGTYP= 5
##$CHEMSTR= <none>
##$CNST= (0..63)
1 1 145 1 1 1 1 1 1 1 1 1 1 1 1 1 1 1 1 1 1 1 1 1 1 1 1 1 1 1 1 1 1 1 
1 1 1 1 1 1 1 1 1 1 1 1 1 1 1 1 1 1 1 1 1 1 1 1 1 1 1 1 1 1 
##$CPDPRG= <>
##$CPDPRG1= <>
##$CPDPRG2= <>
##$CPDPRG3= <>
##$CPDPRG4= <mlev>
##$CPDPRG5= <mlev>
##$CPDPRG6= <mlev>
##$CPDPRG7= <mlev>
##$CPDPRG8= <mlev>
##$CPDPRGB= <>
##$CPDPRGT= <>
##$D= (0..63)
0 2 0 0 0 0 0 0 0 0.06 0 0.03 0 0 0 0 0.0002 0 0 0 0 0 0 0 0 0 0 0 0 0 
0 0 0 0 0 0 0 0 0 0 0 0 0 0 0 0 0 0 0 0 0 0 0 0 0 0 0 0 0 0 0 0 0 0 
##$DATE= 1734517371
##$DBL= (0..7)
120 120 120 120 120 120 120 120 
##$DBP= (0..7)
150 150 150 150 150 150 150 150 
##$DBP07= 0
##$DBPNAM0= <>
##$DBPNAM1= <>
##$DBPNAM2= <>
##$DBPNAM3= <>
##$DBPNAM4= <>
##$DBPNAM5= <>
##$DBPNAM6= <>
##$DBPNAM7= <>
##$DBPOAL= (0..7)
0.5 0.5 0.5 0.5 0.5 0.5 0.5 0.5 
##$DBPOFFS= (0..7)
0 0 0 0 0 0 0 0 
##$DE= 6
##$DECBNUC= <off>
##$DECIM= 32
##$DECNUC= <off>
##$DECSTAT= 4
##$DIGMOD= 1
##$DIGTYP= 9
##$DL= (0..7)
0 120 120 120 120 120 120 120 
##$DP= (0..7)
150 150 150 150 150 150 150 150 
##$DP07= 0
##$DPNAME0= <>
$$ [...]
##$SW= 21.9926040160658
##$SWIBOX= (0..15)
0 0 2 0 0 0 0 0 0 0 0 0 0 0 0 0 
##$SW_h= 4401.40845070422
##$TD= 16384
##$TD0= 1
##$TE= 300
##$TE2= 300
##$TE3= 300
##$TEG= 300
##$TL= (0..7)
0 120 120 120 120 120 120 120 
##$TP= (0..7)
150 150 150 150 150 150 150 150 
##$TP07= 0
##$TPNAME0= <>
##$TPNAME1= <>
##$TPNAME2= <>
##$TPNAME3= <>
##$TPNAME4= <>
##$TPNAME5= <>
##$TPNAME6= <>
##$TPNAME7= <>
##$TPOAL= (0..7)
0.5 0.5 0.5 0.5 0.5 0.5 0.5 0.5 
##$TPOFFS= (0..7)
0 0 0 0 0 0 0 0 
##$TUNHIN= 0
##$TUNHOUT= 0
##$TUNXOUT= 0
##$USERA1= <user>
##$USERA2= <user>
##$USERA3= <user>
##$USERA4= <user>
##$USERA5= <user>
##$V9= 5
##$VALIST= <valist>
##$VCLIST= <CCCCCCCCCCCCCCC>
##$VD= 0
##$VDLIST= <DDDDDDDDDDDDDDD>
##$VPLIST= <PPPPPPPPPPPPPPP>
##$VTLIST= <TTTTTTTTTTTTTTT>
##$WBST= 1024
##$WBSW= 25
##$XGAIN= (0..3)
0 0 0 0 
##$XL= 0
##$YL= 0
##$YMAX_a= 1641068
##$YMIN_a= -1632994
##$ZGOPTNS= <>
##$ZL1= 120
##$ZL2= 120
##$ZL3= 120
##$ZL4= 120
##$ABSF1= 10
##$ABSF2= 0
##$ABSG= 5
##$ABSL= 3
##$ALPHA= 0
##$AQORDER= 0
##$ASSFAC= 0
##$ASSFACI= 0
##$ASSFACX= 0
##$ASSWID= 0
##$AUNMP= <proc_1d>
##$AXLEFT= 0
##$AXRIGHT= 0
##$AXTYPE= 0
##$AXUNIT= <>
##$AZFE= 0.1
##$AZFW= 0.1
##$BCFW= 1
##$BC_mod= 2
##$BYTORDP= 1
##$COROFFS= 0
##$CY= 7568.61572265625
##$DATMOD= 1
##$DC= 2
##$DFILT= <>
##$DTYPP= 0
##$F1P= 17.9538593292236
##$F2P= -4.03888763876832
##$FCOR= 0.5
##$FTSIZE= 32768
##$FT_mod= 4
##$GAMMA= 1
##$GB= 1
##$INTBC= 1
##$INTSCL= 1
##$ISEN= 128
##$LB= 0.02
##$LEV0= 0
##$LPBIN= 0
##$MAXI= 945.577
##$MC2= 0
##$MEAN= 0
##$ME_mod= 0
##$MI= -402.1523
##$NCOEF= 0
##$NC_proc= 0
##$NLEV= 6
##$NOISF1= 8.587773
##$NOISF2= 6.764455
##$NSP= 1
##$NTH_PI= 0
##$NZP= 0
##$OFFSET= 17.49637
##$PC= 1
##$PHC0= 259.4884
##$PHC1= -14.20579
##$PH_mod= 0
##$PKNL= yes
##$PPARMOD= 0
##$PPDIAG= 0
##$PPIPTYP= 0
##$PPMPNUM= 100
##$PPRESOL= 1
##$PSCAL= 0
##$PSIGN= 0
##$REVERSE= no
##$SF= 200.13
##$SI= 32768
##$SIGF1= 18.5376
##$SIGF2= -6.396296
##$SINO= 400
##$SIOLD= 32768
##$SREGLST= <1H.CDCl3>
##$SSB= 3
##$STSI= 0
##$STSR= 0
##$SW_p= 4401.40845070422
##$SYMM= 0
##$S_DEV= 0
##$TDeff= 0
##$TDoff= 0
##$TI= <>
##$TILT= no
##$TM1= 0
##$TM2= 0
##$TOPLEV= 0
##$USERP1= <user>
##$USERP2= <user>
##$USERP3= <user>
##$USERP4= <user>
##$USERP5= <user>
##$WDW= 1
##$XDIM= 8192
##$YMAX_p= 0
##$YMIN_p= 0
$$ End of Bruker specific parameters
$$ ---------------------------------
##NTUPLES= NMR FID
##VAR_NAME=  TIME,          FID/REAL,        FID/IMAG
##SYMBOL=    X,             R,               I
##VAR_TYPE=  INDEPENDENT,   DEPENDENT,       DEPENDENT
##VAR_FORM=  AFFN,          ASDF,            ASDF
##VAR_DIM=   8192,          8192,            8192
##UNITS=     SECONDS,       ARBITRARY UNITS, ARBITRARY UNITS
##FACTOR=    0.0002272,     1,               1
##FIRST=     0,             0,               0
##LAST=      1.8609952,     -486,            518
##MIN=       0,             -1632994,        -1632994
##MAX=       1.8609952,     1641068,         1641068
$$ Real data points
##PAGE= N=1
##DATA TABLE= (X++(R..R)), XYDATA
0 0 0 0 0 0 0 0 0 0 0 0 0 0 0 0 0 0 1 -64 64 -64 64 -64 69 -128 128 -129 164 -192 202 -256 285 -322 373
33 373 -413 466 -522 589 -667 738 -819 909 -1012 1120 -1244 1375 -1513 1673 -1843 2032
49 2032 -2241 2461 -2720 2993 -3311 3664 -4059 4511 -5038 5655 -6382 7263 -8367 9769
63 9769 -11649 14274 -18232 24893 -38192 75451 -422319 -1632994 -1609869 -1131379 -717956
74 -717956 -543647 9573 931795 1641068 1481671 721302 5520 -304092 -540578 -953855
84 -953855 -1325536 -1133266 -363812 459052 823224 844811 901926 1029014 811152 93890
94 93890 -719214 -1091373 -1017870 -844123 -697289 -336733 332815 985624 1206782 973030
104 973030 555541 142285 -306219 -794119 -1123796 -1068973 -639691 -75868 393930 725655
114 725655 946735 993846 742788 223229 -318386 -652820 -778607 -808593 -727295 -407514
124 -407514 113265 568648 751343 720181 632871 464723 94228 -417855 -801183 -864989
134 -864989 -685217 -428924 -134791 258784 691969 948342 864490 503386 77869 -271743
144 -271743 -555968 -788408 -856844 -622143 -138350 334600 596868 675431 680282 584437 269777
155 269777 -212553 -613362 -737307 -643680 -487941 -291820 27679 431235 720822 736008
165 736008 529082 259171 2339 -273906 -558985 -724423 -639927 -330381 31160 304271
175 304271 489039 621780 641959 443944 55751 -332673 -547209 -594008 -560941 -446438
185 -446438 -175654 211844 530691 631069 540093 374494 175408 -92818 -399825 -604062
195 -604062 -589655 -389580 -132425 97705 310168 504308 593976 483891 201828 -105108
205 -105108 -320925 -444887 -517696 -499769 -313329 11452 313875 464219 475995 425586 312113
216 312113 84066 -223294 -463769 -518436 -416401 -256057 -79996 137807 376991 525489
226 525489 487833 292742 59952 -132158 -294913 -437735 -491521 -376598 -122043 139360
236 139360 302304 377793 410264 370833 200510 -73211 -313558 -412544 -385384 -310615 -198134
247 -198134 -8736 234354 415654 436666 321137 164232 15821 -146898 -321309 -425789
257 -425789 -377657 -198340 3142 149275 254774 344468 370875 266670 49626 -163157
267 -163157 -280785 -316313 -318034 -272782 -128357 93763 285492 352935 312711 232159 132543
278 132543 -19624 -209157 -347643 -351059 -238019 -95069 26885 148547 276091 346010
288 346010 289506 124460 -48349 -161811 -230366 -286295 -294313 -195839 -10170 164659 248362
299 248362 258155 243830 199458 83213 -97150 -248088 -290592 -237423 -156781 -75636 37871
310 37871 185223 294444 289352 178598 46172 -53356 -137763 -231161 -287009 -238590 -91966
321 -91966 64528 157673 198021 223186 223950 147748 -5470 -156534 -226073 -215363 -177540 -129563
333 -129563 -40864 95262 218991 254649 197660 108658 27215 -57385 -159642 -239035 -235434
344 -235434 -143203 -23393 69599 134935 190567 217503 174505 60242 -67106 -149523 -180353
355 -180353 -185905 -164702 -91720 28420 142634 196956 187899 147602 91051 7026 -101187 -188737
367 -188737 -205754 -156004 -79810 -6001 70021 150651 200301 179522 95287 -3338 -76919 -127713
379 -127713 -168764 -178808 -127532 -23993 79180 138293 153759 151548 127963 61263 -43041
390 -43041 -134669 -169476 -147747 -105070 -56446 9896 96854 164704 170351 115528 43329 -17440
402 -17440 -73981 -131573 -166913 -143869 -66196 22486 82206 115357 138213 139507 94107 6501
414 6501 -80646 -126359 -130070 -115597 -87733 -31557 50859 123810 146207 119228 72940 26592
426 26592 -27446 -92770 -141824 -138694 -87429 -20655 32585 74569 113494 134142 108575 39739
438 39739 -34604 -81771 -102773 -110964 -104116 -61802 10934 81854 114388 109322 87765 59106 10462
451 10462 -55135 -110691 -124019 -94085 -48933 -8347 35402 83972 118243 110210 61272 1971
463 1971 -41753 -71019 -96593 -106679 -81314 -19732 42614 79836 90147 89252 77576 41460 -20302
476 -20302 -76679 -100751 -89279 -64675 -36091 2642 54067 96278 102555 71696 28148 -8225
488 -8225 -41164 -75345 -98380 -86641 -41724 10454 46389 66023 80386 83661 58169 6783
500 6783 -45060 -73347 -77353 -69687 -54342 -21953 26873 70920 86549 72420 45369 17889 -13952
513 -13952 -52197 -82611 -84448 -53969 -14162 17775 42774 65953 79839 67014 26141 -19170
525 -19170 -47149 -59651 -66450 -63605 -39169 4624 46449 65943 65308 54936 37369 8299 -30639
538 -30639 -64113 -73282 -57967 -30931 -5099 20776 49546 70876 67356 38349 2376 -23736
550 -23736 -41144 -57466 -64428 -49175 -12817 24092 45316 53610 55448 47816 24814 -11108 -43891
563 -43891 -59145 -54681 -41466 -23462 2050 32855 57449 61617 44365 19531 -3784 -24370
575 -24370 -45999 -60026 -52783 -25844 5227 26505 39935 49568 51116 34892 3798 -26447 -42673
588 -42673 -45721 -44063 -34897 -13401 17177 41881 51428 44410 30169 13286 -8293 -32720 -51792
601 -51792 -52453 -34576 -9691 10375 26188 42496 50697 41490 15101 -11913 -28871 -36804 -41747
614 -41747 -39995 -23323 4558 28346 40051 39031 33990 23442 4958 -18839 -38953 -44456 -36081
627 -36081 -20094 -4671 10970 29643 42422 42506 26137 3321 -14213 -26541 -37234 -41591 -32202
640 -32202 -8995 15070 29442 35168 35731 29512 14824 -8113 -27903 -36614 -34610 -26153 -13920
653 -13920 2969 20239 34775 37706 28458 12780 -1797 -15346 -28106 -36822 -33013 -16739 1325
666 1325 15334 24700 31565 33239 23216 3315 -16152 -26927 -30435 -30136 -22991 -8820 11332 27851
680 27851 33356 29360 20017 7859 -6507 -21471 -32522 -32932 -21154 -5877 6660 15866 25668
693 25668 31660 26120 10846 -6943 -16609 -22906 -26022 -26050 -16637 813 17647 25277 26369 22942
707 22942 16392 4701 -10979 -25026 -29725 -25498 -14650 -3759 8298 19436 28273 28294 16773
720 16773 2467 -9851 -17259 -23722 -26825 -20644 -6142 9121 17968 22452 22196 19758 9966 -3528
734 -3528 -16148 -23468 -22613 -17997 -10780 -350 11957 22051 26042 19700 10438 -11 -9680 -18812
748 -18812 -25365 -22886 -12464 206 10681 17040 21756 22731 15674 3438 -10065 -17692 -20086 -19525
762 -19525 -14947 -6011 6518 16990 21894 19462 14351 6449 -3156 -12795 -21587 -21775 -15976 -6603 2552
777 2552 10325 17453 21144 18259 8207 -2089 -10828 -16409 -19369 -17949 -12065 -100 10611 16995
791 16995 18381 15718 11280 3041 -7399 -16681 -19773 -17216 -10434 -2737 3967 13040 19019 18695 11939
806 11939 3053 -5095 -11134 -16340 -18400 -14534 -5087 3892 12166 14778 15846 14615 8369 -1903 -11425
821 -11425 -16583 -16066 -13016 -8052 -519 7977 15563 16536 13994 7465 569 -6291 -12116 -16793 -15621
836 -15621 -9121 -517 6030 10894 14945 15547 11123 3796 -5607 -11919 -13599 -13436 -10565 -5122 3335
851 3335 11693 15243 14014 10523 5410 -1449 -9100 -14054 -15520 -11554 -4809 1069 7714 12304 13979
866 13979 12956 6623 -595 -7208 -11056 -12504 -12347 -9111 -1748 6358 11241 13244 11461 8133 2872
881 2872 -4660 -10878 -13021 -12030 -8363 -3725 2533 8532 12505 13234 9254 3364 -2435 -7053 -11460 -12658
897 -12658 -10351 -4545 2216 6762 10361 11817 10549 6393 -821 -7672 -10430 -11503 -9065 -6271 -1285
912 -1285 5198 9922 11628 9785 6117 1575 -3268 -7815 -10714 -10426 -6995 -1313 4066 6924 10327
927 10327 10446 8517 3424 -3009 -7011 -9598 -9331 -8571 -3965 2055 6015 9404 9476 8526 5298 -395
943 -395 -5566 -9348 -9987 -8077 -4630 -533 4102 7559 9673 9159 5428 360 -3888 -7328 -8811 -9231
959 -9231 -6087 -1130 3790 6492 8385 8511 5827 2640 -2596 -5947 -8654 -8548 -6423 -3670 906 5053
975 5053 8710 8998 7002 3397 -931 -4535 -7092 -8427 -7327 -3523 743 3828 6706 8051 7235 4680
991 4680 582 -4339 -6513 -7889 -7166 -4476 -1781 2680 6109 8111 6919 4782 1646 -1696 -5641
1006 -5641 -7541 -6834 -5941 -1945 1116 5210 7082 7482 5872 2877 -780 -3665 -5676 -7218 -5547 -3659
1022 -3659 920 4310 6459 7103 5286 4111 212 -3144 -5816 -6747 -5927 -3820 -1064 2676 5435 6402
1038 6402 6494 4134 1284 -1950 -4226 -6148 -6742 -4552 -1957 1814 4114 5520 5078 4792 2257 -911
1054 -911 -3832 -5621 -4946 -4691 -2936 599 2947 5373 5223 4665 2256 -189 -2030 -4667 -5295 -4800 -2828
1071 -2828 -292 2015 4267 5187 4936 3240 869 -1490 -3568 -4765 -5044 -3441 -568 755 4088 5620
1087 5620 5404 3886 1001 -382 -2981 -4921 -5200 -4072 -1430 837 2679 4054 5011 4591 1874 -364
1103 -364 -2762 -3784 -4783 -4080 -2518 -267 2599 3754 5078 3664 3058 427 -1933 -3631 -5092 -4430
1119 -4430 -2935 -875 1145 2908 4588 4720 2918 1287 -334 -3130 -3954 -4365 -2668 -1749 867 1875
1135 1875 3932 4263 2594 1862 -400 -2285 -3456 -4594 -3703 -1853 410 1542 3050 3901 3658 1801
1151 1801 955 -869 -2797 -4207 -3886 -2130 -339 1218 3107 3264 3528 2714 348 -1099 -3123 -3177 -3080
1168 -3080 -3038 -1246 135 2128 3061 2227 2666 1237 -343 -2421 -3063 -2427 -2722 -1798 -469 1774 2429
1185 2429 3123 2627 1507 45 -1253 -2647 -3951 -3587 -1452 -242 988 2245 2961 2299 1782 909 -1503
1202 -1503 -2504 -3413 -3395 -1733 -1077 790 1887 2430 2879 3162 1128 -486 -1559 -2195 -2822 -2437 -1187
1219 -1187 203 1384 2440 2807 1940 1736 -281 -1603 -3185 -2373 -2225 -1682 209 1196 2229 2076 3044
1236 3044 1792 770 -830 -2529 -3154 -2135 -2244 -493 742 2055 2165 2120 1520 565 -881 -2023 -1893
1253 -1893 -2682 -1789 -762 107 1059 1722 2525 2450 217 -540 -1455 -2152 -2033 -1724 -1290 244 1122 2236 2436
1272 2436 1730 1016 614 -734 -1499 -1685 -1910 -888 -743 790 1698 1997 1826 1819 945 -409 -1118 -1804 -2104
1291 -2104 -1928 -73 1136 1465 995 1886 1031 400 -418 -492 -2312 -2532 -1207 -522 525 884 1949 1745
1309 1745 1066 987 289 -1220 -1341 -1696 -1280 -346 1146 362 1131 1645 1876 660 -109 -570 -1677 -1482 -1549
1328 -1549 -1283 34 660 1389 1476 1494 1262 -30 240 -755 -1520 -1759 -1253 -1060 904 475 1353 984 1475
1347 1475 -64 147 -996 -980 -1355 -1990 -710 -14 970 968 1471 1383 1009 839 -301 -1042 -1277 -1078 -579 476
1367 476 -96 641 1684 1064 1648 -18 -320 -863 -1096 -1930 -354 -418 765 749 1065 1265 346 101 -220
1386 -220 -558 -672 -689 -2007 -1322 0 593 1051 1051 567 672 58 -780 -1081 -2125 -1596 -359 -559 423 1104
1406 1104 867 1154 847 579 -851 -199 -1217 -692 -954 -210 767 839 1094 624 475 687 -557 -625 -1099
1425 -1099 -1577 -768 112 490 751 1460 1611 1339 395 -691 -656 -362 -505 -300 -837 -356 423 587 443 880
1445 880 266 415 -488 -838 -1316 -888 -242 14 422 941 1233 625 296 425 -728 -214 -1297 -964 -488
1464 -488 158 390 -250 649 1101 427 108 -29 -702 -1229 -383 -235 -517 245 960 1219 675 725 202 168 -215
1485 -215 -624 -1204 -955 -258 -561 290 152 -248 1248 296 -172 113 -655 -590 -770 -1065 -25 604 228 482
1505 482 340 1022 154 -513 -773 -388 -485 -563 -244 451 302 255 915 -257 572 -21 -318 -919 -891 -441 -214
1526 -214 -114 1031 -145 481 715 227 -279 -305 -360 -195 -820 -526 413 281 424 641 1314 701 -97 -604
1546 -604 -204 -748 -432 -323 -311 -305 976 927 298 241 542 120 -231 -46 -720 72 361 265 -169 327 343 42
1568 42 76 -572 -106 39 -591 -1041 603 -58 -691 -188 284 268 486 -251 -241 -601 388 -557 -974 703 572
1589 572 134 372 466 48 23 188 61 -457 -618 -28 -466 -259 193 130 395 480 -502 -160 301 123 -717
1610 -717 -630 -378 -252 -347 279 632 311 65 479 -215 -583 -585 -518 365 -376 -368 14 596 634 316 59 464 195
1633 195 -236 -287 167 193 118 -31 26 455 470 99 -663 -132 -913 -285 -223 251 -131 -207 546 -38 184 127 348
1656 348 -138 -385 -294 163 -285 322 102 10 236 946 30 144 -877 27 12 -80 333 -236 -124 240 -159
1677 -159 288 322 610 -224 -480 -159 -960 189 -330 140 83 261 357 51 -238 -382 -432 -202 -498 -756 -288
1698 -288 453 -53 405 219 -743 726 519 -44 -909 -204 -257 70 97 283 -211 596 434 -241 -355 -274 -285
1719 -285 -850 314 -430 -380 1045 545 -432 364 533 -67 452 -344 -448 452 89 -210 -123 -184 201 451
1739 451 721 515 128 168 92 -82 45 -164 315 242 164 571 300 354 659 -1125 -639 -70 -401 -311 64 226
1761 226 426 220 684 -410 -35 357 642 -437 -274 141 -156 -369 1077 -67 881 232 -433 -504 501
1780 501 579 -489 -19 -126 894 441 157 84 547 -292 588 87 -180 -667 -589 -18 -224 -99 76 206
1800 206 555 433 388 267 -65 387 -459 -140 -271 236 299 514 -45 274 81 -72 -414 -744 167 -515 -533
1821 -533 -79 -146 189 393 492 14 416 167 -67 551 -622 -503 115 355 302 398 -243 92 35 -341 -268 -553
1843 -553 -417 -500 -285 1177 -58 551 -84 168 194 496 -150 -16 41 -90 -23 153 546 -202 559 149 52
1864 52 -32 203 -486 -62 -429 -636 342 -293 260 575 180 217 469 42 -435 -376 -209 -116 -596 108 49 528
1886 528 -36 464 -140 21 258 54 -228 146 411 -362 316 455 208 -60 -80 -124 -319 -320 158 286 429
1907 429 90 251 457 -106 -250 454 -95 180 247 -743 -633 -512 -170 -579 44 389 306 263 521 -3 30
1928 30 -191 -1176 -271 60 -384 51 -338 148 -392 351 -547 -448 -246 -197 -459 575 229 577 -623 401
1948 401 389 -252 -21 311 401 -415 -110 296 438 -666 893 -807 -377 -152 7 33 -473 59 443 375
1968 375 -219 -62 -436 -360 31 -118 114 -9 223 -131 -434 -190 183 699 214 -433 -191 -360 -170 -141 -255
1989 -255 -533 -175 -229 155 242 -609 -71 -177 527 -54 -235 -213 -274 109 -672 235 62 314 -377 587 138
2010 138 -813 487 -386 -20 576 47 -26 337 421 -32 225 480 -111 -243 190 -574 782 -16 -898 -412
2030 -412 -812 988 -509 508 336 -26 340 54 25 162 98 177 -287 -366 388 -380 692 -492 -320 102
2050 102 66 -936 -524 620 -138 -106 -570 527 -180 -71 107 -209 -117 601 434 222 -147 633 821 -13
2070 -13 377 -189 -79 -372 -316 -232 -105 231 27 168 107 180 -683 -152 945 -169 -203 -168 -506 84 0 -64
2092 -64 289 -230 111 -351 -290 -214 -415 -97 485 273 676 526 92 -354 -227 35 600 -2 167 -3 -298
2113 -298 -261 -408 534 -125 -276 -331 73 174 -367 -601 270 -131 373 -174 17 167 -164 123 223 408 -286
2134 -286 50 -187 -191 212 198 -144 -145 -176 -284 226 -480 490 38 184 524 538 -658 319 -697 25 736 924
2156 924 383 -109 -306 461 -252 649 305 398 511 2 -173 -588 157 -2 550 -406 -444 -480 -8 -999 37
2177 37 -274 -145 -556 -44 -373 486 0 443 -42 234 -54 -402 -224 -172 -594 303 245 -137 -1151 557
2197 557 332 -374 -219 -170 -120 67 -329 -82 473 -812 -382 -93 -279 387 275 362 -54 -73 -53 806 964
2218 964 -455 -340 -633 1 -16 -194 -69 119 193 -353 -357 -312 217 -98 -98 -539 677 532 -340 282 -660 -402
2240 -402 -443 -175 -20 -364 197 -330 117 -309 271 5 380 109 -103 -106 -44 261 377 -70 -187 -88 291 -128
2262 -128 10 149 -412 573 318 156 -654 -223 111 -882 -44 -118 402 85 357 -274 -576 19 -122 -467
2282 -467 40 319 -344 -113 580 -588 179 33 121 235 -192 -344 -63 93 -14 366 -207 -397 -495 -190
2302 -190 -515 196 597 713 330 -346 249 35 663 -338 -262 -355 -151 524 -126 -454 193 712 -113 -561
2322 -561 -170 341 -93 353 -783 674 -651 -92 -190 16 -552 -465 638 -128 40 -419 163 -51 55
2341 55 390 -15 1 -766 627 146 328 59 -59 121 219 91 -192 -114 -387 82 -315 -203 309 -57 248
2362 248 704 520 206 33 -18 -460 -71 -129 76 -69 468 -431 -56 198 333 -187 97 -609 -276 236 258
2383 258 -157 -88 -69 -698 -494 -216 115 195 31 140 838 371 -209 145 -757 -247 -247 -127 -91 -89 -661 391
2405 391 6 480 -18 157 -27 -234 -343 145 -483 -465 151 -411 -332 -124 -190 -180 -331 -17 118 -252 -420
2426 -420 -660 157 -622 271 762 481 72 -41 323 241 -128 313 189 -142 -120 -590 -53 42 -412 -498 229
2447 229 -94 291 -394 231 81 137 460 -116 -273 461 351 -204 -535 160 237 -241 257 192 -81 705 165
2468 165 12 93 -388 285 18 385 -134 41 45 -296 322 343 -169 -642 -201 276 -74 36 -79 -211 -64
2489 -64 -422 168 620 -143 -130 568 -163 379 165 -46 487 37 -462 -838 -88 682 -362 160 460 -171
2509 -171 83 305 153 774 -98 332 -318 263 106 -34 -66 49 -147 33 -538 441 542 -230 -160 753 121
2530 121 -207 70 -1093 -200 345 -833 149 -476 264 -67 212 -502 926 297 28 491 -64 199 -325
2549 -325 -299 147 -371 96 339 -125 14 -307 -22 71 -326 508 77 183 277 -120 158 -347 292 -909 215
2570 215 145 122 -58 5 -276 41 305 -357 616 397 -363 -27 9 954 -44 618 501 -216 87 371 62
2591 62 432 308 426 -248 -225 406 -236 239 55 176 -836 589 185 -80 -209 -123 626 -106 6 -356
2611 -356 456 159 183 481 -36 579 368 -346 -84 296 278 877 151 63 437 620 -266 -149 135 24 -488
2632 -488 79 -376 223 221 -49 -34 386 207 364 -36 174 -313 -108 518 94 -110 -4 91 139 -417 71 528
2654 528 218 -374 -7 473 1015 -66 264 -277 76 35 -12 546 247 69 685 -106 -348 542 -310 431
2674 431 241 785 -89 539 -486 -968 -318 -249 121 506 -33 549 246 -644 -639 162 160 93 610 221 -37 -190
2696 -190 -207 331 -45 55 -331 -200 416 132 47 696 74 -101 128 -251 -557 -393 297 -279 -307 -337 118
2717 118 780 -190 111 -196 -329 289 360 -2 -686 -341 180 -543 399 72 -520 113 -58 -31 -459 -202 -659
2738 -659 124 552 -153 -471 -65 -544 31 -75 -95 -65 200 373 320 849 -460 -63 -43 -180 89 123 867
2759 867 458 136 -423 1035 -445 152 51 98 -685 -907 -139 760 2 -423 -463 148 173 402 908 129
2779 129 14 -175 103 -606 29 262 324 -7 339 -213 -490 206 -265 -509 -350 19 360 115 -333 -746
2799 -746 112 -1 -578 -217 211 -357 307 332 540 -799 -436 30 -344 -357 330 44 57 -182 -438 -873 199
2820 199 811 124 -18 117 326 558 -240 -322 -170 82 175 -703 -17 14 456 595 393 -463 307 -74 -198
2841 -198 275 -422 59 28 259 -95 259 -108 194 431 -405 547 194 951 83 -407 -177 99 -348 197
2861 197 -117 567 385 -43 -855 72 329 -374 410 330 126 -841 -558 139 84 233 -175 -472 116 1 196
2882 196 -494 -307 -60 567 -533 -479 -41 21 -271 -72 -124 -64 182 -27 537 -606 69 -68 66 27 49
2903 49 -77 -303 -111 171 -6 138 64 13 199 -715 -287 -116 -165 428 554 92 -390 62 569 -282 954
2924 954 -70 16 27 -376 37 -227 200 -163 76 -187 -84 204 449 -19 199 85 -26 73 -202 66 -75
2945 -75 -54 -29 -122 58 -852 149 510 -296 206 -449 254 197 104 368 458 31 40 433 -78 -541 439 331 182
2968 182 -269 -31 340 57 -329 -213 259 -132 -97 614 -329 588 -377 134 -447 -197 632 -503 112 50
2988 50 329 140 802 -190 -62 -19 480 -351 48 936 -85 571 -91 803 -376 462 -692 -151 -267 -504
3008 -504 139 -283 -87 -16 -228 87 -75 -420 -203 96 -17 -77 280 531 -225 299 563 337 -539 -490 189
3029 189 324 477 496 369 212 563 -499 -26 604 45 -535 -204 244 368 412 -433 -276 -282 -334 264 95
3050 95 612 -206 248 78 500 805 395 136 -65 177 -263 13 614 367 -296 429 -362 44 -237 221
3070 221 -185 321 132 -178 -226 -431 310 48 494 -418 93 -839 -465 -254 -19 252 -739 418 -231 104
3090 104 101 -422 -19 -220 189 -210 -503 -97 211 261 1192 -228 464 -430 632 -1061 -500 -334 -278 -111
3110 -111 666 414 265 -178 -186 -5 148 112 68 -380 -93 -21 120 -577 143 -269 449 116 -590 456 357 -25
3132 -25 545 -7 481 -18 -326 66 -341 456 -518 573 282 751 -295 -995 -70 71 -26 86 208 -16
3152 -16 337 418 -197 -676 223 -518 424 294 695 -365 -83 292 176 724 -82 -53 17 133 167 303 -237
3173 -237 9 -517 439 381 -97 96 124 -503 144 351 326 -326 -254 366 -6 569 237 231 382 -133 -288 166
3195 166 103 480 615 -256 103 -526 -440 -270 154 26 11 -378 61 -86 635 208 -205 -81 804 -180 52
3216 52 5 -107 240 -492 -301 -454 -600 636 260 273 137 565 436 176 -323 -708 -180 -38 -61 -54 -689 727
3238 727 43 -144 -184 -220 -274 393 -736 142 117 -151 217 -418 -193 643 169 48 -141 -839 -462 217 345
3259 345 -236 -210 -406 -662 -22 -483 154 37 229 344 273 51 -123 -8 137 325 180 -68 605 224 -280
3280 -280 153 750 38 -198 -393 274 503 297 -73 -560 189 139 184 -98 -141 193 -239 -394 67 -125 356
3301 356 -552 -477 -294 3 -553 -498 603 -80 62 -26 -182 112 15 48 538 70 -71 -20 -397 -343 -413 197
3323 197 -9 -711 185 476 -141 -367 261 258 313 246 -518 489 -161 -321 -213 -14 328 372 -46 -191 336
3344 336 -521 219 -282 122 220 161 290 -407 90 -477 401 629 68 147 1051 469 220 -228 321 107 -104
3365 -104 -641 -243 358 -436 -82 381 474 233 362 34 -49 580 56 188 -171 -549 119 9 -249 -200 213
3386 213 382 -257 54 -32 -173 69 337 -439 -4 373 -157 -333 283 -211 -119 -71 -122 97 -198 817 -705
3407 -705 209 185 76 354 -270 -397 -15 138 -99 -86 860 148 353 377 261 -54 466 -169 224 434 111
3428 111 39 320 78 103 -576 706 -622 -24 -344 -433 21 -414 568 -114 332 518 -93 54 -39 -411 29
3449 29 -185 -19 590 388 -131 -608 -524 -130 -277 -395 431 -111 213 277 199 -429 287 -67 -155 -562 -641 212
3471 212 586 324 378 212 227 -165 454 -1247 492 15 -8 10 -58 660 535 93 161 440 43 194 -192
3492 -192 300 -167 -188 -114 361 -572 -80 -16 134 -932 -130 144 435 -505 -289 -266 155 129 449 -605 623
3513 623 -211 179 205 -381 571 201 -328 -138 718 -342 -176 72 -129 -270 545 -296 372 112 458 148
3533 148 94 -261 -142 -264 86 183 -535 107 153 369 55 338 -192 322 441 201 -666 141 -450 522 -453
3554 -453 646 -107 -348 474 -265 -586 -446 334 292 -333 -266 -174 76 -342 176 379 -118 -121 132 -135 498
3575 498 -79 157 -43 -110 354 58 -380 769 -13 279 212 -39 -242 170 127 139 433 -317 -237 -3 -70 -650
3597 -650 -726 296 -114 159 22 -196 158 -3 -265 244 949 -248 -654 -730 -584 -410 305 544 1 -123
3617 -123 -357 53 357 -325 671 -415 216 -470 -475 -60 -129 578 -363 -585 -43 459 94 109 -116 -426 -200
3638 -200 215 185 461 -168 394 7 367 206 337 -229 410 289 217 41 209 -45 -630 -273 234 -418 -580
3659 -580 42 -105 -771 323 -77 -613 -416 -661 -132 -260 156 -457 -61 -414 -477 -62 137 714 197 434
3679 434 -549 320 -254 -6 475 -213 49 -232 733 -5 416 -526 135 108 -279 620 -139 337 108 194 200
3700 200 -97 222 403 333 -280 -411 123 93 -88 510 -375 244 -235 -163 277 -611 291 -37 -243 220 254
3721 254 107 484 -106 17 -263 178 -358 -207 145 257 -64 294 -195 203 334 -70 -589 201 -160 15
3741 15 -195 -396 272 -109 288 -311 72 -205 -253 -297 -229 100 380 -420 215 181 -80 77 20 369 271 -112
3763 -112 -406 -829 -383 -210 -16 -322 467 51 -309 -135 253 100 34 134 -720 -520 594 152 58 -87
3783 -87 198 -145 -73 394 335 -623 177 276 193 -315 -286 -678 -145 -324 66 -329 -465 -211 550 258 -164 175
3805 175 316 -311 -458 -335 469 320 -374 128 365 165 -271 317 236 -147 170 248 -381 -213 -785 8 131
3826 131 -82 84 -749 43 -202 212 250 -102 -286 332 143 -255 -185 -413 -110 33 747 -222 -550 33 272
3847 272 198 -63 -230 -663 -539 -55 -277 -328 -924 192 -13 -148 213 46 177 -830 -316 209 -300 261
3867 261 -197 -173 227 200 44 9 383 -431 -626 -351 320 155 -57 356 -136 -290 666 -42 -702 -241 3
3888 3 -18 -141 680 -574 374 -759 48 141 -86 -250 597 81 445 -204 387 -190 290 438 -220 127 572
3909 572 6 45 -257 414 -281 705 -185 -55 -209 -496 307 -558 73 138 184 -557 719 171 107 -650 -132
3930 -132 -11 320 -29 265 -252 -208 325 399 347 -279 290 -168 29 50 8 -196 -183 448 135 -519 428 71
3952 71 -408 1 -4 253 14 272 -268 229 -563 -361 -171 53 309 -249 -130 371 -437 1043 130 -161 -311
3973 -311 240 -485 -935 -205 185 775 -568 170 -176 -440 134 202 142 411 435 369 -81 -236 181 -201 -414
3994 -414 -388 124 215 181 -69 71 104 216 -31 -968 67 483 63 -142 69 266 -462 109 -292 290 -98
4015 -98 -187 1 -412 -8 318 179 44 101 882 598 328 -528 804 453 -146 228 -284 108 -68 7 516
4036 516 -163 -78 449 -448 -442 447 -64 340 216 -214 -99 629 40 -17 -212 -28 -74 86 -12 -230 318 291
4058 291 469 255 314 -559 650 -256 331 845 33 663 -936 -433 -164 -332 -435 -584 356 -527 301 66
4078 66 332 452 -40 -362 435 -822 459 -49 518 -284 -163 180 629 505 474 520 289 289 -385 25 566
4099 566 288 8 265 -130 738 -76 115 465 -159 -151 -289 -268 349 496 198 -357 -175 80 306 301 259 274
4121 274 -312 -415 -151 -149 328 -756 -425 259 42 802 45 -335 -100 277 -612 124 531 -134 -829 124
4141 124 -147 -148 187 -598 -274 -44 350 20 486 -105 -139 452 70 -425 -360 -233 -300 472 203 -61 222 -437
4163 -437 -354 217 64 -375 149 -25 -151 -94 -335 66 -528 373 -97 -509 70 -131 -44 -184 -4 -314 281
4184 281 -299 -770 -190 -376 -310 -103 82 -602 138 -84 -369 -83 -361 312 184 -523 -110 26 241 -297
4204 -297 105 43 -198 448 60 -231 -269 -461 -237 32 -472 607 -281 307 -313 -343 -231 -30 131 411 13
4225 13 -141 -837 -28 108 351 24 258 -534 -50 481 -362 590 -505 -246 21 336 51 272 232 527
4245 527 416 139 -102 14 -638 -41 -114 368 -58 127 423 -284 -513 -312 -106 -582 -121 71 -120 41
4265 41 58 -112 290 -139 39 550 -246 185 90 361 -473 344 826 214 79 366 -500 -158 -138 74 -294
4286 -294 -439 -194 -15 256 533 123 238 195 -29 -82 116 259 37 257 -264 82 -357 105 527 82 374
4307 374 -220 295 175 199 -437 -37 -242 513 -70 93 -364 321 -169 732 273 -119 362 -128 197 223 305
4328 305 509 279 -684 259 277 134 -25 -10 394 -112 421 885 -403 -134 286 895 -49 144 -218 108
4348 108 -73 405 -527 160 468 21 -610 -564 -261 293 -212 401 -236 -83 -363 -46 180 -82 -609 322
4368 322 -213 -398 287 470 -325 -730 508 166 -301 99 -312 -63 -529 -508 238 -197 -344 -453 567 -361
4388 -361 93 -1 773 -323 -628 314 17 118 344 196 222 211 -451 712 452 161 -51 -307 -208 163 757
4409 757 -682 196 115 -258 614 29 419 -22 -236 -180 611 60 71 -408 354 196 -708 -129 -89 111 379
4430 379 72 -459 197 -57 -364 -243 -208 -690 49 -338 -159 -138 262 282 334 747 -351 -13 -83 -38 494 -505
4452 -505 479 383 -508 -46 -314 108 500 255 230 -197 -582 141 90 396 460 416 18 76 -71 194 700 133
4474 133 -401 3 158 98 -90 33 -68 155 191 -231 692 -155 255 123 356 -118 378 498 431 -285 -104
4495 -104 38 524 -79 -540 -389 -704 -310 293 202 -208 768 251 -216 331 -786 -545 195 258 -1 385
4515 385 692 582 -102 302 -615 52 -194 -299 467 155 -333 -269 518 539 461 -297 -222 -164 282 -32 958 -76
4537 -76 -110 -371 51 57 379 -24 -264 602 -56 85 -247 40 616 136 -260 408 149 -360 -547 357 239
4558 239 241 638 -147 304 256 -91 -80 70 152 248 45 -648 788 353 429 711 -199 162 -186 -294 50 162
4580 162 186 115 338 -313 81 356 310 -165 484 359 -339 -329 344 -447 -205 636 490 -38 212 423 276
4601 276 664 92 380 754 38 -457 -621 -214 303 20 -257 553 286 257 -633 -519 471 127 144 87 -238
4622 -238 -254 447 -91 -257 345 -236 -547 -186 465 215 -91 532 -480 -1 -120 -160 77 127 -181 -10 -389
4643 -389 52 -121 46 -5 850 594 81 -480 327 605 41 192 95 164 -372 19 -365 524 -172 -303 152
4664 152 104 149 -505 931 90 22 -146 -287 -411 -460 -256 195 -59 -247 -513 -65 -39 54 305 76 -186 -32
4686 -32 -154 343 -1160 150 103 281 86 54 275 -274 39 693 -18 4 -216 -143 6 164 310 411 -172
4707 -172 50 17 151 249 141 701 314 -286 -234 112 42 366 -83 87 -114 -223 -271 453 -38 164 -610 144
4729 144 371 -346 -408 -271 -163 201 -225 86 -268 764 -45 -235 606 -474 -77 -53 -307 20 183 -246
4749 -246 769 -8 226 -44 143 -369 248 -410 29 -202 -248 -101 -216 364 463 438 16 -163 31 517 442
4770 442 19 432 -339 -272 249 2 32 -46 0 293 -111 15 224 35 625 432 -332 83 -37 -255 719
4791 719 -112 472 -96 -170 232 502 37 -257 667 323 -415 53 719 -37 251 -86 -288 226 598 627 -202
4812 -202 -276 -206 -388 87 -102 775 -213 -14 461 -46 634 94 414 -241 242 -27 140 -244 38 -113 511
4833 511 -463 162 -24 -142 254 -214 -122 -691 -420 -210 91 -997 264 18 182 -265 -255 201 -128 -294
4853 -294 734 28 53 534 -111 -596 -162 -201 -243 -234 -111 135 639 0 -810 -296 38 285 395 191 300
4874 300 252 -440 196 211 -242 35 157 -345 257 -275 593 -158 -115 -405 -319 -264 -40 -680 -12 -72 96 -280
4896 -280 84 30 -113 471 655 24 -136 317 199 38 193 -137 251 272 -380 -29 586 22 -250 -123 -378
4917 -378 68 -533 -367 491 -562 297 -115 -423 335 -12 362 315 89 236 120 -1115 -24 -442 -194
4936 -194 384 -454 543 -271 23 -211 -354 -104 322 -218 -202 308 -212 241 99 139 169 -593 111 63 -10 -56
4958 -56 378 -1023 532 412 -7 63 112 -328 514 -71 -296 -34 -816 315 -621 -20 427 -854 138 423
4978 423 182 166 529 64 225 -442 432 520 -119 -189 -34 -256 426 670 27 -194 -780 -10 -60 143 130 605
5000 605 -52 -312 723 -195 234 -340 398 380 -627 -101 88 297 166 -574 311 248 370 234 -218 75
5020 75 -221 -122 -243 -335 516 188 -346 -9 -646 39 -34 -368 -168 409 -249 275 174 -94 431 -710 -403
5041 -403 -114 9 -216 -552 -373 -324 182 -54 586 449 117 198 159 -175 139 548 -376 -305 907 195 250
5062 250 -46 -814 -70 -217 16 0 318 536 -186 -40 243 -363 -49 260 804 -6 -372 -919 -237 -32
5082 -32 364 -723 116 -135 -4 226 133 312 409 370 -106 -262 -160 41 273 -130 -88 -339 -170 443 32
5103 32 -48 37 433 314 -92 -73 246 -126 -322 26 331 -612 226 75 311 353 132 580 88 583 341 -167
5125 -167 -294 247 56 -30 -519 74 -122 -43 198 -345 -267 -650 -574 167 -208 231 -827 -328 268 -288 175
5146 175 -463 -483 -661 -54 35 325 271 -219 297 328 -702 414 550 607 199 499 152 127 492 357 -989
5167 -989 318 243 -198 109 -223 261 220 -56 -315 -829 -105 20 344 -126 -195 -64 -444 -80 110 -202 -731
5188 -731 147 750 -413 -607 -348 75 292 -74 43 70 33 654 163 165 -301 432 -72 -221 -4 -352 351
5209 351 -139 53 471 -415 -260 262 -387 -48 -68 216 340 374 308 -119 -293 531 -586 -81 -713 676
5229 676 -103 -312 -489 -126 465 770 406 -115 -120 -195 205 -82 -81 108 115 -261 66 -749 -66 30 197 -312 -604
5252 -604 -33 94 -52 428 395 -169 -42 573 281 -830 254 107 27 408 -295 318 -460 71 111 -308
5272 -308 -350 -10 -127 -200 -40 409 -397 35 -203 -647 558 -76 -345 88 372 -152 623 -327 -251 20 -295
5293 -295 -186 919 -184 -165 203 -58 457 -271 55 -57 -18 152 281 152 -154 424 -60 165 345 -184
5313 -184 830 220 319 -523 176 354 278 -241 -292 572 -117 265 -314 -125 -397 89 139 562 -208 530 -243
5334 -243 138 322 230 391 -1054 70 -574 -608 -378 -56 369 -725 -283 -139 -111 631 107 -28 -544 768
5354 768 -330 53 -106 -158 582 150 223 556 574 399 236 -329 347 291 238 -321 -359 530 -233 652 -527
5375 -527 -293 534 146 422 -145 412 -676 347 147 -326 -288 -175 -33 82 -312 -81 244 -58 -34 -115
5395 -115 -155 52 564 532 -344 95 -179 -656 59 45 -273 441 -81 140 321 418 -94 21 482 215 18
5416 18 -271 561 -169 -84 -434 542 565 -82 -136 246 -291 -210 9 -258 181 -592 -44 -650 164 -108 -431 -214
5438 -214 -719 166 -47 186 65 -115 58 -22 -708 -214 -24 -560 806 311 -366 272 -69 -117 187 -700
5458 -700 278 96 297 -440 553 -277 -450 -187 43 1 17 540 -476 -277 -139 -151 444 410 -198 -293 239
5479 239 347 292 337 -966 27 -575 -90 28 -341 -363 152 339 91 -117 162 -452 755 -432 -35 777
5499 777 713 -179 -298 -184 -610 -508 -173 65 327 -344 465 -113 252 -12 35 212 -338 478 -555 198
5519 198 -189 513 -270 175 -59 -224 471 307 516 -253 46 -186 -127 220 515 -207 -184 164 142 449 -274
5540 -274 209 380 -29 -114 344 295 97 -157 -26 -233 -446 -665 -81 -648 140 151 -471 494 -98 274 -251
5561 -251 -107 -70 -962 67 773 24 -506 301 58 173 24 -329 414 -734 453 -110 497 113 594
5580 594 -231 -36 -8 363 521 450 -262 -484 535 -537 216 -234 -262 491 -129 -120 353 -218 -186 -314 1019
5601 1019 565 242 -143 34 -155 185 -27 -135 -547 158 -325 742 -232 153 -108 -213 431 -90 -292
5620 -292 -246 80 170 553 -76 221 261 498 -418 -341 -88 -239 414 -643 382 -496 -126 808 -347 171
5640 171 -126 -420 -299 81 -123 -291 -76 -998 295 -444 344 -232 230 746 72 -292 168 -473 -118 -66
5660 -66 293 116 -52 79 268 -63 -586 786 6 413 -36 -57 -149 -213 105 -188 -104 -55 729 61 93 280
5682 280 -492 -55 154 587 250 -133 -132 -561 -341 -40 -324 258 39 551 70 97 -155 -104 730 -40 -126 409
5704 409 -97 411 725 189 346 -375 603 -268 136 -312 -347 288 146 344 -262 -288 -14 -166 621 290 -909
5725 -909 278 -98 -444 20 86 -281 330 -592 -6 -190 -663 -168 -340 -369 -315 196 553 -50 -154 515 107
5746 107 560 7 -302 488 -181 46 195 -65 -404 -158 -427 7 -294 -78 -217 -217 37 408 -31 -432 -428
5767 -428 -380 40 533 -134 251 312 -66 -596 -70 27 -594 194 564 -39 -153 -100 849 601 -13 708 402
5788 402 212 67 -294 -773 543 186 -380 -359 277 392 246 -533 8 -460 -595 -42 -463 272 -193 989
5808 989 -193 -3 -701 -267 -657 -264 93 -11 -591 -201 745 -462 -872 73 -196 -26 380 -52 852
5827 852 -863 747 -280 18 -213 -31 102 -261 -126 182 94 126 211 62 -69 -80 -219 -308 10 459 824
5848 824 -23 148 449 -218 448 449 142 -192 -79 243 178 320 62 662 261 -306 444 -173 421 76 -201
5869 -201 -108 -373 -345 -46 -280 -35 -96 -67 247 -129 113 93 -201 414 183 -559 659 290 258 -640 193 -371
5891 -371 201 185 -272 454 319 488 128 3 -319 39 500 -353 327 -326 55 12 396 119 76 107 58 267
5913 267 175 -258 -112 -673 -503 -532 -262 414 83 -216 -230 209 -181 283 -373 127 193 -166 -75 -31 -124 385
5935 385 447 97 -265 344 484 206 -274 546 32 -183 162 725 181 -334 -739 118 -1 -236 0 -405
5955 -405 227 -27 -121 -489 553 -206 114 132 -772 -61 283 -246 233 -407 220 -97 -361 -145 41 -549
5975 -549 -593 -524 -297 -577 389 -11 763 -177 608 -341 528 -391 -184 -771 -523 -110 398 -216 228 -273 298
5996 298 68 -154 405 290 -310 -435 174 -168 -349 -187 -100 -458 -283 -50 -15 9 30 142 334 223 -345
6017 -345 266 -94 687 490 179 -69 335 -164 672 -529 78 -15 -241 49 -23 -310 78 43 117 54 150 -229
6039 -229 -606 -163 31 206 -290 258 -346 -162 148 707 -476 -348 169 138 -324 327 -258 -336 -89 -4 -67
6060 -67 -301 -53 212 -331 383 334 -450 -7 -523 557 75 -149 -649 -117 351 501 98 -42 -279 -179
6080 -179 178 -184 281 -205 -40 269 95 308 369 -510 559 932 460 -332 -13 249 -418 -335 -156 -353
6100 -353 136 196 294 201 -95 538 -292 -440 342 557 -144 423 -64 -504 179 288 868 297 49 -729 -67
6121 -67 326 -48 353 808 193 112 -273 -515 3 443 -507 -407 -90 -204 647 367 170 -36 -217 71 327
6142 327 -446 -525 -553 542 -144 333 408 104 -715 -387 -57 286 21 224 95 11 -114 -237 360 -157 -164 34
6164 34 -239 455 656 99 101 -88 -734 -119 -13 528 149 -274 499 318 692 -170 76 77 -520 -373 382 7
6186 7 -738 10 -148 -223 65 -246 -432 24 234 94 427 -275 623 -102 -658 -272 271 100 177 -396 -111
6207 -111 60 -613 330 245 -503 -6 31 -104 -186 256 139 235 233 -322 -331 385 593 -367 59 -659 -242 153 -268
6230 -268 168 562 219 176 -195 255 68 37 -22 -288 132 132 -129 440 302 -596 -115 532 814 -558 -312
6251 -312 -318 132 -496 186 293 121 -138 -498 6 -380 25 -237 -296 655 -90 228 494 -529 417 -305 -259
6272 -259 -182 122 96 -597 -586 4 393 -101 -222 182 150 -169 -248 353 -150 -17 820 378 311 -74 -289 -12
6294 -12 -238 -622 317 600 513 440 -797 -342 767 695 67 -216 191 -803 -3 185 -411 15 522 -98 -320
6315 -320 516 513 -243 661 436 569 -133 -362 -595 -332 132 61 -180 -296 -298 231 378 -222 -761 332 -248
6336 -248 58 -249 154 -206 -28 143 238 34 215 -252 -213 -84 -18 -345 395 92 96 -20 5 214 74 -510
6358 -510 -245 93 6 105 -78 87 135 398 -174 -540 6 503 271 153 462 441 92 -280 -459 420 655
6379 655 409 36 32 139 -196 325 478 -483 681 99 322 -304 -403 -390 -226 -214 -571 -142 -335 352 318 266
6401 266 -139 -505 -365 22 -57 -165 417 120 141 148 265 -180 761 -242 440 -47 176 -201 68 -525 184
6422 184 19 607 142 -17 -38 -63 460 229 -180 -717 392 -220 -132 -372 -171 -547 490 -405 201 272 482
6443 482 -365 358 207 -155 -349 -345 -861 -420 993 -489 -234 -157 83 604 125 269 -373 18 2 -357 -204
6464 -204 373 558 -473 -34 144 441 195 455 454 -401 111 826 245 -725 23 93 447 -134 245 13 525
6485 525 -580 -533 643 129 -143 -230 -61 300 244 112 247 -218 -145 -575 -633 139 74 523 -292 -588 -78
6506 -78 41 50 -95 264 326 262 10 -178 202 325 -531 -369 -215 118 61 31 309 -387 169 -181 -586 -928
6528 -928 -96 590 -924 -152 285 16 -380 -53 -551 230 432 -20 -39 310 -470 96 264 -331 -448 -1016
6548 -1016 716 -226 -184 330 -59 -587 -177 770 -242 347 222 106 248 184 -23 466 -277 25 -167 266
6568 266 371 524 -150 -50 111 359 -254 -113 -415 560 -88 -493 580 -890 -49 461 140 345 -246
6587 -246 -250 532 233 -555 -194 56 -19 -72 968 354 -226 326 272 -455 -408 1109 111 367 -141 -68 -71 -318
6609 -318 374 358 -58 -77 88 -102 -54 -123 638 -74 184 154 -202 267 767 470 -8 213 -313 563 190 -230
6631 -230 -32 -237 770 200 148 -331 -8 -287 -376 93 261 118 292 -771 28 375 276 -35 -4 45 -204
6652 -204 212 74 -444 -125 -92 -47 -425 213 -270 -26 473 80 -153 -755 789 241 566 -426 258 216 96
6673 96 -34 124 187 173 -34 32 66 -68 -369 -196 626 92 -91 -121 647 -150 -129 -391 -451 -494 132 38 18 570
6697 570 -320 -175 -471 238 778 32 11 744 94 -133 -47 604 -110 -239 -471 611 107 507 -298 42
6717 42 -62 -59 61 -150 -133 -447 -448 12 456 -482 28 -422 -639 -256 -39 -121 -466 -552 -753 -309 -135 589 -64
6740 -64 -177 416 -123 -565 167 44 -851 -170 187 -306 448 -49 -939 17 473 -256 -243 -43 367 169 -543
6761 -543 375 -28 -184 275 -117 -248 -263 -7 -114 559 255 -137 665 826 -79 -56 -300 -55 241 -330 -901
6782 -901 149 337 556 -296 -165 -382 -555 -227 267 -151 -245 -411 64 -344 591 -154 -59 -214 62 48 -187
6803 -187 -284 -411 -364 518 492 98 35 -590 -331 -241 -386 225 -56 -319 -90 -175 -142 -505 -184 -514 466 243
6825 243 483 -135 -26 345 321 439 -468 -68 -364 -997 -54 -180 -81 86 -213 -158 386 -45 256 119 143
6846 143 156 28 -134 -42 635 395 95 285 261 291 -162 -183 -339 -137 -311 -213 -92 390 -66 -237 130 -234
6868 -234 -168 158 -194 -123 -297 180 46 -582 487 -116 -157 -422 663 330 -710 -341 -79 196 264 -119
6888 -119 140 -540 596 386 -520 657 163 77 -964 177 -303 -72 227 -323 34 414 431 -617 553
6907 553 -250 -410 5 126 -898 189 -262 62 -469 -223 -289 65 217 326 778 168 -12 710 143 213
6927 213 -4 -294 250 125 7 -98 -265 523 229 -422 410 -461 608 193 -295 -202 165 382 144 536
6947 536 667 339 283 454 723 -628 100 496 -502 -257 262 -372 472 594 -585 -644 598 388 -143 638
6967 638 -412 -145 231 -161 195 -405 -117 446 404 -152 140 10 -52 500 -301 102 -586 179 269 140 142
6988 142 216 725 -318 -60 -322 58 284 13 321 -189 -985 137 -348 -240 113 923 199 407 685 -267
7008 -267 257 -240 -380 -823 -169 -29 337 -207 -171 -206 465 171 22 288 -635 144 -699 -354 -135 103 121
7029 121 219 534 677 -181 5 363 -104 -80 64 -412 -444 -230 147 750 -532 153 321 -205 -166 435 108
7050 108 -263 114 0 -259 -427 -443 200 -12 177 474 -293 -57 691 259 -21 708 166 -354 957 -311
7070 -311 -513 680 64 993 -319 -785 97 -64 80 -400 -273 -394 118 -140 54 -332 732 -434 -436
7089 -436 -411 -684 -39 425 298 -13 238 355 122 -275 326 -536 -28 312 -71 -193 107 395 423 -57 -223
7110 -223 -342 214 213 -457 -549 -357 158 -275 -223 220 373 170 -315 270 483 228 231 450 -201 110 318 -433
7132 -433 550 177 307 533 389 59 240 1 -359 155 -61 -374 215 -82 215 393 318 92 50 682 -530
7153 -530 -80 251 -69 141 72 313 -95 436 398 411 353 540 -69 -343 310 -146 198 323 -305 213 368
7174 368 -361 428 -468 342 198 -590 -102 208 -5 411 -205 -164 -189 -443 -279 192 566 575 395 12 200
7195 200 -390 -87 -353 -241 65 -447 -144 40 -575 508 -85 -295 361 338 573 289 284 94 131 -111 -481
7216 -481 -258 79 -368 342 689 185 363 230 361 29 104 108 456 35 -647 82 165 -699 -384 -46 -277
7237 -277 -143 -197 -472 -211 -785 -619 413 -192 -95 -352 242 163 98 -221 -370 165 -224 -203 -129 407 855 196
7259 196 337 680 200 99 203 -43 534 237 -166 143 487 349 -464 406 -275 -68 -215 -199 -3 -88 272
7280 272 -162 -50 43 218 -414 -184 153 -62 423 113 -36 413 -349 -714 -242 124 -933 311 -178 696
7300 696 -47 347 -296 351 -296 -204 263 -41 469 296 177 6 -278 -547 -275 -61 419 171 -266 -43
7320 -43 -257 181 -521 -382 362 -128 37 -18 134 -104 42 -60 85 409 -115 -114 -90 405 -333 -553 358 -1044
7342 -1044 160 444 -248 -178 30 578 43 -258 -429 -260 15 -410 -795 -165 -252 -295 662 -404 275 203
7362 203 564 6 398 -70 -453 -277 179 -344 -255 -271 -354 -58 -295 273 667 107 295 -272 -105 430 -230
7383 -230 -267 43 -48 279 282 34 151 -305 579 -478 -598 -93 -487 74 -731 -907 370 743 -735 83
7403 83 -344 209 263 98 -637 -2 371 -50 832 -3 488 115 -40 -600 -508 -420 -123 -110 64 78 -537 413
7425 413 30 -432 883 -508 -93 38 202 -127 121 -502 14 -339 -297 480 238 759 -287 544 -315
7444 -315 -145 417 63 -90 452 61 -67 -275 -701 -363 -136 -96 23 -644 181 -167 -307 56 618 -5
7464 -5 83 -99 -54 168 -271 -333 368 -584 51 215 145 401 864 -151 -446 -87 158 271 -329 24 12 767
7486 767 100 412 165 -411 17 857 -456 572 719 -810 36 397 6 489 153 -404 -171 -593 -7
7505 -7 -626 78 246 -273 506 352 542 101 349 -180 80 -276 264 -242 -84 -436 72 331 -5 120 44
7526 44 191 35 459 -26 576 -312 435 -274 305 -66 -338 97 -258 -40 40 178 212 605 -46 195 188 138
7548 138 -124 -60 3 -258 -540 -120 848 102 317 -304 -21 -401 288 -137 -454 81 -37 443 -13 9 -431
7569 -431 -891 -72 270 -219 34 -402 -380 667 -681 138 177 435 159 -766 -266 -88 142 245 109 388
7589 388 263 479 204 555 107 327 -105 -300 86 38 206 171 -279 -408 28 -467 -607 71 -605 131 22
7610 22 292 -318 -933 247 -250 643 857 40 11 418 412 -670 314 30 -669 -467 -253 89 900 148 -53
7631 -53 26 423 596 -584 -115 -436 85 -74 104 76 326 -426 -169 168 198 -554 647 -350 54 -87 268
7652 268 29 -569 -260 -206 -202 543 -329 -56 -460 158 -6 304 -102 215 -136 172 -386 -418 -579 -362 -89
7673 -89 343 -286 389 56 -233 206 -262 51 208 267 396 367 301 -269 -259 -369 -396 -584 -102 -10 -627 -70
7695 -70 471 63 -30 241 -39 -118 213 -856 -404 413 -669 -64 -130 117 452 -151 10 -313 -448 -226 -59
7716 -59 181 -765 -346 -581 632 255 436 -475 23 427 274 369 -86 154 -311 222 314 544 313 311 461
7737 461 543 -460 344 -553 -461 -546 -331 -446 -610 136 -142 168 113 -83 -759 -18 787 -35 -756 103 19
7758 19 -129 714 164 222 97 -538 -375 886 437 897 -48 -107 -84 -115 -227 -433 -59 -185 6 -444 886
7779 886 -80 191 350 383 -185 -300 111 557 -321 -87 189 44 21 -630 -43 480 -44 -139 414 -509 -368
7800 -368 -83 675 -322 53 -271 391 22 355 -267 -383 424 -733 48 -26 203 467 -166 -277 -159 -504
7820 -504 -112 145 451 365 127 243 220 -194 -258 91 361 251 -400 543 -630 -430 -149 111 441 -37 4
7841 4 -546 -193 35 -154 -116 -41 38 -201 -41 -567 -129 117 -90 382 96 575 -738 116 -353 -348 294 302 -499
7864 -499 -403 27 11 11 -591 -894 0 -239 -744 -389 71 265 -122 168 -519 254 201 -66 -401 -670 74 -43
7886 -43 424 -210 483 -721 515 -940 -473 -45 -720 36 -166 759 12 -842 280 434 32 7 11 -91
7906 -91 263 -463 -7 741 160 251 349 205 -140 -181 -442 899 271 -398 -454 547 251 218 -198 -113 309 -273
7928 -273 -94 577 -44 -526 239 163 90 -98 -910 -159 -527 42 127 321 -273 -200 -53 363 -168 -600 -521 342
7950 342 58 -43 -554 213 -154 407 -404 -14 -350 451 -468 351 279 187 -629 -490 -263 87 202 243 233
7971 233 -30 48 -496 68 -251 -17 -774 473 -84 101 242 -739 -326 311 214 543 -506 -30 -186 -523
7991 -523 371 -164 64 -527 -100 -385 -400 -789 325 578 65 -155 323 -529 -161 672 33 -270 -207 131
8011 131 -193 220 -17 394 60 -290 -394 -604 -297 533 103 -194 -699 86 517 563 -912 697 15 -33
8031 -33 234 -327 497 329 399 -170 -685 -167 336 -466 0 -18 -80 93 -145 132 124 -526 -591 236 147 -165 82
8054 82 -148 -690 576 -8 358 -251 174 -521 357 161 -335 106 -383 -57 35 -487 490 -26 -44 -216 550
8075 550 218 383 -158 -29 29 204 -409 -20 287 -385 240 290 -252 296 457 -135 305 256 282 -334 275
8096 275 -17 951 -602 557 -243 -268 -182 -288 98 -53 -254 220 338 54 169 -331 -209 111 167 74 229
8117 229 -63 790 -378 636 554 279 -29 217 -140 -5 405 -107 149 -46 437 -142 -65 211 -221 162
8137 162 -269 51 -144 98 303 210 123 -102 -322 -244 98 -168 69 155 579 97 240 -49 72 -290 98
8158 98 -605 -163 -274 366 454 316 -48 117 119 -403 255 265 43 -328 450 340 -166 -473 -260 -579 -186 300
8180 300 602 10 -202 108 -79 377 125 278 167 410 -486
8191d86
$$ Imaginary data points
##PAGE= N=2
##DATA TABLE= (X++(I..I)), XYDATA
0 0 0 0 0 0 0 0 0 0 0 0 0 0 0 -64 64 -64 64 -128 128 -141 192 -256 256 -320 384 -448 512 -576 703 -769
30 -769 896 -1024 1156 -1323 1479 -1674 1876 -2110 2357 -2626 2929 -3250 3612 -3994 4421 -4882
46 -4882 5384 -5942 6545 -7212 7943 -8750 9650 -10645 11770 -13022 14467 -16112
58 -16112 18024 -20294 23008 -26356 30568 -36084 43644 -54704 72504 -105957 191331 -917139
70 -917139 -1423415 63776 532939 871999 1070472 1558863 1402065 578730 -609706 -1187399
80 -1187399 -1188086 -925144 -855838 -620826 2308 923151 1433238 1287421 735542 339242 63260
91 63260 -375478 -1051053 -1442791 -1206230 -528415 49168 407917 742886 1132568 1236979
101 1236979 823783 75509 -558519 -897390 -1023440 -1018635 -768120 -212410 475998 973449
111 973449 1109409 953463 654535 249743 -268880 -786098 -1055229 -950913 -605212 -233561
121 -233561 117073 507740 860792 946471 676649 246092 -113536 -392039 -679093 -896845
131 -896845 -832915 -438906 69073 450580 671735 807943 832292 612679 133916 -407181
141 -407181 -755095 -828092 -720964 -526942 -216921 235554 686775 890597 750635 423307
151 423307 106970 -180871 -506795 -789423 -821002 -531750 -111041 219118 432034 610080
161 610080 725349 632145 289502 -138092 -443533 -574273 -604127 -562614 -381490 -30074
171 -30074 372898 628779 649567 516194 329031 88635 -239020 -571336 -720667 -601840
181 -601840 -323328 -47740 191646 437245 637807 647528 412010 65173 -218240 -394686
191 -394686 -515255 -566290 -459635 -171975 175599 422298 511340 496715 418178 243256 -47223
202 -47223 -363313 -548157 -534025 -394832 -222662 -21699 235960 484422 576976 454014
212 454014 215666 -9746 -195485 -380599 -520363 -503421 -293644 -2540 228008 363071
222 363071 440590 460882 355393 106319 -188153 -388982 -443817 -406328 -321800 -168408 78266
233 78266 337812 474187 434084 291331 132655 -34226 -239418 -427358 -478455 -347945
243 -347945 -127272 66161 211912 340146 431090 396295 206808 -45193 -235435 -324656
253 -324656 -356825 -348344 -253855 -46859 195250 347544 366153 303427 217205 91953 -101186
264 -101186 -304033 -400704 -345905 -205237 -65403 67069 220945 359171 386678 265453
274 265453 71538 -92691 -202061 -288863 -345020 -303613 -138750 74810 228158 286967 290036
285 290036 264205 176146 1180 -197302 -312027 -305125 -231599 -147268 -40123 114121 272317
296 272317 336929 269180 137123 16603 -83654 -196007 -296441 -308002 -194970 -24106
306 -24106 110707 186272 237012 269726 233807 94059 -89765 -216888 -247638 -227869 -195344
317 -195344 -124802 13941 180474 275489 257578 173009 88740 4870 -108047 -229625 -281807
328 -281807 -220097 -91399 23551 101887 171149 234560 239992 149232 460 -122780 -180318
339 -180318 -199248 -202080 -164351 -58199 87019 193415 218437 186827 136823 68142 -36934
350 -36934 -156222 -227056 -211449 -136740 -51891 27476 114115 194655 220933 166881 61831 -36359
362 -36359 -106812 -161456 -197282 -180845 -98049 19950 114303 160017 172349 163248 115867 19767
374 19767 -94400 -169796 -179030 -146657 -100679 -37567 53116 147570 192921 165040 94422 23194
386 23194 -40091 -108826 -169747 -182035 -124332 -29164 51942 101448 136652 158332 141036 66219
398 66219 -36239 -113104 -139804 -137187 -120577 -80596 -1496 92630 152200 150625 109881 64431
410 64431 12256 -57140 -129818 -162459 -133304 -65540 -637 50934 99375 140329 144040 91715
422 91715 9548 -60088 -97273 -116539 -123850 -102816 -37861 46053 107269 122876 110529 88128
434 88128 50107 -15020 -88631 -132630 -124618 -84075 -39226 5924 59961 113196 133552 102626
446 102626 40522 -15638 -56781 -90016 -115802 -111470 -64504 7639 64903 91869 99453 97612
458 97612 74745 19292 -50110 -98370 -106438 -86917 -62620 -28873 24113 82392 114259 100243
470 100243 60579 18327 -18819 -59399 -98114 -109594 -78380 -22234 27093 58090 79919 94826
482 94826 86268 44765 -16579 -64104 -82602 -81163 -72625 -51122 -5200 51777 87853 89188 67086
495 67086 40712 10852 -30651 -75305 -96246 -80761 -41766 -3735 27730 57079 82228 86586
507 86586 58170 9661 -33081 -57511 -69671 -73573 -63039 -26496 24197 62657 73017 66486
519 66486 53367 31696 -6299 -51546 -78688 -74707 -51254 -25480 1401 34887 66786 79652
531 79652 62345 27471 -6528 -32341 -53648 -69390 -67399 -40293 839 36503 54773 59915
543 59915 59151 45643 13479 -28837 -58235 -63994 -53131 -38996 -19082 13469 48784 67670 59178
556 59178 37425 13452 -9370 -36531 -59101 -64866 -46927 -15596 13708 35095 49298 58097
568 58097 51776 27020 -8789 -37885 -50934 -50630 -45266 -31194 -2291 30816 53224 53684 41085
581 41085 25823 7169 -19719 -46499 -57642 -47230 -25794 -4733 15594 36483 51675 52092
593 52092 35022 7630 -17520 -34612 -42867 -47392 -39695 -17550 13608 37993 44892 40906 34603
606 34603 20701 -3884 -32628 -49650 -46142 -31043 -15312 773 22046 42057 48558 37043
618 37043 16604 -3880 -19652 -32869 -42411 -41001 -24142 -116 21305 33469 37147 35820 29340
631 29340 10150 -16661 -36163 -40441 -33824 -25744 -12354 7925 30559 42978 38837 24609 8730
644 8730 -7236 -23822 -37552 -40633 -29792 -10154 8359 22637 31983 35760 30832 16081 -4551
657 -4551 -22943 -30585 -31636 -28037 -19368 -2864 17640 31820 33018 26480 18363 6563 -10895 -28591
671 -28591 -35844 -30576 -18134 -4271 9175 23714 34055 34343 22719 4585 -11577 -22636 -28883
684 -28883 -30034 -25473 -9943 8975 24396 28155 26224 21999 12937 -2046 -20254 -30160 -29089 -20575
698 -20575 -10994 -1178 13378 25435 31194 25214 12578 -645 -11251 -21156 -28946 -27940 -18014 -2096
712 -2096 13250 22685 25399 24777 19459 6891 -10353 -24338 -26713 -22721 -16065 -8317 5194 19170
726 19170 26934 24554 15871 6491 -3893 -14511 -23485 -26669 -19244 -7641 3665 13065 20362 23738
740 23738 22001 12599 -2007 -14460 -20786 -20806 -20307 -14406 -2888 11643 21149 23044 18979 12297 3821
755 3821 -7933 -19052 -24324 -21054 -11748 -3157 6063 15361 21749 22738 15828 3766 -6694 -14524
769 -14524 -18378 -20482 -17785 -8211 4221 14347 18608 18267 15948 9649 -537 -12303 -19860 -20028
783 -20028 -15378 -9218 -753 8554 18159 21258 17619 8450 181 -7936 -15134 -18894 -19222 -12218 -1473
798 -1473 7684 14023 16540 17051 13329 5335 -6127 -14665 -17318 -16032 -13499 -6746 2916 12530 17905
813 17905 17310 12572 6154 -1083 -9278 -15907 -18522 -14266 -5890 1962 8853 13264 16787 15529 9209
828 9209 -927 -8904 -13377 -14658 -13823 -10703 -2549 7187 14113 15254 13113 9238 3002 -4253 -12212
843 -12212 -16082 -15165 -9540 -2871 3356 9801 14966 15269 11217 3376 -3303 -8828 -12960 -14437 -12926
858 -12926 -7087 2661 9177 13070 12828 11827 6772 195 -7528 -12902 -14031 -10952 -6408 -1903 5377
873 5377 12054 14383 11964 6804 1457 -4177 -9423 -13116 -13565 -9504 -2116 4619 9054 11432 12181 10434
889 10434 4256 -3456 -9254 -11699 -11804 -9032 -5533 1524 7753 11512 11651 9888 5492 55 -5298
904 -5298 -10873 -11805 -10254 -5219 1089 5541 9509 11509 10956 6550 986 -5491 -8581 -11007 -10324 -7596
920 -7596 -2220 4232 9292 11009 9860 7315 2558 -2121 -7897 -10296 -10017 -7386 -2892 1572 6469
935 6469 10105 10752 7623 3493 -1850 -5009 -8515 -10317 -9061 -4342 853 5665 8088 9952 7911
950 7911 5193 1718 -4924 -8416 -8821 -7751 -5849 -1220 3326 7534 9674 8489 5655 1607 -2450
965 -2450 -5976 -10043 -9196 -6008 -2164 2508 6256 7900 8559 6933 3433 -1056 -5197 -7320 -8738 -6803
981 -6803 -4103 823 4903 7714 8602 6981 3993 -6 -3210 -7256 -8182 -7891 -3965 -798 3245 6142
997 6142 7832 7519 5147 1486 -2804 -5563 -7142 -7222 -5257 -2224 2335 5305 7545 7102 5667 3408
1013 3408 -1485 -4959 -7096 -6752 -5184 -3073 487 4098 6162 6972 5909 3097 119 -3173 -5844
1028 -5844 -6514 -5954 -4084 135 2456 5136 6515 6118 4369 1017 -2396 -5129 -5845 -5804 -4408 -1303
1044 -1303 2205 4813 5962 6333 4223 1586 -1442 -3563 -6530 -5812 -3794 -2496 931 3859 5089
1059 5089 5864 4473 2106 -446 -2851 -5038 -5907 -5031 -3283 279 2542 4543 5541 5321 3386 1083
1075 1083 -1565 -4124 -5156 -5372 -3333 -1264 1161 4287 5315 5008 3561 1216 -1643 -3500 -4639
1090 -4639 -4995 -4323 -1246 769 3570 4353 5038 4485 2406 -560 -2670 -4657 -4894 -4185 -2815 494 2526
1107 2526 4543 4961 4711 2371 234 -2110 -3421 -3925 -4132 -2274 -678 1159 2763 4747 4495 3013
1123 3013 1063 -1130 -3342 -4319 -4151 -3768 -1630 1218 3158 3838 3698 3101 1193 279 -1931 -3691 -4514
1140 -4514 -3536 -1721 214 2426 3973 4429 2828 1980 410 -1756 -2697 -4039 -4361 -1720 -221 1278
1156 1278 2585 3775 3132 2492 767 -1711 -1890 -3978 -3342 -2321 -671 1014 2808 4088 3729 2454
1172 2454 847 -426 -1888 -3690 -3122 -2540 -742 197 1740 2756 3149 2670 2351 -344 -1851 -2618 -3530
1189 -3530 -2459 -1677 125 1710 2136 2896 2450 1340 1574 -1544 -2385 -3060 -2744 -2176 -578 489 2462
1206 2462 2902 3396 2450 1178 106 -1698 -2911 -2978 -2476 -1082 714 1763 2278 2750 2504 1281 -232
1223 -232 -1244 -2387 -2343 -3103 -2031 -551 846 2243 2329 2308 1489 102 -1027 -1934 -2821 -2501 -1396 -169
1241 -169 813 1674 2189 2971 1665 245 -668 -2094 -2937 -1836 -1530 -334 297 1736 2555 2052 1843 734
1259 734 -805 -1534 -2168 -2432 -2391 -1226 231 456 2506 2428 2137 1667 -41 -1348 -1506 -1859 -2645 -1131
1277 -1131 303 236 1597 1627 1482 1425 320 -1714 -1167 -1654 -1467 -1729 -562 658 1498 2244 1569 1642 861
1296 861 -518 -1345 -1669 -1517 -1420 -774 758 1003 1497 1533 1705 1507 547 -1080 -1629 -1485 -1045 -1067 -429 897
1316 897 850 2574 1461 1058 24 -294 -1003 -1489 -1217 -1178 -116 349 1119 1740 1883 1106 142 -647 -970
1335 -970 -1175 -1362 -1562 -1180 56 1441 1591 1634 922 1406 -657 -713 -1441 -1213 -689 -1101 73 741 480
1354 480 2226 874 803 -13 -235 -1152 -1332 -1635 -1299 -524 660 857 1297 1391 1250 455 -951 -929 -1145 -996
1374 -996 -307 -601 -25 565 1832 1234 676 626 616 -560 -1030 -2019 -395 -210 -39 820 1344 966 1015 318
1394 318 36 -980 -1054 -987 -708 -783 -304 410 948 1181 853 1053 78 -205 -880 -2055 -161 -426 -297 429
1414 429 470 998 1066 398 -8 -14 -1068 -229 -44 -368 -439 -21 50 765 785 797 273 -544 -622 -1634 -75 -643
1436 -643 -514 325 256 1208 806 724 216 -353 -1019 -1364 -730 -1283 -1219 51 105 1058 629 602 627 -409 -573
1457 -573 -779 -959 -976 -501 -130 -334 955 688 800 654 451 240 -1444 -1000 -361 -306 -70 478 722 1020
1477 1020 1027 890 411 -732 -398 -739 -746 -621 -227 57 107 380 606 171 366 12 -476 -603 -888 -312 -457
1498 -457 -73 -51 617 454 1181 765 404 -623 -416 -480 -177 -148 -113 792 423 542 1088 1001 684 -69 -579
1519 -579 -630 -872 -651 -337 -479 -9 729 715 190 167 245 -170 -249 -878 -665 111 -373 1050 471 9 421
1540 421 184 331 -188 566 -1117 -158 -26 313 -306 458 180 402 -129 432 68 -1112 -465 -1421 -130
1559 -130 802 664 360 426 544 736 705 -44 -711 -96 -1506 -572 131 226 652 671 876 -22 -106 -467 -711
1580 -711 -565 -173 -415 -230 -660 316 -1 571 956 -260 214 51 -576 -596 -41 616 134 -207 871 24
1600 24 685 -9 676 401 -19 -118 -751 -340 254 233 58 177 448 311 368 638 -497 -601 -484 -485 -326 -417
1622 -417 372 281 499 618 422 254 -447 -267 -505 -365 160 -446 -2 629 991 296 496 756 142 -326
1642 -326 -900 -290 -32 55 -563 432 -6 1017 216 -327 -116 -259 218 -668 -400 -718 -286 -82 281 614
1662 614 47 63 -286 -216 -653 -115 -720 -136 316 -343 719 121 194 101 -146 -302 -191 -975 -795 556 -363
1683 -363 -196 11 65 118 108 492 -210 -516 -1050 100 -38 -383 -266 -63 607 520 744 -77 638 190 -224
1704 -224 -1460 -692 161 235 -39 165 117 132 -99 297 -72 -63 -298 -104 230 565 -358 668 383 -162 -50
1725 -50 461 274 318 -44 92 33 -416 -813 113 331 670 627 624 -125 -149 -161 -161 -349 7 -214 -49 918 198
1748 198 212 -191 432 -887 -954 62 -210 -597 650 115 -105 349 704 992 15 233 -345 -201 189 -505
1768 -505 -453 -194 -273 -178 401 328 197 -121 -262 -842 333 -79 -406 -52 702 1 403 355 67 84 683 -283
1790 -283 256 -754 -253 -179 -390 -26 324 415 521 -12 -425 0 -637 -751 -431 -394 287 111 -82 518 365
1811 365 -596 -54 183 -633 -637 -818 -155 647 462 30 96 743 -146 -21 -289 -179 -59 -86 -191 42 -188
1832 -188 156 335 755 -982 174 -206 329 -317 291 -140 -340 -471 106 -412 258 305 -685 96 24 82
1852 82 271 90 -324 346 219 -432 -30 -124 169 -20 -230 -444 -161 -194 -299 -700 155 395 -629 180 132
1873 132 -505 -496 21 596 62 -280 5 560 -616 -382 406 749 -183 -243 489 -15 -108 -253 -410 -123 -529
1894 -529 367 440 -293 -546 -389 -163 -73 94 -359 395 783 648 679 404 307 -393 -294 327 81 -358 131 -746
1916 -746 -108 96 -700 -212 -276 110 294 -12 -323 150 150 -373 41 24 126 469 -142 -28 843 -177 -716
1937 -716 -57 65 -67 24 -284 -228 115 789 248 322 8 154 672 690 119 -188 270 551 74 -153 455
1958 455 809 -108 -258 -554 -100 -2 -61 -297 -43 -225 -43 264 -298 788 40 -129 286 -542 -352 -500
1978 -500 -390 266 -41 241 221 595 313 -535 -320 751 149 -97 158 474 92 103 45 128 -231 -460 -30
1999 -30 -418 -66 457 -48 289 -562 -173 399 171 -592 134 -216 253 -332 -217 -85 -416 164 -263 43
2019 43 -510 325 197 621 -590 88 146 -88 -97 -314 463 26 -97 77 -508 253 56 -546 483 -198 -621
2040 -621 489 -254 -190 -219 148 829 199 -241 -197 -667 407 311 -90 858 -139 36 -312 329 433 -115 -300
2061 -300 -1253 507 36 4 -431 -172 66 450 100 322 127 87 349 -229 167 -343 -637 -487 -348 786
2081 786 705 -671 -85 -10 -314 -34 -514 -55 -210 212 -243 420 -460 319 -397 -269 360 -633 -51 41 -390
2102 -390 -13 446 482 -237 -264 -642 -222 1144 -151 255 -258 -285 -609 336 182 91 430 297 613 250 -323
2123 -323 332 -236 -143 -400 -142 -401 265 -323 501 -616 -366 -613 -437 -422 -166 281 -40 39 -236 -32 -344
2144 -344 559 168 -254 14 4 603 16 -76 570 -154 -97 344 -156 238 389 -479 787 -571 -194 -138 -238
2165 -238 -533 42 19 83 235 -279 347 186 361 -577 195 639 263 -481 586 109 -203 -374 -312 206 5
2186 5 43 401 -223 -149 446 184 235 -323 -426 436 82 -391 -72 485 38 414 75 -118 367 -256 202 193
2208 193 -120 581 499 307 -569 -228 311 53 62 -85 467 -190 286 -53 -129 -61 350 636 -19 -595 275 -146
2230 -146 318 31 367 -685 554 58 297 186 271 400 469 80 -140 34 -104 481 -378 238 -29 -607
2250 -607 141 -720 -657 -644 560 588 -745 -31 -74 130 137 98 528 529 -11 -30 485 29 448 291 543 -648
2272 -648 252 491 -488 578 214 275 84 -426 -298 -410 -362 -189 -591 147 99 -310 424 143 179 364 -182
2293 -182 52 433 334 -123 176 394 -468 -435 263 -249 -210 -246 -270 -147 -255 -97 -130 282 -91 72 191 928
2315 928 -105 -44 354 -179 -416 74 520 250 141 98 479 -334 13 47 -98 -134 73 -391 -627 -310 361
2336 361 -230 953 525 194 238 -167 -522 -130 -255 53 359 365 274 460 -494 294 -153 320 -19 141 181
2357 181 471 -437 170 236 -54 -166 615 389 -57 862 29 336 -127 163 268 398 133 -439 -712 -212
2377 -212 67 596 -98 248 210 -101 457 873 481 -58 474 -233 -307 -82 8 -364 -233 -286 -121 -38 341 762
2399 762 36 548 -809 451 -159 -33 -7 612 331 -128 -200 325 84 -323 303 231 1129 343 -196 589
2419 589 30 766 48 265 415 347 -362 206 364 -518 -301 -449 218 -458 -17 -353 495 543 236 512 -307
2440 -307 502 -598 613 -511 -454 -315 291 46 -49 364 -283 -357 -133 -261 326 -112 -406 367 -83 125
2460 125 269 -276 -114 88 34 -390 -409 256 475 -110 -208 -67 -522 -223 -44 305 -96 -247 -197 -116 -63 -550
2482 -550 572 65 67 178 91 -477 -28 176 -312 -368 41 523 19 -63 337 -562 -264 90 -167 71 -329
2503 -329 -347 242 640 -319 -76 -570 445 -628 -489 242 141 -32 479 -392 -96 -61 163 -252 -135 178
2523 178 -597 485 73 96 -356 209 -243 855 190 -112 -237 190 -210 562 29 -468 94 -52 -111 -236
2543 -236 -376 475 -173 -102 186 -28 228 -47 -264 292 -129 -136 -157 -181 -264 -1 -833 -280 216 -14 -658 -877
2565 -877 -322 333 355 538 -284 122 -219 387 378 -580 -347 -233 732 -240 398 -283 -267 -251 -186 658 351 213
2587 213 378 -123 -56 -68 -822 -307 274 -567 529 153 -352 -125 -164 -50 -492 273 -48 -137 116 41 212
2608 212 -299 -505 347 -21 317 -329 -342 -536 -88 764 -81 280 -353 385 -297 406 372 250 -83 231 -366
2629 -366 -306 -48 -126 558 457 -145 -568 361 -191 245 -320 130 -511 286 -27 2 -20 260 -411 -382 -413 -70
2651 -70 88 -606 -91 229 152 -157 469 -258 -247 -3 238 451 -411 210 27 349 -117 120 -328 -555 473
2672 473 -75 490 -312 220 278 369 -162 -164 -181 -316 319 281 -471 -510 -136 -193 601 -139 154 47 451 81 -355
2695 -355 -236 780 -68 -818 -282 72 -146 -412 147 -296 -487 358 -43 38 -456 -453 -89 -572 122 120 306
2716 306 -475 -84 -135 121 -119 502 -173 780 127 -715 237 -757 -256 304 162 -954 372 -41 196 -102
2736 -102 -124 -134 -55 309 -679 356 -529 172 -244 -316 -613 9 11 -338 283 653 -5 113 531 -402 226 120
2758 120 -104 -825 511 355 -220 -40 -141 388 -38 23 -803 1144 -278 -242 -93 -203 -93 598 -27 -643
2778 -643 85 416 588 18 10 -193 106 250 355 -223 -183 -583 -223 408 155 -552 -386 22 -331 33 92
2799 92 18 -656 563 -436 -126 -81 -355 310 0 -475 372 252 -129 96 -117 -195 -479 -848 -3 -271 -179
2820 -179 142 264 -380 833 -534 1007 74 150 0 -338 -140 -137 -181 448 -218 120 722 -379 -48 -85
2840 -85 -103 -223 522 109 49 61 1 -275 378 -108 -171 421 281 -130 -486 -572 162 246 -218 666 -573 -412
2862 -412 25 188 -207 -489 -285 -66 -240 321 -49 -689 -92 -548 223 116 623 466 -5 -414 -185 -223
2882 -223 399 175 -519 352 98 54 835 -117 229 -343 -207 -2 -548 -670 259 18 425 -204 -440 -437 -459
2903 -459 -459 267 -533 -121 71 222 135 -295 -358 453 208 669 307 31 360 -126 129 -251 -248 -323 427 -164
2925 -164 288 -453 20 -408 12 526 185 213 -180 26 -86 391 681 -145 395 -72 210 216 441 296 -287
2946 -287 60 7 -21 158 222 177 -259 826 -71 106 -310 -562 25 307 282 276 -112 342 371 -333 -197 -443
2968 -443 405 587 316 -44 -499 -160 -126 -404 -156 -222 -368 46 257 22 292 -81 -442 -280 -319 -164 -823
2989 -823 -411 66 -10 -16 329 230 -241 388 -886 131 286 190 -441 360 489 202 215 -354 397 330 224 192
3011 192 321 -554 491 157 -563 -249 -272 -689 42 86 -386 -113 -34 -392 417 -622 679 -136 -558 376
3031 376 213 118 -135 275 168 -120 -202 79 288 67 211 -157 29 -322 179 -125 -363 246 877 -323
3051 -323 -77 -352 -411 -207 -567 -118 -60 276 152 37 556 -427 602 -555 745 523 -49 524 -685
3070 -685 78 -575 231 -201 138 -448 -211 44 -26 320 -400 124 -186 362 -72 -193 287 -361 124 -365
3090 -365 -679 -504 242 197 -171 -194 -383 32 -205 133 -98 -71 -139 -623 -644 -527 -148 705 -19 -362 -80 -416
3112 -416 230 29 -154 80 189 -431 627 565 -437 -224 193 111 -181 -45 271 463 -198 481 43 89
3132 89 -176 214 659 -252 471 681 -75 306 -32 -359 -406 -340 281 -418 -428 -344 87 -261 -119 -164 401 504
3154 504 116 -58 61 -718 -354 357 -324 358 170 107 -168 99 -16 473 372 848 705 -116 -396 427
3174 427 57 413 -290 343 -513 44 55 460 -193 -573 204 -24 58 1 600 -301 -74 27 -260 -138 -471
3195 -471 -252 10 98 -206 466 61 -139 -6 38 51 413 238 178 -294 559 1120 -499 469 258 450 -281
3216 -281 -359 104 196 -215 117 -370 234 254 154 -168 460 211 -441 297 190 -580 -185 -7 -353 340 -345
3237 -345 -80 87 -388 -47 461 -14 154 166 -77 -129 -195 474 -298 -301 -330 153 136 -49 -47 -688 408 -553 -9
3260 -9 -423 176 -154 -9 -206 396 146 1 141 530 349 199 30 40 111 365 -190 258 -193 152 25
3281 25 -350 -283 325 64 -613 190 381 -111 -149 252 -72 -198 -663 154 -561 -164 111 -536 34 372 -505
3302 -505 43 375 233 219 -401 -363 -410 -24 -136 130 830 130 -3 158 143 -159 -36 -458 -14 -195 -250 -322
3324 -322 -567 -150 -81 468 105 468 -451 87 -274 307 -31 242 -35 733 -739 191 173 359 421 -394 254
3345 254 41 95 358 -28 19 228 -30 536 691 -645 -162 -134 -300 -50 833 -171 -282 66 -153 412
3365 412 -405 368 -112 -300 322 -128 345 424 -82 -8 -59 517 -580 25 -49 -88 217 -268 -121 253 248 -250
3387 -250 228 1405 -39 -49 400 297 -131 85 -331 -89 -207 27 186 -100 170 -328 179 -113 451 -261
3407 -261 25 -286 321 -556 -291 413 691 -203 -303 -370 529 78 -225 294 20 -180 -141 60 286 -94 -472
3428 -472 463 -93 80 -556 38 -202 261 -146 -125 351 -92 -508 -111 29 290 5 2 -331 -786 -708 -31
3449 -31 -324 339 -320 -166 437 557 -245 -60 -225 26 -61 177 356 -292 114 126 -513 -427 74 -112 204
3470 204 -23 -106 76 546 15 420 37 43 -236 216 281 -94 164 -364 122 66 39 82 -365 -440 -342 -353 -287 34
3494 34 -36 374 10 -195 175 -52 -617 -431 -278 110 -342 20 652 -576 -20 509 -355 121 438 -211
3514 -211 -37 -235 -68 -655 -477 691 183 -407 -34 -305 367 -6 -609 425 -273 -23 252 -389 71
3533 71 -245 285 -731 -387 33 497 289 -141 2 -446 209 38 -133 573 -519 158 -51 97 205 26
3553 26 -232 456 85 233 -350 166 -65 -72 -263 547 -87 66 270 -578 -121 16 -239 564 -174 -116 255
3574 255 -72 232 -405 -218 -180 280 -614 567 59 -156 329 76 -289 -152 672 -95 -251 143 128 -68
3594 -68 200 191 356 472 421 -677 -214 -235 -222 -273 198 -575 273 -26 19 -368 -591 81 89 107 324 -350 254
3617 254 -33 718 620 64 -425 -193 351 3 64 -171 127 -361 49 -130 13 -216 -393 -120 302 -504 128
3638 128 404 33 323 7 180 344 15 -544 87 161 -637 490 -55 -346 -486 -314 -68 -575 485 455
3658 455 -422 -691 241 61 -96 -143 -306 137 37 -210 219 201 83 239 523 362 379 546 -560 192 -394
3679 -394 198 229 -197 399 420 -206 -496 -833 144 245 66 427 296 -172 739 -165 -428 -215 -528 -736 -680
3700 -680 246 -365 329 -314 -682 -49 117 -319 151 -193 -223 -144 821 -165 -38 22 -367 -47 578 -302 -483
3721 -483 248 70 -129 406 536 15 242 193 24 -484 30 40 -314 -274 -427 -501 -540 -225 -122 -635 -179 -540
3743 -540 129 410 -399 22 237 -473 -696 -277 -159 391 -293 -44 -153 -252 -542 -96 -88 157 -275 -217 271
3764 271 -312 -213 753 75 -472 568 475 439 545 390 -576 -446 -480 -7 80 598 86 -316 256 260 387 -29
3786 -29 386 -734 -382 171 439 12 -551 -321 -343 488 9 -324 -276 163 -933 440 277 12 309 -391
3806 -391 -58 -46 -751 -95 -131 -160 128 110 156 -210 -336 -271 -338 -368 -217 338 630 120 -883 302 867 -150
3828 -150 90 -17 -664 532 605 257 535 -175 513 -371 -305 2 -90 242 -94 509 -119 -143 -78 121 562
3849 562 460 177 175 361 20 -615 32 382 423 -90 34 -385 -643 -232 84 30 24 -564 518 742 -27 769
3871 769 -376 -212 255 78 -42 656 -431 -140 136 -501 181 -89 331 419 168 -283 69 72 -501 -118
3891 -118 -15 -337 -207 93 317 -1088 -224 -348 -250 568 383 -62 -344 379 -174 89 -669 -197 -708 -390
3911 -390 40 232 -492 -49 -90 224 -384 -115 -484 394 -5 168 -52 1179 -481 -120 257 -44 434 -358
3931 -358 181 281 305 -219 865 121 130 465 39 219 271 -726 -246 77 189 -143 -283 -514 -73 147 -681
3952 -681 262 26 125 -117 341 380 -69 180 -451 -671 -243 322 -2 -521 39 218 -3 198 -269 253 52
3973 52 173 384 -424 -410 -216 153 -100 -679 190 192 -167 -165 -537 -39 -78 272 -140 -58 255 46 -302 431 32
3996 32 -277 116 -93 412 -5 -552 -638 386 -571 -68 17 112 781 210 -573 -69 -71 -385 -644 -239 -137 -51
4018 -51 62 -261 -107 -30 -361 -259 -401 -201 877 -424 -19 -402 546 210 -373 296 100 -343 -501 -69
4038 -69 193 59 -458 -453 -448 -344 40 -107 316 7 -764 581 339 633 -20 -425 369 -369 419 366 -7 50
4060 50 578 297 -389 7 -10 -588 291 -585 10 -111 -973 -381 233 -63 -323 131 -313 293 87 58 410
4081 410 -348 -70 -408 -452 719 218 -477 -144 434 361 -168 -457 122 331 231 433 58 -59 379 -527
4101 -527 -416 121 522 -365 -361 -276 -153 -7 -99 -132 161 172 -300 324 -412 233 -40 -84 -392 3 -99 226
4123 226 367 302 -223 -269 -914 585 579 -197 15 -255 897 218 64 216 -83 455 349 -431 74 -312 206
4144 206 -815 306 599 -506 -399 297 -14 246 653 372 -429 -327 -514 -121 -392 -251 616 132 -473
4163 -473 -196 -234 654 368 410 -96 -116 -203 277 73 -249 113 -928 178 -111 -21 695 -191 -156 293 49
4184 49 188 439 388 429 -304 -623 189 462 378 263 -21 323 620 -419 5 -407 -98 284 -300 203 -187
4205 -187 -678 476 -199 8 555 -227 -2 -108 109 102 169 602 -23 301 327 -888 619 -4 220 95
4225 95 -553 -190 -432 357 134 138 250 213 8 126 368 -479 224 740 -312 -121 948 -82 -692 -208
4245 -208 -363 -167 43 -144 310 -224 326 -309 -165 -202 -92 -916 0 -260 401 -4 -98 66 -19 -31 88
4266 88 -39 326 37 543 159 -66 234 14 -202 -493 -500 124 86 -473 -279 9 401 -88 20 166 305
4287 305 24 -117 334 -265 -619 306 18 564 -131 268 -626 -172 248 -156 243 128 -110 -239 -214 629
4307 629 -662 -107 7 -230 28 49 563 32 -174 1018 22 -274 1078 450 235 -63 -54 511 -62 521
4327 521 101 258 -157 -314 60 -38 -132 -329 356 1008 -310 -191 -129 -538 -383 -19 248 -577 885 -327
4347 -327 -11 844 -496 305 260 -378 692 -44 295 -516 -526 -147 339 -551 472 -224 -980 442 -58
4366 -58 -459 -662 -741 75 244 -565 -489 -157 -180 -138 167 -243 -199 233 284 -288 212 -65 -674 27 1088 716
4388 716 233 -772 -130 -92 634 8 -278 -315 -496 540 557 194 -101 365 -212 -462 96 -40 212 556
4408 556 49 386 491 303 -685 -67 250 272 152 -331 -68 -192 -103 678 -661 -274 -41 -245 -135 325
4428 325 21 70 -605 475 119 143 -140 -23 169 99 392 -30 -565 -248 -523 -405 765 -30 -417 -54
4448 -54 127 563 -190 584 95 -569 47 -410 -220 -95 -755 -342 -67 105 241 2 -516 419 414 -326 9
4469 9 181 -84 -366 -393 -440 -48 256 400 247 -419 139 -94 -447 -83 -583 -164 -473 -91 456 -173 361
4490 361 150 87 -656 398 -31 35 1208 -585 300 -182 149 -142 14 -126 -533 -26 -556 -68 -564 -130
4510 -130 127 -335 -11 -423 431 278 141 -140 517 -471 161 233 -222 624 -73 -425 231 -259 16 -477
4530 -477 222 -279 -183 -123 16 460 -308 -190 -817 -854 186 -110 -3 187 -540 462 -77 209 -115 143
4550 143 -406 -57 -552 -459 316 642 499 -43 -96 -33 -94 270 -249 -619 607 156 -403 -414 76 372 321 -683
4572 -683 112 -161 639 424 -421 524 -282 -95 -249 536 -29 779 -78 -468 433 263 9 -196 48 -82
4592 -82 -313 70 1 -400 639 645 -658 -438 -270 -955 -601 165 -129 -233 242 -895 -84 -353 233 -49
4612 -49 -176 -1 -330 396 -421 -319 140 -477 208 753 50 304 -425 -87 219 70 -731 306 -52 336
4632 336 421 -160 445 -43 -181 280 -310 -357 35 304 -625 -321 570 -542 -6 252 258 -204 360 142 195
4653 195 -296 281 -137 -492 144 44 -466 15 -389 -523 36 151 273 553 20 54 -739 -314 -222 370 -28
4674 -28 -358 -3 139 35 654 498 -201 -396 -209 -59 155 -975 -381 -89 437 235 348 610 563 -537
4694 -537 695 -94 194 -98 196 378 35 265 210 21 191 -686 292 -446 -64 11 -113 157 -104 771
4714 771 -1061 56 116 94 187 -199 -477 -445 522 -284 -767 -245 81 183 -501 73 -23 -357 112 95 -309
4735 -309 -217 -52 472 -436 -719 517 301 289 -50 -152 24 -72 -423 212 110 -413 -63 -271 115 466 -136
4756 -136 -409 560 -503 56 -149 -185 -152 562 -391 212 1 170 376 48 -88 -411 910 38 267 -323
4776 -323 178 -173 -200 -209 -136 -153 -324 -120 304 -165 -78 -418 -264 211 -23 89 -452 465 -51 -209 67 6
4798 6 -87 -360 -344 -58 -219 217 646 -184 22 11 121 327 -243 -449 165 144 155 -7 25 -542 184 -651 -289
4821 -289 -29 -613 172 595 328 -300 -205 -474 -557 57 426 99 165 339 -102 299 -147 270 -528 512 -244
4842 -244 390 149 25 -177 409 411 -31 67 -362 -268 -176 -342 476 -513 -187 -339 239 -90 21 -282 338 -403
4864 -403 204 101 -919 420 109 68 -8 -26 39 -353 473 -152 6 -711 339 -13 -58 -802 261 461
4884 461 262 -473 -188 -55 543 259 -206 -413 617 401 -189 -619 -302 34 -148 127 110 147 581 861
4904 861 765 351 -107 419 148 113 -272 192 63 456 -90 248 -298 377 310 -95 207 130 -253 365 -222
4925 -222 -25 -94 2 355 267 -84 33 168 203 514 -41 90 -120 91 -142 634 -136 6 18 107 -288 -311
4947 -311 -64 -92 -328 -159 603 154 -16 17 395 -454 -14 -576 -112 -92 -296 -273 568 332 16 48 209 457
4969 457 -126 -579 -506 522 -680 -245 18 -931 -1086 177 -364 -430 -310 831 -408 34 -279 71 343
4988 343 -391 1013 -78 -290 305 106 355 57 -186 -827 -169 -277 -170 -80 468 549 115 477 -545 345
5008 345 359 -473 -476 563 196 -477 161 -374 293 190 6 27 130 -642 -457 121 -378 -42 -11 386 -245
5029 -245 4 29 -116 -160 -612 617 -172 426 -109 -66 -332 58 -528 -496 -193 -211 564 353 106 155 461 -478
5051 -478 -583 -162 1 -243 54 -374 -320 -213 -119 208 -544 9 215 311 324 37 -313 546 411 617 -628
5072 -628 137 307 -784 -182 -365 372 -25 614 -202 -155 187 -72 -103 105 -24 296 -51 92 146 -477 -394
5093 -394 -323 -183 66 -459 -432 415 61 0 21 -438 84 -524 373 211 62 186 -229 185 -457 -283 -86
5114 -86 960 357 -105 739 -105 190 392 -149 124 -305 -82 257 284 413 -385 328 140 417 -289 -158
5134 -158 333 240 521 123 196 -91 -53 -609 112 -209 95 -561 33 -250 -170 -733 -103 291 -190 -158 64 77
5156 77 -601 96 -611 36 -464 -241 491 281 3 567 -65 18 573 540 -268 -186 -8 -712 200 567 212
5177 212 25 -350 62 -392 -558 -194 -593 335 -416 233 -11 -446 -494 11 197 24 371 -184 -333 -493
5197 -493 169 65 7 -124 110 -567 -535 160 -606 213 -273 510 233 -645 272 -172 -186 -68 -305 -84 673
5218 673 -442 -768 19 327 476 233 559 413 75 679 -414 270 31 -651 311 50 242 -185 92
5237 92 67 -376 -34 -85 -265 -114 -128 513 -260 -169 286 -290 284 -201 165 -451 102 -139 618 -776 907
5258 907 160 116 77 380 82 -246 210 -821 144 67 521 -611 -24 499 -292 -318 -326 588 442 119 -28
5279 -28 65 -75 319 -78 279 532 -24 502 37 -192 285 -348 -36 -600 285 -124 298 -160 894 239
5299 239 615 -238 231 -12 -149 162 -89 -296 11 -208 157 -362 -439 -812 -297 -345 79 645 126 141 -359
5320 -359 2 9 322 93 52 -236 -125 552 42 -352 19 35 -232 -571 272 321 -14 -440 -33 462 -749
5341 -749 -191 -32 -221 -218 -266 -251 145 246 -299 494 -57 -497 73 -204 -136 524 -127 306 -2 -552 -540 220
5363 220 227 261 107 142 299 143 -193 36 -484 36 -107 -235 -110 220 498 -195 -422 44 -185 -152 -172 165
5385 165 313 -133 101 -541 94 114 565 -592 -81 483 -104 1198 434 -379 -494 773 -571 105 8
5404 8 227 407 -27 -175 25 535 -161 -59 -342 405 501 20 144 -495 -61 -82 -218 -405 2 -235 179
5425 179 -125 193 -189 -231 -521 473 41 91 -389 71 384 292 -944 -290 205 320 50 -753 140 -253 -250
5446 -250 -560 178 643 -455 278 -230 -298 254 -517 -446 224 -458 -21 -124 -233 346 -623 -33 -222 -41
5466 -41 -148 200 5 -638 -19 -316 -449 93 -110 760 -514 -636 -548 191 -37 -816 -67 -587 -647 268 423
5487 423 172 -242 -270 -344 -599 -414 196 122 -125 -301 220 -411 231 -96 -196 -305 -418 126 -26 634 1209
5508 1209 -793 -498 -13 -687 -255 285 -262 528 691 -142 -23 -109 113 -85 -378 -24 40 130 318 -266
5528 -266 -43 139 232 -43 244 21 65 352 -518 639 755 401 42 -12 241 596 537 582 -33 121 468
5549 468 57 397 -138 434 357 -103 -565 -221 412 -155 92 -295 69 361 -468 69 -15 159 397 -527 -1
5570 -1 131 190 134 -332 -132 -150 -496 -266 123 828 545 -41 140 69 116 -20 -126 276 163 106 -545 252 -161
5593 -161 291 25 -112 167 -304 -59 -295 -74 -390 227 -403 -196 729 369 193 271 -275 -458 315 488
5613 488 -410 102 252 331 -112 -19 191 159 -63 -369 -64 -543 163 147 557 0 -328 104 -323 406 -149
5634 -149 356 -107 18 -51 174 -107 -6 145 -48 -472 60 265 22 -265 -128 282 -320 -40 -220 -484
5654 -484 360 -514 336 -94 144 188 0 -441 -357 123 -429 -20 196 308 127 53 220 -21 46 16 -427 391
5676 391 -24 242 236 -143 -439 -121 94 -203 -336 201 807 -299 -136 -484 -673 -189 6 191 -211 319
5696 319 -78 -30 -202 -211 -243 397 120 -152 -231 -341 -853 -198 -197 -357 -144 -104 -166 137 382 -264 885 -107 49
5719 49 37 22 226 57 -81 -381 356 69 262 285 -558 268 318 -29 68 14 95 -257 517 1044 -618 -139
5741 -139 -290 -263 95 253 -364 394 80 255 -20 -239 -72 -349 542 146 -177 -55 -101 19 -66 -88 -382
5762 -382 1062 807 16 259 623 -25 65 179 -81 -29 429 53 -197 453 427 17 210 -192 424 -328 -109
5783 -109 -487 161 -222 -7 39 245 247 198 31 -93 137 -28 327 193 133 -355 74 -1253 -143 226 -352
5804 -352 -567 -398 396 -605 255 714 488 35 687 141 -96 202 -331 92 602 321 236 422 -82 -670
5824 -670 13 108 234 -73 -55 -297 827 100 -291 476 571 135 537 -412 -616 -494 -632 -356 -287 -52 151
5845 151 -344 -598 147 61 112 -268 -335 376 202 688 -97 571 -268 -168 -160 87 273 -27 92 -244 -2 -947
5867 -947 249 289 187 75 358 -42 35 246 66 -453 241 -387 208 230 -598 271 -110 -225 59 -322 -487
5888 -487 486 -80 105 94 104 423 651 477 496 110 23 286 -219 222 133 377 404 510 -212 -386 156 -158
5910 -158 -303 -647 71 749 26 8 -397 149 259 -248 618 -140 -216 28 687 415 -353 543 -215 550 150
5931 150 -554 -395 -205 277 -183 -18 395 -91 395 -172 -801 -139 -503 -392 -271 299 -576 -169 -567 391
5951 391 -47 -46 392 442 -181 2 -503 -438 -69 528 188 -231 -394 -93 -12 395 -273 -125 600 -159 -73 40
5973 40 197 -373 -177 -399 723 -301 444 70 572 -176 64 -483 -56 -456 -268 390 73 -6 23 -154
5993 -154 41 157 -21 -383 -255 90 -116 97 675 569 -166 -267 424 -304 -29 598 -360 416 95 -232
6013 -232 325 90 -485 -138 567 -4 -328 -216 22 127 -160 -410 284 31 -632 -50 -238 109 583 72
6033 72 418 23 171 -134 306 -82 -182 148 -375 46 -363 171 -588 103 -647 -214 490 66 286 52
6053 52 -559 158 -297 17 -20 38 494 -651 -93 53 386 -395 -339 90 -45 122 122 162 666 522 -7 -22
6075 -22 127 274 -3 -136 498 -38 -391 40 -163 -181 -363 -357 -65 87 -171 350 289 -313 -278 -282 -103 211 -372
6098 -372 576 -212 -323 -394 -343 -68 100 58 206 75 -413 337 83 -3 332 -26 -638 -22 373 130 -155
6119 -155 -109 44 -144 -344 -536 507 5 319 512 -15 -259 -203 -204 219 -10 -374 67 559 202 124 -236
6140 -236 -174 28 -100 279 -268 -409 57 -536 3 -31 -706 299 -626 -592 116 -217 -130 614 252 38 -511
6161 -511 282 76 -325 -512 -283 -255 -415 -202 -383 416 -52 -9 86 247 247 -137 -95 -156 37 95 -61 -464 12
6184 12 326 -13 -720 632 4 450 -4 -416 -244 -630 -456 -689 463 -284 -566 -272 -310 -298 264 -403
6204 -403 -244 23 470 418 -310 309 57 -237 647 127 553 368 -161 131 -220 -62 679 180 -47 396
6224 396 -43 -381 -791 -108 73 137 380 -285 163 291 173 -99 -93 -550 380 102 -484 -33 -180 110 -193
6245 -193 -19 288 598 0 182 -89 -181 -138 240 245 101 50 -394 143 397 13 25 302 680 -720 141 -144
6267 -144 215 312 209 123 -58 -115 -73 39 -377 -110 -378 52 -10 -481 222 13 948 80 266 94 -198 22
6289 22 34 -690 67 -302 -221 91 -307 -143 89 25 -145 -255 75 -781 -462 -9 -66 402 -14 694 -113 211
6311 211 191 588 -339 -319 350 51 588 -374 188 -90 105 97 246 -85 224 124 261 491 503 298 -856
6332 -856 -37 275 -100 530 -306 -185 82 -75 -19 577 238 -163 -60 -360 -556 -363 -173 580 -687 -97
6352 -97 -155 -320 429 140 -293 -500 -534 49 -707 -28 -412 201 505 -368 421 6 -272 396 429 101 -117
6373 -117 874 -203 293 -156 751 -264 5 -120 -169 -256 -188 -102 22 -721 99 -33 -447 -13 378 289 -147
6394 -147 162 -393 -200 -78 -498 -240 -508 -554 20 -175 -158 531 220 469 -57 131 592 820 616 -235 -330
6415 -330 -262 346 -46 455 526 97 107 45 -52 -221 40 -183 -428 -596 20 -520 -4 582 509 7 55 394
6437 394 439 339 -105 -329 233 295 -352 -146 -153 52 242 32 254 -109 224 -437 -35 -873 -539 -66 62
6458 62 376 239 -247 561 -494 393 916 -120 28 -49 659 -233 -456 74 -29 413 -170 -427 -129 -692
6478 -692 42 -295 850 -356 201 -48 634 -94 -268 88 437 -32 -461 214 -204 -206 454 -474 -84 -203
6498 -203 25 45 -281 93 39 175 -540 68 459 -179 -122 -18 -341 -381 -51 142 -630 -636 -201 -1269 -174
6519 -174 20 -123 362 161 490 579 753 -471 -301 189 347 137 -211 402 539 278 -41 -74 4 -159 500
6540 500 -500 -803 -251 -382 295 -84 397 193 117 226 -17 68 456 -689 397 79 108 -262 -103 438
6560 438 245 -241 197 173 161 306 -281 465 -68 111 361 383 -192 267 -230 -240 281 439 228 96 84 -91
6582 -91 228 136 -357 380 552 581 222 -441 -109 -242 -259 298 -267 -186 -268 -166 -424 56 436 -300 -252 446
6604 446 176 -331 99 -151 -145 -777 38 -774 5 395 319 -320 226 -225 22 -196 -506 -113 -573 58 229
6625 229 63 -213 264 -37 -339 433 111 -209 518 -192 -227 -134 130 307 444 94 -210 182 613 -127 279
6646 279 469 169 -402 387 178 41 -169 142 234 -490 38 489 91 53 -355 -234 -266 -137 -101 -616 -299
6667 -299 398 111 396 165 217 372 431 -557 486 -31 462 550 232 -150 710 86 -530 -297 670 62 -45
6688 -45 -348 -194 193 50 249 -783 -113 -158 -363 -66 -395 33 -257 -345 -81 368 60 -773 86 -178 -374
6709 -374 -211 467 -233 160 -12 198 127 6 119 -539 -532 -67 3 233 414 395 -139 -1 189 164 233 -329
6731 -329 -146 356 35 -28 166 -68 -207 21 330 114 -407 269 103 -268 93 612 -51 -430 -588 202
6751 202 405 -395 -33 -222 -394 141 244 -29 427 37 -26 -472 -181 -107 -187 -436 344 -235 -233 146 -87 5
6773 5 -60 -230 -523 134 110 121 819 -9 -112 504 -181 -315 -201 -542 -367 -156 -352 -146 234 -182 524 -416
6795 -416 120 208 -195 236 -54 -115 134 284 -268 118 -293 242 -566 370 706 -6 -236 -41 -255 622 38
6816 38 -247 -297 187 145 -842 67 167 -340 -643 -320 363 -408 -151 -387 -470 -514 532 230 -568 -52 414
6837 414 -343 433 262 57 -559 -46 -273 236 -50 -626 -363 -285 619 66 116 -107 -31 -89 550 456 704 -103
6859 -103 -261 770 -117 -389 375 109 389 356 67 198 -229 -613 -49 129 89 -34 -284 -190 -548 -582 -299
6880 -299 -153 37 -308 -89 -287 44 142 -191 -220 529 55 592 -138 357 321 317 179 -298 -285 -65 -184 -90
6902 -90 61 -97 93 186 -263 423 -213 -218 214 -115 84 -90 977 80 -697 37 121 314 -130 83 -285
6923 -285 -225 -123 -150 64 418 -337 -228 28 -508 8 -7 484 151 -218 -22 189 458 -440 -115 228 -79
6944 -79 -427 -113 -27 -252 -690 520 -104 432 -225 360 468 -228 306 -338 -406 -223 -64 275 77 703 -441
6965 -441 -282 296 47 -77 -62 -129 -371 303 -598 483 246 76 -508 -6 -286 -94 -242 18 -109 235
6985 235 547 205 134 -288 -255 -218 -349 384 178 -161 -385 -538 670 -279 -425 170 -61 -33 -55 254 -367
7006 -367 5 -102 -11 337 33 26 -365 495 -742 293 407 651 -74 -111 391 328 301 291 -221 -360 -51 -249
7028 -249 -4 -21 -34 206 -32 -193 -561 310 275 -172 784 -400 47 -735 89 -135 -221 516 204 582 304
7049 304 -172 -36 -138 -260 -528 -55 383 573 370 -281 47 -557 288 -307 1261 -152 -27 -466 651
7068 651 -19 -75 -600 -170 -11 -19 369 90 -98 -145 -219 -360 -51 189 130 577 -162 202 243 313 45 -185 -346
7091 -346 417 -200 99 -242 390 -454 457 164 239 316 321 236 -270 -789 -114 -386 -271 49 189 222 -391 274
7113 274 526 -29 -333 -117 -72 415 134 457 -194 246 224 -18 -871 -111 -255 -192 34 -81 -641 304 92
7134 92 -89 558 258 -633 289 -58 -163 944 -113 462 -277 -82 130 272 373 450 192 -413 -152 -17
7154 -17 -317 -659 -484 -357 60 -251 -807 307 62 -211 47 306 -627 -90 -89 -43 2 -256 432 -55 -349
7175 -349 -32 -110 -349 53 -356 -34 224 513 127 -169 -277 -354 431 193 -121 216 666 175 44 -481 -112
7196 -112 -294 244 -211 -136 -339 -489 -86 -227 -440 468 -291 -441 90 -67 -448 627 -258 -159 77 -615
7216 -615 -221 170 598 221 -314 238 -118 621 -79 189 272 -314 -21 57 338 -438 -458 -148 216 -278 -27
7237 -27 300 339 -203 249 -156 270 -55 -185 384 83 1301 392 64 153 -369 -248 -156 47 -454 212 -199
7258 -199 -274 448 -99 -154 382 119 -152 313 417 -157 126 -283 -67 300 -424 1104 153 311 482 580 -42
7279 -42 -148 -227 42 -131 303 244 -176 -298 176 583 270 496 343 479 -348 189 -109 229 -156 519 -335
7300 -335 17 746 284 -49 -303 -734 361 -147 -23 87 64 210 76 -336 -174 314 -371 -258 142 791
7320 791 6 58 117 -240 -148 -101 -305 -262 326 -265 -836 256 -250 288 -206 -366 689 -206 702 -215 -498
7341 -498 -684 300 -81 -242 218 290 -24 -141 30 -688 314 357 -83 230 -490 39 -11 46 -110 -493 -58
7362 -58 50 463 -624 58 -329 -152 25 51 -490 -78 45 -34 560 410 -295 484 -314 -490 -56 752 -20
7383 -20 -201 -513 -329 91 181 -7 -180 -245 209 498 235 300 -34 73 23 164 53 146 283 -179 53 132
7405 132 -639 348 -465 300 -17 9 463 345 371 -57 -19 -702 -92 -135 -187 480 17 176 685 473 -206 -364
7427 -364 -177 -176 349 21 -208 232 263 68 -121 -397 482 -64 -262 -26 3 105 -78 175 148 475 -749
7448 -749 -539 173 -255 207 496 184 -614 342 -12 378 -1043 -619 -374 134 -200 72 -68 -302 824
7467 824 954 -218 -200 71 268 532 -4 -60 -181 -610 -283 345 681 -709 293 59 279 -464 -484 -192
7487 -192 -288 26 59 85 -439 72 973 647 -234 386 -483 -505 -359 -460 409 586 -128 457 38 704 -64
7508 -64 257 -97 131 13 128 -185 -470 176 -156 -265 128 338 -247 -268 -529 -28 -487 -150 -96 274 -539
7529 -539 -699 -347 -627 -155 130 197 277 57 -17 -394 -241 286 363 -3 -347 579 346 227 350 163 -262
7550 -262 -480 -210 -149 142 -490 -271 -74 583 155 -349 69 172 185 -238 -117 -108 96 481 42 488 298
7571 298 236 366 -266 -280 41 172 -317 -273 -30 376 -131 -21 263 -211 -148 126 -159 -192 -313 -304 -188 34
7593 34 -836 272 206 -329 -377 -131 0 -295 -59 152 -498 -450 -164 230 -531 -71 232 235 215 194 507 -185
7615 -185 -191 300 258 89 42 -268 -664 499 -350 -31 -150 -228 -134 -507 489 -378 82 -62 -296 -443 -81 -393
7637 -393 -326 -422 -335 -345 -101 -415 119 645 316 199 -352 -107 -20 25 -54 -209 -28 -388 364 -543 -57 -56 -69
7660 -69 -130 -138 277 -140 116 47 -177 197 -15 336 96 -577 -210 50 473 -278 -426 353 -425 -150 -376 -253
7682 -253 48 -428 -276 364 2 -122 -224 -503 470 -667 39 204 199 380 -364 124 236 -234 485 288
7702 288 -160 810 -112 368 122 -300 -551 290 -175 -997 294 131 -23 176 770 145 168 574 86 -528
7722 -528 552 -355 -377 -279 -572 277 150 -493 -39 146 359 152 305 -119 -690 -87 137 -48 350 -31
7742 -31 23 70 -190 17 58 296 177 -508 824 -111 -75 143 -505 202 609 383 46 31 561 299 -11 520
7764 520 390 -151 8 -46 240 -660 -2 89 171 -81 234 127 -111 -45 -476 -419 229 -198 -226 -360 -230 -110
7786 -110 602 89 92 182 -309 79 125 305 -440 92 -53 17 110 -606 -839 -723 -566 -91 -148 -130 -78 -380 -432
7809 -432 472 575 -207 263 -118 -213 197 -164 -285 -386 -236 66 103 306 45 -65 -71 290 955 312 0
7830 0 -360 104 95 248 525 -252 34 -82 -79 224 799 398 218 340 484 239 -94 -376 -75 207 101 -188
7852 -188 -370 -140 671 198 -681 256 -845 195 208 347 -205 136 -533 82 -278 329 443 747 718 -679
7872 -679 -22 273 367 31 213 447 -158 -245 19 -285 -88 734 -296 304 -62 -597 404 -309 219 286
7892 286 -292 192 179 141 -245 408 -166 -161 216 -443 278 -114 235 1 -339 -185 159 -81 697 271 266 627
7914 627 588 -193 486 642 298 214 -502 152 -532 -689 541 355 264 -666 -483 -152 -396 -737 274 -13
7934 -13 234 433 195 -114 -186 336 -314 37 119 -615 -238 -229 -129 292 -216 -422 -221 751 -118 -111 -156 57 208
7957 208 -466 -931 188 497 -404 27 455 -44 -279 242 -639 -71 -727 -744 283 -463 274 34 521 450
7977 450 372 -324 -377 410 -198 -556 -498 116 -322 -398 129 -24 -22 361 499 -77 -144 -465 -774 -264 -97 257
7999 257 279 739 -530 86 -396 248 -382 165 446 306 639 839 -49 -366 216 349 -108 -5 -6 504 27
8020 27 -148 -7 442 -262 -369 -99 -254 69 -210 -96 282 357 108 -140 -71 639 -105 -283 571 85 -543
8041 -543 532 -65 636 24 638 98 -263 -62 -125 -87 66 457 375 179 262 -743 71 435 451 -523 -133
8062 -133 582 -27 368 -457 -12 -65 309 -98 -75 -81 50 -707 -402 -58 751 194 876 -377 -198 192 -478
8083 -478 255 375 -361 188 -609 272 -2 -88 570 -312 -137 961 197 29 -203 482 -49 44 -68 -119 -43
8104 -43 -73 -593 116 -217 89 -231 241 205 123 -216 214 17 -380 -147 459 -195 199 -426 234 -99 -315
8125 -315 -222 117 492 -16 -87 -542 -57 -23 -65 -398 42 114 163 594 -73 -277 -405 164 -494 332 475 515
8147 515 83 86 560 79 -16 367 -394 248 150 -133 -139 277 880 -77 484 -213 -91 178 -525 71 -108 189
8169 189 -192 195 -247 79 139 -563 -114 -202 -253 211 -348 -65 127 -114 -432 -224 211 -507 30 155 -172
8190 -172 518
8191E18
##END NTUPLES=NMR FID
##END=
