##TITLE=1H ikalashn
DE-63-P3
19.12.2024
##JCAMPDX= 6.0         $$ Bruker NMR JCAMP-DX V2.0
##DATA TYPE= NMR FID
##DATA CLASS= NTUPLES
##ORIGIN= UXNMR, Bruker Analytische Messtechnik GmbH
##OWNER= root
$$ TOPSPIN		Version 1.3
$$ 2024-12-19 15:14:20.968 +0400  Irina@DPX200
$$ Compression mode = diff/dup
##.OBSERVE FREQUENCY= 200.131300845
##.OBSERVE NUCLEUS= ^1H
##.DELAY= (6, 6)
##.ACQUISITION MODE= SIMULTANEOUS
##.ACQUISITION SCHEME= undefined
##.AVERAGES= 64
##.DIGITISER RES= 18
##SPECTROMETER/DATA SYSTEM= spect
##.PULSE SEQUENCE= zg
##.SOLVENT NAME= CDCl3
##.SHIFT REFERENCE= INTERNAL, CDCl3, 1, 17.49637
##AUDIT TRAIL= $$ (NUMBER, WHEN, WHO, WHERE, WHAT)
$$ ##TITLE= Audit trail, TOPSPIN		Version 1.3
$$ ##JCAMPDX= 5.01
$$ ##ORIGIN= Bruker BioSpin GmbH
$$ ##OWNER= Irina
$$ $$ F:/spectra/data/iren/nmr/1H/4/audita.txt
$$ ##AUDIT TRAIL=  $$ (NUMBER, WHEN, WHO, WHERE, VERSION, WHAT)
(   1,<2024-12-19 15:14:03.031 +0400>,<Irina>,<DPX200>,<TOPSPIN 1.3>,
      <created by zg
	started at 2024-12-19 15:09:49.781 +0400,
	POWCHK disabled, PULCHK disabled
       configuration hash MD5:
       BE 6D 3F 07 2A EA 11 49 91 17 2B D3 AF B3 58 0D
       data hash MD5: 16K
       91 F0 FE FB 9B D0 6A 26 C9 CA 61 CB 3B 69 13 04>)
$$ ##END=
$$ 
$$ $$ hash MD5
$$ $$ CB 4F D9 D8 7C 08 8A BD 3F D2 8A E6 FD 13 91 85
##$RELAX= 
##$RELAX= 
##$RELAX= 
##$RELAX= 
##$RELAX= 
##$RELAX= 
##$RELAX= 
##$RELAX= 
##$RELAX= 
$$ Bruker specific parameters
$$ --------------------------
##$DU= <F:/spectra>
##$EXPNO= 4
##$NAME= <1H>
##$PROCNO= 1
##$TYPE= <nmr>
##$USER= <iren>
##$AMP= (0..31)
100 100 100 100 100 100 100 100 100 100 100 100 100 100 100 100 100 100 
100 100 100 100 100 100 100 100 100 100 100 100 100 100 
##$ANAVPT= -1
##$AQSEQ= 0
##$AQ_mod= 1
##$AUNM= <au_zg>
##$AUTOPOS= <>
##$BF1= 200.13
##$BF2= 200.13
##$BF3= 200.13
##$BF4= 200.13
##$BF5= 200.13
##$BF6= 200.13
##$BF7= 200.13
##$BF8= 200.13
##$BYTORDA= 1
##$CFDGTYP= 0
##$CFRGTYP= 5
##$CHEMSTR= <none>
##$CNST= (0..63)
1 1 145 1 1 1 1 1 1 1 1 1 1 1 1 1 1 1 1 1 1 1 1 1 1 1 1 1 1 1 1 1 1 1 
1 1 1 1 1 1 1 1 1 1 1 1 1 1 1 1 1 1 1 1 1 1 1 1 1 1 1 1 1 1 
##$CPDPRG= <>
##$CPDPRG1= <>
##$CPDPRG2= <>
##$CPDPRG3= <>
##$CPDPRG4= <mlev>
##$CPDPRG5= <mlev>
##$CPDPRG6= <mlev>
##$CPDPRG7= <mlev>
##$CPDPRG8= <mlev>
##$CPDPRGB= <>
##$CPDPRGT= <>
##$D= (0..63)
0 2 0 0 0 0 0 0 0 0.06 0 0.03 0 0 0 0 0.0002 0 0 0 0 0 0 0 0 0 0 0 0 0 
0 0 0 0 0 0 0 0 0 0 0 0 0 0 0 0 0 0 0 0 0 0 0 0 0 0 0 0 0 0 0 0 0 0 
##$DATE= 1734606841
##$DBL= (0..7)
120 120 120 120 120 120 120 120 
##$DBP= (0..7)
150 150 150 150 150 150 150 150 
##$DBP07= 0
##$DBPNAM0= <>
##$DBPNAM1= <>
##$DBPNAM2= <>
##$DBPNAM3= <>
##$DBPNAM4= <>
##$DBPNAM5= <>
##$DBPNAM6= <>
##$DBPNAM7= <>
##$DBPOAL= (0..7)
0.5 0.5 0.5 0.5 0.5 0.5 0.5 0.5 
##$DBPOFFS= (0..7)
0 0 0 0 0 0 0 0 
##$DE= 6
##$DECBNUC= <off>
##$DECIM= 32
##$DECNUC= <off>
##$DECSTAT= 4
##$DIGMOD= 1
##$DIGTYP= 9
##$DL= (0..7)
0 120 120 120 120 120 120 120 
##$DP= (0..7)
150 150 150 150 150 150 150 150 
##$DP07= 0
##$DPNAME0= <>
$$ [...]
##$SW= 21.9926040160658
##$SWIBOX= (0..15)
0 0 2 0 0 0 0 0 0 0 0 0 0 0 0 0 
##$SW_h= 4401.40845070422
##$TD= 16384
##$TD0= 1
##$TE= 300
##$TE2= 300
##$TE3= 300
##$TEG= 300
##$TL= (0..7)
0 120 120 120 120 120 120 120 
##$TP= (0..7)
150 150 150 150 150 150 150 150 
##$TP07= 0
##$TPNAME0= <>
##$TPNAME1= <>
##$TPNAME2= <>
##$TPNAME3= <>
##$TPNAME4= <>
##$TPNAME5= <>
##$TPNAME6= <>
##$TPNAME7= <>
##$TPOAL= (0..7)
0.5 0.5 0.5 0.5 0.5 0.5 0.5 0.5 
##$TPOFFS= (0..7)
0 0 0 0 0 0 0 0 
##$TUNHIN= 0
##$TUNHOUT= 0
##$TUNXOUT= 0
##$USERA1= <user>
##$USERA2= <user>
##$USERA3= <user>
##$USERA4= <user>
##$USERA5= <user>
##$V9= 5
##$VALIST= <valist>
##$VCLIST= <CCCCCCCCCCCCCCC>
##$VD= 0
##$VDLIST= <DDDDDDDDDDDDDDD>
##$VPLIST= <PPPPPPPPPPPPPPP>
##$VTLIST= <TTTTTTTTTTTTTTT>
##$WBST= 1024
##$WBSW= 25
##$XGAIN= (0..3)
0 0 0 0 
##$XL= 0
##$YL= 0
##$YMAX_a= 613144
##$YMIN_a= -559432
##$ZGOPTNS= <>
##$ZL1= 120
##$ZL2= 120
##$ZL3= 120
##$ZL4= 120
##$ABSF1= 10
##$ABSF2= 0
##$ABSG= 5
##$ABSL= 3
##$ALPHA= 0
##$AQORDER= 0
##$ASSFAC= 0
##$ASSFACI= 0
##$ASSFACX= 0
##$ASSWID= 0
##$AUNMP= <proc_1d>
##$AXLEFT= 0
##$AXRIGHT= 0
##$AXTYPE= 0
##$AXUNIT= <>
##$AZFE= 0.1
##$AZFW= 0.1
##$BCFW= 1
##$BC_mod= 2
##$BYTORDP= 1
##$COROFFS= 0
##$CY= 7568.61572265625
##$DATMOD= 1
##$DC= 2
##$DFILT= <>
##$DTYPP= 0
##$F1P= 17.9538593292236
##$F2P= -4.03888763876832
##$FCOR= 0.5
##$FTSIZE= 32768
##$FT_mod= 4
##$GAMMA= 1
##$GB= 1
##$INTBC= 1
##$INTSCL= 1
##$ISEN= 128
##$LB= 0.05
##$LEV0= 0
##$LPBIN= 0
##$MAXI= 945.577
##$MC2= 0
##$MEAN= 0
##$ME_mod= 0
##$MI= -402.1523
##$NCOEF= 0
##$NC_proc= 0
##$NLEV= 6
##$NOISF1= 8.587773
##$NOISF2= 6.764455
##$NSP= 1
##$NTH_PI= 0
##$NZP= 0
##$OFFSET= 17.49637
##$PC= 1
##$PHC0= 81.83525
##$PHC1= 17.7478
##$PH_mod= 0
##$PKNL= yes
##$PPARMOD= 0
##$PPDIAG= 0
##$PPIPTYP= 0
##$PPMPNUM= 100
##$PPRESOL= 1
##$PSCAL= 0
##$PSIGN= 0
##$REVERSE= no
##$SF= 200.13
##$SI= 32768
##$SIGF1= 18.5376
##$SIGF2= -6.396296
##$SINO= 400
##$SIOLD= 32768
##$SREGLST= <1H.CDCl3>
##$SSB= 3
##$STSI= 0
##$STSR= 0
##$SW_p= 4401.40845070422
##$SYMM= 0
##$S_DEV= 0
##$TDeff= 0
##$TDoff= 0
##$TI= <>
##$TILT= no
##$TM1= 0
##$TM2= 0
##$TOPLEV= 0
##$USERP1= <user>
##$USERP2= <user>
##$USERP3= <user>
##$USERP4= <user>
##$USERP5= <user>
##$WDW= 1
##$XDIM= 8192
##$YMAX_p= 0
##$YMIN_p= 0
$$ End of Bruker specific parameters
$$ ---------------------------------
##NTUPLES= NMR FID
##VAR_NAME=  TIME,          FID/REAL,        FID/IMAG
##SYMBOL=    X,             R,               I
##VAR_TYPE=  INDEPENDENT,   DEPENDENT,       DEPENDENT
##VAR_FORM=  AFFN,          ASDF,            ASDF
##VAR_DIM=   8192,          8192,            8192
##UNITS=     SECONDS,       ARBITRARY UNITS, ARBITRARY UNITS
##FACTOR=    0.0002272,     1,               1
##FIRST=     0,             0,               0
##LAST=      1.8609952,     -188,            99
##MIN=       0,             -559432,         -559432
##MAX=       1.8609952,     613144,          613144
$$ Real data points
##PAGE= N=1
##DATA TABLE= (X++(R..R)), XYDATA
0 0 0 0 0 0 0 0 0 0 0 0 0 0 0 0 0 0 0 0 0 0 0 0 0 0 0 0 0 0 0 0 4 -45 51 -61 62 -63 64 -64 64 -73 107 -115 125
43 125 -128 141 -174 179 -198 227 -243 268 -301 320 -364 386 -438 474 -527 586 -650 724 -800
62 -800 899 -1000 1117 -1233 1286 -1012 -1185 31774 448759 506703 163105 59895 259305
75 259305 313075 -41896 -435344 -461372 -168166 58397 44534 -45170 39728 282187 408209
86 408209 208382 -131279 -248633 -95467 -24608 -221861 -394039 -206263 160815 283768
96 283768 136453 77651 229605 302086 90761 -193661 -273290 -183899 -124408 -126335 -68937
107 -68937 84357 227232 259312 175064 49022 -35630 -68458 -120364 -219914 -259346 -141863
118 -141863 29802 80698 40899 95733 247028 271842 86409 -92990 -86220 -27536 -114323
129 -114323 -258773 -221442 -2708 163689 158785 111333 148850 197612 118089 -84250 -259324
140 -259324 -283359 -182365 -85473 -57434 -20197 123000 299032 313784 134511 -39759 -51367
151 -51367 -19376 -122401 -285020 -266186 -44079 140374 136734 82104 142278 237279 174042
162 174042 -43176 -215011 -221077 -147999 -126060 -142979 -80829 92432 257274 273964 155120
173 155120 42995 21586 450 -122463 -268643 -258249 -77468 78888 85662 52883 127997
184 127997 237009 193966 -3279 -153959 -145808 -91913 -127631 -190160 -130682 51078 194830
195 194830 195885 121574 91416 105017 60676 -83146 -220380 -222048 -103495 -8874 -5737 300
207 300 106933 232967 211929 47933 -81663 -78002 -51781 -121418 -211988 -163861 11260 137464
219 137464 129909 83830 109581 157913 108161 -42674 -166091 -169323 -101070 -68245 -79985 -47805
231 -47805 74645 196752 194012 81277 -6640 -7723 -11840 -105998 -209350 -180385 -34220 75369
243 75369 75031 59410 119237 184466 134278 -11538 -119367 -118168 -83407 -94880 -123577 -79394
255 -79394 44381 146736 145502 79740 43853 54724 28094 -77442 -176319 -160690 -57319
266 -57319 12329 6029 18366 108874 188222 148644 22502 -58595 -54438 -51125 -109268 -160948
278 -160948 -111614 14515 102770 97609 64321 77271 105812 63452 -54580 -145709 -131015 -59072
290 -59072 -31697 -47340 -18977 86753 172724 145264 44422 -12673 -3009 -16179 -97347 -166600
302 -166600 -129202 -16626 56051 51847 41410 84628 130150 90289 -21666 -105203 -98558 -57300
314 -57300 -59065 -83936 -48653 56689 140609 127125 59399 28678 40519 13449 -75848 -149850
326 -149850 -125107 -40012 10144 5807 17773 80164 133172 99603 5192 -58367 -55708 -44102
338 -44102 -75937 -107781 -68405 29533 99755 93711 59124 61065 77963 39514 -54418 -120868
350 -120868 -104910 -49949 -29139 -37193 -7426 70999 125911 96739 22260 -16473 -13400 -26009
362 -26009 -81415 -119141 -80228 7846 60401 56308 48491 77657 102649 60149 -32091 -89640
374 -89640 -78909 -48454 -53099 -67991 -30855 52068 106850 85036 33202 14531 22425 -2981
386 -2981 -70402 -114688 -83724 -12743 23920 19831 30090 76959 109342 72492 -6203 -53183
398 -53183 -48006 -40044 -64763 -86016 -49113 29265 77747 64589 36937 40546 51351 16840 -54293
411 -54293 -96463 -74644 -28377 -12120 -14985 12879 71613 104452 72759 14670 -14618 -13499
423 -13499 -29938 -72335 -94259 -57871 9010 44573 39001 36016 58914 72018 33118 -37207
435 -37207 -73665 -57595 -34306 -39509 -45258 -6912 59877 92625 65635 25471 15607 17642 -12543
448 -12543 -69413 -94044 -60924 -7152 15694 11807 26032 65416 83738 44970 -17883 -48984
460 -48984 -39014 -31938 -53397 -64877 -26038 41655 74603 54858 29804 35709 41686 5820 -57854
473 -57854 -85833 -58266 -19762 -10170 -12188 13887 61666 83401 52586 3085 -19933 -18895 -28398
486 -28398 -59161 -74855 -40490 19660 51772 42489 33593 49859 58023 19644 -42515 -70691 -51213
499 -51213 -28632 -31862 -32121 4441 55957 74066 50142 17431 6365 1211 -22450 -57825 -71728
512 -71728 -44509 -206 23659 23695 28766 54335 66466 32716 -22663 -49419 -37497 -32250 -47733
525 -47733 -50394 -9647 45790 64103 44135 25993 28197 21179 -13665 -54040 -64988 -42842 -14073
538 -14073 641 7396 25822 53973 63833 37793 -6467 -28235 -25265 -28495 -49786 -59644 -23835
551 -23835 27316 45064 32481 28013 44348 42624 1448 -43756 -55342 -38863 -25932 -23217 -10939
564 -10939 19867 52129 59978 40435 10161 -7574 -12179 -25111 -50113 -58716 -30782 11374 29689
577 29689 22515 26499 47591 50141 12674 -30547 -39583 -27741 -27135 -37501 -28013 6599 40800
590 40800 48514 36292 23673 16708 3648 -21400 -48818 -57016 -35636 -5795 10380 12244 24147
603 24147 47818 51566 20887 -15973 -25108 -17181 -24616 -43507 -40122 -4296 30298 34448 25785
616 25785 27332 33759 22029 -10474 -38940 -44936 -34169 -21299 -14330 -3710 19406 45914 53301
629 53301 31836 2430 -9879 -12349 -25952 -47227 -46142 -12834 20936 26511 18720 25853 39720
642 39720 31307 -2209 -30502 -33130 -25445 -25566 -29143 -17242 11311 36592 41889 30518 17246
655 17246 9289 1134 -19212 -43181 -47146 -24389 2823 11826 12715 26803 46291 41252 7053
668 7053 -23584 -28155 -20513 -25818 -35070 -23257 7541 30700 30209 21586 19663 20995 11559 -10590
682 -10590 -31621 -36049 -24205 -10424 -5371 -869 16390 38715 42608 20253 -4569 -10386 -9520
695 -9520 -24026 -43097 -37846 -6981 19721 22436 19695 27351 33423 19971 -8084 -27326 -29225
708 -29225 -24252 -18172 -14791 -4971 12001 29460 35018 23390 7573 2254 -592 -16324 -37621
721 -37621 -39210 -17224 4663 8654 10369 26119 40144 30776 3821 -16136 -19136 -22288 -28405
734 -28405 -29657 -15427 8968 26113 31553 25501 18523 11618 1688 -15519 -32913 -34969 -18753
747 -18753 -2990 -155 2477 19022 36429 31746 9622 -6169 -7282 -11798 -26561 -34930 -23007
760 -23007 -122 15359 19450 20630 24556 23398 12257 -7484 -25498 -30012 -22398 -14114 -10825 -2891
774 -2891 15659 33646 31568 14588 1966 869 -4593 -22212 -34350 -25471 -6633 6174 8663
787 8663 14137 25302 29883 19289 280 -15300 -20447 -20589 -21449 -20904 -11067 9319 26627 29125
801 29125 18814 12056 10293 1821 -17543 -32725 -27745 -11747 -1725 -186 7321 23529 31344
814 31344 22535 4912 -7432 -11224 -15317 -22959 -25815 -16943 1720 16093 21240 19180 18032 18318
828 18318 8984 -10354 -25703 -26073 -16737 -10365 -8315 1461 18623 30008 24252 10780 1566 -1950
842 -1950 -10444 -22459 -28245 -19441 -4671 7920 12502 15637 21242 22574 13846 -3693 -17050 -19365
856 -19365 -16530 -17080 -15971 -5794 11924 24464 22732 14524 9791 6102 -3862 -19664 -27532 -21304
870 -21304 -9481 -288 3726 11441 22125 25859 16729 1984 -9107 -12590 -15404 -20226 -20594 -10008
884 -10008 6194 17082 18155 15399 15052 13351 2481 -13765 -23285 -20807 -12907 -7759 -4490 5509
898 5509 19843 25176 18787 7116 -789 -5257 -11419 -20535 -23304 -14799 11 9783 12647 14554
912 14554 18109 18199 8211 -7293 -17228 -17838 -14260 -13375 -11003 -676 14221 22400 18752 11350 6400
927 6400 2054 -6722 -17892 -23071 -17426 -5980 2064 6706 12234 19107 20991 12517 -829 -10479
941 -10479 -13029 -15200 -16687 -15020 -5025 8302 16780 16893 14256 12157 7767 -2168 -14070 -20242 -16920
956 -16920 -9430 -5097 430 8415 18021 20766 14153 4448 -3089 -7490 -12479 -18229 -18181 -9182 2526
971 2526 10503 13044 14093 14796 11836 2531 -9572 -14920 -15341 -12775 -10485 -5267 3543 13805 19315
986 19315 14844 8157 3884 -1799 -9124 -17612 -18269 -11741 -3292 4090 7137 11911 18192 16162 6420
1001 6420 -2941 -10873 -13005 -12348 -13863 -11008 -1156 9426 15435 13653 11430 9100 4332 -4756 -14910
1016 -14910 -17339 -13813 -8275 -2217 2586 9495 16511 16417 10402 1527 -5295 -8299 -11781 -16184 -14212
1031 -14212 -5386 4519 10655 12321 13461 12560 8359 -68 -11131 -14844 -13514 -10981 -7772 -2408 5871
1046 5871 13652 16342 11901 5691 363 -3505 -10157 -16045 -14670 -8071 -27 5844 9116 12169 14166
1061 14166 12588 4238 -6341 -11521 -12085 -11826 -10635 -7059 2413 10250 13417 12035 8852 5455 762
1076 762 -7536 -12843 -14568 -10719 -4633 -106 4511 9502 14209 13014 7161 -1189 -6391 -8310 -10978
1091 -10978 -12511 -10024 -2141 6449 10618 11226 10797 9950 5055 -3412 -11299 -12435 -11011 -7450 -4686
1106 -4686 -644 7031 13395 13614 8784 3098 -1338 -5654 -10228 -13546 -12267 -5251 2411 6284 8508
1121 8508 10922 12025 8207 1164 -6302 -10436 -10083 -10147 -8645 -2456 4719 9696 12221 10262 7235 3352
1137 3352 -2099 -7445 -12084 -12489 -8220 -1992 2068 5018 9201 12302 10120 3534 -2333 -6878 -8028
1152 -8028 -10424 -11797 -5757 695 7518 10292 10262 9541 6891 1334 -5261 -9835 -10707 -8514 -5935 -1321
1168 -1321 2867 8123 11148 11292 6835 1389 -2503 -6480 -9179 -11423 -9088 -2515 2881 6087 9093
1183 9093 9217 9954 5160 -1884 -6856 -9164 -9334 -7614 -4886 -43 5534 9912 10655 8510 4567 735
1199 735 -3787 -7919 -10323 -8856 -5629 -83 3215 6233 9442 10845 7899 1288 -3453 -5575 -7921
1214 -7921 -10219 -7452 -3672 2481 6461 9482 8726 6788 4231 -836 -5366 -9020 -10255 -7537 -3228
1229 -3228 -252 3130 7622 10130 8196 3150 -649 -4188 -6137 -9319 -9143 -6160 -929 3488 6179
1244 6179 7339 8005 6431 3018 -3270 -7329 -8669 -7584 -6257 -2979 1092 5557 8811 9361 6328
1259 6328 2097 -1047 -4467 -8073 -9637 -6937 -2457 1106 4152 6791 8822 7787 4165 -153 -4145
1274 -4145 -6875 -7714 -7101 -5378 -1346 2468 6703 8491 7585 5000 1810 -2120 -5941 -8703 -7962 -5050
1290 -5050 -1717 1443 5190 7809 8566 5806 2096 -1750 -4836 -6997 -8265 -7521 -2865 1447 4229
1305 4229 5844 7851 5898 3578 495 -4008 -6274 -8067 -5766 -5209 -1167 2702 6196 7681 6700
1320 6700 4367 1457 -1603 -5515 -7420 -7158 -4422 -1684 1755 4822 6657 7394 6015 2833 -1210
1335 -1210 -5152 -7546 -6115 -5454 -3541 614 4239 6483 7250 5478 3331 236 -3370 -6627 -7684
1350 -7684 -6460 -4310 -486 2568 5245 7025 6619 4013 891 -2514 -4798 -6446 -7687 -5248 -1648
1365 -1648 2349 4921 6430 6187 5272 3216 -1112 -4309 -6746 -6585 -5261 -2668 -22 3676 5988 6370
1381 6370 5188 3102 218 -3463 -5235 -6268 -5933 -3801 -512 2740 4570 5768 6133 4284 1406
1396 1406 -2307 -4793 -5627 -5756 -4741 -1049 1473 4404 6087 5267 4413 2211 -1404 -4219 -6087 -6439
1412 -6439 -4693 -2012 227 3355 5634 6322 5358 2546 -331 -3134 -4680 -5736 -5309 -3682 -272 2879
1428 2879 5312 5875 5385 3585 966 -2231 -4595 -5498 -4855 -3449 -1073 1423 4094 5539 5298 3628
1444 3628 1692 -1314 -3666 -4896 -5138 -4251 -1938 747 3522 4798 6015 4248 2814 96 -2749
1459 -2749 -4325 -5452 -4778 -2937 -449 2307 4648 6088 5099 2359 412 -1441 -4458 -4920 -5333 -2953
1475 -2953 -909 1845 3932 4951 5179 3507 1293 -700 -2654 -5395 -4982 -3969 -1404 962 3192
1490 3192 5076 4974 4340 2032 -594 -2888 -4625 -4151 -4523 -3094 -90 2395 3439 4518 4097 3240
1506 3240 533 -1420 -4296 -5006 -5591 -3405 -640 1353 3273 4235 4292 2525 1808 -1165 -3142 -5314
1522 -5314 -3812 -3288 -1468 406 3529 4273 4370 4174 2510 1428 -3317 -4020 -4527 -3759 -2263 366 2047
1539 2047 4397 4632 4161 1834 655 -2108 -2980 -4680 -4905 -2945 -145 1833 3263 4287 3804 3319
1555 3319 707 -574 -3316 -3961 -3998 -3134 -1671 86 2634 3833 4425 3077 2714 -1025 -2103 -4187
1571 -4187 -4289 -3344 -792 69 1631 3975 2822 3930 2231 576 -2136 -3866 -4395 -3264 -2838 -740
1587 -740 1181 3754 4166 3659 2794 741 -1350 -3083 -4571 -3503 -3161 -1825 891 2280 3493 4566
1603 4566 3008 368 -973 -2537 -3723 -3398 -4261 -2290 688 1842 2537 3102 3006 1554 -39 -1730
1619 -1730 -3087 -3331 -3265 -3003 -642 942 3290 4194 3579 2049 1105 -1209 -2784 -4018 -3433 -2824 -1336
1636 -1336 1151 2547 2594 3157 2687 992 -995 -2218 -3364 -3241 -3498 -2308 179 2380 3229 3600 2922
1653 2922 2623 538 -2274 -3322 -4953 -4172 -2890 -690 1630 3252 3921 4193 2460 914 -972 -2168
1669 -2168 -3412 -3650 -2681 -566 792 3018 3829 3775 3200 1993 -545 -3177 -2673 -3216 -2551 -2209 -591
1686 -591 1986 3903 3594 2855 2143 -62 -1954 -2937 -4010 -3806 -1599 -700 1479 2731 2854 3369 1920
1703 1920 487 -802 -2054 -3015 -3124 -2181 -716 417 2442 2951 2624 2762 630 -854 -2708 -3299 -2730
1720 -2730 -2649 -1043 629 1662 3316 3039 2975 1469 411 -1257 -1900 -3142 -3189 -1477 -667 1534 2778
1737 2778 3599 2390 1767 581 -423 -2419 -2880 -2764 -1489 -1307 500 2053 2897 3168 2242 1024 -407
1754 -407 -2213 -3513 -3190 -2917 -1477 -195 1532 2784 3175 2532 1933 -277 -1570 -2677 -2885 -2238 -2068
1771 -2068 -407 2050 2475 2915 2788 1953 826 -637 -1152 -3197 -2824 -2199 -991 707 1826 3250 3088
1788 3088 1506 127 -387 -1154 -2289 -2998 -2742 -1048 357 1547 2432 3059 2321 1721 230 -1373 -2571
1805 -2571 -2268 -2188 -1241 -1163 628 1988 2863 4074 2571 843 -670 -1291 -1967 -2035 -2024 -252 136 2207
1823 2207 2321 2092 2048 1028 -625 -1316 -2630 -2281 -2143 -1510 605 1794 3436 2427 1927 2048 444
1840 444 -175 -2704 -3366 -1805 -1300 149 465 807 1543 1577 1624 535 -270 -1724 -1361 -1993 -1823 -535 462
1859 462 1588 1758 2238 1281 1504 7 -1402 -2623 -2121 -1090 -799 43 1443 2113 3158 1871 1732
1876 1732 -909 -513 -2479 -2561 -2067 -2179 -578 1289 2585 2108 1377 2995 648 -328 -1646 -2439 -1992
1893 -1992 -2072 -1338 1150 1199 2036 2352 1694 630 -56 -788 -2638 -2193 -2654 -1100 432 1181 2043 3724
1911 3724 1736 1952 -306 -602 -1013 -1444 -3260 -1262 -610 1222 1492 2497 1520 1678 395 -1092 -208
1928 -208 -3190 -2987 -1488 111 665 1027 1914 2461 886 905 -622 -631 -1191 -2356 -2473 -1052 83 1365
1946 1365 2218 1844 1723 1614 -896 210 -1927 -2186 -2475 -1171 -435 879 1536 1173 1609 1144 237 -515
1964 -515 -1846 -2509 -1483 -1593 -372 -246 1504 1536 1897 1418 515 -659 -1221 -697 -2485 -1008 -156 -1
1982 -1 1898 2445 2630 740 575 169 -1073 -1698 -1266 -2396 -1240 1188 1145 1226 1357 2144 415 272 -607
2001 -607 -719 -2111 -1913 -1174 982 1299 1151 1612 1106 1520 829 202 -690 -2008 -1359 -1680 -516 -209 654
2020 654 1511 2212 1717 -72 164 -321 -2891 -2165 -2554 -692 -367 -5 1816 2705 2874 1007 -1183 -422
2038 -422 -971 -1804 -1428 -938 -798 642 1611 737 2043 620 711 -258 -966 -1926 -1837 -1479 -322 510 1065
2057 1065 733 1986 2508 874 150 -286 -2962 -2710 -1509 -1980 593 901 1812 2128 1269 1105 226 -137
2075 -137 -1932 -2126 -641 -1162 -231 -430 768 1106 2293 1706 1054 419 -657 -1743 -1405 -1869 -1005 788
2093 788 1618 1198 949 1201 1132 -584 -250 -931 -2191 -1450 -625 -982 835 1516 757 1665 1147 -32 99
2112 99 -1156 -1685 -2020 -797 -417 38 1213 1031 1469 1109 -18 -539 -194 -960 -1015 -1621 -801 395 799
2131 799 1089 1678 996 1002 552 -216 -1167 -1716 -784 -937 67 519 1152 1866 1488 1141 162 -1039 -766 -1460
2151 -1460 -1064 -1171 -130 720 1614 1544 1944 838 622 -324 -854 -1527 -1349 -996 -503 -144 828 1341 1453
2170 1453 960 651 419 -915 -1118 -1489 -1037 -175 -233 46 863 1022 1507 1141 -505 -633 -1149 -1383 -390
2189 -390 -680 -134 603 926 810 1229 1148 720 -321 -896 -1602 -1697 -1178 -358 -135 298 1236 1304 690 471 -193
2210 -193 -1081 -1493 -1392 -823 -534 258 596 1380 885 1268 1423 988 230 -916 -959 -2026 -1402 518 1200
2229 1200 268 1039 1566 295 488 -549 -816 -1219 -1303 -900 -48 514 632 -91 953 1269 1607 505 -673
2248 -673 -630 -800 -1010 -1307 111 914 1074 815 927 768 799 -576 -182 -1489 -1129 -323 -234 580 386 1065
2268 1065 711 1330 1053 -755 -1570 -1502 -923 -612 -805 -218 906 1252 1683 263 169 542 -1261 -102 -1492
2287 -1492 -521 -32 -684 323 590 1614 1206 901 476 -202 -781 -1375 -816 -845 -193 440 762 1192 1151 1507
2307 1507 122 -372 -877 -1941 18 -417 -948 -95 1134 852 393 468 240 -429 194 -1179 -440 -2154
2325 -2154 -1040 -613 858 298 593 1141 225 661 -1307 -87 -757 -723 -663 -143 355 1106 666 635 1935
2344 1935 991 -179 -410 -807 -455 -648 -156 633 395 944 1802 1175 520 -397 -149 -1625 -1689 -794 -242
2363 -242 180 305 571 804 1088 870 815 -694 -372 -905 -569 -666 -460 -203 788 755 790 882 194 -749 -518
2384 -518 -668 -1605 -458 -560 390 922 691 1040 715 208 -420 -282 -960 -337 -769 -353 -188 125 949 746
2404 746 252 750 104 -1064 -621 -629 -830 -912 68 -371 909 810 749 932 511 -715 -173 -688 -389 -498 -81
2425 -81 423 353 1084 1037 1263 597 -162 -562 -874 -866 -700 -265 330 296 747 953 745 624 -19 -500 -756 -1051
2447 -1051 -808 -683 47 494 747 822 908 450 284 -257 -453 -748 -623 -640 -312 105 636 774 854 510 494
2468 494 -83 -399 -682 -629 -648 -359 -42 379 756 1029 711 524 -143 -353 -371 -525 -920 -591 116 92 241
2489 241 601 762 729 116 -305 -352 -405 -410 -418 -646 -65 850 1145 1132 692 144 165 -486 -871 -1201 -1002 -338 460
2512 460 822 808 376 808 210 -4 -818 -651 -567 -687 -750 -21 -106 447 225 170 478 -93 -358 -1082 -336 -778
2534 -778 -504 -392 28 455 1061 724 689 388 -83 -50 -431 -865 -768 -183 88 605 108 486 433 395 -41 -29
2556 -29 -689 -585 -612 -582 -257 439 701 541 411 485 88 -5 -280 -666 -1052 -890 -168 -147 424 305 863 674
2578 674 581 -101 -455 -172 -947 -782 -384 97 302 741 837 781 51 442 889 -603 -854 -905 96 12 251
2599 251 773 683 1097 1175 -125 -1186 236 -647 -443 -851 -414 169 -334 211 995 873 979 -636 -225
2618 -225 -647 -536 179 -1132 -246 475 323 831 281 1023 354 128 185 -834 -481 -288 -643 -252 657 212
2638 212 707 525 68 -655 271 -716 -147 -223 -241 -196 333 694 307 1093 1391 52 8 -217 -776 -320 -271
2659 -271 619 -381 657 -248 996 526 15 -194 -604 -823 -449 5 -31 513 605 936 363 793 -136 -810
2679 -810 564 -82 -828 -470 -586 -188 395 750 456 282 257 808 215 -1012 -925 -959 -848 -162 26 -17 841
2700 841 534 704 504 -363 -214 -350 9 144 -520 488 -451 1051 350 13 -328 -197 -88 -246 -536
2719 -536 -596 -169 645 -401 583 285 138 182 -578 -21 -733 72 -580 985 126 262 374 364 62 338
2739 338 -221 619 -290 -1378 -200 556 481 -173 -225 47 832 626 24 417 115 -797 -512 -859 237 -8
2759 -8 -187 149 817 181 141 -376 -623 -332 -143 61 -47 -262 637 309 214 343 141 95 -539 -531 -402 -706
2781 -706 341 -347 437 12 1127 782 906 -111 40 -246 -1028 -970 19 97 -498 459 82 1055 -194
2800 -194 50 -538 -137 -197 -431 -1015 16 618 453 8 739 -349 -132 590 300 -628 -351 -954 -599 -466
2820 -466 -561 670 -100 482 82 177 -968 -141 -701 -130 459 -420 -505 -137 -693 394 477 97 637 -30
2840 -30 -195 192 67 342 49 487 807 -47 488 709 595 414 -114 -330 -587 -585 23 -174 -614 687 536
2861 536 873 117 -259 -231 -134 -492 -237 -191 631 166 794 671 494 286 -264 -504 -680 -440 480 691 466
2882 466 -107 -116 -138 105 115 -290 -77 -272 -656 8 445 -428 184 618 853 487 243 -509 -1122 -920 -156
2903 -156 121 -502 213 -1219 888 -596 -6 336 173 -559 -534 -817 -813 -248 -388 -229 16 173 525 301
2923 301 -168 -1213 -201 164 97 -301 -321 84 -236 944 -571 293 247 -81 -542 -80 -303 98 129 -620
2943 -620 413 85 39 -87 -188 429 239 -133 -753 -336 167 280 147 -218 267 688 -668 147 288 -425
2963 -425 -448 -347 -239 82 -786 -322 411 712 -267 -486 335 10 276 -307 54 -208 -567 146 470 -176
2983 -176 574 231 -125 194 -711 -422 -92 -579 109 -180 206 226 -10 -198 -212 270 -660 -883 -299 -706 -464
3004 -464 -62 -507 687 570 -449 95 -323 -602 -567 -994 -97 -128 -571 178 287 -4 294 10 -71 -231
3024 -231 -88 -35 -435 -255 -65 -112 312 -349 689 -204 409 -292 -120 55 -240 -161 333 -499 -111 -137 728
3045 728 -114 -221 51 445 -350 -244 78 -866 -432 -116 191 -456 562 142 410 -548 194 -454 408 -866
3065 -866 436 -134 -244 343 168 392 -40 394 -239 -486 137 -539 -261 -274 -50 485 -65 579 -113 286
3085 286 -45 -24 102 -335 -275 187 -326 -384 541 601 796 401 0 166 481 -513 -482 523 288 162 568
3106 568 565 917 503 -113 -648 -260 -139 -884 -67 -140 36 74 327 453 790 364 -222 -309 144 -120 -296 333
3128 333 313 -813 485 715 -41 50 238 -291 -425 -491 193 45 -492 -520 45 199 98 -1 -218 -356 -544
3149 -544 150 -399 -169 475 220 -248 -148 393 265 -146 -154 -394 -356 -93 -284 -240 276 360 -84 379 195 105
3171 105 -160 -42 -260 -249 -309 -70 81 -13 285 -24 -229 -160 -160 399 -272 -168 -198 -460 321 -6 -679 86
3193 86 283 -67 367 39 19 -121 -347 -217 -297 -147 95 579 -257 326 132 631 -12 -253 182 -102 405
3214 405 -168 126 69 296 845 -635 23 -428 393 35 -352 283 -51 278 -17 244 440 -245 211 -252
3234 -252 -184 124 -344 -284 -286 185 -100 326 -175 151 166 -42 -164 -234 -36 -37 -409 598 601 -48 973 -407
3256 -407 421 -458 -78 -188 -430 442 -496 -541 57 -836 176 456 -257 80 213 -118 305 -268 -351 60
3276 60 180 -7 640 -270 73 178 125 -278 252 -321 -328 -514 271 815 354 -8 -286 109 165 -332 164 -208
3298 -208 -158 1029 87 -165 114 176 -158 -58 -104 -335 -442 -113 -194 31 -133 371 583 -71 461 737 567
3319 567 -224 597 31 152 76 211 2 505 -109 664 -97 -375 702 830 707 828 126 -30 -220 310
3339 310 -392 -354 265 453 -229 40 304 -387 291 -193 352 -111 293 562 404 183 -386 -50 635 -326
3359 -326 148 -428 -209 -391 38 60 -134 -26 -305 214 710 -687 258 300 -198 -5 -562 433 489 174 113
3380 113 -65 -114 225 -26 -318 -190 509 189 -189 -67 -569 125 -264 -233 -273 -260 151 264 -634 -111 655
3401 655 -158 -188 -493 -138 -97 168 -431 177 136 -436 594 58 -73 232 -126 977 88 655 5 -526
3421 -526 -112 379 256 -206 129 -439 -92 218 -413 -155 286 -259 164 381 121 229 854 -12 -369 67
3441 67 -113 -785 -275 -234 -117 237 -785 -414 -97 -42 708 -99 736 322 290 -118 -581 -202 -129 -750 -406
3462 -406 293 158 635 -835 210 -271 -144 744 -291 -35 94 -937 -362 836 105 279 -391 -675
3480 -675 -580 -1 6 86 727 -12 75 194 -303 649 622 998 -3 612 252 525 397 704 -53 461 -234 142
3502 142 -236 218 721 -679 182 -6 -295 44 463 39 -76 232 2 -161 -216 228 -30 -84 -421 321
3522 321 -650 -253 5 64 -475 63 392 73 -496 415 88 -110 -441 597 979 -274 425 -443 -114 25
3542 25 -60 543 -31 -394 -117 -115 1114 783 -228 322 -462 -28 -224 252 -458 -674 53 -140 -87 -145 206
3563 206 -171 406 15 75 245 -321 -184 -187 12 -109 114 -166 251 302 107 191 -173 14 -311 -184 46 -167
3585 -167 307 519 94 332 441 -106 182 -172 -7 -15 239 86 -322 109 280 133 48 -51 122 -49 66
3606 66 94 99 80 -175 45 141 54 -60 235 -354 283 140 -17 146 365 119 -117 186 -172 13 118 82 -216
3629 -216 -315 -79 176 -29 61 108 46 365 -123 282 102 -42 128 -82 52 193 317 232 176 -37 101 -111
3651 -111 55 225 -217 -569 -192 -67 -57 -182 200 33 -78 198 -448 -101 -87 229 119 -528 -135 -24 -242
3672 -242 3 -75 58 288 54 476 230 -189 -71 -437 378 -164 -164 398 -84 -61 -225 202 4 -28 93 366
3694 366 -451 -156 -139 9 92 362 -158 74 73 -339 -123 47 439 -341 -164 76 -203 23 -39 267 -389 153
3716 153 -19 -47 -233 -291 245 137 102 74 494 136 -227 -388 -43 -108 76 435 -767 488 -134 49 229
3737 229 173 47 -229 -387 9 -240 87 -24 -68 -259 -43 94 35 -457 -306 -154 395 -690 250 118 -172
3758 -172 -49 -68 27 164 -396 -497 -747 32 -46 300 -288 396 292 491 -350 -15 -119 -1122 -164 259 61
3779 61 -599 168 57 352 -302 148 427 227 -418 -123 -524 -659 -319 -363 204 246 -103 -267 -255 -227 -68 37
3801 37 -77 754 17 424 464 170 773 116 -78 178 282 -238 -263 -68 333 474 -652 -457 192 215 -409
3822 -409 -93 -170 -250 360 -111 -114 -12 152 -80 7 512 -138 -234 -470 -362 37 -40 -19 749 -290 437 -104
3844 -104 -939 130 -991 -616 672 -584 81 109 94 64 -155 -612 132 -621 550 415 492 13 -85 196
3864 196 -194 -385 -120 64 -44 -73 563 83 179 -248 315 -5 -342 -19 293 -600 68 -598 -517 -568 -122
3885 -122 202 -148 -402 -244 -667 -785 -140 128 -382 -114 -121 -332 153 -613 -414 -85 -633 -277 105 -533 175
3906 175 363 297 309 81 -624 720 -128 -23 -53 287 -337 -70 189 103 139 24 -86 -591 225 -229 -406
3927 -406 26 194 -62 -72 -13 452 -323 -261 -281 -227 -114 659 46 150 -219 68 164 180 -568 -297 97 -218
3949 -218 -188 -188 410 434 -223 -8 247 197 154 -140 361 -140 -226 127 -60 144 238 47 112 368 -217 -513 392
3972 392 -345 -176 433 -121 49 -268 -241 -19 132 -101 80 -155 -224 -140 -266 150 362 171 -133 -274 -284
3993 -284 -91 73 -12 -134 -123 2 176 -133 -111 179 215 28 -48 -339 309 153 -98 77 -324 8 -301 -8
4015 -8 364 48 -33 -120 19 42 29 81 -82 -597 93 206 -15 17 -59 545 -867 -856 846 -35 166 -78 6
4038 6 -179 -588 -1 -20 -196 94 238 -426 -515 78 240 -365 65 259 369 -336 -1 -55 -356 -24 -119 -162
4060 -162 -232 67 -568 164 157 273 -189 -170 -244 -618 18 269 151 -173 102 49 60 86 250 76 -12 0 -60 -69
4084 -69 242 299 -11 -163 -79 -3 -130 9 -266 423 169 156 410 -285 -353 -78 -28 561 76 -72 336 -195
4106 -195 -59 106 234 -41 -59 -38 201 49 -134 -17 -117 164 -182 -187 525 75 104 -286 45 253 38 -218
4128 -218 -46 113 202 199 -54 271 154 -80 122 -164 -114 336 187 265 163 -18 -108 -408 365 420 -357 52
4150 52 117 -686 198 -22 63 -180 -185 -29 -460 305 -188 25 -276 -175 -492 123 342 -463 -208 -218 -360 -366 -585
4173 -585 -232 355 -314 -415 67 138 -354 -31 -177 -539 -182 90 -21 429 -637 289 526 98 284 541
4193 541 -205 -324 -610 -252 920 -393 -129 -19 -162 127 386 54 135 38 -175 184 -67 52 -177 222
4213 222 -383 -371 79 33 64 169 90 221 32 -78 -239 -5 57 73 249 -349 41 2 201 -374 83 -66
4235 -66 111 -282 -124 -100 -396 -158 -184 268 322 119 -780 121 -174 27 -248 53 265 -117 -26 149 -179 -298
4257 -298 -375 379 52 -517 -86 763 -490 -1107 -518 -57 -491 -829 384 -249 -467 -453 -274 18 463 277
4277 277 -327 -409 372 -457 106 -425 286 221 390 122 148 -89 304 10 25 235 102 -297 149 -71 116
4298 116 -709 -1059 172 134 -455 -342 52 161 369 -344 240 402 66 -322 284 709 364 115 -107 -594
4318 -594 -694 -204 145 66 335 -179 673 271 635 972 -754 303 506 -26 -262 129 44 68 -178 119
4338 119 -133 237 -690 290 -413 -289 -199 -143 59 -162 39 131 -249 267 117 -373 -265 -433 69 -46 -164
4359 -164 -3 -95 98 -208 -14 -56 -110 -278 107 231 -378 -169 491 -356 -29 -47 -95 -152 272 -315 -796 382
4381 382 34 54 56 123 41 -35 -146 21 -36 -373 124 187 242 -216 -183 -104 -451 247 295 377 -345 192 1 -105
4405 -105 -153 -454 244 396 433 747 91 719 -77 109 108 -149 -169 29 -18 -59 -92 145 173 239 -23 196 30
4428 30 -18 -150 -78 -352 111 -51 -261 75 -80 138 -401 -43 -75 271 50 -226 -82 -30 35 -27 190 71
4450 71 97 18 -56 210 -113 225 -96 -126 -86 283 -287 -29 181 -175 214 -71 -95 76 -88 47 -84 24
4472 24 -54 -555 -243 -208 -115 231 77 -29 -283 289 -341 -20 79 343 -143 -138 -51 97 -87 189 -11 -466 256
4495 256 215 268 161 -25 169 -36 185 120 -158 -224 -44 -24 226 93 242 124 -88 77 282 -101 6 -76
4517 -76 -71 137 39 93 971 417 161 79 303 -29 -250 -43 44 -94 -347 233 -267 308 -42 110 142 40 3
4540 3 -40 -243 144 -19 18 203 -42 -58 -337 -36 -147 -391 -107 53 163 42 28 174 -58 190 -57 36
4562 36 322 -31 55 -175 170 56 154 -408 359 153 -249 -125 174 136 -77 38 -146 -41 -50 -94 49 96 117
4585 117 49 -86 236 106 -48 -43 -23 -246 153 -169 126 -131 4 -50 -232 29 -109 53 -5 -213 -59 59
4607 59 -46 -4 432 -45 -129 -148 38 78 84 6 128 5 -6 -77 -206 103 207 105 196 -13 13 -39 88 -66
4631 -66 120 73 187 80 164 12 249 36 -28 297 32 -174 103 66 -168 255 -273 -130 -138 -38 -198 -106 34
4654 34 99 360 187 12 -87 166 37 42 69 -95 77 122 -125 29 343 43 48 117 -45 -255 -90 109 135 -48
4678 -48 -228 -159 127 102 -70 43 116 156 -16 -66 229 -94 -15 -46 -102 5 372 -354 -548 237 6 -252 124
4701 124 45 -195 -182 -195 -255 -62 -88 -22 92 -84 449 -72 -41 159 141 -79 -396 139 -59 77 45 -207 85
4724 85 -21 38 172 120 46 3 -4 67 46 -143 -74 99 -314 -136 -116 -217 43 -77 6 -115 -195 -59 130 35 -46
4749 -46 1 4 -135 -123 -95 -142 -181 -245 136 -22 -186 115 58 -74 144 359 -302 -23 227 -17 41 210 155 -242
4773 -242 36 -131 -58 81 -153 29 -49 -21 -257 -126 44 105 -14 -16 32 -177 -222 -284 -368 300 125 -189 -92 86
4797 86 165 -135 189 5 -333 -9 135 80 -238 -168 239 308 -206 24 187 -704 -300 18 338 -452 491 315
4819 315 -499 -341 -261 369 72 -189 -355 -5 -86 -86 -209 16 -164 -44 -19 -143 109 85 104 289 -199 86
4841 86 69 29 -36 -177 -280 37 65 -72 31 -609 140 3 -14 205 -24 -110 163 172 62 58 114 -251 8 212
4865 212 350 -11 -131 50 -76 -91 131 -113 4 401 -21 92 24 65 -92 118 -242 377 203 169 292
4886 292 202 63 154 38 197 151 190 159 -52 -87 35 139 -96 201 -63 -181 -143 534 51 25 20 -418 69
4909 69 -425 -1267 154 83 -683 -95 -225 38 -318 135 -367 -188 52 -185 -111 15 -92 231 10 -98 141
4930 141 104 302 560 10 143 -11 -156 -84 286 -235 -75 113 719 -479 122 -351 -56 -62 235 -828 -166
4951 -166 283 111 -946 153 361 195 26 183 -123 -244 380 -580 96 226 10 264 104 479 399 276
4971 276 155 158 501 447 49 282 133 -205 -394 -461 -23 101 -1300 -93 403 -68 -216 -54 -155 -205 -366
4992 -366 -344 23 118 -378 235 -9 -216 153 -906 -529 540 -712 446 -729 -567 -130 310 -125 223
5011 223 11 165 -803 -162 585 -437 389 -622 72 -667 -270 -93 428 339 152 46 58 71 526 -185
5031 -185 -109 -103 -340 -684 112 324 -186 -94 -64 196 -228 -69 -3 192 -162 312 67 -240 67 240 -20 536
5053 536 -205 188 -1015 -137 399 -132 72 -177 -351 -260 280 -462 51 46 361 341 -358 -10 59 -344 -389 -355
5075 -355 -95 -275 2 -73 -240 -196 -215 -69 -222 411 327 415 -757 -56 -147 68 64 -36 -251 -241 -227 787 -267
5098 -267 -204 -755 102 186 403 -371 140 -329 -454 -443 -453 -497 -531 -415 -200 -383 363 519 -119 -54 560 -322
5120 -322 -64 302 -322 171 -193 12 -62 -151 -128 574 -78 399 127 136 -329 -53 -275 286 -869 -161 -396
5141 -396 -11 577 -330 -719 -197 -342 -439 -583 -561 479 -426 592 -193 -129 325 -154 -608 292 -180 388
5161 388 60 -69 -25 -73 -307 467 437 61 -314 -54 -35 -205 -504 478 -42 174 77 639 -291 -337 -313 -459
5183 -459 379 -194 391 -252 -687 -323 89 76 259 -757 63 452 -364 -98 50 51 -426 161 -79 -838 238
5204 238 -334 -429 -125 75 -5 146 146 299 -216 61 73 -168 -49 -49 44 -306 -15 230 116 317 623 -23 223
5227 223 321 19 282 -131 350 -60 -234 -386 -135 -12 58 -161 -43 -171 -658 -324 -391 -272 -231 758 -165
5248 -165 64 5 -332 -551 -21 208 67 -318 -266 37 -246 57 263 463 -139 68 335 400 141 103 -142
5269 -142 223 -7 13 -192 -319 295 296 -32 -22 187 -192 -231 -91 795 57 95 -27 -48 309 131 239 122
5291 122 154 -14 205 -177 -546 -148 -354 38 -458 -507 414 181 -173 16 -190 241 195 -75 -55 -40 361 -70
5313 -70 190 -364 98 23 -113 181 -88 -5 119 -124 357 -298 142 -110 -174 315 63 29 64 80 -113 -229
5335 -229 -118 -94 -281 -434 -522 -292 111 281 465 -315 -112 563 -330 344 -150 -300 174 -122 -320 -296 -356
5356 -356 -222 -323 117 70 -166 24 384 608 -246 329 16 161 266 -298 190 -9 125 158 -121 0 -59
5377 -59 64 -61 56 164 -106 -83 -92 162 -26 112 31 72 34 -151 40 14 207 -136 145 -83 -157 -10 -293
5400 -293 318 137 -189 38 -182 147 -122 -177 -117 90 221 -28 58 195 106 60 162 184 -121 -211 -59 -16 18
5423 18 112 -13 -66 137 -75 -357 -85 -208 5 -26 -314 -125 105 -66 -134 -50 -82 -246 -125 35 -215 -447
5445 -447 -345 438 -149 26 141 -88 -313 149 21 -101 400 -59 299 378 -1218 -179 -359 -370 -407 290
5465 290 355 -299 -56 -124 26 193 -694 -645 -460 -576 863 -50 236 -478 274 -519 -287 -706 618 -494
5485 -494 152 -93 -529 437 -653 268 14 -743 143 11 -153 -33 296 72 -58 91 -363 401 -226 507
5505 507 180 -436 733 -46 -519 -226 6 487 187 236 -129 9 121 -37 269 255 525 403 -105 252
5525 252 -47 53 211 259 241 -64 -53 -3 101 -77 204 -94 -145 128 -105 -127 117 29 -221 134 -13 66 -6
5548 -6 63 -106 8 61 -47 17 -77 -224 -35 -35 -88 103 82 143 130 -32 190 107 -170 177 -19 -139 193 31
5572 31 -131 166 257 60 -25 229 169 -16 28 363 -207 76 -122 -26 362 -35 -85 -13 -753 -63 -254 -81 96
5595 96 461 -8 158 -520 275 597 455 -282 315 478 204 -77 197 -20 -65 292 43 -457 580 194
5615 194 166 -127 418 235 195 -88 -177 -47 -46 256 -344 128 -31 118 -34 -149 -63 132 136 -210 -129 -172 -56
5638 -56 -446 406 -324 10 -2 -826 -166 -33 -348 564 -118 -154 218 -176 482 166 -259 -87 224 -193 -645
5659 -645 650 -446 -114 -670 -80 572 -253 -443 894 -327 -368 -423 -179 -289 -14 191 -231 368 116
5678 116 80 -153 -146 42 232 377 -562 -74 62 -401 110 -4 158 127 82 8 281 108 -171 236 -75 590
5700 590 99 3 178 -302 339 -222 411 -410 -339 -59 -3 -279 -181 -295 52 -143 50 -59 -44 -23 -346 282
5722 282 18 -3 421 -82 140 91 -172 -105 -37 -75 -183 -142 -176 -543 -240 -46 -68 45 -159 80 252 -552 17
5745 17 -97 -115 401 -182 -101 -27 169 -169 405 7 385 320 -140 -293 197 27 -478 -98 287 287 414 -28
5767 -28 -174 564 109 707 159 -104 413 -64 587 370 -329 507 -744 319 105 -423 -207 264 262 -420
5787 -420 425 -471 -607 -264 -450 -460 -178 72 580 -145 -454 67 551 402 -42 705 -746 78 -135 -45
5807 -45 -138 -183 302 419 166 -106 294 -197 605 370 60 34 -21 -184 -756 379 770 -634 341 493 -70
5828 -70 195 -337 -437 130 -843 -230 566 618 382 -426 206 -559 137 105 -152 -95 -110 -247 536 501 -114 69
5850 69 178 502 413 332 -127 -89 590 438 -192 -235 410 -70 -295 -286 -190 292 -149 174 548 -137 117 -269 74
5873 74 190 -430 -44 251 -264 43 316 347 176 13 -148 269 355 -40 100 332 -40 68 90 14 -76 24
5895 24 -408 54 -270 225 68 0 -24 173 -88 -87 -320 -330 -307 91 493 348 143 -293 -123 -193 185 98 59
5918 59 -200 175 -295 -135 -224 300 91 -68 302 130 -139 63 50 -24 -74 27 68 -125 -87 -314 -323 -183 352
5941 352 -41 225 160 213 12 -121 -441 65 -178 -300 -34 138 281 -640 -78 -206 -223 -160 220 -189 420
5962 420 -189 -559 -926 298 -240 -276 -46 -27 1 -18 221 3 302 313 131 -574 -99 -127 371 -140 278 153
5984 153 -215 -540 12 2 -6 -177 188 94 233 240 49 -116 -230 272 97 96 68 -150 513 249 15 411 172
6007 172 225 84 109 150 -241 61 4 35 -31 -84 -163 -46 71 -234 -11 306 -79 213 191 -293 -215 -34 142
6030 142 338 543 381 477 -155 287 -87 213 126 158 219 -393 -687 411 124 -190 118 93 75 -89 -445 -53
6052 -53 218 -53 215 133 287 -39 -97 68 -89 -258 341 -633 15 -115 60 611 -395 9 -66 274 239
6073 239 12 54 -504 247 170 403 192 277 -496 -287 70 546 -214 184 294 -784 -83 -92 -66 337 790 -236
6095 -236 121 446 483 5 -150 15 -321 -256 -93 173 215 -312 628 259 -209 175 140 46 -81 -288 -6 -271
6117 -271 111 153 703 511 831 169 -28 -167 -269 -140 -639 -430 480 35 300 -30 -338 -216 121 222
6137 222 -255 -2 -66 -252 -126 187 267 121 70 -99 -94 -159 52 -182 -101 -402 101 -23 -162 258 178 197 -194
6160 -194 95 -97 -121 -414 131 -54 97 345 291 207 31 -155 15 362 -95 -271 -142 -85 -113 283 263 -28
6182 -28 -42 -306 279 -7 183 197 161 97 167 58 -11 -130 -461 159 37 -33 -110 145 49 13 -48 353 -628 77
6206 77 -209 -44 -130 -222 -169 356 -71 93 -412 -60 199 -229 180 -20 180 -87 173 -19 296 -232 -391
6227 -391 87 -484 196 407 -303 7 86 275 160 -90 -490 -94 154 -367 -111 66 -60 -320 136 -117
6247 -117 -430 -132 -308 -399 -85 133 10 97 -170 -11 -9 -218 87 -24 -434 501 -370 -818 364 65 337
6268 337 -317 26 -259 114 -74 -122 26 -78 342 -350 99 -1031 -6 -229 -120 79 -172 352 98 -372
6288 -372 -229 -266 319 -40 -244 41 -252 -217 51 -50 117 -50 -76 -222 -71 -88 -411 144 -47 13 -140 131
6310 131 -39 -276 49 -138 155 225 -22 168 66 265 353 173 -356 139 -75 -24 166 0 27 198 -36
6331 -36 -72 -131 84 -163 11 -29 -37 -162 69 117 -265 57 81 300 452 -4 -326 57 -159 -246 -244 347 -335 -160
6355 -160 122 -353 175 -16 125 104 -61 56 6 58 262 72 15 -92 42 -187 231 367 -77 40 -28 19
6377 19 225 -120 -295 185 1 116 61 471 101 -497 525 -229 -24 10 42 143 -130 53 -46 39 -39 -97
6399 -97 -119 205 11 156 -99 20 16 -51 -184 -6 117 225 137 -320 170 -198 -125 106 -50 -65 -127 -22 44
6422 44 -205 94 -135 201 -213 -364 -32 -301 189 -228 475 251 158 -351 157 -84 -53 72 -258 267 -74
6443 -74 -88 -76 -70 315 117 79 99 326 41 -470 231 -4 461 128 -241 107 -170 -686 36 309 129 -356
6465 -356 -303 -138 -505 706 -36 -59 -199 245 -84 -381 -337 -410 159 248 109 21 -594 190 -234 316 -97 423
6487 423 -118 -132 400 -26 328 -497 -674 -121 57 -409 217 25 298 384 389 -276 -213 -122 122 2 -443 409
6509 409 -344 16 -300 -656 909 313 499 132 -414 87 234 -243 -281 230 -56 358 490 -557 795
6528 795 -157 -316 519 -486 527 -196 79 522 505 328 927 -109 25 -98 -1204 294 302 -765 -458
6547 -458 -75 24 637 67 304 -427 162 -145 117 -240 228 264 186 -457 241 -477 -354 -46 249 134 403
6568 403 41 -176 162 470 -200 295 163 -228 179 -191 -369 -49 -206 368 -112 335 -328 -527 1054 -980
6588 -980 -489 -311 -472 314 -331 314 -141 234 -130 -413 82 113 407 357 -145 -206 316 371 -18 -84 113 926
6610 926 -363 -92 -81 889 140 860 327 17 221 -342 -195 204 -119 -16 325 -294 -7 643 64 -781
6630 -781 369 -20 -252 -506 769 -890 -51 -196 -12 -80 588 -389 -439 175 279 -220 -299 -10 -133 -17
6650 -17 -154 -147 -425 -377 431 89 -679 -26 -10 -218 -435 411 -209 -18 37 -508 293 768 59 -62 332 -148
6672 -148 -247 -93 -546 -222 -510 -408 -556 -273 66 105 -294 37 -212 199 -258 -313 -216 185 42 512 575 -293
6694 -293 80 451 0 352 195 7 35 272 -415 492 186 20 15 -76 1083 75 -181 -156 665 246 171
6715 171 -271 701 -558 -189 -9 -487 -318 -393 -320 -512 -303 35 -337 -12 295 -645 -98 -644 -559 -479 -175
6736 -175 479 289 -858 -49 299 -315 565 -49 380 -369 312 -521 35 -164 -414 -146 -64 -695 -551 343
6756 343 343 -146 -199 243 436 -184 18 -349 -226 192 249 203 14 214 125 -31 -126 -136 -201 -67 -190 -415 11
6779 11 -51 -307 371 129 46 266 139 131 69 -190 339 -17 -131 468 340 -58 -115 -168 1 21 -75 -84 67 -1
6803 -1 52 -66 208 168 66 86 -57 197 -161 -156 -144 -136 52 -223 -90 133 443 107 261 -332 -153 -146 6 65
6827 65 107 137 -116 97 51 74 159 -48 107 29 36 -87 -100 145 -2 -28 49 79 -36 106 -164 -13 -100 38 -26
6852 -26 2 151 18 -222 110 8 84 5 -87 -145 -83 206 162 78 -194 -37 4 1 -38 -75 132 -148 194 313 -37
6877 -37 -130 152 171 -263 125 360 -277 -458 -341 117 504 66 -211 -22 188 -45 -329 -126 -110 -238 -128
6898 -128 0 309 -154 138 91 -311 -13 -216 251 94 595 57 155 -718 -179 13 -50 -86 -394 -122 -82 329
6920 329 -65 -106 48 -268 483 341 542 -103 521 -344 558 484 -50 119 338 -77 -993 -330 -285 -538 165
6941 165 -723 -458 -299 290 572 -9 4 -31 -760 -559 110 461 100 -308 429 -288 155 461 -254 -106 -92
6962 -92 398 217 -108 83 -246 188 93 -464 -304 -257 -419 -280 56 276 -351 -7 827 -46 98 141 -435
6983 -435 -108 -404 -3 129 166 -136 -133 78 130 218 -15 -91 162 95 -97 186 39 112 -375 -280 -122 -41 258
7006 258 -116 -50 -488 -292 77 59 58 183 5 -27 -172 -319 -285 83 96 -18 175 -299 -86 -69 68 92 -179
7029 -179 -132 60 106 -220 -36 87 160 -185 -87 -267 -179 -92 156 -117 93 416 539 -242 -318 -19 -200 260
7051 260 45 -327 14 -249 196 163 281 135 356 253 -209 -41 129 -434 -324 -249 -226 77 -154 199 -26
7072 -26 282 -24 138 -214 -112 15 -410 517 -332 -391 20 -150 -277 -121 -115 171 286 -217 -130 137 71 -113
7094 -113 -109 -370 300 221 271 545 -121 141 -187 -238 106 -81 -229 101 -493 306 -386 459 346 491 -769
7115 -769 -113 -115 -196 -55 -385 -740 266 334 -128 -157 -336 -204 71 68 -37 32 -348 -103 -95 234 105 202 100
7138 100 -212 -76 -131 -115 169 -75 -246 -370 -151 112 -243 13 -54 256 155 -60 65 -153 -186 -514 -158
7159 -158 -175 -62 30 179 -44 66 265 107 167 -66 -202 -49 -72 0 43 -144 324 243 -308 107 -143 -49 -78
7182 -78 93 169 144 43 -32 -101 291 159 -160 -28 41 -63 237 179 -701 677 456 -256 -19 -550 -846 171
7204 171 -42 215 -56 -201 -210 19 424 236 -239 -679 -20 53 492 369 -155 -5 -102 -170 100 -445 -175 151
7226 151 66 -126 -92 -33 17 68 363 316 378 455 -138 -86 337 631 -390 109 265 236 482 -171 -138 444 560
7249 560 -315 -146 210 -43 214 -120 214 -246 -498 -675 309 -125 -146 9 -138 521 140 -29 -236 128
7269 128 -27 106 377 531 -116 8 -76 169 -253 435 -285 21 -35 -73 287 87 440 445 -251 -829 154 136
7291 136 41 -47 -464 -907 135 510 397 -213 483 -153 -617 -450 82 -465 217 -114 67 -262 -16 449
7311 449 -396 52 -275 124 -166 82 27 1 -201 165 102 237 361 216 -324 211 157 -1 150 396 150
7332 150 -27 -36 42 95 -313 -187 -245 -411 -356 39 56 -20 101 17 -43 522 -67 -121 8 109 82 -99 108 452
7356 452 -821 -20 121 2 52 -333 301 -160 6 -155 38 -235 330 20 -226 63 -109 -102 -254 90 249
7377 249 -398 -269 -84 408 -636 205 602 -106 -571 562 211 -26 -72 225 462 153 -712 -129 217 -105
7397 -105 168 200 71 229 -133 174 -141 290 230 93 -83 -170 301 633 54 91 244 633 -197 -198 96 5
7419 5 91 -250 115 -151 -26 172 11 185 -15 -270 -180 -12 -524 -421 209 924 57 55 -201 30 181 -51
7441 -51 -154 -9 44 133 173 13 -103 -148 111 106 -49 71 12 151 147 -24 -89 -78 25 -21 -210 -26 -10 -241 -37
7466 -37 -5 84 -120 -122 -240 139 -203 52 78 -52 -131 -146 128 -19 -303 -344 121 -40 121 181 128 -144 200 -99
7490 -99 102 -59 -320 -42 -224 37 -27 -60 -187 187 -119 190 -181 -148 67 -316 10 -170 -228 303 27 164
7512 164 -39 -40 -217 -5 -74 -145 7 239 -269 332 -43 -191 -90 -92 493 -56 235 -128 6 216 -119 -238
7534 -238 -40 46 -259 219 -238 47 -59 -327 -70 213 299 -493 -11 -10 -462 -453 -489 180 118 64 135 -283 164
7557 164 -8 -59 -111 126 -518 68 6 -25 78 16 213 261 -19 186 190 116 484 -108 -156 -193 522 -386 -23 -6
7581 -6 -54 230 28 -309 331 -107 229 67 304 398 -388 -54 -31 -299 -118 -14 1 388 -441 88 -61 -33
7603 -33 2 -300 -302 789 -159 354 -61 -461 -109 9 -44 91 64 198 391 -106 -2 -139 -96 195 -47 8
7625 8 109 -59 -243 253 50 200 -194 -191 33 109 -157 -122 53 -653 54 240 182 146 79 -413 -742 111 466
7648 466 -235 -406 338 360 133 -195 283 -154 300 911 254 586 203 33 -871 86 154 -165 107 54 79
7669 79 360 250 393 532 -84 -248 330 -75 166 198 -161 -59 -72 -143 167 -602 168 155 113 -458 256 -26
7691 -26 -159 184 385 -310 -284 -51 -500 -573 40 -115 -278 63 -125 499 -30 -21 -182 -53 -497 -218 -506 -337
7713 -337 -244 666 -208 208 -565 -224 -1 -83 317 -119 -276 -439 459 275 -399 32 -60 -304 -65 30 -310
7734 -310 -343 48 -35 224 236 103 -297 -208 43 -391 -131 30 214 -537 -48 343 100 409 618 745 -307
7755 -307 64 -169 193 -718 319 -467 143 -1 -171 116 -571 -136 -120 -417 -178 -136 -369 -150 -253 -776
7775 -776 -280 -64 -36 -266 -586 139 121 505 134 -80 -378 187 -63 200 334 777 148 -50 -105 49 -368
7796 -368 -308 -178 429 -92 3 159 443 257 361 149 -148 80 328 42 -180 77 378 -342 -619 -444 22
7817 22 82 -86 -210 -393 -436 177 -129 23 60 -361 505 -535 367 -117 -267 -105 30 -59 62 -167 -638
7838 -638 -378 25 -537 123 -484 -304 395 550 128 43 -5 -201 -32 -496 -1 -264 14 546 -123 459 -319
7859 -319 -199 -154 -632 269 208 -34 -427 -174 38 192 -210 -114 -284 -407 55 42 -180 -198 69 -244 -473 -469
7881 -469 498 244 -335 -97 117 -125 -264 71 -105 440 189 -545 -381 -447 -385 106 -127 -8 508 -487 150
7902 150 -328 87 -388 203 24 3 -107 -149 -333 -716 337 -320 376 367 103 -39 34 -219 -209 -126 122 161
7924 161 713 -155 368 397 -146 430 -220 50 -355 -121 128 -198 231 -551 -410 -708 120 -124 250 223 272
7945 272 93 149 -213 643 -524 114 44 10 -427 -178 -144 -376 408 -262 651 277 -299 492 171 77 -39
7966 -39 46 1 14 242 -18 28 532 30 -172 158 -223 383 276 385 -204 517 372 102 235 770 50 -12
7988 -12 93 153 -384 -198 -167 256 -279 673 472 8 -590 -386 -792 -365 -284 -278 62 -178 709 100 -135 -454
8010 -454 393 -318 509 -412 195 75 -376 -574 381 -140 180 87 -202 -16 573 -214 -43 -51 -246 -29 -346
8031 -346 -235 -92 -321 80 263 -80 -278 48 -351 68 279 33 340 115 -290 -80 -718 98 -387 282
8051 282 221 39 307 27 78 -267 205 11 -155 -138 49 -314 188 -183 37 202 -383 8 132 -41 -42 125
8073 125 27 -147 -19 189 91 342 -153 -24 94 -114 299 247 -238 22 -37 224 50 -108 167 -47 -255
8094 -255 135 8 35 -23 46 -26 -67 177 -98 169 -182 52 -44 -312 120 -170 45 -136 195 -29 -369 -37
8116 -37 112 -91 -84 105 -81 44 291 95 182 261 -74 -98 92 -77 8 -88 11 35 291 32 -85 319 69
8139 69 -26 -363 -261 -47 99 -7 84 101 22 -83 -107 -143 84 315 -7 273 -295 -256 -1 104 383 -190 67
8162 67 -22 -213 -156 -58 190 70 39 76 80 -127 74 198 94 -17 -2 -31 77 75 181 114 110 -190 150 68 193
8187 193 -102 134 277 -188
8191a88
$$ Imaginary data points
##PAGE= N=2
##DATA TABLE= (X++(I..I)), XYDATA
0 0 0 0 0 0 0 0 0 0 0 0 0 0 0 0 0 1 -64 64 -64 64 -65 65 -128 129 -129 193 -193 257 -258 322 -386 389 -451
33 -451 515 -582 679 -772 838 -963 1057 -1168 1305 -1461 1611 -1790 1969 -2179 2394 -2639
49 -2639 2909 -3204 3531 -3891 4290 -4743 5255 -5835 6508 -7285 8198 -9300 10656 -12366
63 -12366 14609 -17693 22200 -29502 43262 -78554 380847 613144 -52909 -172911 -63402
74 -63402 -24150 -375708 -559432 -344899 128908 339967 263310 105230 146036 248784 197913
85 197913 -125205 -421778 -411266 -131203 14882 -82708 -130979 140349 451591 423006 116196
96 116196 -44361 23727 21439 -211652 -403288 -310267 -55796 92758 117021 155889 239414
107 239414 249407 126214 -63091 -206196 -242441 -193811 -144090 -121152 -48626 120377 266427
118 266427 242243 116948 78338 121265 51074 -162876 -288497 -186690 -39228 -44694 -99541
129 -99541 6658 219518 289905 154024 2079 -28364 -26088 -117141 -254618 -283819 -145202
140 -145202 55040 171785 170811 150753 193639 223427 102463 -132729 -267227 -194611 -77601
151 -77601 -93162 -148073 -39769 192897 294366 171784 21212 12093 43820 -55334 -234514
162 -234514 -288063 -153311 15539 76624 70381 114700 215466 249338 129940 -61778 -169672
173 -169672 -146037 -107143 -145293 -176343 -66864 139224 240177 157444 47656 54408 91522
184 91522 -3476 -186399 -251028 -137462 -9377 1681 -22641 54460 197100 239932 129570
195 129570 -13918 -65549 -51891 -80028 -167061 -203490 -103586 61411 142179 105900 67416
206 67416 113885 151655 54910 -124963 -205340 -128351 -41618 -58469 -88390 4518 166021 220857
218 220857 124280 18144 8276 24927 -42807 -164422 -206816 -119396 4263 54103 42527
229 42527 64381 141981 180373 93500 -58452 -132646 -97763 -64194 -105398 -134313 -40503 119476
241 119476 185825 122286 52307 62157 73530 -13789 -150597 -196184 -118848 -27808 -7077 -9785
253 -9785 46225 142631 176689 99548 -10608 -57978 -45413 -59843 -124558 -152853 -68048 65490
265 65490 122300 87558 65173 106008 119363 22739 -113771 -159438 -103140 -54877 -68169 -69063
277 -69063 16709 134487 167443 99167 20662 5326 8711 -45939 -135144 -160523 -78464 30370
289 30370 65965 45898 61194 126153 143888 50977 -75459 -117334 -78950 -62085 -101038 -108798
301 -108798 -18480 103806 142035 90492 41095 47085 51629 -17079 -119431 -151483 -85770 -4268
313 -4268 15905 8943 48593 126995 149238 72196 -30886 -67894 -51074 -62479 -115466 -127388
325 -127388 -46215 61546 99687 71046 54310 79492 82614 8579 -92132 -123547 -77683 -31832
337 -31832 -30502 -28871 31087 115495 138287 76529 6165 -14934 -13866 -54254 -121550 -132292 -60015
350 -60015 25475 52745 41558 57923 101482 102756 26666 -63046 -89256 -61097 -47364 -66522
362 -66522 -59831 12461 98183 118269 72446 30435 29244 20842 -39569 -114114 -127769 -66497 -3193
375 -3193 11382 10561 49791 107496 111323 42095 -34555 -54102 -39878 -50586 -85915 -80899 -9554
388 -9554 71264 91645 61182 44483 58272 49297 -16870 -93442 -109652 -66473 -26910 -23892 -16841
401 -16841 34632 98419 106738 51140 -4581 -17323 -16939 -48135 -93357 -89312 -25568 39753 56255
414 56255 44941 54185 79157 67210 207 -67402 -81385 -56606 -44367 -54168 -39863 21669
426 21669 83305 91104 51156 19643 17248 6535 -41044 -92048 -89323 -33575 13790 21714 22248
439 22248 54266 90955 78306 14128 -43031 -50967 -39523 -51939 -74426 -57422 6968 64751
451 64751 71138 44616 34525 43480 28123 -27750 -80856 -81852 -38069 -6941 -7187 -670 42878
464 42878 88758 82140 24973 -20723 -24042 -20345 -47417 -82019 -67919 -6812 43503 47228 33827
477 33827 41777 59772 43741 -10920 -60973 -65533 -40231 -26184 -30415 -18824 28810 75920 76756
490 76756 35656 2797 815 -4075 -41511 -81152 -71377 -18677 20924 23014 21944 45486 70037
503 70037 51535 -387 -40019 -43300 -32862 -37435 -46669 -29764 15511 55357 59610 36611 19396
516 19396 22190 13499 -28205 -69197 -68384 -27871 -257 -2798 4857 42939 74878 58066 10691
529 10691 -19806 -21292 -22763 -44633 -58903 -38571 5747 37707 41244 33252 32033 36757 22385
542 22385 -17096 -54193 -55185 -30170 -13992 -18456 -10329 29539 65427 57487 19549 -523 4592
555 4592 -7069 -41915 -65696 -47191 -7511 16404 20080 26478 42905 49997 31367 -6659 -36788
568 -36788 -42540 -32188 -28230 -31064 -19136 19063 53101 51941 25267 13223 18302 7604 -31925
581 -31925 -60039 -45927 -13837 -122 -1196 11119 41319 55360 37206 5170 -15887 -22323
593 -22323 -28952 -41098 -43818 -27547 6918 37313 42342 29901 25609 29047 15396 -22364 -50337
606 -50337 -42456 -18001 -11063 -17165 -2140 34245 53829 38278 10752 914 -682 -16419 -41846
619 -41846 -50714 -33305 -4749 15284 22669 28188 37693 42562 26448 -8857 -37483 -39346 -27499
632 -27499 -25118 -27664 -9680 28357 50921 38986 15046 9050 10988 -6126 -37099 -50205 -32949
645 -32949 -8704 1657 4726 18666 39066 45820 29365 2079 -17986 -23589 -25671 -33116 -37053
658 -37053 -20448 13489 38159 36166 23870 21499 23393 3996 -32269 -50491 -36387 -12516 -5784
671 -5784 -5479 12151 38155 44619 25958 3697 -5375 -7712 -17331 -32241 -36988 -23049 1110 18760
685 18760 22099 20281 26518 31327 17474 -14161 -35953 -31803 -19448 -19854 -22857 -4186 29810 45409
699 45409 32012 13704 8956 4843 -13752 -36169 -40492 -24777 -4392 7354 13088 20235 28353
712 28353 31321 20106 -3004 -20936 -22941 -19284 -23787 -28750 -14132 15849 34287 29180 17836
725 17836 19895 19267 -1313 -30055 -39031 -27717 -14257 -9679 -1054 16708 33937 36045 23671
738 23671 4558 -9565 -17141 -22423 -28715 -30010 -16238 8960 25189 22549 18039 22783 25676 6801
752 6801 -20241 -31564 -23327 -15439 -19028 -13753 7109 28646 33989 23692 12538 5801 -2617 -16629
766 -16629 -30242 -32352 -21747 -1968 11433 16093 19196 26702 29616 12733 -12456 -23588 -19389
779 -19389 -15927 -22535 -21098 -1931 21364 28094 19867 15536 15421 9314 -8735 -25617 -30390 -21778
793 -21778 -10212 -1768 5024 15107 28216 31713 19405 -477 -12145 -13656 -17106 -26367 -26723 -9135
807 -9135 13072 21997 17735 17096 21700 16986 -2096 -21209 -26482 -20021 -13733 -11522 -4822 9339
821 9339 24353 28837 20559 7322 -230 -5456 -14502 -26379 -29028 -15721 2987 12348 13245 17672
835 17672 25026 22327 5493 -13283 -20142 -17783 -17344 -18784 -12354 4019 20377 24466 19654 13570
849 13570 9024 2267 -10038 -23866 -26234 -17111 -5092 1305 6046 15083 25659 24974 11562 -4340
863 -4340 -11302 -13067 -17677 -22924 -19111 -2547 13158 19418 17682 16312 16684 10161 -5527 -20253
877 -20253 -23376 -17732 -11332 -7141 -773 12249 23614 24473 14214 2938 -2905 -7268 -15539 -24041
891 -24041 -22015 -8172 6309 11298 13002 16793 20963 15818 348 -13990 -18467 -15831 -14631 -14190
905 -14190 -7814 6401 19741 22100 15829 9474 5544 -332 -11767 -22809 -22768 -12499 -1168 3929
919 3929 8312 16060 22541 19567 6783 -7069 -12016 -13723 -16027 -18426 -13468 623 13572 18173
933 18173 16066 13455 11378 5180 -7512 -18921 -21026 -14862 -8213 -3470 3097 12361 21202 20606 10644
948 10644 540 -5001 -9745 -16052 -20253 -15942 -4270 7058 12199 13824 15189 15704 9538 -3018
962 -3018 -14007 -16800 -14419 -11946 -9748 -2351 9057 18539 17934 11852 5576 1764 -4325 -13269 -19684
977 -19684 -17508 -7798 1303 5807 9867 14901 18180 13514 1275 -6401 -11107 -12381 -14344 -14739 -7133
992 -7133 3839 13037 15632 12849 10104 7355 688 -10126 -17104 -16688 -10701 -6410 -441 4655 13022
1007 13022 18549 15116 7113 -1842 -5523 -9448 -13738 -16224 -11388 106 8121 12017 12640 13572 12363
1022 12363 5774 -5782 -12627 -15850 -13267 -8377 -6361 247 10207 16544 15946 9085 3556 702 -6795
1037 -6795 -13448 -17594 -13727 -4197 2821 6508 9926 14031 15557 8369 5 -9112 -11608 -11128 -11859
1052 -11859 -10142 -3025 6507 14060 13475 10318 7559 4949 -2309 -11154 -15635 -13623 -7237 -3565 2524
1067 2524 6634 12882 15607 10238 2894 -3553 -7491 -10149 -12900 -12396 -7239 2454 8566 11261 11128
1082 11128 10873 8581 2199 -6556 -12401 -13360 -9152 -6945 -3832 2931 10612 13944 11875 6776 1520
1097 1520 -2545 -7771 -12334 -13976 -8881 -2123 3825 7623 9500 11538 10642 5724 -2512 -8182 -12021
1112 -12021 -10085 -9372 -6514 -479 7687 12926 11592 8306 5694 2278 -3943 -10492 -13234 -10538 -5201
1127 -5201 -1457 3712 8325 12081 11876 7877 1619 -4680 -7817 -10485 -11461 -9458 -4141 3659 8734
1142 8734 11035 9841 8608 6059 -506 -7097 -11854 -10933 -7912 -4672 -911 5585 10450 12206 9277
1157 9277 4643 -461 -4195 -8796 -11702 -10455 -6308 220 5221 8563 9442 9131 7631 2155 -4222
1172 -4222 -8016 -10842 -9633 -6697 -4694 822 8034 9988 9266 6403 4093 -270 -5877 -10356 -10841
1187 -10841 -7884 -2814 -315 4857 8371 10767 9287 5072 546 -5342 -9241 -8884 -8298 -6783 -1168
1202 -1168 4773 9105 8785 8147 6053 2998 -1576 -8070 -10215 -8792 -5443 -3067 1495 6002 10110
1217 10110 10764 6285 2984 -1829 -6076 -8181 -9903 -8675 -3175 1197 5581 7903 8313 7732 5771
1232 5771 282 -5657 -8458 -8573 -6453 -5116 -1609 3413 8261 9097 7652 5401 2379 -2098 -6421
1247 -6421 -9134 -9233 -6058 -1687 2802 5747 7652 8831 7920 3406 -1902 -6099 -7131 -7688 -7154 -4577
1263 -4577 742 5729 8157 7722 6750 4701 423 -4749 -8214 -8349 -7017 -3783 -145 3379 6146 7983
1279 7983 9204 5316 703 -2607 -5361 -7559 -7496 -6338 -2411 2967 6518 7260 7671 6186 3124 -1804
1295 -1804 -5599 -7494 -7764 -5900 -2852 600 5173 7414 8022 6494 2788 -707 -4435 -6782 -7257 -6772
1311 -6772 -4324 194 3139 6125 7137 7801 5191 1839 -3042 -5750 -7425 -7091 -5494 -2614 2792
1326 2792 5701 6853 6745 5613 2130 -1037 -5008 -6620 -7869 -5074 -3322 550 4499 6171 7196
1341 7196 6049 3167 -924 -3492 -5567 -6721 -6449 -3940 -57 3531 5854 6661 6378 4107 1286 -2602
1357 -2602 -5919 -7241 -6317 -4227 -2152 1741 5326 6970 6876 5037 1479 -1265 -3968 -6751 -6261 -5366
1373 -5366 -1921 1113 4085 5884 6508 5760 2930 -577 -4029 -5949 -6553 -5909 -3989 -774 3059 5593
1389 5593 6817 5352 3518 1199 -2808 -4981 -6028 -6071 -4205 -937 1845 4487 5928 6314 4251 1446
1405 1446 -2094 -4351 -5930 -5541 -5071 -2071 731 4088 5407 5955 4906 2796 -395 -3680 -5472 -5703
1421 -5703 -5041 -2945 275 2888 5156 6273 5341 2959 425 -2240 -4448 -5720 -5519 -3454 -1132 2210
1437 2210 4403 5744 5393 3931 1539 -1046 -3907 -5241 -5339 -4383 -1866 769 3838 4905 5432 4024
1453 4024 2209 -487 -3781 -5563 -5789 -4774 -2358 24 2424 4856 5223 4506 2846 788 -2443 -4127
1469 -4127 -5269 -4873 -3178 -750 2263 3927 4898 4444 3218 1214 -2652 -3973 -5448 -4758 -3940 -2128
1485 -2128 502 3433 5196 5580 3645 2487 -603 -2748 -5127 -5431 -4322 -2647 742 2783 4549
1500 4549 4513 5134 2961 -295 -1202 -3529 -5642 -4117 -2329 -1699 1768 4061 4360 4519 2717 1394 -1730
1517 -1730 -4112 -5494 -3726 -2472 -1168 712 2422 4548 4266 3277 891 -236 -2009 -4065 -3256 -3585
1533 -3585 -2176 21 2390 4004 4480 4130 1942 -587 -2201 -3597 -4428 -4075 -1689 -690 1551 3931
1549 3931 4474 4194 2817 1047 -1051 -2733 -4670 -2560 -2661 -1123 1096 2389 3943 4645 3645 1152
1565 1152 -1819 -2563 -4881 -4174 -3496 -1577 392 2616 4334 4419 4086 1527 -249 -2511 -2840 -4005 -2595
1582 -2595 -2026 -235 1922 3326 3937 3860 2791 -454 -485 -1569 -3743 -4047 -3132 -1183 1272 4070 3855
1599 3855 4488 2958 723 -416 -2432 -4032 -3428 -3331 -2762 836 2882 3827 3753 2620 1631 123 -1923
1616 -1923 -3806 -4203 -2426 -1052 376 1445 3004 3915 3865 2762 -324 -1925 -2511 -3909 -2867 -2775 -1581
1633 -1581 1308 2253 4033 4223 3952 1312 -200 -2149 -3538 -2957 -3259 -2508 -67 2658 3706 3562 2931
1650 2931 2127 -647 -1843 -2683 -3505 -2402 -1468 204 1227 3306 3120 3314 2463 -205 -1605 -1743 -3488
1667 -3488 -3639 -2784 -926 459 2620 3712 4015 1813 283 273 -2706 -3952 -3017 -2810 -280 304 2117
1684 2117 3020 3399 2082 1999 -554 -1279 -2680 -3132 -2378 -2118 -385 1258 2511 3687 2470 1384 946
1701 946 -1280 -3098 -3286 -3028 -2098 -1463 1255 2790 2948 3320 2043 1510 -973 -1667 -2893 -3166 -2772 -884
1719 -884 712 1725 2764 3138 3191 2624 158 -1437 -1959 -3188 -2404 -2452 -737 663 2651 3626 3281 2178
1737 2178 340 -553 -2307 -3531 -2409 -1995 -707 869 2189 2932 3757 2526 874 -404 -2233 -3379
1753 -3379 -2417 -3014 -1403 433 1457 2760 2829 3001 1163 172 -1288 -2628 -2873 -2533 -1189 -99 1220
1770 1220 1949 3042 3327 2348 804 -1157 -1330 -2174 -2949 -2219 -274 376 2171 2957 2278 2047 1374 -272
1788 -272 -1752 -2525 -2441 -2065 -1214 403 1971 3009 3078 2074 504 187 -1578 -2216 -2409 -1846 -886 -33
1806 -33 1012 2315 3039 2612 2473 158 -1568 -1664 -3068 -2433 -2340 -973 119 1001 3714 2546 2195 1044
1824 1044 -372 -1170 -2746 -2763 -1945 -1058 978 1370 2331 1888 3020 905 433 -1320 -1656 -2813 -2288 -1395
1842 -1395 716 1333 2319 2597 2153 1965 -433 -1265 -2287 -2301 -1877 -2317 -702 254 1028 2278 2548 2107
1860 2107 720 -708 -1304 -2534 -2585 -1877 -257 517 1867 2204 1879 2085 1518 -206 -2577 -2180 -3239
1877 -3239 -2007 -1042 82 994 2517 3376 1617 942 854 -929 -1564 -3455 -1892 -1867 -662 288 1624
1894 1624 2390 1944 2183 1056 -1262 -2187 -2759 -2472 -2239 -535 -373 708 2004 1850 1754 856 -863 -576
1912 -576 -2258 -3005 -1502 -335 112 1052 1812 2021 2972 910 -508 -931 -1354 -2023 -1579 -665 -834 -238
1930 -238 1439 2056 1675 1513 854 -292 -2245 -2215 -2462 -1983 -2162 3 1285 2392 2589 1350 854 -525
1948 -525 -911 -2011 -2455 -2353 -1000 -57 192 2227 2498 1730 1684 706 -497 -2024 -1593 -1586 -1773 -604 -273
1967 -273 1123 1461 1695 862 362 179 -1982 -1978 -3116 -1722 -315 -359 1319 2124 1831 1733 -66 1230 -1549
1986 -1549 -1519 -1676 -833 -900 199 1744 1581 1915 2012 1268 393 -1646 -1493 -1562 -1662 -462 -6 1031 2417
2005 2417 1642 1486 173 1130 66 -1629 -1309 -2185 -794 -8 227 1469 1652 404 1928 -152 -177
2022 -177 -1087 270 -1428 -1531 -1636 -505 1066 2464 1956 663 -165 66 -68 -1335 -1579 -1694 -767 162
2040 162 -194 260 1909 2990 1622 613 -173 -1127 -1563 -1458 -828 -925 -47 881 1309 1303 1137 495 99 -997
2060 -997 -2077 -2328 -1609 -423 -2345 -229 966 1517 1265 1374 -122 -521 -1407 -2038 -1521 -1531 -74 1509
2078 1509 762 1145 1438 1847 -387 -355 -1472 -1271 -1625 85 -366 222 1049 1028 1750 1216 1227 -406 -468 -1483
2098 -1483 -1161 -1223 -493 -324 753 856 2089 2023 239 12 -723 -1259 -1999 -2638 -385 -536 752 1145 2040
2117 2040 1390 1283 381 611 -698 -1459 -1748 -1289 -436 -464 763 1205 1945 1660 642 18 -555 -939 -1488
2136 -1488 -951 -502 529 1060 1582 1332 873 685 181 -588 -1399 -915 -1185 -658 -282 624 1044 1532 1307
2155 1307 398 -201 30 -384 -1600 -929 -941 -960 673 379 1330 1544 1236 162 -541 -807 -1380 -823 -1580
2174 -1580 -1084 -534 1317 1457 1373 760 696 433 -801 -877 -1823 -718 -1051 -409 48 1251 1677 1406 1123
2193 1123 158 -279 -693 -996 -1846 -1344 1 245 1135 1089 710 1395 1200 -453 -133 -1152 -1639 -490 -325
2212 -325 44 510 1281 1625 1339 392 492 -1142 -1238 -872 -1189 -903 390 30 774 691 1464 627 872 -800
2232 -800 -1074 -1512 -1137 -1012 -381 376 1348 1477 1052 1456 388 -367 -675 -1606 -2162 -1546 71 312 733
2251 733 409 1181 1171 635 -880 -753 -1405 -494 -2276 -1348 -541 762 387 1591 1233 57 382 -188 -304
2270 -304 -1533 152 -1152 -767 -210 145 1144 470 1012 108 -682 -395 -889 -1060 -1439 -499 225 661 1280
2289 1280 1108 1612 1297 -319 -719 -601 -599 -490 -235 -69 809 324 1097 808 497 229 -254 -26 -1745 -1296
2309 -1296 49 -318 969 224 1528 640 773 696 -357 -915 -1086 -1602 -640 -604 88 677 172 1392 854
2328 854 592 -62 -116 -186 -717 -528 -616 -756 190 72 1092 1759 700 -953 -507 -1181 -1626 -693 -1647 21
2348 21 1090 460 737 1222 353 730 -754 -391 -1299 -968 -1276 -819 -41 108 1617 1432 1482 469 257
2367 257 21 -1221 -1000 -1056 -1001 -91 683 741 760 208 202 -171 -275 -367 -1639 -1120 -1149 174 1483 -99 882
2388 882 840 320 442 68 -1274 -286 -1384 -1137 -681 -673 231 714 1185 973 513 -287 -4 -1300 -1551 -797
2408 -797 -772 -367 857 313 292 1097 751 753 -5 -746 -1449 -1188 -665 -467 112 493 954 949 734 -13 264 -69
2430 -69 -765 -1170 -914 -305 252 144 395 808 711 484 -147 -504 -539 -813 -787 -534 94 207 811 888 762 441
2452 441 331 -170 -661 -925 -909 -377 -113 363 150 817 605 724 352 -103 -459 -806 -725 -536 -360 -167 571
2473 571 688 855 528 508 307 -101 -1028 -862 -509 -500 -176 52 613 567 998 609 288 -306 -382 -564 -956 -545
2495 -545 -181 15 633 907 565 700 598 67 -155 -178 -1239 -523 -323 61 -182 813 962 395 359 -90
2515 -90 28 -431 -151 -1226 -188 -213 164 781 807 1174 446 -340 -83 -495 -788 -358 -781 -778 560 345 449
2536 449 452 401 559 -71 -556 -746 -505 -618 -599 -115 527 729 908 895 541 401 -104 -140 -636 -817 -336 -327 392
2559 392 626 569 921 783 -152 -286 -153 -608 -614 -426 -376 -29 566 1189 706 320 250 288 -83 -253 -593 -489
2581 -489 -228 26 -221 336 532 48 -259 -256 -749 -355 -240 -811 -66 -478 862 871 845 746 698 473 -421 -189
2603 -189 -755 -633 -249 -193 289 822 660 -238 1278 -137 183 39 -829 -461 -296 -530 57 -514 143 1168
2623 1168 1554 69 -224 -888 -631 -952 319 -860 -35 413 816 451 902 1059 -96 -727 -953 -787
2641 -787 -852 -175 -476 582 -197 881 656 605 84 155 -221 -529 -15 -577 -149 -710 183 1046 70 -164
2661 -164 406 117 -609 182 -1099 -567 -829 -697 115 522 1125 1012 290 188 -685 -1271 -562 -1223 -981 659
2681 659 254 -225 244 -238 -49 308 -621 -927 -516 -582 686 -1122 404 21 855 16 449 -38 -123 -281
2701 -281 -315 -631 -189 -176 -227 -29 616 336 436 615 502 -627 259 -381 -60 -252 -90 646 261 721 415
2722 415 -609 -231 -453 -41 -437 530 -998 -182 -28 204 463 485 868 205 728 -448 -816 -568 -934
2741 -934 195 415 -535 106 194 199 1060 564 -105 -444 -620 -161 69 -491 751 -245 965 992 140 574
2761 574 -277 -103 -821 -1202 -1755 581 276 13 161 -334 312 395 -24 -401 -825 -1320 -1040 300 103 -14
2781 -14 -48 -10 216 262 433 -448 -679 -726 -870 -18 -199 988 130 153 -452 202 264 696 -66 -940 -169 -931
2803 -931 579 -196 340 672 784 -54 908 491 412 76 52 275 -228 -46 -94 -35 -66 690 77 -188 -341
2824 -341 231 177 -801 -115 -493 16 857 225 371 254 367 315 453 -869 -191 -645 50 -359 258 57
2844 57 172 170 796 -80 -175 -91 -24 -259 -697 -170 132 -43 260 -49 1236 252 477 -366 135 300 14 -61
2866 -61 -140 591 -47 1182 -87 -280 -76 -557 -288 -638 -909 -641 -274 228 493 37 714 369 248 152
2886 152 -32 -361 -160 270 566 520 76 875 672 -121 922 -55 137 322 -441 -587 -591 -404 -93 1104
2906 1104 379 850 -152 -213 83 677 615 -137 457 156 744 92 -25 -54 591 -499 -263 528 -168 -251
2926 -251 51 -137 109 -512 549 131 273 754 -451 -327 -337 -506 -302 -190 -274 48 705 968 -758 -237
2946 -237 -318 -733 -778 -292 -216 -468 19 -26 687 608 556 77 -202 -162 -411 -1278 -188 267 838 -356 202 26
2968 26 165 -281 541 557 -452 -172 -379 158 907 475 109 1175 -297 -312 174 -289 -333 -46 -661 135
2988 135 -976 236 495 733 85 1105 79 -148 138 91 -180 180 -69 -159 -790 338 90 -558 191
3007 191 -99 564 -213 -308 152 216 -244 333 36 -61 462 776 -224 -752 -942 -15 -219 -323 112 -303 -44
3028 -44 -136 478 359 -79 225 -65 -444 -243 -149 -278 38 567 494 -38 210 -56 773 327 -270 494 -140
3049 -140 -109 98 128 427 -51 375 -250 302 153 -114 376 -229 211 -448 91 83 101 967 112 67 3 275
3071 275 110 -157 -315 268 197 590 151 -308 295 149 64 435 -522 -535 -42 246 -913 -339 365 395 -199
3092 -199 571 2 386 386 248 -94 -113 -258 -878 84 -65 92 -397 684 178 -52 32 -487 327 165 624
3113 624 356 5 252 84 193 -65 110 -342 164 -71 -55 36 445 -88 -109 122 23 -81 -422 -1 524
3134 524 -280 -292 -209 457 224 944 -63 -384 514 328 468 -538 -326 -390 -102 -67 177 -735 317 305 360
3155 360 90 411 391 96 -86 -426 157 235 146 19 59 203 596 -214 159 -263 89 -646 184 194 -24 112
3177 112 238 101 122 266 -418 -21 -295 -32 146 -73 282 532 466 468 422 -237 -31 -286 203 -78 434 464
3199 464 70 137 346 -15 14 17 -513 -423 -195 -224 -58 61 136 176 522 769 295 0 100 -152 -172 55 -131
3222 -131 -57 494 -195 -200 234 194 -563 614 -28 -376 337 -185 76 -242 -120 -113 192 334 688 1038 -390
3243 -390 -226 -38 7 -575 303 365 -127 84 416 266 1014 -258 -72 -598 267 220 295 193 640 506 197
3264 197 472 -442 -536 226 -167 -11 189 32 210 -17 388 -100 -35 353 436 -557 -637 253 -73 -461 -566
3285 -566 -102 -276 -199 289 514 342 209 148 163 -494 168 802 -27 -65 715 872 505 541 70 322 -479 -388
3307 -388 176 421 288 211 -98 313 207 98 -122 199 51 192 -222 49 -479 589 249 205 -42 218
3327 218 430 -242 -556 -168 -42 -644 -219 -512 322 328 75 173 -92 558 -362 -129 531 -985 -209 -590 317
3348 317 -202 355 39 209 410 -131 -69 -571 -713 -60 175 -208 365 44 966 27 -356 219 30 -40 -49
3369 -49 -142 36 103 165 237 600 401 17 10 -119 190 215 131 -172 706 -396 110 169 -43 409 244 -122 -166
3392 -166 -112 -132 -3 530 153 91 -590 557 256 523 -716 89 -452 183 751 253 737 -276 -7 -115
3412 -115 702 -23 -5 -363 -447 -483 -479 -348 101 231 357 150 115 155 -529 378 292 -444 53 -457 163 84 617
3435 617 96 -67 -75 359 49 163 -199 204 331 -388 -278 -73 571 650 259 -258 -497 606 -224 344 -9
3456 -9 -119 15 -39 160 121 380 -499 -106 27 281 -465 -740 -131 41 -244 -266 -188 221 720 -961 149
3477 149 351 -573 -381 1164 26 -293 -78 518 55 711 -204 399 643 39 -426 178 -361 190 14
3496 14 -495 -125 517 444 631 -182 -546 106 -665 31 115 -187 -47 181 165 -5 92 -247 -177 16 -354 25
3518 25 189 14 170 393 -3 -153 -237 157 -660 -136 579 175 -160 -515 556 -169 373 -18 -154 -234 -24
3539 -24 274 277 295 -540 -433 -457 -122 -570 171 1288 -370 104 -71 369 -599 -177 213 -66 -207 19 176
3560 176 435 -79 81 148 366 -343 394 439 69 138 -33 -46 418 -168 71 56 12 135 404 201 -307 -296
3582 -296 87 173 56 -106 -182 603 13 91 35 -30 -88 87 118 134 -188 -11 190 20 60 -166 -100 -153 210 190
3606 190 174 3 150 129 -224 -64 -110 151 -263 -235 -104 -185 -341 43 -370 58 -106 -99 -50 -112 -127 -58 -476 -349
3630 -349 -69 114 56 80 160 31 -254 -288 -91 27 -153 -7 -148 347 310 176 -161 62 7 190 171 -138
3652 -138 292 240 -153 335 -71 -260 74 94 -195 3 263 -84 -295 279 -56 -166 -17 -49 429 18 -6
3673 -6 -44 156 -370 -2 -221 -402 -57 138 -455 -129 -349 -342 441 -84 -319 180 -287 -153 -70 -199 20 -551
3695 -551 1 252 -345 -336 120 -201 51 -255 50 101 516 -123 10 -133 -72 115 150 -55 -249 185 -540 -308
3717 -308 -191 107 -164 191 -82 -19 -117 607 15 -205 298 -28 4 232 474 134 26 -51 -431 -323 130
3738 130 -409 -315 -284 -159 -150 277 378 653 -141 81 411 105 -586 -410 140 282 -324 -116 -35 270 129 -174
3760 -174 -94 282 -80 24 -72 -673 -103 460 -129 228 -462 -274 656 245 161 103 517 -132 -1171 -335 -10
3781 -10 -307 -87 423 -340 139 -101 281 81 -154 227 280 -13 -575 -113 140 -441 -225 83 -208 -12 484
3802 484 172 -69 146 -117 -30 -361 -374 -398 293 -249 101 -117 -272 268 -42 296 -77 52 85 485 273
3823 273 76 473 7 241 -355 415 178 -218 40 225 -489 429 212 137 -572 -21 -158 277 200 132 298
3844 298 -148 -99 -599 -246 172 -19 -25 -250 286 614 -240 418 87 -216 -322 441 -159 -220 -421 453 -418
3865 -418 -445 -77 176 42 -314 238 129 -468 73 -262 17 606 39 140 -208 -487 -483 -406 391 -686 616
3886 616 57 -770 342 581 317 81 487 -731 -315 12 -652 -693 422 -57 -497 246 814 -446 -15
3905 -15 48 308 -214 -163 -305 -250 -74 139 -589 -248 14 80 -164 173 -148 -73 -640 -350 70 -24 -30 -45 162
3928 162 -588 354 576 114 310 -106 -446 -264 -175 182 17 519 -183 -37 85 -220 -421 31 -269 276
3948 276 -73 -196 344 531 -107 475 -132 -66 -94 -779 -200 359 102 294 -283 33 198 178 78 251 365
3969 365 641 -13 -81 -383 1 533 34 122 -423 125 -80 103 -278 -76 -188 -243 350 147 -154 -62 375
3990 375 256 139 146 579 -87 194 275 -21 2 -162 5 -108 319 -120 223 -79 -59 -233 132 143 -37 -51
4012 -51 -186 -219 667 123 -319 -10 -91 -382 -110 162 -136 -288 -62 -62 147 55 -542 149 418 -180 51 389
4034 389 -11 -59 88 83 -54 385 -6 374 105 -86 174 -162 67 -53 -134 619 153 20 253 -219 -71
4055 -71 -6 80 -216 -316 -82 15 66 -83 -222 -334 -658 139 656 -387 516 -348 -179 158 -242 -129 -198 -210
4077 -210 -40 55 -99 -105 168 -15 267 -203 -249 148 -27 388 -221 221 119 -33 -880 -568 288 359 207 39
4099 39 728 -44 119 161 390 -213 -67 -272 185 -85 179 -171 268 126 88 -31 -90 224 -549 -323 -208
4120 -208 460 227 216 17 -242 -78 138 -359 99 125 -519 -24 -229 400 -203 -67 -108 233 -318 -29 -238
4141 -238 106 -273 17 -332 -158 215 -139 213 140 108 172 -591 695 65 -93 -405 -175 -148 67 -132 77
4162 77 136 -24 459 -666 74 166 -509 -406 126 319 -87 -122 518 -397 362 -55 -254 -67 245 37 88
4183 88 -550 132 -45 84 -34 -1 13 572 95 177 459 149 11 -661 95 -722 16 154 -709 -312 940
4204 940 -365 -421 -421 198 -505 -340 143 285 268 6 93 -26 -111 90 -132 2 -212 -48 48 -107 -64 56
4226 56 -148 197 -195 -71 8 213 271 -106 -329 0 363 -78 -311 58 392 -304 -519 -514 -223 -52 18 -246
4248 -246 -82 -165 -157 160 -371 -510 -381 330 189 41 14 336 162 -25 -111 294 324 689 -268 -389 -278 437
4270 437 -495 255 -39 153 -43 292 198 -33 -326 -65 571 -383 -146 556 334 -23 -153 -318 452 398 -214
4291 -214 185 -168 457 -162 -400 -262 -328 116 121 -50 -282 -580 -26 346 96 -344 546 24 139 39 -236
4312 -236 154 -76 27 155 -149 79 353 -386 -113 165 -266 265 282 350 -129 411 797 -407 715 295
4332 295 301 -40 249 310 -233 -50 -25 -149 -97 -683 195 -35 -405 -96 -109 69 382 7 -19 -1 50 -518 284
4355 284 31 5 326 26 228 -263 120 224 -7 -171 45 426 292 -130 137 387 88 29 -93 -238 132
4376 132 -147 90 -382 325 227 -174 -79 -173 -90 -23 -28 23 -161 -169 -11 95 197 126 -234 -63 -42 -105 -209 -163 -72
4401 -72 -58 29 40 -116 43 293 -125 198 -435 -562 -212 -459 -485 -351 6 -47 -48 -179 -23 88 51 95 -155
4424 -155 -207 -65 42 -302 -85 -86 -150 19 166 653 -306 -36 -123 209 338 -596 281 43 374 -20 264 100
4446 100 -22 -241 531 -50 -103 64 4 1 139 -442 -99 -174 15 -235 281 43 -61 107 632 676 -178 35
4468 35 -266 229 -137 75 -337 -337 -491 -179 163 40 0 2 -75 76 -200 153 284 68 22 -83 -259 -295 206
4491 206 43 195 92 39 -70 -86 -148 155 31 -81 146 -73 -240 -112 399 141 243 413 41 -37 283
4512 283 -153 -105 -221 -631 -122 -167 -382 49 -80 27 4 -149 -70 -162 -113 -194 237 -472 125 95 381 276 187
4535 187 -234 -127 -275 -85 26 -353 -48 129 -188 278 153 241 187 -51 148 -129 145 16 -53 -4 193
4556 193 49 -68 -171 22 63 -7 -29 158 205 84 52 3 88 214 1 -393 -279 -194 -86 -125 -111 209 -140
4579 -140 -34 -14 -75 -37 164 -55 -166 7 204 171 -10 -12 -19 -219 -107 20 247 161 -137 2 22 -266 353
4602 353 318 -27 6 97 -24 98 178 195 59 -75 130 -244 86 -149 54 294 -259 262 9 -65 72 -3
4624 -3 -136 -37 124 96 -30 67 -259 78 -14 -250 101 200 -114 26 42 4 -40 38 -27 -113 92 125 216 10 -171
4649 -171 -38 96 -76 33 -158 71 60 -158 -117 -28 45 -48 72 88 -85 92 62 66 -92 284 -181 -176 10 62
4673 62 -157 -158 33 -147 -170 -25 192 12 112 56 3 -92 223 -7 -166 109 114 50 178 212 -28 365 224 329
4697 329 158 672 -140 -493 -661 347 -274 199 293 141 43 259 57 302 -88 40 26 8 38 -433 -320
4718 -320 -16 152 -83 -41 -106 82 -165 -56 89 -111 224 178 61 222 1 -197 92 12 -12 -100 276 9
4740 9 294 275 3 -163 86 43 -194 203 153 150 -193 -41 118 166 40 -149 -93 153 -262 54 -76 -275 436
4763 436 -176 295 205 -87 -50 79 -43 9 -112 -84 239 83 -473 -127 -71 58 36 -191 34 -42 246 -56
4785 -56 -32 -147 -132 -200 -5 -71 46 -13 55 70 -171 -75 -238 56 129 -37 -97 -197 -146 40 84 -224 319 -459
4809 -459 -76 175 126 -416 116 119 409 717 -15 80 481 190 105 266 17 36 -95 -93 -64 169 -82 238 -60
4832 -60 103 -86 137 42 -120 -123 156 -214 -172 69 -286 86 140 -141 361 156 72 -38 349 4 15 255 165
4855 165 91 -201 267 -145 414 135 -180 44 -27 181 -148 207 38 159 63 -34 -318 -74 210 -92 13
4876 13 256 143 -516 241 138 43 77 178 193 83 -219 -138 150 98 5 110 100 -163 62 -134 -49 112 -4
4899 -4 -533 540 -274 -26 -65 -544 -134 -295 676 18 -81 -58 26 318 241 -345 -394 -27 634 548 162 138 147 126
4923 126 -69 192 193 388 -290 -98 -434 10 369 -49 513 -72 175 -616 -180 -409 -163 166 -277 39 150
4944 150 -181 -103 516 311 -370 796 -15 107 -308 128 213 -206 418 474 333 62 -1016 -842 -197 65
4964 65 -295 -324 534 151 -210 -157 -2 208 -483 130 597 -109 439 -4 -23 69 142 -177 -90 -361 -23 -572
4986 -572 -806 -24 392 -321 -429 -140 281 22 64 -413 177 383 376 305 170 282 533 -457 685 43 -289
5007 -289 151 139 394 -26 -541 372 -857 -480 -326 39 -565 -126 -231 78 749 -441 375 179 -209 514
5027 514 222 619 971 -13 243 -684 362 244 430 294 352 -220 -339 -351 -517 -101 402 216 146 -181 42
5048 42 410 579 219 -210 -6 -329 12 -158 -62 204 -160 -236 397 -233 -122 293 -280 -221 -90 451 104
5069 104 318 638 512 260 -619 45 -234 730 385 21 169 -344 -325 -69 390 -89 36 109 -17 210 -166
5090 -166 260 70 235 588 -157 -132 -321 -295 -205 -161 267 -507 -267 624 -741 -323 -13 222 -332 247 771
5111 771 280 -539 -719 78 26 499 86 486 355 -82 42 139 -251 88 -420 868 73 -1017 -1 130
5131 130 528 -447 -336 73 85 632 169 353 -433 265 942 -449 41 -60 102 -229 -105 -581 588 291
5151 291 -277 -214 -137 265 28 -354 687 298 35 147 -874 116 420 -261 338 380 94 192 -405 -168 -37
5172 -37 274 443 -178 163 249 -707 -217 689 -155 -269 131 432 178 28 -66 334 -290 -471 334 981 278
5193 278 -62 20 -241 162 -231 -605 -181 189 -84 -493 159 229 223 412 -25 -520 -120 525 -84 -205 -284 -111
5215 -111 -391 270 -121 -84 -244 136 -255 -22 146 -172 457 -416 -55 52 -434 -119 -267 -38 16 315 24
5236 24 -272 190 30 -242 511 120 79 -47 257 -15 -239 91 -90 -625 -597 232 372 232 121 -139 -17
5257 -17 -2 185 117 410 116 89 224 -44 -35 -33 -326 401 -30 413 -174 -145 272 -99 85 464 -54 319 -82
5280 -82 210 245 336 445 -144 -135 -37 330 168 295 84 -310 -55 170 -97 -210 -178 171 21 -167 234 -14
5302 -14 -436 -370 -19 -212 457 -96 6 -130 318 52 170 74 88 -395 237 -67 28 -34 107 131 -258 24
5324 24 220 120 -40 35 98 -248 44 79 -234 -102 336 112 134 48 -427 -237 -540 33 5 -430 9 394
5346 394 181 451 487 -537 -103 -402 208 -182 142 169 303 177 -285 -200 -33 264 72 -406 -286 -40 46
5367 46 -138 -1045 -26 200 372 -348 40 127 -76 275 -20 -59 -90 -82 -20 104 -88 378 -77 125 64 279
5389 279 -183 -78 54 -152 279 150 -78 262 -196 28 119 -172 160 178 -36 37 43 44 111 -7 179 -107 -55
5412 -55 -207 168 -115 182 -254 143 90 -96 -130 -124 84 92 110 -164 51 59 -287 -5 -10 242 -33 -66 -33 190 -146
5437 -146 112 102 -158 439 -10 -67 -82 -202 -259 2 113 532 -183 -173 -724 -65 -312 -29 -14 -573 34 174
5459 174 -238 -201 -421 691 27 -273 427 -1069 64 109 65 -2 -256 -110 -327 194 -283 1054 -79 -8
5479 -8 35 96 276 209 14 -589 -135 -299 532 -599 -203 278 -506 -82 571 -352 -280 477 -191 73 -18 -110
5501 -110 -93 -389 138 -274 -289 -103 -155 -6 402 -319 161 -535 -63 164 -434 -325 -255 88 127 -88 679 -115
5523 -115 274 176 -288 -127 -110 159 -242 239 -403 14 25 32 -155 -102 -108 63 -149 -247 163 -13 140 -218 304
5546 304 80 226 202 -58 126 -355 -106 171 239 -88 -147 -190 -118 83 157 -195 1 -123 -469 -127 -113 -219
5568 -219 163 -140 -304 0 107 313 77 -149 -188 346 215 104 207 165 -229 61 295 -496 15 -375 453
5589 453 126 233 230 114 -70 439 -198 422 -48 -327 -114 273 -325 96 351 -173 -67 464 786 -24 113
5610 113 -161 -438 116 -274 168 -54 -95 -280 250 -263 -395 -34 61 476 -662 148 128 -683 347 424 -76
5631 -76 -7 142 -67 -24 161 -240 141 -5 -123 -135 205 -463 -222 -72 -623 276 -330 9 150 589 -65
5652 -65 -490 -285 409 -19 134 -247 595 -63 -360 245 61 -39 233 -58 -288 -455 5 -443 14 -236
5672 -236 -166 71 -118 -259 71 417 -166 -717 534 -117 -156 23 490 83 -16 77 310 116 435 91 390
5693 390 3 -82 -123 28 133 98 178 9 -507 -61 169 -425 400 167 -221 -388 114 23 4 -200 -310 154
5715 154 -150 -114 267 80 57 185 182 106 53 110 -215 52 6 55 -77 -144 132 106 85 -30 -137 -98 131 -198
5739 -198 -166 -187 198 -149 51 -95 398 221 -106 -658 -135 354 -5 6 139 65 62 -266 277 242 451 33
5761 33 -9 -538 938 385 -621 659 285 573 -643 91 168 112 -350 279 196 199 -628 -87 65 -584 -229
5782 -229 320 201 -137 149 -486 -450 362 262 -249 -62 272 102 219 395 606 -325 -363 -705 98 509 -310
5803 -310 -55 482 16 679 -219 153 578 210 -266 339 280 -125 523 -61 -962 -436 71 609 404 405 233
5824 233 463 608 749 228 152 -392 -16 215 644 -364 -22 123 -98 771 -898 129 -624 689 291
5843 291 227 457 205 73 -24 72 70 -192 -235 185 350 239 107 -588 -248 -111 -355 314 8 -426 -368 89
5865 89 27 859 -77 46 -476 -489 -295 -331 37 325 -136 693 -113 219 -412 448 20 -534 -123 -415 248
5886 248 -282 -121 210 -167 -292 530 117 -145 -53 250 -42 49 -188 145 -10 177 24 -142 -137 -154 -13 338
5908 338 -54 363 -76 107 71 106 -229 147 80 145 -20 288 234 26 -55 89 -259 -116 -295 -89 -128 -181 -94
5931 -94 -105 -38 211 263 190 -277 -338 -215 -99 433 137 416 -5 -177 617 521 259 -128 -157 -118 202 143 225 38
5955 38 445 -80 -528 420 90 -544 -297 -75 -398 156 288 115 166 -170 85 346 -160 -484 664 99
5975 99 -208 -636 316 -727 393 252 -269 54 220 139 -207 116 -278 223 301 -166 -359 -401 -10 517 45
5996 45 0 170 67 -471 488 -35 218 -252 35 -306 103 4 116 285 108 37 -444 -10 391 -154 296
6017 296 278 -233 -98 -322 52 316 -69 246 115 210 -68 -232 212 -268 154 -139 -54 281 -238 -236 407 -244
6039 -244 -228 -83 302 -80 433 -42 117 -100 261 -348 72 -470 78 15 -52 -14 78 912 -92 450 -213
6060 -213 85 38 -130 19 174 -123 367 28 -194 229 228 82 -353 342 165 -288 -196 -515 -112 90 57 -475
6082 -475 -46 350 13 -311 -198 -331 -501 -216 530 102 -285 -54 171 697 -555 -137 335 -154 -156 -448
6102 -448 -158 -684 133 334 82 -457 41 119 766 129 277 370 -18 387 -243 36 -535 -249 -123 104 -133
6123 -133 -549 -94 262 405 540 718 135 242 -36 12 124 -37 644 215 -120 464 306 -507 261 -464
6143 -464 421 -539 -127 -21 -251 -55 130 385 -46 -292 184 63 -154 -335 364 -247 -41 154 -182 467
6163 467 -184 -78 -76 -33 -58 133 -170 25 126 -305 -578 330 -191 -225 -55 31 199 -158 85 8 -22 78 117
6186 117 242 -185 13 -55 -26 -170 28 -310 -87 46 141 -415 320 -95 -149 -52 -15 68 88 79 -165 -80 233 -34
6210 -34 147 -41 296 -4 -70 121 338 409 -50 -454 199 -169 -205 -87 -295 269 411 -33 82 -108 -125 91
6232 91 -28 -112 -121 -628 -271 -43 -721 202 -458 593 479 -192 -45 -409 297 -158 6 39 -411 102 -40
6253 -40 -5 -289 -106 208 -95 151 54 -662 -138 240 -7 -422 -22 102 86 299 -161 -92 468 185 -257 288
6275 288 42 206 67 107 523 143 262 -305 167 -449 427 186 -477 -86 107 221 -119 -102 -55 258 303
6296 303 6 -67 71 213 -1 -41 -265 -30 94 -92 47 -107 -192 189 164 -35 51 83 31 193 -147 -82 11
6319 11 -21 186 48 -2 187 61 -111 149 110 -17 192 -90 -243 -243 176 87 295 94 -20 17 118 -90 77
6342 77 -94 51 -35 47 -550 265 362 200 -19 319 221 113 218 37 234 450 577 -377 -143 -109 -146 160
6364 160 -119 4 -257 34 120 27 -143 -61 145 -42 215 -476 -120 -227 -68 -272 2 301 -100 -346 -408
6385 -408 -292 -309 251 -24 17 81 265 -202 -141 -19 68 292 30 54 -123 50 -120 -69 49 -144 -61 30 -136
6408 -136 -14 -158 -53 -330 -70 -252 468 22 -85 -167 339 -211 -386 -296 145 -18 54 418 286 138 34
6429 34 76 -206 -378 -137 46 -86 149 29 79 -256 15 24 104 -271 -80 64 79 190 4 -94 228 259 196
6452 196 -278 -338 -214 380 194 -52 -218 -410 134 24 321 156 -276 510 -8 46 148 -710 -205 159 94
6473 94 -119 197 290 195 -439 137 -175 -361 469 82 -258 57 -121 117 -205 -75 -350 -516 -376 -142 -496
6494 -496 -1016 -638 238 -508 -333 -37 213 148 -38 455 306 -245 141 389 -329 -211 -477 -329 260 -80
6514 -80 -686 195 -207 -599 51 277 90 175 -403 567 -1510 -167 -290 -412 -204 -260 -102 -37 53 -21 -131
6535 -131 -511 507 132 -269 -329 942 462 -275 301 139 553 -392 -601 -673 -8 -151 -607 -617 454 24
6555 24 -367 -170 -429 -236 -173 -116 80 -162 -232 -80 571 177 -200 406 -539 39 167 51 -373 -60 544
6576 544 -640 -197 514 267 -177 534 -710 32 115 -278 148 -240 39 -247 294 382 642 -246 -28 567
6596 567 -302 -238 -84 532 -14 -545 -535 321 -141 -365 286 -387 11 180 866 -495 -710 490 -412 120
6616 120 -700 483 83 -164 -57 -164 697 -291 98 565 61 261 -362 470 68 -287 -193 -611 -225 -355
6636 -355 -527 257 -354 204 -572 22 106 215 -1 -402 -186 -93 671 238 -290 2 -258 -837 -47 -232 -405
6657 -405 194 61 -478 -55 -404 -397 -70 82 -31 73 140 -98 -164 223 -359 15 -115 -330 135 278 105
6678 105 244 -198 103 -284 56 198 -209 -180 -408 -1 -20 65 -136 533 75 -406 -223 -67 -137 -530 102
6699 102 -51 422 -55 -159 141 211 110 123 -113 -330 -544 -304 -85 -35 137 434 181 -495 -302 662 -333
6720 -333 -336 -110 -173 138 -161 -330 10 493 371 -47 346 -65 377 363 -748 18 158 -208 393 237 589
6741 589 249 -90 307 109 66 -331 -65 186 357 281 -61 -611 -489 137 190 408 371 -96 -282 -213 348 594
6763 594 61 -85 -389 -283 593 -308 -285 -291 -486 56 17 70 -145 107 178 -43 -344 -32 -271 39 -93 151
6785 151 134 70 -22 -191 9 -305 258 366 -201 193 234 -232 135 307 -207 -254 60 14 -224 15 -11 -86 220
6808 220 150 219 -40 -218 -11 -116 77 -81 -117 -155 -283 105 319 107 -90 -180 151 6 -180 -38 -151 75
6830 75 266 43 113 6 42 -141 -110 -173 -222 -145 -124 85 68 -170 -43 -94 -132 99 -203 96 51 232 248 -130
6854 -130 -30 79 -14 139 -146 -103 -206 107 -50 11 68 78 379 195 184 214 -219 131 -40 -198 154 -451
6876 -451 -56 196 161 -239 -240 -265 226 62 233 -514 485 110 61 -66 -326 503 -189 62 -150 71 -106 -384
6898 -384 390 27 372 -573 36 330 -34 -90 -110 -210 246 -478 98 24 254 -79 239 -146 -81 598 -22
6919 -22 3 104 -167 -337 61 472 -97 -340 154 179 545 -236 -548 -37 -359 -428 531 -716 562 262 699
6940 699 -396 -261 449 -34 -286 -160 -414 379 527 286 266 -467 305 -174 -429 58 -287 -279 407 -61 767
6961 767 299 10 -15 -30 202 95 -197 -215 210 -408 -26 58 -223 43 318 131 -426 169 -125 -190 -347 -5
6983 -5 508 -256 164 20 319 2 331 -114 -21 -124 42 -45 -31 -325 183 -126 394 -369 -37 -108 253 178
7005 178 240 -366 -152 -117 95 -64 73 237 154 108 66 -202 20 60 -137 65 -39 17 -44 60 223 71 26
7028 26 -142 66 53 30 -8 45 -191 74 -189 75 325 -22 -189 76 -51 41 291 43 -251 92 500 162
7050 162 218 22 53 51 136 -366 -127 214 36 347 135 38 -175 -332 421 88 292 202 -273 -56 -82 -132 340
7073 340 -57 -82 -87 -236 -12 -428 219 -38 -537 275 95 -32 228 -82 380 4 -40 -14 441 287 76 7
7095 7 422 -254 658 -222 110 -461 -209 209 92 654 -118 64 370 317 159 239 -118 353 368 290 875 585
7117 585 -192 -416 -442 143 -82 340 -119 -408 101 217 150 225 108 6 82 -3 77 -125 -382 203 -289 45
7139 45 21 -20 -184 365 -197 123 197 297 -92 310 231 -255 -34 -303 85 179 -52 -245 -34 158 48 -268
7161 -268 31 126 -18 -51 -123 57 141 50 -198 -15 -330 220 160 -69 264 -103 174 -293 278 130 -393 -54
7183 -54 -118 -242 277 178 77 195 -190 -94 -22 -76 -189 102 386 157 -92 389 953 -228 -322 -325 -189 -147 -475
7206 -475 19 -135 667 -417 217 -24 -87 -53 93 145 224 -160 378 -29 157 101 46 -119 16 -10 49 -43 -456
7229 -456 -90 -380 -128 -369 -414 -474 125 -183 -84 287 -25 -375 -342 397 -93 -46 392 -731 -165 26 -385
7250 -385 -499 -131 283 148 113 -320 -45 10 185 -259 179 81 261 -103 60 -131 -227 222 -178 -40 428
7271 428 157 -120 -53 -196 -74 280 176 70 127 -306 525 133 184 327 -132 -95 -63 -677 -100 124 578 1022
7293 1022 -286 16 609 -580 1055 222 -114 -167 -845 -95 -385 392 23 -229 224 -153 189 663 -150
7312 -150 -101 -56 478 -158 -47 15 29 78 -406 258 -288 378 -143 65 40 -78 -302 -219 -220 -200 282 204 268 -238
7336 -238 53 -106 -154 -85 32 175 -48 99 305 89 288 156 198 401 22 187 -261 29 -299 -74 -341
7357 -341 -403 -185 -32 125 -22 379 -75 -322 -303 -22 323 695 201 203 382 3 133 179 28 -57 84 -199
7379 -199 -325 231 -18 -334 271 213 329 286 -42 -277 -199 -321 361 120 27 366 -282 16 -42 322 1 -127
7401 -127 277 -57 -226 -236 -421 214 -36 314 383 136 148 47 -540 384 -667 -305 447 95 143 -146 -33
7422 -33 95 97 -396 -54 133 100 -309 -327 -187 -12 54 -590 -165 24 52 32 148 50 16 -87 -44 113 54 -170
7446 -170 109 172 338 -92 -17 29 -260 88 150 237 -280 274 -127 189 -110 -65 -112 81 -235 -232 -27 -8 13 19
7470 19 -250 -43 8 141 -67 18 87 184 101 -235 -208 -237 225 195 203 -48 9 122 -109 -60 -31 -165 -214 -195 -187 -105
7496 -105 75 -227 -34 26 130 40 -72 166 90 34 -107 62 69 303 296 -76 -255 326 106 -80 112 -227 -53
7519 -53 -282 188 -301 -131 65 -410 133 84 79 176 -60 12 -134 59 -217 77 -403 -77 2 -33 -34 138 264
7542 264 -197 60 53 89 66 -360 -822 -311 -516 -126 459 -16 -530 120 -10 -25 -100 234 -218 399 -122 -36
7564 -36 -368 -67 379 9 156 -125 -211 -69 17 -355 -44 -458 529 696 -379 139 380 158 -250 71 116
7585 116 -149 -133 -79 284 56 -275 -145 -150 73 -220 331 198 -8 -222 185 138 218 -32 116 192 -342 281
7607 281 -332 -397 197 4 97 -25 -501 171 -208 -148 -64 -162 -88 27 41 -316 -34 -306 -137 405 -88 -222
7629 -222 317 132 373 -30 -255 -56 408 161 69 -62 -56 73 -239 651 -136 -770 -372 -625 -426 -11 -541
7650 -541 58 -167 -109 -90 -245 230 814 242 113 -221 172 248 -189 148 -310 147 -453 180 -198 382 -189
7671 -189 45 469 -492 41 -122 -360 -186 298 -156 -333 -552 338 254 379 919 73 497 -502 287 -30
7691 -30 -529 290 -29 -248 -85 -465 723 534 -237 -163 748 -79 -150 -438 -1009 2 163 335 -81 201
7711 201 -278 -4 52 41 -34 -158 205 37 -236 308 40 -260 241 334 -271 -74 208 -131 -129 167 440 747
7733 747 216 543 424 -711 -74 -278 59 262 250 436 -94 -67 76 -525 225 523 -194 -68 707 544
7753 544 244 -21 -196 476 -186 -273 75 226 540 -159 -308 153 232 453 -1 613 -171 245 344 -759 13
7774 13 -78 -250 -425 374 595 -371 359 118 397 259 100 229 -5 171 205 -97 -47 170 245 -58 240 -175
7796 -175 -192 222 261 274 215 621 91 -349 -507 100 -214 91 127 -35 -306 -424 -137 -236 96 -100 236 -266
7818 -266 -8 78 -207 250 -769 -56 554 829 394 -44 500 223 -218 -608 627 261 -116 -68 -449 -362
7838 -362 84 30 -208 -342 55 128 -211 -27 -307 -87 57 -364 470 347 -432 103 -155 131 -347 -90 145
7859 145 -58 -148 68 185 -548 49 -208 -303 -479 -11 12 235 -45 238 -201 -126 261 52 -436 3 -131
7880 -131 100 -17 329 -114 -149 -184 126 349 -203 393 -823 36 222 312 150 873 592 532 183 154 -428
7901 -428 -144 53 35 518 154 504 206 291 -5 300 88 -89 -190 208 -165 -615 188 489 220 124 -24
7922 -24 351 302 283 -553 173 -88 -84 595 -394 -668 200 381 524 -343 46 -702 230 490 34 -203 -309 191
7944 191 -675 -169 87 496 -329 44 310 206 -455 -786 514 -667 9 -283 -197 515 577 290 -235 101
7964 101 835 -704 862 125 -916 249 -49 34 -200 -180 -364 137 386 18 -273 -559 359 28 -486
7983 -486 536 -181 -140 812 173 -167 -150 438 -185 20 426 -338 -183 466 -17 -201 -240 -335 312 123 308
8004 308 664 202 157 202 -658 -14 -732 146 -235 65 81 -166 -581 -357 327 37 441 -578 0 -328 -292
8025 -292 142 -171 -247 275 27 -7 54 479 -423 255 -222 -107 33 -18 96 535 14 -306 290 -103 -306
8046 -306 -335 238 198 66 -52 278 -211 207 -124 -23 -162 91 27 -176 -320 -160 15 25 224 -381 -128
8067 -128 134 -69 67 110 -106 -36 314 -145 -36 112 -89 145 148 33 135 502 -241 -371 -194 18 244
8088 244 256 -151 -97 213 -102 -322 216 99 -179 -67 -32 240 157 2 31 -84 -154 -204 -87 169 -45 -152
8110 -152 -99 -3 13 -189 156 -128 48 37 78 181 303 10 -20 10 125 -24 -269 51 19 10 -94 169 -244
8133 -244 -28 9 212 78 19 48 -96 85 -136 55 16 -133 234 -49 -58 91 146 -94 -73 70 203 -159 -145
8156 -145 223 -68 76 168 -225 91 -36 -300 424 -43 31 -101 273 -202 -80 152 27 251 -328 59 176
8177 176 -67 35 -97 -273 84 -220 -274 -24 -90 130 -108 19 -85 99
8191I9
##END NTUPLES=NMR FID
##END=
