##TITLE=1H ikalashn
DE-54H_2
12.12.2024
##JCAMPDX= 6.0         $$ Bruker NMR JCAMP-DX V2.0
##DATA TYPE= NMR FID
##DATA CLASS= NTUPLES
##ORIGIN= UXNMR, Bruker Analytische Messtechnik GmbH
##OWNER= root
$$ TOPSPIN		Version 1.3
$$ 2024-12-12 14:46:00.125 +0400  Irina@DPX200
$$ Compression mode = diff/dup
##.OBSERVE FREQUENCY= 200.131300845
##.OBSERVE NUCLEUS= ^1H
##.DELAY= (6, 6)
##.ACQUISITION MODE= SIMULTANEOUS
##.ACQUISITION SCHEME= undefined
##.AVERAGES= 64
##.DIGITISER RES= 18
##SPECTROMETER/DATA SYSTEM= spect
##.PULSE SEQUENCE= zg
##.SOLVENT NAME= CDCl3
##.SHIFT REFERENCE= INTERNAL, CDCl3, 1, 17.49637
##AUDIT TRAIL= $$ (NUMBER, WHEN, WHO, WHERE, WHAT)
$$ ##TITLE= Audit trail, TOPSPIN		Version 1.3
$$ ##JCAMPDX= 5.01
$$ ##ORIGIN= Bruker BioSpin GmbH
$$ ##OWNER= Irina
$$ $$ F:/spectra/data/iren/nmr/1H/4/audita.txt
$$ ##AUDIT TRAIL=  $$ (NUMBER, WHEN, WHO, WHERE, VERSION, WHAT)
(   1,<2024-12-12 14:44:10.250 +0400>,<Irina>,<DPX200>,<TOPSPIN 1.3>,
      <created by zg
	started at 2024-12-12 14:39:57.312 +0400,
	POWCHK disabled, PULCHK disabled
       configuration hash MD5:
       BE 6D 3F 07 2A EA 11 49 91 17 2B D3 AF B3 58 0D
       data hash MD5: 16K
       31 B7 CD C5 66 78 46 39 CD 8B 91 A8 7F 43 88 0F>)
$$ ##END=
$$ 
$$ $$ hash MD5
$$ $$ 9D 0A F6 93 BF 47 C2 0B 1E 7B 58 05 EF 55 EA EA
##$RELAX= 
##$RELAX= 
##$RELAX= 
##$RELAX= 
##$RELAX= 
##$RELAX= 
##$RELAX= 
##$RELAX= 
##$RELAX= 
$$ Bruker specific parameters
$$ --------------------------
##$DU= <F:/spectra>
##$EXPNO= 4
##$NAME= <1H>
##$PROCNO= 1
##$TYPE= <nmr>
##$USER= <iren>
##$AMP= (0..31)
100 100 100 100 100 100 100 100 100 100 100 100 100 100 100 100 100 100 
100 100 100 100 100 100 100 100 100 100 100 100 100 100 
##$ANAVPT= -1
##$AQSEQ= 0
##$AQ_mod= 1
##$AUNM= <au_zg>
##$AUTOPOS= <>
##$BF1= 200.13
##$BF2= 200.13
##$BF3= 200.13
##$BF4= 200.13
##$BF5= 200.13
##$BF6= 200.13
##$BF7= 200.13
##$BF8= 200.13
##$BYTORDA= 1
##$CFDGTYP= 0
##$CFRGTYP= 5
##$CHEMSTR= <none>
##$CNST= (0..63)
1 1 145 1 1 1 1 1 1 1 1 1 1 1 1 1 1 1 1 1 1 1 1 1 1 1 1 1 1 1 1 1 1 1 
1 1 1 1 1 1 1 1 1 1 1 1 1 1 1 1 1 1 1 1 1 1 1 1 1 1 1 1 1 1 
##$CPDPRG= <>
##$CPDPRG1= <>
##$CPDPRG2= <>
##$CPDPRG3= <>
##$CPDPRG4= <mlev>
##$CPDPRG5= <mlev>
##$CPDPRG6= <mlev>
##$CPDPRG7= <mlev>
##$CPDPRG8= <mlev>
##$CPDPRGB= <>
##$CPDPRGT= <>
##$D= (0..63)
0 2 0 0 0 0 0 0 0 0.06 0 0.03 0 0 0 0 0.0002 0 0 0 0 0 0 0 0 0 0 0 0 0 
0 0 0 0 0 0 0 0 0 0 0 0 0 0 0 0 0 0 0 0 0 0 0 0 0 0 0 0 0 0 0 0 0 0 
##$DATE= 1734000249
##$DBL= (0..7)
120 120 120 120 120 120 120 120 
##$DBP= (0..7)
150 150 150 150 150 150 150 150 
##$DBP07= 0
##$DBPNAM0= <>
##$DBPNAM1= <>
##$DBPNAM2= <>
##$DBPNAM3= <>
##$DBPNAM4= <>
##$DBPNAM5= <>
##$DBPNAM6= <>
##$DBPNAM7= <>
##$DBPOAL= (0..7)
0.5 0.5 0.5 0.5 0.5 0.5 0.5 0.5 
##$DBPOFFS= (0..7)
0 0 0 0 0 0 0 0 
##$DE= 6
##$DECBNUC= <off>
##$DECIM= 32
##$DECNUC= <off>
##$DECSTAT= 4
##$DIGMOD= 1
##$DIGTYP= 9
##$DL= (0..7)
0 120 120 120 120 120 120 120 
##$DP= (0..7)
150 150 150 150 150 150 150 150 
##$DP07= 0
##$DPNAME0= <>
$$ [...]
##$SW= 21.9926040160658
##$SWIBOX= (0..15)
0 0 2 0 0 0 0 0 0 0 0 0 0 0 0 0 
##$SW_h= 4401.40845070422
##$TD= 16384
##$TD0= 1
##$TE= 300
##$TE2= 300
##$TE3= 300
##$TEG= 300
##$TL= (0..7)
0 120 120 120 120 120 120 120 
##$TP= (0..7)
150 150 150 150 150 150 150 150 
##$TP07= 0
##$TPNAME0= <>
##$TPNAME1= <>
##$TPNAME2= <>
##$TPNAME3= <>
##$TPNAME4= <>
##$TPNAME5= <>
##$TPNAME6= <>
##$TPNAME7= <>
##$TPOAL= (0..7)
0.5 0.5 0.5 0.5 0.5 0.5 0.5 0.5 
##$TPOFFS= (0..7)
0 0 0 0 0 0 0 0 
##$TUNHIN= 0
##$TUNHOUT= 0
##$TUNXOUT= 0
##$USERA1= <user>
##$USERA2= <user>
##$USERA3= <user>
##$USERA4= <user>
##$USERA5= <user>
##$V9= 5
##$VALIST= <valist>
##$VCLIST= <CCCCCCCCCCCCCCC>
##$VD= 0
##$VDLIST= <DDDDDDDDDDDDDDD>
##$VPLIST= <PPPPPPPPPPPPPPP>
##$VTLIST= <TTTTTTTTTTTTTTT>
##$WBST= 1024
##$WBSW= 25
##$XGAIN= (0..3)
0 0 0 0 
##$XL= 0
##$YL= 0
##$YMAX_a= 421926
##$YMIN_a= -665054
##$ZGOPTNS= <>
##$ZL1= 120
##$ZL2= 120
##$ZL3= 120
##$ZL4= 120
##$ABSF1= 10
##$ABSF2= 0
##$ABSG= 5
##$ABSL= 3
##$ALPHA= 0
##$AQORDER= 0
##$ASSFAC= 0
##$ASSFACI= 0
##$ASSFACX= 0
##$ASSWID= 0
##$AUNMP= <proc_1d>
##$AXLEFT= 0
##$AXRIGHT= 0
##$AXTYPE= 0
##$AXUNIT= <>
##$AZFE= 0.1
##$AZFW= 0.1
##$BCFW= 1
##$BC_mod= 2
##$BYTORDP= 1
##$COROFFS= 0
##$CY= 7568.61572265625
##$DATMOD= 1
##$DC= 2
##$DFILT= <>
##$DTYPP= 0
##$F1P= 17.9538593292236
##$F2P= -4.03888763876832
##$FCOR= 0.5
##$FTSIZE= 32768
##$FT_mod= 4
##$GAMMA= 1
##$GB= 1
##$INTBC= 1
##$INTSCL= 1
##$ISEN= 128
##$LB= 0.02
##$LEV0= 0
##$LPBIN= 0
##$MAXI= 945.577
##$MC2= 0
##$MEAN= 0
##$ME_mod= 0
##$MI= -402.1523
##$NCOEF= 0
##$NC_proc= 0
##$NLEV= 6
##$NOISF1= 8.587773
##$NOISF2= 6.764455
##$NSP= 1
##$NTH_PI= 0
##$NZP= 0
##$OFFSET= 17.49637
##$PC= 1
##$PHC0= -35.1467
##$PHC1= 8.961438
##$PH_mod= 0
##$PKNL= yes
##$PPARMOD= 0
##$PPDIAG= 0
##$PPIPTYP= 0
##$PPMPNUM= 100
##$PPRESOL= 1
##$PSCAL= 0
##$PSIGN= 0
##$REVERSE= no
##$SF= 200.13
##$SI= 32768
##$SIGF1= 18.5376
##$SIGF2= -6.396296
##$SINO= 400
##$SIOLD= 32768
##$SREGLST= <1H.CDCl3>
##$SSB= 3
##$STSI= 0
##$STSR= 0
##$SW_p= 4401.40845070422
##$SYMM= 0
##$S_DEV= 0
##$TDeff= 0
##$TDoff= 0
##$TI= <>
##$TILT= no
##$TM1= 0
##$TM2= 0
##$TOPLEV= 0
##$USERP1= <user>
##$USERP2= <user>
##$USERP3= <user>
##$USERP4= <user>
##$USERP5= <user>
##$WDW= 1
##$XDIM= 8192
##$YMAX_p= 0
##$YMIN_p= 0
$$ End of Bruker specific parameters
$$ ---------------------------------
##NTUPLES= NMR FID
##VAR_NAME=  TIME,          FID/REAL,        FID/IMAG
##SYMBOL=    X,             R,               I
##VAR_TYPE=  INDEPENDENT,   DEPENDENT,       DEPENDENT
##VAR_FORM=  AFFN,          ASDF,            ASDF
##VAR_DIM=   8192,          8192,            8192
##UNITS=     SECONDS,       ARBITRARY UNITS, ARBITRARY UNITS
##FACTOR=    0.0002272,     1,               1
##FIRST=     0,             0,               0
##LAST=      1.8609952,     25,              18
##MIN=       0,             -665054,         -665054
##MAX=       1.8609952,     421926,          421926
$$ Real data points
##PAGE= N=1
##DATA TABLE= (X++(R..R)), XYDATA
$$ [...]
$$ plain form
1386 68 97 -1 -36 29 -42 158 -78 96 -12 -19 -114 13 -136 -1 80 -73 117 6 206 -12 81 -199 -61 82
1410 82 -27 88 52 -219 -7 -85 -40 8 -217 -9 -2 93 88 46 -35 248 -20 76 -217 -43 -140 -171 20 39 186
1435 186 10 -92 41 -57 -143 54 54 19 -69 51 -12 176 15 -121 -2 199 -96 -77 -139 -148 64 -17 9 71 -15
1460 -15 -201 105 82 -8 -59 308 66 -219 -13 -39 40 -85 106 -93 92 61 -248 -27 -33 -138 -47 67 -15 -108
1484 -108 101 -23 179 -13 -11 -53 -104 -43 -179 136 20 17 -28 -129 51 60 -89 186 -19 -93 226 64 26 100
1508 100 -3 -23 113 -7 77 -108 137 122 -87 12 -4 -85 110 115 -37 -48 -43 -50 114 70 22 5 73 27 -197 7
1534 7 36 4 153 -65 17 83 -113 -31 -181 13 31 51 90 222 87 66 -26 -62 42 -82 -86 154 148 125 -80 13
1560 13 -34 -84 -89 -57 188 -207 -56 109 -64 72 103 -67 -10 17 -152 -95 -68 -90 46 -97 -165 -183 103 -38 -59
$$ packed form
1386F8K9r8l5O5p1K00k36J74j08pr5J27j49J35Q1j53J90j11K00k18R3k80J38J43
1410H2j09J15l6k71K12p8M5M8k25K08PR5nm2q1K83k68R6k93J74r7l1J91J9J47
1435A86j76j02J33r8q6J97%l5q8J20o3J88j61j36J19K01k95J9o2rK12q1K6O2q6
1460a5j86L06k3r0n1L67k42k85K06k6P9j25J91j99J85l1l09K21oj05R1J14q2r3
1484a08K09j24K02j92Km2n1O1j36L15j16lm5j01J80Rj49K75k05p4L19j62l8P4
1508A00j03k0J36j20Q4j85K45j5k09R9j6q1J95Nj52j1NpJ64m4m8j7O8m6k24K04
1534GK9l2J49k18Q2O6j96Q2j50J94J8K0L9J32j35k1r2l6J04j24mK40ok3k05R3
1560A3m7n0nL2K45l95J51J65j73J36L1j70N7K7j69N7K7k2J36j43o8j8K86j41k1
$$ plain form
1585 -59 59 -93 -101 -60 40 74 -32 96 -145 55 -140 -167 35 105 13 -87 -8 -21 -25 -56 39 -18 -221 94 37
1610 37 -27 -58 40 -25 -28 126 -131 -53 32 -44 -124 -27 125 -85 51 96 224 -44 105 -104 -172 -56 -56 29 93 -114
1636 -114 -20 202 21 127 57 -4 73 27 106 158 43 -83 -135 71 26 235 -16 89 -20 -24 -61 -9 -49 62 53
1661 53 -75 -45 -125 115 -22 -10 -50 61 38 161 -174 65 90 20 -129 -112 152 -11 -145 -55 -70 -18 -19 -10 -71 -57
1687 -57 -36 -45 11 219 -83 -205 264 -152 119 -43 59 -6 29 62 -100 65 -32 75 -2 27 9 -35 -16 -64 -9
1712 -9 -53 -109 -210 -121 153 -68 -80 71 19 -50 70 55 58 118 -8 -106 37 -56 -140 -112 -85 -59 -320 -45 50 20 91
1739 91 69 -165 -165 9 -209 219 164 -6 25 -19 -80 34 75 23 8 -93 76 -47 -128 81 112 99 -39 19 153
1764 153 18 -26 -99 -67 -190 46 48 -156 53 -25 81 70 -55 116 -145 88 -99 -47 155 188 -52 -65 5 85
$$ packed form
1585e9J18j52qM1J00L4j06J28k41K00j95k7K02P0r2j00P9j3ml1R5n7k03L15n7
1610C7o4l1R8o5lJ54k57P8Q5p6q0R7J52k10J36M5J28k68J49k09o8J16%Q5O4k07
1636a14R4K22j81J06p0o1P7m6P9N2j15j26n2K06m5K09k51J05j09ml7N2m0J11r
1661E3j28L0q0K40j37J2m0J11k3J23l35K39K5p0j49J7K64j63j34R0j5N2jRo1J4
1687e7K1rN6K08l02j22M69m16K71j62J02o5L5L3j62J65r7J07p7K9j8m4J9m8N5
1712im4n6j01Q9K74k21j2J51n2o9J20j5LO0j26r8J43r3q4K8K7K6k61K75R5l0P1
1739I1k2k34%J74k18M28n5j70L1m4o1J14M1n2j5j01J69j23q1K09L1j3j38N8J34
1764A53j35m4p3L2j23K36Kk04K09p8J06j1j25J71k61K33j87N2K02L3k40j3P0Q0
$$ plain form
1788 85 145 -39 30 -107 -49 -107 -214 90 -7 -42 5 111 159 -170 -196 99 -40 -135 33 -45 112 31 -69 128
1812 128 181 -3 -96 11 -57 -28 118 95 -210 56 72 28 -35 -206 143 48 153 61 78 46 9 28 -215 94 -147
1837 -147 11 76 -85 -108 -23 -41 -111 -117 -54 -72 92 138 32 -4 -78 -69 256 -107 69 11 235 139 -114 195 -146
1862 -146 -91 -58 138 58 -68 -150 -87 -57 27 -4 -27 -121 -74 -156 56 -43 -29 -143 -33 -103 86 29 -105 54 59 -23
1888 -23 -67 -37 -6 -9 -141 -34 -21 192 -181 -60 -81 -11 74 55 102 -99 -62 40 1 14 60 78 -146 58 -114 -120
1914 -120 157 -48 -27 88 125 42 40 -5 114 -52 -6 -2 20 -82 -190 -17 -131 -62 -130 -51 45 -9 91 -63 -127
1939 -127 -12 23 16 -23 -80 -31 86 93 168 39 89 -33 23 24 84 -18 282 30 27 64 16 101 42 85 -68 67 -126
1966 -126 -29 31 230 19 -93 62 -38 27 -11 2 -113 194 -79 77 27 29 -126 10 -32 -3 76 8 -102 55
$$ packed form
1788H5O0j84O9j37N8n8j07L04r7l5M7J06M8l29k6K95j39r5J68p8J57q1j00J97
1812A28N3j84r3J07o8K9J46k3l05K66J6m4o3j71L49r5J05r2J7l2l7J9k43L09k41
1837a47J58O5j61k3Q5j8p0oO3j8J64M6j06l6p4RL25l63J76n8K24r6k53L09l41
1862a46N5L3J96q0j26q2O3L0Q4l1k3r4M7q2K12r9J4j14J10p0J89n7j34J59Nq2
1888b3m4L0L1lj32J07J3K13l73J21k1P0Q5j9M7k01L7J02l9J3M6J8k24K04j72o
1914a20K77k05K1J15L7q3km5J19j66M6MK2j02j08J73j14O9o8P9R6n4J00j54o4
1939a27J15L5pl9n7M9J17PP5j29N0j22N6JO0j02L00k52lL7m8Q5n9M3j53J35j93
1966a26R7O0J99k11j12J55j00O5l8J3j15L07k73J56n0Kj55J36m2K9P9o8j10J57
$$ plain form
1990 55 18 -12 20 38 -4 98 30 -68 184 -77 234 49 -86 -109 -186 74 33 -52 117 -19 -18 17 -100 79 43
2015 43 40 35 -16 -82 20 -300 -92 26 77 -55 -221 122 -19 4 35 25 170 33 60 -144 -111 -124 -61 -25 -18 128
2041 128 76 51 3 -68 -117 95 113 -88 37 -58 40 52 164 264 68 2 -138 29 106 -31 161 180 -41 139
2065 139 -24 -5 -27 -25 -56 32 25 43 -34 -75 -25 150 167 -16 53 51 102 12 -148 23 35 -39 79 75 153 -5 131 -36
2093 -36 -133 10 1 -214 50 -104 -117 -38 7 43 -237 -116 172 57 -24 12 -154 107 -83 93 -35 0 -98 -59
2117 -59 34 21 147 9 121 -38 72 1 98 -21 -98 62 -22 -14 128 -43 -80 -19 -96 -140 -27 -90 -14 -54 -2 35
2143 35 110 111 -158 -3 35 -88 -130 56 49 163 7 96 165 127 47 198 70 -70 31 -152 -79 34 92 50 121
2168 121 80 208 -1 23 209 31 -51 -45 -26 -67 73 -66 -121 -57 -45 65 116 107 -193 -40 102 -157 -296 97
$$ packed form
1990E5l7l0L2J8m2J02o8r8K52k61L11j85j35k3p7K60m1q5J69j36JL5j17J79l6
2015D3lnn1o6J02l20K08J18N1j32j66L43j41K3L1j0J45j37K7k04L3j3O3L6PJ46
2041A28n2k5m8p1m9K12J8k01J25r5R8J2J12J00j96o6j40J67P7j37J92J9k21J80
2065A39j63J9k2Kl1Q8pJ8p7m1N0J75J7j83O9kN1r0j60J71J2p4J18mP8j58J36j67
2093c6r7J43rk15K64j54j3P9M5L6k80J21K88j15q1L6j66K61j90J76j28L5r8L9
2117e9R3j3J26j38J12j59J10p1R7j19p7J60q4QJ42j71l7O1p7m4J13o3P6m0N2L7
2143C5P5Jk69J55L8j23m2J86pJ14j56Q9O9l8q0J51j28j40J01j83P3J13N8m2P1
2168A21m1J28k09K4J86j78q2OJ9m1J40j39n5O4J2J10N1rl00J53J42k59j39L93
$$ plain form
2192 97 -12 150 -52 -186 60 147 1 -205 185 1 1 -33 -116 -37 68 110 -32 -36 15 187 -80 -28 -69 -84 21
2217 21 -7 -26 118 211 37 -28 10 47 94 122 -93 -76 29 53 -112 -70 -184 6 -4 -182 12 -49 -67 153 47
2242 47 26 42 -15 -186 109 -50 76 69 -6 -84 123 -4 -94 -34 -30 35 23 46 15 163 64 -35 -8 -35 -48 120 -78
2269 -78 69 22 -4 60 2 -40 -143 27 -75 62 40 12 -61 55 8 -36 44 -46 182 -3 -52 126 -88 -183 184
2294 184 75 96 90 51 30 6 0 -101 96 194 296 100 -27 25 -115 111 -75 128 127 87 39 6 39 -145 -35
2319 -35 -41 -53 -139 8 179 93 -2 -33 99 23 75 -166 -24 -42 132 -41 166 -49 -11 -19 -79 11 -6 -103 -70 -88 85
2346 85 -23 110 79 -66 -17 39 -82 -82 -83 -72 -52 107 87 112 -167 85 -30 49 118 -50 246 -126 51 1 107
2371 107 -110 -96 71 72 104 187 131 -24 -205 43 -134 -19 20 -13 -136 54 26 -33 -15 -49 -100 20 -134 14
$$ packed form
2192I7j09J62k02j34K46Q7j46k06L90j84%l4q3P9J05M2j42mN1J72k67N2m1j5J05
2217B1k8j9J44R3j74o5L8L7M7K8k15J7J05K4j65M2j14J90j0j78J94o1j8K20j06
2242D7k1J6n7j71K95j59J26pp5p8K07j27r0O0MO5j2K3l1J48r9r9K7k7j3J68j98
2269g8J47m7k6O4n8m2j03J70j02J37k2k8p3J16m7m4Q0r0K28j85m9J78k14r5L67
2294A84j09K1ol9k1k4oj01J97R8J02j96j27N2j40K26j86K03jm0m8l3L3j84J10
2319c5oj2q6J47J71q6r5l1J32p6N2k41J42j8J74j73K07k15L8qo0R0j7r7L3j8J73
2346H5j08J33l1j45M9N6j21%jJ1K0J59k0K5k79K52j15P9O9j68K96l72J77n0J06
2371A07k17J4J67JL2Q3n6j55j81K48j77J15L9l3j23J90k8n9J8l4n1J20j54J48
$$ plain form
2395 14 -145 -40 16 -109 -43 57 -96 -37 -81 -16 -40 -140 38 22 20 -188 -1 -22 58 107 85 137 -76 -116 -65 185
2421 185 -1 147 9 -55 -8 -31 -12 38 -116 111 34 138 34 -64 -108 -246 187 -138 -71 -33 174 20 28 12
2445 12 -71 -138 0 -242 -9 -67 -26 29 -46 -151 64 -46 -46 -130 69 41 30 136 -136 63 -98 -124 -27 43 26
2470 26 201 65 93 194 139 -121 29 23 -79 -114 44 8 32 -211 19 137 -96 126 -23 132 107 35 -112
2493 -112 -1 256 -102 21 -22 54 1 123 37 -135 -84 -24 34 -158 -231 36 87 -86 -106 -37 -33 58 -18 -54 -16 9
2519 9 56 68 84 -21 37 99 99 35 193 53 -49 -206 -41 -132 33 -89 6 -40 125 107 61 -167 -87 -7 -80 -32
2545 -32 82 55 -108 -153 -103 112 -91 -129 95 -13 -46 104 -14 153 98 181 -35 80 64 99 88 64 6 -43 33
2570 33 47 -4 33 59 28 -51 -178 31 -33 -113 -135 -23 -4 73 -161 -133 136 35 -91 215 -72 -94 40 111 -216
$$ packed form
2395A4j59J05N6j25O6J00j53N9m4O5k4j00J78j6kk08J87k1Q0M9k2N2k13m0N1K50
2421A85j86J48j38o4M7k3J9N0j54K27p7J04j04r8m4j38M33l25O7L8K07j54Qj6
2445A2q3o7J38k42K33n8M1N5p5j05K15j10%q4J99k8j1J06k72J99j61k6R7P0j7
2470B6J75j36K8J01n5k60J50oj02l5J58l6K4k43K30J18k33K22j49J55k5p2j47
2493a12J11K57l58J23m3P6n3J22q6j72N1O0N8j92p3K67N1j73k0O9MR1p6l6L8K5
2519IM7J2J6j05N8O2%o4J58j40j02j57J65r1J65j22R5m6J65j8m6k28Q0Q0p3M8
2545c2J14k7j63m5N0K15k03l8K24j08l3J50j18J67n5Q3k16J15j6L5j1k4n8m9P6
2570C3J4n1L7K6l1p9j27K09o4q0k2J12J9P7k34K8K69j01j26L06k87k2J34P1l27
$$ plain form
2595 -216 -136 24 47 -125 -16 162 -6 -2 111 135 -63 16 6 -167 -53 -66 33 -75 33 -9 106 -23 33 -58
2619 -58 28 -23 -139 -36 -36 -204 84 120 -67 9 -111 -109 -3 115 86 41 -36 60 50 79 -76 -5 -102 66 61 -29 -21
2646 -21 -12 21 -48 -143 -57 1 4 -68 -7 -72 -65 -118 -62 -44 62 198 -10 -62 -24 145 63 136 99 2 -150 -27 62 84 94
2675 94 -45 -165 2 -7 25 -38 131 9 -25 18 45 -179 67 7 39 29 13 -33 -48 79 -12 -125 -127 -76 -15 180
2701 180 -157 34 -116 31 41 -147 -98 54 -73 69 104 160 -5 25 -19 159 151 -21 -193 18 -7 -134 -104
2724 -104 -55 63 -104 81 -68 116 -180 22 47 191 -135 -23 28 46 -91 91 6 -49 -21 -66 -65 26 174 -55
2748 -55 -54 -31 10 -42 -161 59 127 -20 -110 30 -120 79 -158 55 128 -129 -16 214 43 -90 -31 57 -23 -39
2772 -39 55 -139 33 5 38 43 96 -65 -70 -263 44 -7 -86 -64 -28 96 -123 -136 46 11 -171 -83 112 -89 30
$$ packed form
2595b16Q0J60K3j72J09J78j68MJ13K4j98P9j0j73J14j3R9j08J08m2J15j29N6r1
2619e8Q6n1j16J03%j68K88L6j87P6j20KJ06J18k9m5p7R6j0K9j55P1r7J68nr0Q
2646b1RL3o9r5Q6N8Lp2O1o5Pn3N6J8J06J36k08n2L8J69q2P3l7r7j52J23Q9K2J0
2675I4j39j20J67rL2o3J69j22l4M3K7k24K46o0L2j0j6m6j5J27r1j13kN1O1J95
2701A80l37J91j50J47J0j88M9J52j27J42L5N6j65L0m4J78qj72j72K11k5j27L0
2724a04M9J18j67J85j49J84k96K02K5J44l26J12N1J8j37J82q5n5K8m5JR1J48k29
2748e5JK3M1n2j19K20O8j47r0J40j50J99k37K13P3k57J13K30j71j33N9Q8q0j6
2772c9R4j94J72k8L3NN3j61nj93L07n1p9K2L6J24k19j3J82l5j82Q8J95k01J19
$$ plain form
2797 30 -70 26 65 -63 33 -89 57 60 -81 -136 12 85 103 -44 60 171 -47 -133 -21 -23 -49 -20 -62 81 -47
2822 -47 29 1 -75 -167 -70 -38 -134 -65 71 60 14 145 -54 -110 -128 -30 -190 -78 19 -91 101 -14 14 -152 80
2847 80 -55 106 -129 145 -77 -131 -142 -147 -11 11 30 -224 -63 132 81 11 21 94 -14 10 85 86 17 98 1 -89
2873 -89 157 45 -42 9 41 -23 182 -45 40 9 61 273 97 37 40 -3 15 111 -64 -49 -66 -74 -166 20 -26 -142 -99
2900 -99 -146 171 -77 -42 -38 46 -41 -28 17 15 -77 48 -104 33 -56 109 -18 -130 143 -131 -66 109 54 55 171 -20
2926 -20 98 104 149 63 26 -39 38 20 -136 32 -52 -17 -278 3 -260 -115 -88 114 31 -16 36 -66 -54 -68 -14 125
2952 125 -111 180 -19 -240 -17 24 -62 98 -124 -264 -182 8 76 158 62 16 0 -49 70 206 -22 20 22 -91
2976 -91 -132 -43 -2 71 -112 137 56 51 -2 40 -54 -16 -128 47 -22 -3 90 -26 12 -111 -149 -125 79 -1 33 11 -140
$$ packed form
2797C0j00R6L9j28R6j22J46Lj41n5J48P3J8j47J04J11k18q6J12kk6K9m2J43j28
2822d7P6k8p6r2R7L2r6O9J36j1m6J31j99n6j8R8j60J12R7j10J92j15K8j66K32
2847H0j35J61k35K74k22n4j1nJ36K2J9k54J61J95n1p0J0P3j08K4P5Jo9Q1r7r0
2873h9K46j12q7N1L2o4K05k27Q5l1N2K12j76o0Lm3J8R6j75J5j7qr2J86m6j16M3
2900i9m7L17k48L5MQ4q7J3M5kr2J25j52J37q9J65j27j12K73k74O5J75n5JJ16j91
2926b0J18OM5q6l7o5P7j8j56J68q4L5k61K81k63J45K7K02q3m7N2j02J2j4N4J39
2952A25k36K91j99k21K23M1q6J60k22j40Q2J90O8Q2r6m6j6m9J19J36k28M2Kj13
2976i1m1Q9M1P3j83K49q1nn3M2r4L8j12J75o9J9R3j16L8j23l8K4K04q0L4k2j51
$$ plain form
3003 -140 -162 -67 -48 28 -30 -54 -111 -24 15 86 129 -36 -116 8 -136 -52 -59 112 -143 48 -216 -21 57 42 -3 -76
3029 -76 45 30 6 11 52 10 -48 -21 52 23 -9 -127 72 -16 -59 -75 14 122 -102 -25 88 -14 15 -151 135 -4
3055 -4 -102 166 -5 115 -182 -136 6 -77 167 -83 179 33 100 -24 78 80 -137 106 -147 -33 184 -23 100
3078 100 43 -9 132 191 -20 -2 11 -12 -103 67 -5 -23 57 -194 -109 43 -14 -126 29 11 -21 -139 -75 -265 -37
3103 -37 -45 -27 -3 143 116 -133 -117 -37 -42 70 19 -17 15 -164 14 133 20 -30 1 108 -82 71 -58 -118 126
3128 126 -55 -51 44 109 0 -21 -76 90 -49 5 -107 -98 18 7 -97 -27 -98 -159 -49 -42 42 80 -144 -87 -137 102
3154 102 -108 189 70 52 37 -227 74 26 -68 -125 -23 53 -28 74 -61 -89 0 -146 -73 -33 -215 -202 118 -203
3178 -203 -81 -106 96 -9 150 104 83 63 -15 2 32 72 13 76 154 27 149 77 -176 -64 -55 -43 -71 -11 -3 128
$$ packed form
3003a40k2R5J9P6n8k4n7Q7L9P1M3j65q0J24j44Q4pJ71k55J91k64J95P8j5m5p3
3029g6J21j5k4NM1m2n8K7P3k9l2j18J99q8m3j6Q9J08k24P7J13j02K9j66K86j39
3055dr8K68j71J20k97M6J42q3K44k50K62j46O7j24J02Kk17K43k53J14K17k07J23
3078A00n7n2J41N9k11J8J3k3r1J70p2j8Q0k51Q5J52n7j12J55j8l2j18O4j90K28
3103c7qJ8K4J46k7k49J6Q0nJ12n1l6L2j79J78J19j13n0L1J07j90J53j29o0K44
3128A26j81MR5O5j09k1n5J66j39N4j12RJ16j1j04P0p1o1J10PQ4L8k24N7n0K39
3154A02k10K97j19j8j5k64L01m8r4n7J02P6q1J02j35k8Q9j46P3M0j82J3L20l21
3178b03J22k5K02j05J59m6k1k0p8J7L0M0n9O3P8j27J22p2k53J12RJ2k8O0QJ31
$$ plain form
3204 128 -12 -247 -50 71 93 -151 -25 -5 -10 -4 -184 -209 -85 48 6 90 39 -88 -133 -111 51 18 -56 74 55
3229 55 -173 31 -65 -99 24 -47 -35 -11 19 -43 -13 186 -9 -24 -54 51 -104 -34 77 -23 32 70 78 -179 -192 20
3255 20 21 -21 -61 -88 -143 -156 -127 -157 73 -51 -73 103 -56 37 -94 -23 90 -2 160 28 -20 47 11 -72 -242 78
3281 78 -33 12 69 43 -53 45 -3 -26 -51 -37 201 106 -45 -99 -16 -113 33 -70 -41 20 237 -109 111 1 -22 -50
3307 -50 -116 -19 -161 -71 114 54 146 -207 -145 128 -60 83 38 3 155 -103 -22 6 -79 25 -76 -62 -144 22 -66
3332 -66 -93 -171 7 -36 43 -22 84 -39 -23 48 -75 122 -137 -84 -46 -76 -97 -23 -51 123 -18 147 -75 44 110
3357 110 88 -69 113 -51 31 136 -127 -103 9 43 -154 -17 -118 15 -214 142 -151 -174 -23 -26 -149 -59 100
3380 100 -241 -26 4 142 307 55 -61 -13 11 -98 -114 2 117 -74 -177 -66 98 4 -78 2 251 -27
$$ packed form
3204A28j40k35J97J21K2k44J26K0nOj80k5J24J33m2Q4n1j27m5K2J62l3p4J30j9
3229E5k28K04r6l4J23p1J2K4L0o2L0J99j95j5l0J05j55P0J11j00N5L8Qk57j3K12
3255B0Jm2m0k7n5j3K9l0K30j24k2J76j59R3j31P1J13r2J62j32m8O7l6q3j70L20
3281G8j11M5N7k6r6R8m8k3k5J4K38r5j51n4Q3r7J46j03K9O1K17l46K20j10k3k8
3307e0o6R7j42R0J85o0R2l53O2K73j88J43m5l5J52k58Q1K8q5J04j01J4q2J66q8
3332f6k7p8J78m3P9o5J06j23J6P1j23J97k59N3L8l0k1P4k8J74j41J65k22J19O6
3357A10k2j57J82j64Q2J05k63K4J12L4j97J37j01J33k29L56k93k3J51lj23R0J59
3380A00l41K15L0J38J65k52j16M8K4j09j6J16J15j91j03J11J64r4q2Q0K49k78
$$ plain form
3402 -27 -72 73 8 -6 -3 -19 -7 -20 -67 15 36 -184 50 219 -152 -39 91 -1 -187 42 -178 -20 56 22 16 -4
3428 -4 -40 -171 -197 123 -10 76 77 46 68 18 26 60 -31 -61 -71 -33 190 -143 -13 -107 -18 -43 202 -27 -14 16 18 61
3456 61 4 -96 -49 25 131 -201 -57 -20 -118 5 24 74 -147 96 -247 30 -9 39 -36 -43 -37 -76 -207 -58 63
3481 63 204 -20 -68 19 126 -40 8 -39 -23 -3 158 89 -160 -61 68 -53 237 -77 -76 -39 -165 98 89 -111 -67
3506 -67 -156 -48 -120 -98 -173 -211 -87 -187 5 -254 220 -212 -94 -61 -119 -99 -28 -9 -49 -103 60 -40 -123 112 -39
3531 -39 91 47 -25 -90 10 104 36 0 21 28 -52 111 -47 -207 -140 -33 80 69 -11 39 101 18 -124 11 -114 24
3557 24 -202 -51 -49 -106 -34 -103 68 63 58 51 77 14 167 -39 -14 27 -6 125 -218 -92 7 191 112 -71 -138 77 -61
3584 -61 -67 -24 141 -4 222 -35 -8 29 57 22 97 54 32 -56 54 0 7 32 -11 -219 -50 155 0 31 -14 -122
$$ packed form
3402b7m5J45o5j4Lj6J2j3m7Q2K1k20K34J69l71J13J30r2j86K29k20J58P6l4ok0
3428dl6j31k6L20j33Q6Jl1K2n0QL4r1l0j0L8K23l33J30r4Q9k5K45k29J3L0KM3
3456F1n7j00M7P4J06l32J44L7r8J23J9N0k21K43l43K77l9M8p5pOl9j31J49J21
3481F3J41k24m8Q7J07j66M8m7J6K0J61o9k49R9J29j21K90l14JL7j26K63rk00M4
3506f7q9J08p2K2p5l8J24j00J92k59M74m32J18L3n8K0P1J9m0n4J63j00q3K35j51
3531c9J30m4p2o5J00R4o8l6K1Pq0J63j58j60O7J07J13j1q0N0O2q3j42J35j25J38
3557B4k26J51Kn7P2o9J71nnpK6o3J53k06K5M1l3J31l43J26R9J84p9j83o7K15j38
3584f1oM3J65j45K26k57K7L7K8l5P5m3k2q8J10n4PK5m3k08J69K05j55L1m5j08
$$ plain form
3610 -122 55 -254 60 -68 -68 74 12 82 48 -33 73 -54 116 5 -71 -57 -70 110 45 26 65 82 4 -129 -97
3635 -97 -102 14 74 -14 -23 -66 -138 -66 74 142 72 120 -2 1 141 -65 24 45 -25 169 -79 -39 -69 -109 -106 -79 184 -52
3663 -52 -44 -75 15 -5 -94 -30 -94 -12 -59 -51 -14 -82 -73 -43 -37 -17 45 28 -70 201 -50 -24 172 -171 109 32 -45 22 -48 20
3693 20 0 179 -46 -35 44 -218 59 26 99 34 164 45 142 94 39 41 16 -170 -174 75 93 78 -122 -36 81 100
3719 100 136 -79 -62 238 -29 75 -178 -94 35 -125 212 -45 109 -85 -133 174 42 -94 30 -98 -52 -29
3741 -29 11 257 -21 -28 38 74 -228 -98 2 79 -2 152 -70 -20 -128 24 -40 -186 -115 51 40 -13 -216 -46
3765 -46 -23 -28 59 -11 -48 -51 -49 61 -21 120 -36 72 -118 -19 100 -76 -60 -66 21 112 163 196 109 23 27 121 162 71 -29
3794 -29 55 63 -37 59 -86 90 -38 -98 -120 28 70 -105 -76 -29 -8 136 -54 111 -20 68 -104 130 -43 5
$$ packed form
3610a22J77l09L14j28%J42o2P0l4q1J06j27J70j11p6J4j3J80o5j9L9J7p8j33L2
3635i7nJ16O0q8rm3p2P2J40O8p0M8j22LJ40k06Q9K1p0J94k48M0l0m0LK7K63k36
3663e2Ql1R0k0q9O4o4Q2m7QL7o8RL0OK0O2j7r8K71k51K6J96l43K80p7p7O7p0O8
3693B0k0J79k25J1P9k62K77l3P3o5J30j19R7m8n5Kk5j86mK49J8j5k00Q6J17J9
3719A00L6k15J7L00k67J04k53Q4J29j60L37k57J54j94m8L07j32j36J24j28M6K3
3741b9M0K46k78pO6L6l02J30J00P7q1J54k22N0j08J52o4j46P1J66j1n3k03J70
3765d6K3nQ7p0l7lKJ10q2J41j56J08j90R9J19j76J6oQ7R1N1L3q7q6MR4M1r1j00
3794b9Q4Qj00R6j45J76j28o0k2J48M2j75K9M7K1J44j90J65j31Q8j72K34j73M8
$$ plain form
3818 5 -10 86 144 -26 -88 -135 -80 -9 84 -141 115 -38 121 -178 -80 34 47 275 82 174 76 11 -60 45 117 24
3844 24 -123 198 103 48 99 -25 41 -65 -40 114 49 57 98 42 113 -108 54 -42 -11 -121 -164 -23 48 -74 60
3869 60 -51 123 0 42 3 211 -142 9 -28 22 96 -37 1 -57 73 14 248 13 -135 -19 182 42 -14
3892 -14 -13 58 89 40 20 71 -23 171 137 103 -3 119 11 43 -77 17 109 -130 -5 1 -100 183 204 -35 103 35
3918 35 20 93 -46 -170 -6 -72 132 -120 30 160 -32 67 23 17 -92 71 112 82 25 2 106 -141 143 -55
3942 -55 103 -79 -31 95 -27 -2 12 134 -10 -70 -46 98 -21 -12 94 -89 161 -68 55 139 54 -236 -55
3965 -55 64 -252 12 -109 -28 76 -176 -58 -30 -130 32 -7 24 -25 -185 -18 -26 50 -89 6 142 -44 -33 -58
3989 -58 64 61 156 20 78 114 64 212 134 139 170 -186 65 -14 -118 -11 80 87 178 -167 95 -146 -160 75 29 88
$$ packed form
3818Ej5R6N8j70o2m7N5P1R3k25K56j53J59k99R8J14J3K28j93R2r8o5p1J05P2r3
3844B4j47L21r5n5N1j24O6j06K5J54o5QM1n6P1k21J62r6L1j10m3J41P1j22J34
3869F0j11J74j23M2l9K08l53J51l7N0P4j33L8n8J30n9K34k35j48J16K01j40n6
3892a4JP1L1m9k0N1r4J94l4l4j06J22j08L2j20R4R2k39J25Oj01K83K1k39J38o8
3918C5j5P3j39j24J64o6K04k52J50J30j92R9m4oj09J63M1l0n7k3J04k47K84j98
3942e5J58j82M8J26j22K5J4J22j44o0K4J44j19RJ06j83K50k29J23Q4q5k90J81
3965e5J19l16K64j21Q1J04k52J18K8j00J62l9L1m9j60J67qP6j39R5J36j86J1k5
3989e8J22lR5j36N8L6n0J48p8NL1l56K51p9j04J07R1PR1l45K62k41j4K35m6N9
$$ plain form
4015 88 -25 130 -186 -120 -123 -141 51 -82 -135 205 12 64 -32 -62 22 -130 -178 -125 -13 -2 -64 1 111 -52 55
4040 55 27 46 -153 35 78 31 -43 -117 16 -108 -37 43 -23 6 80 -20 56 -89 181 -10 2 45 -16 -76 -1 20
4066 20 56 54 40 -59 -49 64 -1 75 56 -52 -96 -94 -113 83 -85 72 140 -10 -72 -50 13 -2 -62 98 57 -18 -38 227
4094 227 -110 14 -165 -105 -159 -191 -105 -78 1 98 68 6 98 -178 120 192 45 203 72 -35 88 -5 47 126 -142
4119 -142 -122 218 60 27 -17 -1 -130 89 64 -106 92 -32 -82 -14 64 52 39 -98 162 52 131 -41 -15 136
4143 136 2 98 58 49 -53 124 218 39 -30 -136 56 124 44 14 229 25 43 112 -11 -177 21 -74 -49 75
4167 75 -83 -26 126 -92 57 -122 -29 92 -27 42 -17 -63 -96 -21 116 17 -129 -19 47 30 -173 126 103 -2
4191 -2 -90 18 237 173 54 148 30 -12 37 -89 -23 54 53 24 -53 134 -116 20 53 58 24 -203 -79 90 19 -70
$$ packed form
4015H8j13J55l16O6lj8J92j33n3L40j93N2r6l0Q4j52m8N3J12J1o2O5J10j63J07
4040E5k8J9j99J88M3m7p4p4J33j24P1Q0o6K9P4j00P6j45K70j91J2M3o1o0P5K1
4066B0L6kj4r9J0J13o5P6j9j08m4Kj9J96j68J57O8j50o2K2O3j5o0J60m1p5k0K65
4094B27l37J24j79O0n4l2Q6K7P9R7l0o2R2k76K98P2j47J58j31j07J23r3N2P9k68
4119a42K0L40j58l3m4J6j29K19k5j70J98j24n0O8P8j2j3j37K60j10P9j72K6J51
4143A36j34R6m0rj02J77R4j79o9j06J92O8q0l0K15k04J8O9j23j66J98r5K5J24
4167G5j58N7J52k18J49j79R3J21j19O9n9m6l3P5J37r9j46J10O6j7k03K99k3j05
4191bq8J08K19o4j19R4j18m2M9j26O6P7jk9p7J87k50J36L3Nl4k27J24J69p1q9
$$ plain form
4217 -70 110 78 48 6 -63 -217 90 94 -138 80 111 -12 41 31 -161 -144 -1 70 58 36 -19 13 126 113 276 24
4243 24 29 -4 195 31 3 281 27 94 81 28 1 -38 -42 125 170 48 242 136 16 -159 -90 64 95 43 -119
4268 -119 -76 75 166 129 69 13 -245 67 147 -105 -109 67 -5 -55 -3 -69 101 -68 105 -87 -114 -117 -21 -250 -41
4293 -41 -61 -107 53 -127 -33 111 143 -134 -45 -75 59 46 59 98 104 -60 50 -69 47 -52 -12 -55 94 14 -25 79
4319 79 -74 -56 14 67 6 60 -64 26 128 123 -71 -112 -96 -51 -11 -9 50 0 90 100 -44 -28 -71 -141 108 -64 -108 -42
4347 -42 56 -115 -92 -83 112 21 124 39 227 15 -48 126 78 68 82 186 2 -19 10 54 -1 -37 -100 -148 -110 11
4373 11 79 -69 -33 230 3 -107 -256 87 10 139 -114 28 -24 -91 108 -66 -38 72 70 21 62 109 -214 -127
4397 -127 115 -27 13 -9 -26 25 -156 186 -58 67 174 63 86 85 -28 126 55 96 46 76 49 95 -86 -36 19
$$ packed form
4217g0J80l2l0m2o9j54L07Mk32K18L1j23N3j0j92J7J43P1j2k2n5L2J13j3J63k52
4243B4Nl3J99j64k8K78k54O7j3n3k7l9mJ67M5j22J94j06j20j75O9J54L1n2j62
4268a19M3J51R1l7o0n6k58L12Q0k52mJ76p2n0N2o6J70j69J73j92k7lR6k29K09
4293d1k0m6J60j80R4J44L2k77Q9l0J34j3J3L9Oj64J10j19J16r9M0m3J49q0l9J04
4319G9j53J8P0N3o1N4j24R0J02nj94m1J6M5M0KN9n0R0J0j44J6m3p0K49j72m4O6
4347d2R8j71K3RJ95r1J03q5J88k12o3J74m8j0J4J04j84k1K9M4n5l6o3m8L8J21
4373A1O8j48L6K63k27j10j49L43p7J29k53J42n2o7J99j74K8J10km9M1M7l23Q7
4397a27K42j42M0k2j7N1j81L42k44J25J07j11K3jj13J54p1M1n0L0k7M6j81N0N5
$$ plain form
4422 19 -25 -45 -106 -136 121 -165 139 145 -55 43 -32 -96 -72 6 300 -43 -123 -10 256 81 96 46 -79 -63 -244
4447 -244 58 34 -12 85 129 13 99 -25 106 166 -78 149 -56 -82 -50 -1 -12 5 -45 -93 147 -73 113 217
4471 217 -16 -78 89 39 90 210 31 82 -64 85 2 50 59 82 -45 -21 67 63 161 34 -22 -108 206 -98 17
4496 17 142 12 83 66 -7 92 -98 132 -87 114 -65 104 -39 95 131 14 -81 180 -24 103 49 62 135
4519 135 -35 -12 -69 42 -17 81 -4 54 -27 98 -111 112 -162 111 36 44 -6 -71 59 57 145 91 87 99 73 238 35
4546 35 -8 91 -79 -127 127 -81 -85 222 44 37 145 13 -198 5 -36 100 136 34 42 59 41 25 10 111 -165
4571 -165 89 -82 -118 -71 -3 167 -65 -12 167 159 -107 -230 35 208 76 -64 66 -89 57 63 -14 55 153 32
4595 32 -57 -26 -246 74 -105 129 157 87 -180 -22 -48 183 -88 -61 19 -140 -99 -78 -37 -91 26 100 141 -154 -12
$$ packed form
4422A9m4k0o1l0K57k86L04Ok00R8p5o4K4P8K94l43q0J13K66j75J5n0j25J6j81
4447b44L02k4m6R7M4j16Q6j24J31O0k44K27k05k6L2M9j1J7n0m8K40k20J86J04
4471B17k33o2J67n0N1J20j79N1j46J49q3M8RK3j27K4Q8mR8j27n6q6L14l04J15
4496A7J25j30P1j7p3R9j90K30k19K01j79J69j43J34L6j17r5K61k04J27n4J3P3
4519A35j70K3n7J11n9R8q5N8q1J25k09K23k74K73p5Qn0o5J30kQ8n4mJ2k6J65k03
4546C5m3R9j70m8K54k08mL07j78pJ08j32k11K03m1J36L6j02QJ7j8j6j5J01k76
4571a65K54j71l6M7O8J70k32N3J79qk66j23K65J73j32j40J30j55J46Op7O9R8j21
4595C2q9L1k20L20j79K34K8p0k67J58k6K31k71K7Q0j59M1K1M1n4J17P4M1k95J42
$$ plain form
4620 -12 -155 -77 53 115 198 113 174 53 -26 -152 -141 -89 7 81 -22 -3 12 -17 -64 -19 -69 61 -100 -193 142 93
4646 93 62 35 -112 -70 -189 -147 70 132 -45 43 -70 -258 12 -38 39 142 292 -34 127 180 47 -45 -157 -27
4670 -27 18 16 -126 82 73 68 -98 -104 82 -17 110 -86 -52 16 -123 58 -35 -34 -34 3 -129 -251 -166 54 -20 -3 -32 13
4698 13 -120 199 -16 183 119 -59 110 16 -5 -73 -56 -98 163 -47 27 -105 151 36 69 106 88 182 5 -2 -37
4723 -37 -43 -30 -12 69 -96 91 92 146 49 64 113 87 -107 -70 -90 130 57 79 18 -36 105 -2 74 -1 58 147 -1 -97
4751 -97 -6 120 18 41 -13 53 -17 48 159 146 92 -7 -72 -33 54 124 -45 -59 75 192 57 -106 104 -63 21
4776 21 57 21 -46 -30 -55 -12 -246 134 -217 -57 22 23 -19 -54 -219 -24 41 130 8 72 -97 -127 -62 34 114 27 61
4803 61 -8 -199 -99 6 -110 -93 -95 34 22 57 -25 113 -18 62 199 -123 167 165 63 97 -89 -70 -11 -21 -45
$$ packed form
4620a2j43P8J30O2Q3q5O1j21p9j26J1N2R6P4j03J9J5k9m7M5n0J30j61r3L35m9
4646I3l1k7j47M2j19M2K17O2j77Q8j13j88K70n0P7J03J50l26J61N3j33r2j12J30
4670b7M5kj42K08rnj66oJ86r9J27j96L4O8j39J81r3J%L7j32j22Q5K20p4J7k9M5
4698A3j33L19k15J99o4j78J69r4k1o8J7m2K61k10P4j32K56j15L3L7j8R4j77pl5
4723c7oJ3J8Q1j65J87JN4r7J5M9k6j94L7k0K20p3K2o1n4J41j07P6p5N9Q9j48r6
4751i7R1J26j02K3n4O6p0O5J11j3n4r9o5L9Q7P0j69j4J34J17j35j63K10j67Q4
4776B1L6l6o7J6k5M3k34L80l51J60P9Jm2l5j65J95O5Q9j22O4j69l0O5R6Q0q7L4
4803F1o9j91J00J05j16J7kJ29j2L5q2J38j31Q0J37l22K90kj02L4j86J9N9j0k4
$$ plain form
4828 -45 107 -175 172 -125 38 -67 10 -99 9 101 -162 -57 118 76 -61 31 10 -1 -147 86 171 116 6
4851 6 131 -85 213 1 -35 4 64 32 -72 144 -69 -16 -49 -35 -13 -105 -18 -72 167 27 146 7 35 54 -138
4876 -138 -131 22 -50 -78 28 182 -230 -117 -182 89 -8 83 -12 14 100 70 -35 -42 0 -36 13 22 -105 -66 52 -38 -7
4903 -7 -3 6 -108 -57 -20 35 226 -18 79 73 -111 67 -14 149 74 -69 -42 3 -5 -52 -34 7 -74 49 192 -108 17
4930 17 15 18 -141 -197 3 -7 -60 -77 174 -88 -50 106 -87 46 -83 125 13 130 13 -75 -72 -148 -147 -79 159 -102
4956 -102 33 134 6 -51 37 12 -139 -93 -153 -217 -185 -155 -54 52 -24 -37 10 1 26 51 -83 -55 -8 6 -124 -54
4982 -54 -44 27 121 -153 -24 -82 -62 1 -46 -2 -28 -44 234 -139 61 52 27 -11 11 119 -114 56 -158 111 0
5007 0 -82 79 13 105 38 15 -62 11 -37 -17 105 -81 -154 -118 53 -18 185 -8 -74 40 -42 -23 -68 110 -17 162
$$ packed form
4828d5J52k82L47k97J63j05P7j09J08R2k63J05J75m2j37R2k1j1j46K33Q5n5j10
4851FJ25k16K98k12l6L9O0l2j04K16k13N3l3J4K2r2Q7n4K39j40J19j39K8J9j92
4876a38PJ53p2k8J06J54m12J13o5K71r7R1r5K6Q6l0j05pM2l6M9Rj27L9J18r0L1
4903gMRj14N1L7N5J91k44R7oj84J78q1J63p5j43K7M5qm7J8M1q1J23J43l00J25
4930A7kLj59n6K00j0n3j7K51k62L8J56j93J33j29K08j12J17j17q8Lp6JO8K38k61
4956a02J35J01j28n7Q8k5j51M6o0o4L2L0J01J06p6j3M7rK5K5j34K8M7J4j30P0
4982e4J0P1R4k74J29n8K0O3m7M4k6j6K78l73K00rk5l8K2J08k33J70k14K69j11
5007@q2J61o6R2o7k3p7P3m8K0J22j86p3L6J71p1K03j93o6J14q2J9m5J78j27J79
$$ plain form
5033 162 151 -26 31 -190 -74 -113 -121 -84 27 -29 -72 -61 127 -7 -11 118 51 -43 -139 209 -213 62 23 -149 -27
5058 -27 227 -164 55 -119 68 91 35 -1 111 8 -47 -9 91 6 35 -105 87 6 73 36 -9 -61 98 53 -67
5083 -67 -30 102 -16 67 14 -105 55 -19 44 -60 -15 -54 61 53 99 -94 58 -187 70 -64 -62 -194 -9 -55 -133
5108 -133 -38 -83 -72 -9 -24 68 7 52 35 107 108 49 82 -111 -64 -184 -52 54 -26 -40 86 -38 150 -53 -18 -119
5134 -119 2 50 -136 30 76 -59 -174 27 -143 -53 -47 -17 23 -37 -57 41 128 -218 44 -32 119 -19 186 118
5158 118 -18 20 -89 -128 -123 -127 -47 -135 -149 141 -179 149 8 60 -239 -98 38 239 68 -105 155 0 149
5181 149 -201 -131 217 13 -7 -60 54 -95 41 -113 62 24 -13 -4 105 -52 1 -20 17 -74 -133 96 14 -62 -30
5206 -30 -12 116 -14 -24 11 -45 47 -45 85 -224 10 -16 -43 110 81 -59 -103 151 -155 66 -9 23 7 -129 -63
$$ packed form
5033A62j1j77N7k21J16l9qL7J11n6m3J1J88j34mJ29o7r4r6L48m22K75l9j72J22
5058b7K54l91K19j74J87K3n6l6J12j03n5L8J00q5K9j40J92q1O7l7m5n2J59m5j20
5083f7L7J32j18Q3n3j19J60p4O3j04M5l9J15qM6j93J52k45K57j34Kj32J85m6p8
5108a33R5m5J1O3j5R2o1M5j7P2Jn9L3j93M7j20J32J06q0j4J26j24J88k03L5j01
5134a19J21M8j86J66M6j35j15K01j70R0OL0M0o0k0R8Q7l46K62p6J51j38K05o8
5158A18j36L8j09l9NmQ0q8j4K90l20L28j41N2k99J41J36K01j71j73K60j55J49
5181A49l50P0L48k04k0n3J14j49J36j54J75l8l7RJ09j57N3k1L7r1n9K29q2p6L2
5206c0J8J28j30j0L5n6R2r2J30l09K34k6k7J53k9j40m4K54l06K21p5L2j6j36O6
$$ plain form
5231 -63 -2 -50 28 -203 8 101 -76 -128 13 -142 137 104 -64 90 111 -127 -28 39 -24 -49 1 -50 22 -89 10
5256 10 -87 -36 -38 -113 120 -137 32 -73 21 -64 229 -139 68 41 96 -167 0 82 14 -114 31 222 -41 6
5280 6 -89 64 28 27 -8 -116 2 151 111 89 -14 128 -27 49 23 95 -98 -139 -43 137 68 63 42 -147 -58 62
5306 62 -63 -26 25 25 77 -26 -91 154 -196 187 102 -7 34 -46 84 -130 144 175 60 -19 44 129 46 -65 -60 -36
5332 -36 176 134 34 -121 95 27 -114 -38 -72 -30 -16 80 -162 4 -61 -44 -74 -1 127 -153 -173 90 29 3 -66
5357 -66 102 166 -191 -38 -42 -64 -57 187 -70 55 -62 -55 158 -71 -146 -72 -346 5 -61 -24 -29 -33 11 30 -18 -44 -13
5384 -13 -168 -155 -35 16 -7 -69 -54 135 -113 125 -10 97 -169 35 -16 -114 -43 79 -58 24 107 33 -29 151
5408 151 -42 -100 61 70 -117 127 -76 -91 142 11 -118 24 30 -41 31 -22 -45 -76 -166 -10 -91 -149 -22 -19 -54 -82
$$ packed form
5231f3O1m8P8k31K11R3j77n2J41j55K79l3j68J54K1k38R9O7o3k5N0n1P2j11R9
5256A0r7N1kp5K33k57J69j05R4q5K93l68K07k7N5k63J67Q2o8j28J45J91k63M7
5280Fr5J53l6jl5j08J18J49m0k2j03J42j55P6k6P2j93m1R6J80o9nk1j89Q9J20
5306F2j25L7N1%N2j03o5K45l50L83q5j09M1q0J30k14K74L1j15p9O3Q5q3j11NK4
5332c6K12m2j00j55K16o8j41P6l4M2J4R6k42J66o5J7l0P3J28k80k0K63o1k6o9
5357f6J68O4l57J53mk2PK44k57J25j17PK13k29p5P4k74L51o6L7nmM4J9m8k6L1
5384a3j55J3J20N1k3o2J5J89k48K38j35J07k66K04n1r8P1J22j37Q2Q3p4o2J80
5408A51j93n8J61Rj87K44k03j5K33j31j29J42Op1P2n3k3l1r0J56q1n8J27Ll5k8
$$ plain form
5434 -82 -32 56 -134 105 -58 116 -82 229 26 92 -295 -48 50 -23 -22 -104 0 -96 -90 88 81 -94 -154 -66 21 -15
5460 -15 -16 22 -36 57 -48 -156 163 54 -26 -18 101 95 91 96 66 204 28 192 5 -92 94 21 -126 -14 88 87 63
5487 63 -6 -26 -48 -126 87 13 -107 29 29 93 -20 89 73 -4 -127 40 181 142 26 29 -1 -122 -183 72 -41
5512 -41 -168 -225 144 75 -101 -47 -116 -28 -57 -68 151 -42 64 -41 -76 -28 -113 -93 -39 154 -92 -139 90 -2 -113
5537 -113 18 122 -66 -4 123 -40 160 -5 -62 -52 -86 24 -155 -71 -20 28 -117 -13 -61 -121 116 168 -42
5560 -42 28 -21 65 11 -131 -56 -296 169 143 -209 25 52 -166 157 26 27 -179 103 32 -127 48 74 268 -13
5584 -13 -6 68 7 -115 -65 17 -58 82 -108 -39 96 -70 -37 -68 121 155 54 2 -26 -79 80 -67 92 25 124 160
5610 160 -98 -10 60 -11 17 37 -87 -159 -147 82 73 -205 -42 -36 59 35 5 28 -27 42 -105 -136 128 23 151 -206
$$ packed form
5434h2N0Q8j90K39j63J74j98L11k03O6l87K47R8p3Jq2J04r6OJ78pj75o0Q8Q7l6
5460a5jL8n8R3j05j08L19j09q0QJ19omNl0J38j76J64j87r7J86p3j47J12J02jk4
5487F3o9k0k2p8K13p4j20J36%O4j13J09j6p7j23J67J41l9j16Ll0j21o1K55j13
5512d1j27n7L69o9j76N4o9Q8k9j1K19j93J06j05l5M8q5K0N4J93k46m7K29r2j11
5537a13J31J04j88O2J27j63K00j65n7J0l4J10j79Q4N1M8j45J04m8o0K37N2k10
5560d2P0m9Q6n4j42P5k40M65k6l52K34K7k18L23j31Jk06K82p1j59J75K6J94k81
5584a3PP4o1j22N0Q2p5J40j90O9J35j66L3l1J89L4j01n2k8n3J59j47J59o7R9L6
5610A60k58Q8P0p1K8K0j24p2J2K29rk78J63OR5k4l0K3n5O9j47l1K64j05J28l57
$$ plain form
5636 -206 -108 -30 149 84 32 149 155 -151 91 14 -132 86 -50 -6 -90 -9 -80 -180 -72 22 -36 34 65 17 -81 -53
5662 -53 -75 -24 36 -29 -66 -63 -74 -40 283 -17 -84 -50 -11 154 -120 60 -333 -49 85 -9 -10 -37 67 31 3 -23 99
5689 99 145 -12 -91 135 -51 -116 -228 -80 10 72 68 91 74 41 -161 19 -37 -26 -29 -190 19 38 84 -99 90 63
5715 63 162 41 -122 -1 -42 23 52 37 30 8 -4 -14 0 1 177 71 28 36 77 30 20 -45 -114 14 98 -5 111 14
5743 14 148 -104 -40 88 106 -102 -71 -64 -121 38 -92 -140 -12 87 117 -25 -53 119 -52 17 46 108 38 -164 156
5768 156 -31 -39 -40 -94 198 122 38 65 -8 43 4 -204 6 -34 11 50 -75 -30 -39 -5 57 -26 41 59 113 20 -63 -100 164
5797 164 132 125 37 -54 -107 86 35 38 -6 44 143 -51 84 50 -123 8 123 121 -24 23 -78 -27 12 -116 9 -100
5823 -100 78 22 -16 -65 69 177 165 74 -83 42 -41 -21 79 21 147 -46 -70 -67 -25 -27 -94 -23 -80 21 62 59 -94
$$ packed form
5636b06R8P8J79o5n2J17Ol06K42p7j46K18j36M4q4Q1p1j00J08R4n8P0L1m8r8K8
5662e3k2N1O0o5l7Lj1L4L23l00o7L4L9J65k74J80l93K84J34r4jk7J04l6k8k6J22
5689I9M6j57p9K26j86o5j12J48R0O2mK3j7l3k02J80n6J1lj61K09J9M6j83J89k7
5715F3R9j21j63J21m1O5K9j5pk2j2j0J4JJ76j06m3QM1m7j0o5o9J28Q4j03J16r7
5743A4J34k52O4J28J8k08L1Pn7J59j30m8J28R9L0j42k8J72j71O9K9O2p0k02L20
5768A56j87qjn4K92p6q4K7p3N1l9k08K10m0M5L9j25M5rL4O2q3O7J8N4r3q3l7K64
5797A64l2pq8r1n3J93n1Lm4N0R9j94J35l4j73J31J15kj45M7j01N1L9j28J25j09
5823a00J78n6l8m9J34J08j2r1j57J25q3K0J00n8J26j93k4LM2ko7P1n7J01M1lj53
$$ plain form
5850 -94 142 -9 46 -130 -172 -5 10 -160 -81 10 -31 -112 -174 66 105 57 169 28 10 -57 152 163 -35 37 25
5875 25 23 97 -69 -103 -22 -250 67 83 -57 -184 57 -76 174 -73 -179 178 63 -67 -270 37 -117 42
5897 42 -89 73 40 32 120 68 74 -4 32 -101 140 98 178 -102 153 109 91 38 -14 -35 -25 -15 -7 70 -117 -220 84
5924 84 -52 -55 21 -141 64 38 10 60 -43 155 49 183 16 11 -62 -99 90 -9 49 -13 120 62 45 117 47 -118
5950 -118 77 81 -76 -191 -51 35 -64 54 -2 -10 89 -9 -19 -82 43 136 -35 -40 -30 18 -71 61 -15 43 -132 65
5976 65 13 -86 213 61 44 77 78 -119 87 -34 -59 32 -131 26 18 316 63 2 -25 107 -149 109 -35 32 -24
6001 -24 75 -92 -82 65 -60 -20 95 -13 -54 27 -30 22 107 -54 -103 79 68 15 59 -72 -108 -48 -21 8 -97 68
6027 68 -2 -232 80 110 35 -118 -38 -67 65 28 55 143 120 -25 108 66 5 -47 -7 143 -123 -24 -158 -121 -1
$$ packed form
5850i4K36j51N5j76m2J67J5j70P9R1m1q1o2K40L9m8J12j41j8o7K09J1j98P2j2
5875B5kP4j66l4Q1k28L17J6j40j27K41j33K50k47j06L57j15j30k03L07j54J59
5897D2j31J62l3qQ8n2Op8L6j33K41m2Q0k80K55m4j8n3n2k1J0J0QP7j87j03L04
5924H4j36lP6j62K05k6k8N0j03J98j06J34j67np3l7J89r9N8o2J33n8j7P2p0j65
5950a18J95Mj57j15J40Q6r9J18n6qR9r8j0o3J25R3j71nJ0M8q9J32p6N8j75J97
5976F5n2r9K99j52j7L3Jj97K06j21k5R1j63J57qK98k53o1k7J32k56K58j44O7n6
6001b4R9j67J0J47j25M0J15j08m1Q1n7N2Q5j61m9J82j1n3M4j31l6O0K7K9j05J65
6027F8p0k30L12L0p5j53Q0k9J32l7K7Q8k3j45J33m2o1n2M0J50k66R9j34L7J20
$$ plain form
6052 -1 -3 109 -135 -50 -31 25 -124 -46 76 -52 -9 135 53 125 30 -41 -11 -11 -99 -157 25 -35 110 73 -112 9 137
6079 137 111 61 101 84 -27 -21 51 131 -60 0 -64 127 -51 102 4 -13 89 -11 59 52 69 34 126 164 98 -2 62
6106 62 36 -21 55 70 130 -50 33 71 -54 -27 -37 -85 -60 32 -36 -4 -14 82 64 128 256 119 158 -11 -90 -17 150
6133 150 -57 60 51 2 64 -14 -78 -58 -160 -2 -83 35 -7 43 -22 -64 55 -1 -8 -48 -97 -6 -108 -70 -95 93 -50
6160 -50 -3 16 7 171 -77 195 141 50 -95 -54 49 30 -25 38 113 9 36 48 87 -136 -12 -84 181 -37 -170
6185 -170 118 10 -45 -88 62 -116 -16 26 22 -192 247 -63 77 -65 202 -194 116 101 -76 -30 -60 95 -172
6208 -172 -14 -26 13 -23 -16 13 25 -106 45 -71 64 -9 55 -106 -94 -50 -3 -106 -118 94 -49 7 -8 51 87 -27
6234 -27 -253 1 -106 202 34 -48 22 17 -28 -76 36 -248 67 113 242 -10 -109 -78 7 6 -5 80 -119 300 60
$$ packed form
6052akJ12k44Q5J9N6j49P8J22j28M3J44q2P2r5p1L0%q8n8J82o0J45l7j85J21J28
6079A37k6n0M0j7j11OP2Q0j91O0o4J91j78J53r8j7J02j00P0pJ7l5R2L8o6j00O4
6106F2k6n7P6J5O0j80Q3L8j25K7j0m8K5R2o8L2j0R6j8O4J28j37L9j69p9P3J67
6133A50k07J17rm9O2p8o4K0j02J58q1J18m2N0o5m2J19n6pm0m9R1j02L8k5J88j43
6160e0M7J9rJ64k48K72n4r1j45M1J03j9n5O3P5j04K7J2L9k23J24p2K65k18j33
6185a70K88j08n5m3J50j78J00M2mk14M39l10J40j42K67l96L10j5j77M6l0J55k67
6208a72J58j2L9l6PK9J2j31J51j16J35p3O4j61J2M4M7j03j2K12j43N6j5N9L6j14
6234b7k26K54j07L08j68q2P0nm5m8J12k84L15M6J29k52r9L1Q5jj1Q5j99M19k40
$$ plain form
6259 60 -42 23 3 -6 -132 1 -59 -21 97 -49 108 -129 4 -40 -67 68 -82 6 -13 -124 45 63 63 -74 -33
6284 -33 -88 -88 99 -45 -105 31 4 56 41 47 -43 -62 -86 -116 -59 65 71 14 165 -48 -177 99 -67 36 56 55 -16
6311 -16 -125 37 -81 96 74 1 5 -130 117 91 47 -119 -38 -102 11 -17 -104 53 57 -17 -122 -180 -115 -177 -93 77
6337 77 -3 123 93 -27 135 126 10 23 -208 78 105 -50 69 -164 -43 -133 -110 -11 107 -36 42 45 -54 30 -50
6362 -50 -10 16 6 -37 13 51 56 80 17 -35 69 -16 210 129 164 -18 79 -156 -55 7 77 36 163 -67 -60 77 -171
6389 -171 156 -4 19 -19 -9 -93 33 48 42 121 136 106 32 -59 -1 -43 34 66 -49 -151 75 -22 -139 82 24 -12
6415 -12 -53 2 83 -110 59 45 58 -63 -60 -141 178 -109 110 -45 -108 -91 16 158 85 31 -74 104 41 -90 -146
6440 -146 157 -18 36 152 68 66 63 85 153 31 98 65 -7 29 34 -45 206 -12 61 -130 -72 -152 -81 -25 -70 -74 -56 -59 70
$$ packed form
6259F0j02O5k0rj26J33o0L8J18j46J57k37J33m4k7J35j50Q8j9j11J69J8%j37M1
6284c3n5%J87j44o0J36k7N2j5Or0j9k4l0N7J24On7J51k13j29K76j66J03K0jp1
6311a6j09J62j18J77k2p3Mj35K47k6m4j66Q1o4J13k8q7J57Mp4j05n8O5o2Q4J70
6337G7q0J26l0j20J62rj16J3k31K86K7j55J19k33J21r0K3R9J18j43P8Lr9Q4q0
6362e0M0K6j0m3N0L8NK4o3n2J04q5K26q1L5j82R7k35J01O2P0m1J27k30PJ37k48
6389a71L27j60K3l8J0q4J26J5oP9J5l0p4r1N8m2P7L2j15j02K26r7j17K21n8l6
6415a2m1N5Q1j93J69j4J3j21Lq1L19k87K19j55o3J7J07J42p3n4j05J78o3j31n6
6440a46L03j75N4J16q4klK2O8j22O7l3p2L6Np9K51k18P3j91N8q0P1N6m5mJ8lJ29
$$ plain form
6469 70 -43 -172 -58 -127 -66 246 144 61 117 12 -123 -208 -15 67 -100 -91 -68 -165 170 18 -85 -4 -83 49
6493 49 -39 -33 157 42 -163 143 110 119 71 -132 49 -58 0 -2 28 100 -188 -93 -18 -157 121 -66 -155 87 -74
6518 -74 65 -20 97 62 -17 -20 5 74 70 -49 45 140 -91 101 131 -8 57 -25 -34 39 -152 -47 36 -59 -2 -103 15
6545 15 208 60 -20 149 255 17 -188 100 324 179 -5 -11 46 -70 9 30 -79 -69 -21 3 -87 46 -162 -16
6569 -16 -192 40 -44 26 109 87 -17 45 147 117 -27 -64 -113 99 135 -78 -152 0 139 176 119 -55 -106 -2 87
6594 87 23 60 -46 -115 144 100 -94 45 45 -8 122 0 -27 29 180 -85 63 -170 -59 104 29 159 1 -79
6618 -79 61 75 126 -137 151 -61 86 63 39 27 52 112 -80 47 22 172 -125 -113 -107 111 -5 26 -109 -37 -152
6643 -152 -53 -62 4 42 193 -161 -95 -150 -12 -21 -132 -55 -143 -108 -27 -23 -97 -151 106 -34 82 38 -16 -114 171 -60 -81
$$ packed form
6469G0j13j29J14o9O1L12j02q3N6j05j35q5J93Q2j67RK3r7L35j52j03Q1p9J32
6493D9q8OJ90j15k05L06l3Rm8k03J81j07N8kL0P2k88R5P5j39K78j87q9K42j61
6518g4J39q5J17l5p9lK5O9mj19R4R5k31J92L0j39O5q2rP3j91J05Q3r5N7j01J18
6545A5J93j48q0J69J06k38k05K88K24j45j84oN7j16P9K1j09J0M8K4r0J33k08J46
6569a6j76K32q4P0Q3k2j04O2J02l0j44l7m9K12L6k13p4J52J39L7n7j74n1J04Q9
6594H7o4L7j06o9K59m4j94J39%n3J30j22k7N6J51k65J48k33J11J63p5J30j58q0
6618g9J40J4N1k63K88k12J47k3k4j2K5O0j92J27k5J50k97J2OK18j16L1j35P2j15
6643a52R9rO6L8J51l54O6n5J38rj11P7q8L5Q1Mp4n4K57j40J16m4n4r8K85k31k1
$$ plain form
6670 -81 44 -84 -11 102 98 -3 11 -81 -176 -28 -66 109 -124 91 -87 -278 35 -26 -79 21 -77 57 -126 -42
6694 -42 108 -1 -86 59 -71 -40 96 -29 -8 -30 99 -79 15 -24 13 -166 59 -93 -139 26 -91 -203 73
6717 73 7 22 6 -56 92 -31 -73 -54 -51 32 -6 -10 -114 82 -55 -57 -85 31 112 -13 78 7 2 89 53 127 99 10 13
6746 13 3 -39 183 -102 30 103 -87 -194 -69 31 13 -60 -232 15 -100 -88 27 24 82 -30 6 21 -83 -78 -196
6771 -196 89 -87 74 106 26 -46 51 -60 82 -163 -123 180 42 -24 53 -28 -35 140 119 -9 -52 -55 110 -78 -102
6796 -102 -25 13 16 48 88 106 -10 -4 60 69 -20 146 35 103 -49 8 71 -70 69 9 -76 -1 -91 -101 48 -38 -63 109
6824 109 97 -51 6 60 5 -15 -93 -117 -62 -135 -87 -19 -31 20 -9 -62 -103 -230 -62 72 177 -41 -15 -74 139 11
6850 11 61 -7 7 14 91 11 -100 -4 2 -35 -106 123 40 -126 -39 12 -60 135 59 -112 -51 -52 12 78 36 -105 -153 208
$$ packed form
6670h1J25j28P3J13mj01J4r2r5J48l8J75k33K15j78j91L13o1n3J00r8J34j83Q4
6694d2J50j09q5J45j30L1J36j25K1k2J29j78R4l9L7j79K25j52m6J65j17j12K76
6717G3o6J5j6o2J48j23m2J9LQ3l8mj04J96j37kk8J16Q1j25R1p1nQ7l6P4k8q9L
6746A3j0m2K22k85J32P3j90j07J25J00j8p3j72K47j15J2J15lN8j12L6J5j04Nj18
6771a96K85j76J61L2q0p2R7j11J42k45M0L03j38o6P7q1pJ75k1j28m3lJ65j88k4
6796a02P7L8LL2M0J8j16OO4Rq9J66j11O8j52N7O3j41J39o0q5P5r0j0J49q6k5J72
6824A09j2j48N7N4n5k0p8k4N5p3M8O8j2N1k9n3m1j27J68J34J05k18K6n9K13j28
6850A1N0o8J4PP7q0j11R6Ol7p1K29q3j66Q7N1p2J95p6j71O1jO4O6m2j41m8L61
$$ plain form
6878 208 35 79 -18 138 61 7 -46 52 -170 -31 -191 -27 -39 -219 -92 -17 8 108 188 -47 97 75 93 28
6902 28 52 47 -160 -144 46 -60 -130 56 -38 50 -52 -53 -258 -107 -44 -156 -69 153 70 -162 13 -108 55 6 -29
6927 -29 116 34 173 48 -115 -53 34 -18 -31 178 -79 -31 91 -35 71 -112 -157 155 106 -46 28 -204 -95
6950 -95 -6 -48 32 22 111 -34 -3 -33 -69 -243 -162 54 41 -33 2 132 -167 -72 49 39 6 157 39 -204 -58
6975 -58 -122 -17 -127 -7 32 -112 -224 -50 42 131 38 -148 192 -81 -48 39 -7 -102 -53 -98 -161 -166 43 -140 106
7000 106 65 131 30 -71 -30 -80 23 -102 -111 58 157 -41 48 10 -95 89 -38 -101 -124 0 -104 -32 -8 204
7024 204 59 -14 -124 -22 295 -57 -116 -118 -35 -48 49 -73 -26 56 -133 -8 107 11 67 -63 90 20 170 209
7048 209 -38 -107 -63 -41 143 151 -100 -26 -110 130 45 -54 62 -53 79 62 198 -19 -29 41 -106 -13 -174 86
$$ packed form
6878B08j73M4r7J56p7n4n3R8k22J39j60J64j2j80J27P5K5J00Q0k35J44k2J8o5
6902B8K4nk07J6J90j06p0J86r4Q8j02jk05J51O3j12Q7K22q3k32J75j21J63m9l5
6927b9J45q2J39j25j63O2Q7n2j3K09k57M8J22j26J06j83m5L12m9j52P4k32J09
6950i5Q9m2Q0j0Q9j45L1l0l6j74Q1K16j3p4L5J30k99R5J21j0l3J51j18k43J46
6975e8o4J05j10J20L9j44j12J74R2Q9r3j86L40k73L3Q7m6r5M9m5o3nK09j83K46
7000A06m1O6j01j01M1n0J03j25rJ69R9j98Q9l8j05J84j27o3k3J24j04P2K4K12
7024B04j45p3j10J02L17l52n9kQ3j3R7j22M7Q2j89J25J15r6N6j30J53p0J50L9
7048B09k47o9M4K2J84Qk51P4q4K40q5r9J16j15J32j7J36k17j0P0j47R3j61K60
$$ plain form
7072 86 2 -191 -57 -63 87 -43 -130 -69 201 37 -10 76 -139 122 -114 -112 38 229 4 44 -68 106 -75 -107
7096 -107 -72 132 56 -144 20 -6 -39 -15 -44 15 -18 -83 -55 -118 80 -93 165 10 53 -76 -86 220 -25 -237
7120 -237 -120 64 -1 3 -81 49 -61 -161 1 -11 12 -42 5 -43 -3 238 70 -224 -125 143 38 101 -37 243
7144 243 -57 -39 83 -56 159 25 18 25 -14 131 100 -144 -152 -26 -124 110 64 4 -157 -111 -79 76 -24 33 -41
7169 -41 -108 -69 -36 34 45 78 -81 -48 20 -57 59 63 103 85 261 139 3 67 -95 -31 -98 -64 12 125 -108 130
7195 130 61 21 114 -96 -86 29 -7 -19 -37 101 77 14 -18 -119 22 -166 2 -40 -9 156 -78 -15 -87 41 -76
7220 -76 -28 -141 -66 -129 -33 88 -18 34 -21 -105 79 -115 -51 -111 -29 -64 -93 -181 -51 -226 -224 18 103 167 -133 -68
7246 -68 -121 -104 -64 118 -70 43 25 -142 4 180 -7 -6 3 53 153 54 0 -118 1 98 -82 13 15 85 -8 13
$$ packed form
7072H6q4j93J34oJ50j30q7O1K70j64m7Q6k15K61k36KJ50J91k25M0j12J74j81l2
7096a07L5K04p6k00J64k6l3K4k9N9l3o5K8o3J98j73K58j55M3j29j0L06k45k12
7120b37J17J84o5Mq4J30j10j00J62j2K3n4M7m8M0K41j68k94R9K68j05O3j38K80
7144B43l00J8J22j39K15j34pPl9J45l1k44qJ26r8K34m6o0j61M6L2J55j00N7p4
7169d1o7L9L3P0J1L3j59L3O8p7J16MM0j8J76j22j36O4j62O4o7L4P6J13k33K38
7195A30o9m0R3k10J0J15l6j2j8J38k4o3l2j01J41j88J68m2L1J65k34O3p2J28j17
7220g6M8j13P5o3R6J21j06N2n5q4J84j94O4o0Q2l5k9q8J30j75KK42Q5O4l00O5
7246f8n3J7M0J82j88J13j8j67J46J76j87JRN0J00r9n4j18J19R7j80R5KP0r3K1
$$ plain form
7272 13 -12 -72 -124 12 -206 -46 16 82 49 -93 -37 -217 -116 -176 82 -15 15 27 -12 -134 -112 -21 75 101 53 4
7298 4 -66 -38 -44 -53 -4 36 -98 -82 97 158 -106 -30 -84 67 -40 -31 -99 65 3 112 -148 -61 119 -131 -183 -68 -53
7325 -53 119 117 6 35 -8 -87 -50 -121 57 119 -172 -45 61 -1 124 -87 22 43 105 182 -56 33 42 -191 -212 6
7351 6 29 -47 107 -7 -69 74 -114 -6 123 -68 -34 -24 39 -33 -134 18 6 101 -56 -104 132 -43 -156 68
7375 68 -8 -44 -159 -14 108 -46 50 -111 -126 -57 19 40 -107 -174 -94 -157 -56 47 -19 -155 -19 -169 46 -155
7399 -155 12 -105 -47 40 7 -149 -52 63 77 -31 -71 -8 -123 -76 146 -28 88 -118 -3 76 139 99 232 61
7423 61 -86 -42 41 -11 -74 31 -81 36 86 209 111 -108 -69 -15 18 -160 110 40 -16 -94 -74 36 -19 89 135
7448 135 -191 -124 -81 -83 10 -10 -159 2 71 -3 8 22 -91 64 -29 237 26 -144 167 207 86 -74 -131 -30
$$ packed form
7272A3k5o0n2J36k18J60O2O6l3j42N6j80J01o0K58r7L0J2l9j22K2R1R6K6m8m9
7298Dp0K8orM9M0j34J6J79O1k64P6n4J51j07Ro8J64o2J09k60Q7J80k50n2J15J5
7325e3J72kj11K9m3p9L7p1J78O2k91J27J06o2J25k11J09K1O2P7k38Q9Rk33k1K18
7351FK3p6J54j14o2J43j88J08J29j91L4J0O3p2j01J52j2R5j57m8K36j75j13K24
7375F8p6l6j15J45J22j54R6j61j5O9P6K1j47o7Q0o3J01J03o6j36J36j50K15k01
7399a55J67j17N8Q7l3j56R7J15J4j08m0O3j15M7K22j74J16k06J15P9O3m0J33j71
7423F1j47M4Q3n2o3J05j12J17N0J23r8k19L9N4L3j78K70p0n6p8K0J10n5J08M6
7448A35l26O7M3kR3k0j49J61O9p4J1J4j13J55r3K66k11j70L11M0j21j60n7J01
$$ plain form
7472 -30 -28 -173 81 -35 86 98 -28 201 76 -4 81 -83 121 23 100 -109 44 229 34 -28 127 -127 -59
7495 -59 15 -50 46 -40 -66 -61 -73 -56 19 -85 -28 -60 124 114 -3 -85 20 -17 53 37 -63 63 66 -69 -141 -47 100
7522 100 82 73 -55 4 -196 -2 19 -183 102 83 25 80 141 -31 186 38 15 74 30 -13 -182 60 -19 13 116
7547 116 -27 -2 -51 -151 5 -24 78 63 -80 130 116 67 -61 -3 -124 4 85 105 64 2 -51 71 44 23 -103
7572 -103 -30 -145 -72 -86 63 209 -97 -19 139 -70 -27 40 21 38 11 -5 -21 -25 -57 -83 -79 19 8 -243 -2 106
7598 106 35 -68 -35 -57 69 64 14 97 -18 -96 -32 -70 73 43 -65 -22 44 39 67 -91 102 -92 -46 -22 85 -100
7624 -100 36 -103 4 7 -24 -90 -20 5 -134 -14 -13 162 45 78 45 53 62 -144 -11 1 63 -55 116 20 -216 -108
7650 -108 -13 -59 20 -68 -31 -87 37 173 51 121 -69 48 74 37 73 127 50 44 20 86 -131 10 58 -47 193 -191
$$ packed form
7472c0Kj45K54j16J21J2j26K29j25q0Q5j64K04r8P7k09J53J85j95o2J55k54O8
7495e9P4o5R6q6k6Nj2J7P5j04N7l2J84j0j17q2J05l7P0j6j00J26Lj35p2R4J47
7522A00j8rj28N9k00J94K1k02K85j9n8N5O1j72K17j48k3N9m4m3j69K42p9L2J03
7547A16j43K5m9j00J56k9J02j5j43K10j4m9j28N8j21J28Q1K0m1o2n3J22k7k1j26
7572a03P3j15P3j4J49J46l06P8J58k09M3O7j9J7k7j6j6ml2k6MR8j1k51K41J08
7598A06p1j03L3k2J26nn0Q3j15p8O4l8J43l0j08M3O6nK8j58J93j94M6K4J07j85
7624a00J36j39J07Ll1o6P0K5j39J20JJ75j17L3l3QRk06J33J2O2j18J71r6k36J08
7650a08R5m6P9q8L7n6J24J36j22P0j90J17K6l7L6N4p7ok4O6k17J41M8j05K40l84
$$ plain form
7676 -191 30 -26 -50 -67 -38 39 -96 8 55 -6 157 -70 -132 110 -2 59 -193 3 -97 -167 71 6 -68 -48
7700 -48 -1 22 219 -110 45 62 161 76 -34 -174 -154 206 -65 -1 33 -50 134 102 11 41 61 29 -196 21 -15
7725 -15 105 -3 48 302 -75 19 -102 -6 -144 -112 177 54 114 -169 38 16 -33 -198 68 -57 -73 31 -21
7748 -21 32 -38 -87 95 -172 -71 -109 -27 37 165 59 -162 -80 -179 33 -89 5 79 -17 0 15 -103 18 -13 -3
7773 -3 114 73 -89 -64 -12 -39 67 54 -42 -146 -248 59 147 18 -201 143 127 82 117 -50 -53 -12 -57 -170 89
7798 89 85 -42 5 41 16 -196 46 -167 -93 -61 40 11 -36 -39 -90 -28 128 -131 -11 -209 -92 78 81 -63 -103 55
7824 55 -137 74 19 14 118 157 -94 -11 -175 73 -91 62 80 -138 37 -51 -162 -131 -190 -101 97 39 -38 -73 -61
7849 -61 -40 85 34 83 50 -259 29 -1 20 28 25 6 -206 77 -116 -85 73 62 -96 49 62 140 -65 -182 58
$$ packed form
7676a91K21n6k4j7K9P7j35J04M7o1J63k27o2K42j12O1k52J96j00p0K38o5p4K0
7700d8M7K3J97l29J55J7R9q5j10j40K0L60k71O4L4q3J84l2r1L0K0l2k25K17l6
7725a5J20j08N1K54l77R4j21R6j38L2K89j23O0k83K07k2m9j65K66j25j6J04n2
7748b1N3p0m9J82k67J01l8Q2O4J28j06k21Q2r9K12j22R4P4r6J7J5j18J21l1J0
7773cJ17m1j62K5N2k7J06j3r6j04j02L07Q8j29k19L44j6m5L5j67lM1m5j13K59
7798H9mj27M7L6k5k12K42k13P4L2J01k9m7ln1O2J56k59J20j98J17J70Lj44m0J58
7824E5j92K11n5nJ04L9k51Q3j64K48j64J53J8k18J75q8j11L1n9Q9J98n8p7l5J2
7849f1K1J25n1M9l3l09K88l0K1Qlj9k12K83j93L1J58j1j58J45J3P8k05j17K40
$$ plain form
7874 58 -28 28 67 118 41 67 124 15 -9 22 -48 55 -71 24 212 45 -50 -199 37 43 -101 28 73 23 -234 -119
7900 -119 -16 -123 -3 117 -9 -48 109 -31 1 -88 -95 56 109 55 103 -58 -98 -120 -40 8 -86 70 -99 -92 108
7925 108 -146 -124 94 264 -33 123 -47 -97 -149 -75 40 9 -6 -118 -103 -95 98 38 24 115 -69 -31 -249 32
7949 32 -104 -49 88 -51 -31 -153 -114 -45 -73 -145 -7 92 -38 102 102 137 160 27 55 -84 -5 -70 -60 61 -72
7974 -72 47 -22 -60 20 149 -177 -141 55 76 -9 1 -45 63 28 48 104 212 73 69 90 10 74 -170 16 -37 59
8000 59 13 -190 104 171 -58 26 84 29 47 -146 -101 -41 -69 6 -31 134 108 -198 7 95 81 18 140 -91 121
8025 121 108 -165 -18 134 8 38 29 -43 -127 100 51 66 78 75 -31 -83 -125 79 86 42 67 108 -133 51 70 62 -20
8052 -20 23 65 -70 162 6 -48 -76 47 -60 -51 68 105 55 31 -141 107 165 118 60 -114 -235 53 -11 43 178
$$ packed form
7874E8q6N6L9N1p7K6N7j09k4L1p0J03j26R5J88j67r5j49K36Oj44J29M5n0k57J15
7900a19J03j07J20J20j26l9J57j40L2q9pJ51N3n4M8j61m0k2Q0M8r4J56j69PK00
7925A08k54K2K18J70k97J56j70n0n2P4J15l1j5j12J5QJ93o0j4R1j84L8k18K81
7949C2j36N5J37j39K0j22L9O9k8p2J38R9j30J40%L5K3j33K8j39P9o5J0J21j33
7974g2J19o9l8Q0J29l26L6J96K1q5J0m6J08l5K0N6J08j39mK1q0O4k44J86n3R6
8000E9m6k03K94O7k29Q4N8n5J8j93M5O0k8P5l7J65k6l06K05Q8j4o3J22k31K12
8025A21j3k73J47J52j26L0rp2q4K27m9J5J2lj06n2m2K04Pm4K5M1k41J84J9qq2
8052b0M3M2j35K32j56n4k8J23j07RJ19L7n0k4j72K48N8m7n8j74j21K88o4N4J35
$$ plain form
8077 178 233 86 102 20 -15 -119 -95 52 -108 -64 -81 -53 1 14 151 -120 73 -177 -183 61 85 51 -65 66 68
8102 68 -23 7 -116 -161 85 -11 -31 2 -28 -78 -123 -118 19 3 54 77 25 -56 18 243 49 17 123 -83 48 25 62
8129 62 -79 37 -63 60 81 -131 11 -121 103 -12 53 -12 -32 99 -54 118 -32 28 -91 6 -77 -33 72
8152 72 45 -20 -20 -103 40 -67 -175 155 120 -19 40 -12 36 -41 0 -53 259 -13 99 73 206 -36 43 -23 -36 -128
8178 -128 -34 134 -10 186 -67 -53 161 -66 112 68 -129 89 25
$$ packed form
8077A78N5j47J6q2l5j04K4J47j60M4j7K8N4J3J37k71J93k50oK44K4l4j16J31K
8102F8r1L0j23m5K46r6k0L3l0n0m5NJ37j6N1K3n2q1P4K25j94l2J06k06J31k3L7
8129F2j41J16j00J23K1k12J42j32K24j15O5o5k0J31j53J72j50O0j19R7q3M4J05
8152G2k7o5%q3J43j07j08L30l5j39N9n2M8p7M1n3L12k72J12k6J33k42P9o6j3r2
8178a28R4J68j44J96k53J4K14k27J78m4j97K18o4
8191B5
$$ Imaginary data points
##PAGE= N=2
##DATA TABLE= (X++(I..I)), XYDATA
$$ plain form
0 0 0 0 0 0 0 0 0 0 0 0 0 0 0 0 0 0 0 0 0 -9 64 -64 64 -64 64 -64 128 -128 128 -128 192 -192 253 -256 308
35 308 -320 384 -392 448 -512 576 -640 704 -768 848 -956 1032 -1150 1271 -1400 1535 -1698
52 -1698 1865 -2061 2283 -2528 2810 -3137 3519 -3967 4515 -5194 6058 -7205 8809 -11199
66 -11199 15164 -22899 43819 -215111 -665054 -309546 -118877 -220928 -174493 230358 421926
77 421926 301064 214840 248149 73833 -197912 -279792 -236729 -299407 -273582 -18095 205250
88 205250 189275 186729 296827 254247 3971 -118683 -81185 -179926 -371841 -285483 13428
99 13428 127295 67057 164698 340678 258390 884 -92215 -64916 -160857 -287247 -216488
110 -216488 -48643 25895 81454 207200 255455 149002 48555 17303 -76294 -209298 -200448
$$ packed form
0@%%%%%%%%%%%%%%%%%%%rP3j28J28j28J28j28J92k56K56k56L20l84M45n09N64
35C08o28P04p76Q40r60J088j216J344j472J616j804J988k182K421k671K935l233
52a698L563l926M344m811N338n947O656p486Q482r709J1252j3263J6014k0008
66a1199K6363l8063O6718k58930m49943L55508J90669j02051M6435M04851J91568
77D21926j20862q6224L3309j74316k71745q1880M3063o2678K5825K55487K23345
88B05250j5975k546J10098m2580k50276j22654L7498r8741j91915Q6358K98911
99A3428J13867o0238R7641J75980q2288k57506r3099K7299r5941j26390P0759
110b16488J67845P4538N5559J25746M8255j06453j00447l1252r3597j33004Q850
$$ plain form
121 -200448 -88146 -67671 -85480 41566 211372 197638 79998 70024 90570 -32026 -184178
132 -184178 -172503 -84312 -81760 -81865 28435 139421 135612 105139 117353 78184 -44003 -123992
144 -123992 -114891 -109469 -118102 -55332 48077 85792 80862 114105 130144 48596 -48937 -63404
156 -63404 -60624 -113193 -133013 -47142 45063 54553 52161 96544 111677 48712 -15062 -31603 -55137
169 -55137 -100344 -100033 -45186 -1900 19262 59640 98560 83712 39190 16197 -6990 -58151
181 -58151 -92482 -71531 -39019 -29068 -1223 58490 89184 63460 35488 30392 3769 -49996
193 -49996 -75257 -56667 -39343 -33861 -5108 41678 62069 53865 46221 35437 1042 -36669 -48811
206 -48811 -47556 -48965 -36524 -1137 29451 38009 43909 52170 38026 1716 -25055 -32262 -40961
$$ packed form
121b00448J12302K0475j7809J27046J69806j3734j17640r974K0546j22596j52152
132a84178J1675Q8191K552j05J10300J10986l809l0473J2214l9169j22187p9989
144a23992R101N422q633O2770J03409L7715m930L3243J6039q1548r7533j4467
156f3404K780n2569j9820Q5871R2205R490k392M4383J5133o2965o3774j6541k3534
169e5137m5207L11N4847M3286K1162M0378L8920j4848m4522k2993k3187n1161
181e8151l4331K0951L2512R951K7845N9713L0694k5724k7972n096k6623n3765
193d9996k5261J8590J7324N482K8753M6786K0391q204p644j0784l4395l7711j2142
206d8811J255j409J2441L5387L0588Q558N900Q261j4144l6310k6771p207q699
$$ plain form
219 -40961 -50210 -36166 -3674 19075 27427 38214 46259 33834 7958 -11782 -24536 -37827 -42615
232 -42615 -30570 -10664 5881 21565 36028 38396 27615 13152 -665 -18372 -34096 -35943
244 -35943 -25901 -14601 -2397 15552 30948 32934 24644 15136 3825 -12546 -26334 -29799 -24815
257 -24815 -16312 -4423 10633 22359 26638 24776 17149 4930 -8616 -18620 -23663 -23676 -17923 -6120
271 -6120 6879 16049 21536 22535 17456 7099 -4828 -13932 -19639 -20793 -16657 -7922 2417 11844
285 11844 18069 19273 15527 8626 -507 -10172 -16431 -17759 -14543 -9210 -979 8454 14754 16092 13931
300 13931 9323 2066 -6633 -13122 -14786 -13614 -9684 -2308 5500 10746 13437 13449 9888 2547 -4573
315 -4573 -9016 -12180 -12888 -9767 -3078 3311 7492 10927 12527 9514 3302 -2203 -6399 -9748 -11561
$$ packed form
219d0961r249J4044L2492K2749Q352J0787Q045j2425k5876j9740j2754j3291m788
232d2615J2045J9906J6545J5684J4463K368j0781j4463j3817j7707j5724j847
244c5943J0042J1300J2204J7949J5396J986q290r508j1311j6371j3788l465M984
257b4815Q503J1889J5056J1726M279j862p627j2219j3546j0004n043j3N753J1803
271f120J2999R170N487R99n079j0357j1927r104n707j154M136Q735J0339R427
285A1844O225J204l746o901r133r665o259j328L216N333Q231R433O300J338k161
300A3931m608p257q699o489j664J172L930P376P808N246K691J2l561p341p120
315d573m443l164p08L121O689O389M181L435J600l013o212n505m196l349j813
$$ plain form
330 -11561 -9153 -3990 1151 5498 9228 10530 8100 4058 110 -4298 -8801 -10051 -7456 -4009 -922
345 -922 3682 7748 9056 7448 4606 1335 -3189 -7204 -8078 -6495 -4748 -2049 2786 6306 7193 6160
361 6160 4869 2265 -2113 -5322 -6353 -6087 -5088 -2175 1681 4647 5385 5573 4983 2065 -1503 -3656
377 -3656 -4758 -5497 -4891 -2163 1050 3016 4318 5245 4681 2103 -705 -2496 -3919 -5092 -4311 -2017
393 -2017 256 1747 3778 4790 3714 1788 247 -1415 -3291 -4240 -3769 -2048 -460 1167 2999 3990
409 3990 3382 2111 712 -879 -2796 -3484 -3024 -2001 -935 701 2422 2942 2763 2008 1084 -679 -2210
426 -2210 -2723 -2521 -2168 -1011 380 1801 2556 2274 2000 1112 -264 -1608 -2092 -2310 -1874 -1102 311 1413
444 1413 1716 2186 1870 1116 -56 -925 -1636 -2038 -1803 -962 -9 810 1441 1735 1809 1168 252 -715 -1247 -1457
$$ packed form
330a1561K408N163N141M347L730J302k430m042l948m408m503j250K595L447L087
345i22M604M066J308j608k842l271m524m015q74J583J747K699M835L520Q87j033
361F160j291k604m378l209j031K66R99K913L856K966P38J88n90k918l568k153
377c656j102p39O06K728L213J966J302R27n64k578k808j791j423j173P81K294
393b017K273J491K031J012j076j926j541j662j876r49M71J721J588J627J832R91
409C990o08j271j399j591j917o88M60J023J066J636J721N20j79p55r24j763j531
426b210n13K02L53J157J391J421P55k82k74q88j376j344m84k18M36P72J413J102
444A413L03M70l16p54j172q69p11m02K35Q41R53Q19O31K94P4o41r16r67n32k10
$$ plain form
464 -1457 -1666 -953 45 576 1162 1524 1485 1080 371 -442 -943 -1307 -1291 -925 -378 321 899 1262 1060 767 267
485 267 -366 -815 -1008 -894 -849 -432 248 610 884 1037 550 373 -135 -501 -738 -877 -784 -250 4 617 751
506 751 765 530 211 -58 -418 -701 -697 -611 -421 178 411 595 753 459 125 34 -284 -585 -390 -407 -6 48 167
529 167 646 342 261 293 28 -110 -504 -687 -438 -278 -6 148 328 267 441 202 -61 -121 -506 -446 -332 -134
551 -134 -60 303 359 526 275 140 6 -116 -63 -267 -202 -130 69 26 356 297 304 125 61 -162 -258 -224 -221 -259 -85
576 -85 215 163 182 277 96 -46 -242 -280 -370 -286 -174 -264 82 205 242 227 -85 -243 -102 -47 -202 35 -150 -50
600 -50 192 140 65 148 99 68 -120 -209 -187 -70 23 118 201 302 168 188 117 -5 -131 -49 -195 -228 -185 10 127 154
626 154 17 180 129 -170 42 -150 -284 -120 -58 87 260 78 303 274 100 -22 -83 -176 -229 -271 -26 180 324
$$ packed form
464a457k09P13R98N31N86L62l9m05p09q13n01l64J6L66N47O99N78L63k02k93n00
485B67o33m49j93J14M5M17O80L62K74J53m87j77n08l66k37j39R3N34K54O13J34
506G51J4k35l19k69l60k83MQ6J90N99K33J84J58k94l34r1l18l01J95j7M01N4J19
529A67M79l04q1L2k65j38l94j83K49J60K72J54J80o1J74k39k63o0l85O0J14J98
551a34P4L63N6J67k51j35j34j22N3k04O5P2J99m3L30n9Pj79o4k23r6L4Ll8J74
576h5L00n2J9R5j81j42j96l8r0Q4J12r0L46J23L7j5l12j58J41N5j55K37j85J00
600e0K42n2p5Q3m9l1j88q9K2J17R3R5Q3J01j34K0p1j22j26Q2j46l3M3J95J17K7
626A54j37J63n1k99K12j92j34J64O2J45J73j82K25k9j74j22o1r3n3m2K45K06J44
$$ plain form
649 324 22 147 137 20 -155 -147 -179 -197 96 -91 115 109 130 82 160 -20 -99 71 -255 -140 37 -120 59 -72
673 -72 30 220 211 82 34 -96 -115 -69 -4 105 17 182 318 -28 139 -3 9 -25 -129 -42 -153 -238 -107 65
697 65 75 186 137 109 -1 -13 -65 -44 -88 101 71 128 13 185 37 122 186 -1 -128 3 -121 3 -38 109 83
722 83 54 -41 202 -40 -142 14 -135 76 -34 141 34 141 44 104 40 36 -19 88 -80 -151 -167 -74 -43 205 12
747 12 13 -27 9 121 -58 127 -128 -175 75 16 -225 -136 185 -47 -106 110 -14 110 -143 18 55 15 -95 59
771 59 176 -35 -15 -116 -117 59 -75 -44 46 -66 119 142 78 98 -74 50 29 -140 -211 -66 -93 57 167 115 84
796 84 -110 -76 46 -144 -156 -83 -81 -56 -40 -27 18 -5 -2 -22 13 -242 -48 -29 -21 -83 -81 176 -138 123 15 -83 -5 76
824 76 -122 -131 -223 -114 97 49 -33 121 121 -193 83 -133 -56 -67 -66 2 22 -105 79 -15 71 75 -33 -67 -27 7 -70 -49
$$ packed form
649C24l02J25j0j17j75Ql2j8K93j87K06oK1m8P8j80p9J70l26J15J77j57J79j31
673g2J02J90rj29m8j30j9M6O5J09q8J65J36l46J67j42J2l4j04Q7j11q5J31J72
697F5J0J11m9k8j10j2n2K1m4J89l0N7j15J72j48Q5O4j87j27J31j24J24m1J47k6
722H3k9r5K43k42j02J56j49K11j10J75j07J07r7O0o4mn5J07j68p1j6R3L1K48j93
747A2Jm0L6J12j79J85k55m7K50n9k41Q9L21k32n9K16j24J24k53J61L7m0j10J54
771E9J17k11K0j01jJ76j34L1R0j12J85K3o4K0j72J24k1j69p1J45k7J50J10n2l1
796H4j94L4J22j90j2P3KK5J6J3M5k3Lk0L5k55J94J9Qo2KK57l14K61j08r8P8Q1
824G6j98rr2J09K11m8q2J54%l14K76k16P7j1JO8K0j27J84r4Q6Mj08l4M0L4p7K1
$$ plain form
852 -49 18 14 -89 -64 -8 207 44 7 73 -14 -70 20 128 124 -41 89 90 31 -125 84 -160 -16 -77 -82 91 -110 66
879 66 -43 -52 -8 -164 3 -86 -7 53 -100 -156 3 102 -42 169 72 24 -156 -247 -55 -14 -114 58 -51 144 -46
904 -46 319 151 0 119 -115 -79 -32 23 63 -46 79 108 112 -109 278 139 -21 -115 -48 -179 -32 -52 -84 -57 4
929 4 -2 -142 -6 -185 4 -81 120 -28 6 -33 18 21 -188 -34 -105 94 -34 67 -83 -162 -74 -132 65 -207 -127
954 -127 -44 10 -80 -20 142 -207 74 189 -61 101 37 37 283 41 28 40 83 -146 33 65 -26 -4 -2 148 -27
979 -27 92 154 194 66 112 -27 60 53 91 -191 24 139 -131 -75 31 227 -125 -13 -49 185 -50 -173 6 86
1003 86 -77 -38 -93 37 -55 -4 -86 -30 24 -14 54 13 -61 48 -123 41 140 151 33 113 125 -38 152 176 -87 -57
1029 -57 97 46 26 84 189 37 23 46 168 -75 -65 -91 -179 -120 68 38 3 -60 16 -39 -35 12 105 -77 60 -72
$$ packed form
852d9O7mj03K5N6K15j63l7O6q7n6R0J08mj65J30Jn9j56K09k44J44o1nJ73k01J76
879F6j09rM4j56J67q9P9O0j53n6J59R9j44K11r7m8j80r1J92M1j00J72j09J95j90
904d6L65j68j51J19k34L6M7N5M0j09J25K9Mk21L87j39j60r4O7j31J47k0l2K7O1
929Doj40J36j79J89q5K01j48L4l9N1Lk09J54p1J99j28J01j50p9Q8n8J97k72Q0
954a27Q3N4r0O0J62l49K81J15k50J62o4%K46k42j3J2M3k29J79L2r1K2KJ50j75
979b7J19O2M0j28M6j39Q7pL8k82K15J15k70N6J06J96l52J12l6K34k35j23J79Q0
1003H6j63L9n5J30r2N1q2N6N4l8O8m1p4J09j71J64R9J1j18Q0J2j63J90K4k63L0
1029e7J54n1k0N8J05j52j4K3J22k43J0k6q8N9J88l0l5o3P6n5MM7R3j82J37j32
$$ plain form
1055 -72 -94 -145 -33 108 -60 72 32 -11 216 101 -33 227 39 56 12 155 110 41 71 104 -4 160 -95 -37
1079 -37 -5 83 -74 -41 168 24 -150 -47 -53 -62 212 -76 95 2 -153 20 -61 150 -80 22 -5 119 2 -31
1103 -31 1 -158 80 137 -36 -14 27 -75 -117 57 47 -68 -8 -80 -92 185 15 10 -111 1 69 -119 -72 53 50
1128 50 -104 -56 174 30 8 101 -11 144 -77 90 186 -45 -102 -202 -101 -97 -110 -20 40 -28 -118 -136 -99 162 5
1153 5 -6 36 42 155 1 -218 42 -17 -155 -34 -62 18 59 7 -26 10 108 264 94 62 -67 138 12 148 93
1178 93 -72 122 44 53 54 48 -95 89 -7 4 -83 56 61 -159 -91 43 69 36 -113 -45 -70 66 20 28 115 -46 -28 -48
1206 -48 -18 -101 21 30 82 -170 -73 -154 -116 88 -50 -20 164 -35 67 -59 -64 -44 115 107 189 -9 74 -78 -52 -72
1232 -72 114 120 24 63 157 -145 65 72 -198 -27 149 -103 95 245 -101 -154 -49 23 171 -60 -109 -59 -7 -118
$$ packed form
1055g2k2n1J12J41j68J32m0m3K27j15j34K60j88J7m4J43m5o9L0L3j08J64k55N8
1079c7L2Q8j57L3K09j44j74J03orK74k88J71r3j55J73q1K11k30J02k7J24j17l3
1103c1L2j59K38N7j73K2M1j02m2J74j0j15O0p2j2K77j70nj21J12O8j88M7J25l
1128E0j54M8K30j44k2R3j12J55k21J67R6k31n7j00J01Mj3R0O0o8r0j8L7K61j57
1153Ej1M2OJ13j54k19K60n9j38J21k8Q0M1n2l3L6R8J56j70l2j29K05j26J36n5
1178I3j65J94p8RJoj43J84r6J1q7J39Nk20O8J34K6l3j49O8k5J36m6QQ7j61J8k0
1206d8L0q3J22RN2k52R7q1L8K04j38L0J84j99J02j26nK0J59qQ2j98Q3j52K6k0
1232g2J86Or6L9R4l02K10Pk70J71J76k52J98J50l46n3J05P2J48k31m9N0N2j11
$$ plain form
1256 -118 67 -15 24 56 61 -131 -17 93 24 99 -93 28 104 24 -40 112 113 133 -3 -119 173 -12 -3 -37 8 13
1282 13 42 38 -5 -82 154 109 14 165 -110 -42 -46 82 -53 83 -22 80 -37 52 -11 154 125 62 9 113 47 -18
1308 -18 129 -95 98 -124 32 49 -72 -247 -65 -67 75 -68 -28 -113 -198 2 330 97 -82 80 -26 95
1330 95 47 98 10 42 83 -66 -159 110 37 -45 -52 -187 -100 84 60 124 -90 33 -42 20 -50 122 52 -21 -184 130
1356 130 50 -121 77 47 38 -201 -32 -139 107 37 31 77 -183 84 -16 9 -2 -65 82 80 -57 13 0 -50 44 35
1382 35 1 -5 -1 -36 -25 166 -46 -14 58 79 -32 5 62 -25 -15 -83 -143 -188 23 -63 -114 -203 -123 -263 -65 -72 70 34
1410 34 -51 131 -3 19 -23 -19 -104 98 60 -43 -124 -79 88 19 98 89 -24 1 -206 -137 -21 -37 -71 100 -74 -169
1436 -169 88 113 238 -48 137 -55 37 67 4 -19 28 122 -5 -75 -210 102 -119 -33 -76 86 -246 -54 -40 56
$$ packed form
1256a18J85q2L9L2Nj92J14J10o9P5j92J21P6q0o4J52JK0j36j16K92j85Rl4M5N
1282A3K9mm3p7K36m5r5J51k75O8mJ28j35J36j05J02j17Q9o3J65k9o3n3J04o6o5
1308a8J47k24J93k22J56J7j21j75J82kJ42j43M0q5q5K00L28k33j79J62j06J21
1330I5m8N1q8L2M1j49r3K69p3q2pj35Q7J84k4O4k14J23p5O2p0J72p0p3j63L14
1356A30q0j71J98l0rk39J69j07K46p0oM6k60K67j00K5j1o3J47kj37P0j3n0R4r
1382C5l4oMl5J1J91k12L2P2K1j11L7N7q7J0o8o0m5K11q6n1q9Q0j40J98pJ42l6
1410C4q5J82j34K2m2Mq5K02l8j03q1M5J67o9P9rj13K5k07O9J16j6l4J71j74r5
1436a69K57K5J25k86J85j92R2L0o3k3M7R4j27p0j35L12k21Q6m3J62l32J92J4R6
$$ plain form
1460 56 100 -72 -20 48 46 -100 56 51 17 35 -50 -6 163 121 97 -88 313 -102 -27 40 150 45 -131 -29 31 -136
1486 -136 -123 89 -76 -222 132 88 99 -136 -38 33 144 -143 -24 -17 -52 -227 -92 175 50 -105 10 -84 -139
1509 -139 -103 -23 65 -106 -32 95 -146 -47 -112 99 -65 -121 -9 -259 84 -46 119 -61 108 -5 -15 20 21 58
1533 58 24 -18 77 -112 -43 -31 124 -67 201 186 -7 -48 -3 176 -51 8 -23 29 47 132 -45 -61 -213 -42 152
1558 152 -92 -14 197 91 -75 -3 -72 66 18 -10 0 -46 -133 -53 28 -179 69 -100 -43 -49 8 -109 -104 209 6
1583 6 -96 32 26 117 132 145 85 52 -62 -155 99 30 25 -34 124 -3 -53 -331 -69 -89 -202 105 -35 -54 69 -76
1609 -76 68 -25 -25 -21 68 -135 55 -74 12 -76 -127 -123 -50 66 -13 69 102 -12 29 -53 -145 5 -129 -101 144 -184 -13
1636 -13 107 -157 -62 80 108 73 -57 51 136 -27 -89 83 -69 -70 -32 -133 1 -75 262 191 174 29 87 51 -116
$$ packed form
1460E6M4j72N2O8kj46J56nl4J8q5M4J69m2k4j85M01m15P5O7J10j05j76J02O0j67
1486a36J3K12j65j46L54m4J1k35R8P1J11k87J19Pl5j75J35K67j25j55J15r4n5
1509a39L6Q0Q8j71P4J27k41R9o5K11j64n6J12k50L43j30J65j80J69j13j0L5JL7
1533E8l4m2R5j89O9J2J55j91K68j5j93m1M5J79k27N9l1N2J8Q5j77j6j52J71J94
1558A52k44P8K11j06j66P2o9J38m8k8J0m6q7Q0Q1k07K48j69N7oN7j17NL13k03
1583Fj02J28oR1J5J3o0l3j14r3K54o9nn9J58j27n0k78K62k0j13L07j40j9J23j45
1609g6J44r3%MQ9k03J90j29Q6q8n1MP3J16p9Q2L3j14M1q2r2J50j34K8K45l28J71
1636a3J20k64R5J42K8l5j30J08Q5j63o2J72j52jL8j01J34p6L37p1j7j45N8l6j67
$$ plain form
1661 -116 -45 6 -125 33 -19 226 -49 72 107 -17 114 -13 103 -217 -99 -116 9 -1 176 42 -48 -4 123
1684 123 -73 109 60 148 -32 176 33 198 112 29 -143 117 -11 -87 53 -52 115 122 -47 -42 35 -188 -42
1707 -42 -70 -42 -16 -32 1 47 -131 69 102 66 62 -78 -92 -164 -149 -21 43 -104 69 -78 33 -8 170 115 19 -32
1733 -32 110 34 -25 15 -53 -43 79 116 -58 -53 192 144 70 -110 -68 -108 -85 -138 -126 -9 34 230 -72 5 -2 64 -136
1760 -136 16 46 -49 -104 11 52 -63 23 -36 -111 7 97 -212 -56 -54 104 -33 41 57 -74 72 36 -37 50 17
1785 17 -105 128 -32 27 7 52 83 51 -94 55 73 26 25 -1 127 7 -50 -7 -84 -46 4 -76 94 190 101 -92
1811 -92 -25 65 -23 215 100 -65 -143 -67 -34 -14 0 -79 214 -250 -27 -84 -101 2 20 57 -171 -92 109 -70 -24
1836 -24 17 133 107 -11 91 60 84 -205 -50 84 -97 143 159 -31 150 109 2 110 -165 -158 -124 32 7 35
$$ packed form
1661a16P1N1j31J58n2K45k75J21L5j24J31j27J16l20J18j7J25j0J77j34r0M4J27
1684A23j96J82m9Q8j80K08j43J65q6q3j72K60j28p6J40j05J67Pj69NP7k23J46
1707d2k8K8K6j6L3M6j78K00L3l6mj40j4p2J5J28O4j47J73j47J11m1J78n5r6n1
1733c2J42p6n9M0o8J0J22L7j74NK45m8p4j80M2m0K3n3J2J17M3J96l02P7pO6k00
1760a36J52L0r5n5J15M1j15Q6n9p5J18R0l09J56KJ58j37P4J6j31J46l6p3Q7l3
1785A7j22K33j60N9k0M5L1l2j45J49J8m7jk6J28j20n7M3p7L8N0q0J70R6q9j93
1811i2O7R0q8K38j15j65p8P6L3K0J4p9K93m64K23n7j7J03J8L7k28P9K01j79M6
1836b4M1J16k6j18J02l1K4k89J55J34j81K40J6j90J81m1j07J08k75PL4J56k5K8
$$ plain form
1860 35 -8 -76 -28 30 -68 -158 -25 5 -21 -9 -76 -63 -271 -105 -80 60 134 50 111 -35 -82 21 151 6 -26 -72
1886 -72 90 155 -91 -115 187 42 192 -47 -66 -102 181 -57 -35 -24 94 115 -164 9 -13 23 -18 19 -24 -14 60
1911 60 -169 -70 30 -109 10 -133 -22 -62 -26 -45 -126 15 81 -71 21 147 62 35 119 149 49 -269 -85 83
1935 83 97 -45 -96 -68 105 -91 81 149 98 81 98 -40 -38 44 -152 7 -75 35 24 -31 -69 -149 119 28 12 111
1961 111 -128 -31 -96 18 150 -1 -161 92 114 21 -53 -140 60 -1 112 -223 -155 50 -127 -56 -36 53 138 106
1985 106 25 -134 75 65 55 129 3 -9 -61 80 -231 94 140 -59 63 79 13 -49 1 88 90 -28 -48 -144 -51 -189
2011 -189 92 29 52 120 -47 -66 -34 9 42 2 203 23 12 -16 172 23 53 25 -150 38 40 18 -11 -76 -71 92
2037 92 -31 -52 -29 -52 -58 -22 -137 2 16 -21 25 19 -29 -15 64 87 152 12 62 2 -201 -81 -19 -18 -121 46 -168
$$ packed form
1860C5m3o8M8N8r8r0J33L0k6J2o7J3k08J66K5J40P4q4O1j46m7J03J30j45l2m6
1886g2J62O5k46k4L02j45J50k39j9l6K83k38K2J1J18K1k79J73k2L6m1L7m3J0P4
1911F0k29R9J00j39J19j43J11m0L6j9q1J41O6j52R2J26q5k7Q4L0j00l18J84J68
1935H3J4j42n1K8J73j96J72O8n1j7J7j38KQ2j96J59q2J10j1n5l8q0K68r1j6R9
1961A11k39R7o5J14J32j51j60K53K2r3p4q7K00o1J13l35O8K05j77P1K0Q9Q5l2
1985A06q1j59K09j0j0P4j26j2n2J41l11L25M6j99J22J6o6o2N0Q7Kj18k0r6R3j38
2011a89K81o3K3O8j67j9L2M3L3m0K01j80j1k8J88j49L0k8j75J88Kk2k9o5NJ63
2037I2j23k1K3k3oL6j15J39J4l7M6om8J4P9K3O5j40N0o0k03J20O2Jj03J67k14
$$ plain form
2064 -168 -68 75 33 3 -66 113 -7 -137 171 -7 -104 -61 3 59 62 -65 61 -52 34 -59 -54 183 -15 66 123
2089 123 -7 -198 -125 64 218 22 49 31 146 75 -21 104 -102 129 -196 223 -90 -131 50 14 -123 -165 -221
2112 -221 -12 105 -38 168 -17 87 -211 -167 -117 157 74 -101 -87 61 -13 80 -41 28 -36 36 -111 11 1
2135 1 60 107 1 -54 191 -46 48 141 -51 -107 -16 215 -84 -59 -181 100 -158 79 75 -33 8 1 -48 62 -92
2160 -92 125 21 -196 40 7 71 -28 -60 -94 11 118 21 -21 48 -7 -62 -110 17 42 -86 96 27 61 11 7 122
2186 122 67 -96 6 -140 -6 -25 74 95 7 28 87 202 14 -105 -25 10 36 -19 43 -118 -115 3 4 99 35 87
2212 87 38 -135 -71 -120 -90 0 -102 96 48 -165 -63 94 -95 -8 -88 64 -36 30 69 14 45 -17 -28 74 -160
2237 -160 133 -1 56 58 -53 0 -23 54 5 -143 -43 29 -132 168 -107 -33 165 95 81 9 -152 -53 10 85 -49
$$ packed form
2064a68J00J43m2l0o9J79j20j30L08j78r7M3O4N6Lj27J26j13Q6r3NK37j98Q1N7
2089A23j30j91P3J89J54j96K7j8J15p1r6J25k06K31l25M19l13m1J81l6j37m2n6
2112b21K09J17j43K06j85J04k98M4N0K74q3j75J4J48p4R3j21O9o4P2j47J22j0
2135AN9M7j06n5K45k37R4R3j92n6R1K31k99K5j22K81k58K37mj08M1pm9J10j54
2160i2K17j04k17K36l3O4r9l2l4J05J07r7m2O9n5n5m8J27K5j28J82o9L4n0mJ15
2186A22n5j63J02j46J34j9R9K1q8K1N9J15j88j19Q0L5K6n5O2j61LJ18JR5o4N2
2212H7m9j73O4m9L0R0j02J98m8k13J02J57j89Q7q0J52j00O6L9n5L1o2j1J02k34
2237a60K93j34N7Kj11N3k3P7m9j48J00P2j61L00k75P4J98p0j4p2j61R9O3P5j34
$$ plain form
2262 -49 -106 -167 8 19 107 -6 -63 -94 101 61 -18 124 -169 -27 -11 26 -37 -33 -81 -206 25 -55 -36 -93 -35 -20 86
2289 86 -80 153 -83 39 76 71 -43 75 -28 -6 57 230 -129 52 92 -111 5 -3 54 110 0 -28 150 -35
2313 -35 6 -48 -25 54 35 -234 -34 205 -79 -26 -10 181 15 75 31 -26 1 182 -5 10 207 -99 212 118 -70
2338 -70 -238 -29 -3 -40 61 186 33 195 0 35 150 190 -28 -89 30 45 78 -29 82 -60 -133 13 31
2361 31 -64 -213 77 75 45 221 -52 -170 37 -155 92 14 -56 -87 -56 -42 32 39 -41 216 -20 51 -60 -53 -73 84
2387 84 -69 20 85 83 -38 -99 25 138 -259 -64 137 -49 85 72 54 51 142 110 132 32 -111 -18 64 108 41 -40
2413 -40 -67 -186 -123 173 22 -13 12 -64 21 -39 -83 -109 -200 63 -102 75 22 -84 -31 95 -169 79 19 24 -66 132
2439 132 -149 70 45 23 61 54 73 7 12 37 -27 -29 -57 217 -37 25 64 -96 -15 87 134 124 -138 -18 70 50 -83
$$ packed form
2262d9n7o1J75J1Q8j13n7l1J95m0p9J42k93J42J6L7o3Mm8j25K31q0J9n7N8J5J06
2289H6j66K33k36J22L7nj14J18j03K2O3J73l59J81M0k03J16qN7N6j10k8J78j85
2313c5M1n4K3P9j9k69K00K39k84N3J6J91j66O0m4n7K7J81j87J5J97l06L11r4j88
2338g0j68K09K6l7J01J25j53J62j95L5J15M0k18o1J19J5L3j07J11j42p3J46J8
2361C1r5j49K90kl0J76k73j18K07j92K47p8p0l1L1J4P4Pq0K57k36P1j11Pk0J57
2387H4j53Q9O5kj21o1J24J13l97J95K01j86J34j3j8lR1l2K2j00j43R3Q2M4o7q1
2413d0k7j19O3K96j51l5K5p6Q5o0m4k6r1K63j65J77n3j06N3J26k64K48o0Nr0J98
2439A32k81K19k5k2L8pJ9o6NK5o4kk8K74k54O2L9j60Q1J02M7j0k62J20Q8k0j33
$$ plain form
2466 -83 125 153 -178 -102 -157 -52 -15 12 -116 -1 -187 40 41 -138 18 71 -10 -141 -74 79 137 76 -2 253 2
2491 2 -27 49 7 23 -24 -29 42 73 33 14 -6 65 -12 133 -70 18 55 -70 -38 258 80 10 -201 43 50 11 101 -140
2519 -140 101 -40 -51 32 56 -101 85 20 -76 45 75 12 197 -62 36 40 -45 -127 11 -33 -58 -2 -76 132 -84
2544 -84 -32 -19 126 -84 125 19 79 88 194 52 -41 93 48 221 114 64 -142 -91 115 -15 19 -43 -204 165
2568 165 76 122 88 67 -1 71 39 34 7 -9 -38 185 -61 -9 -24 -35 -125 -19 87 -158 -91 -92 1 41 59 -40 120 -20
2596 -20 61 -34 97 78 -124 8 -88 125 -56 -20 61 -11 -16 -89 94 38 -16 -125 103 142 16 194 59 46 13
2621 13 -157 -77 33 -140 62 -104 30 -29 48 -4 -43 -152 126 -36 -110 34 -89 -43 -211 -164 40 -13 16 21
2645 21 -79 -221 -57 0 65 169 116 -103 109 -10 12 42 31 -12 -28 67 -46 -62 34 283 -58 -95 43 68 -41
$$ packed form
2466h3K08K8l31P6n5J05L7K7j28J15j86K27Jj79J56N3q1j31O7J53N8o1p8K55k51
2491Bk9P6m2J6m7nP1L1m0j9k0P1p7J45k03Q8L7j25L2K96j78p0k11K44Pl9R0k41
2519a40K41j41j1Q3K4j57J86o5r6J21L0o3J85k59R8Mq5q2J38m4k5N6p4K08k16
2544h4N2J3J45k10K09j06O0RJ06j42r3J34m5J73j07n0k06N1K06j30L4o2j61L69
2568A65q9M6l4k1o8P2l2nk7j6k9K23k46N2j5j1r0J06J06k45O7jR3M0J8r9J60j40
2596b0Q1r5J31j9k02J32r6K13j81L6Q1p2np3J83n6n4j09K28L9j26J78j35j3l3
2621A3j70Q0J10j73K02j66J34n9P7n2l9j09K78j62p4J44j23M6j68M7K04n3K9N
2645B1j00j42J64N7O5J04n3k19K12j19K2L0j1m3j6R5j13j6R6K49l41l7J38K5j09
$$ plain form
2670 -41 0 41 -73 157 35 -225 27 -78 -38 -108 56 -116 106 -88 -30 -116 -15 58 -27 79 -43 -3 -34 -259
2694 -259 16 3 -80 -72 -12 -33 -14 -48 67 -80 163 58 36 141 8 -105 145 112 -77 41 36 37 -59 -71 -175
2719 -175 -102 -178 100 -7 128 85 -164 146 -122 75 73 -24 151 -138 47 -51 -25 -89 -113 93 4 -64 -43 35 61
2744 61 83 140 -11 26 -32 54 84 -30 167 -137 28 0 -186 -132 65 -114 -34 80 -96 41 -93 -109 25 66
2768 66 26 -24 48 -21 47 -131 -14 116 -33 93 66 -113 -208 47 -23 1 62 25 -57 -52 24 -98 -81 -57 62 -65
2794 -65 -26 -129 42 -70 58 63 59 147 136 -110 108 173 -77 -73 -87 -169 189 -17 34 -42 26 275 -84 67 -24 99
2820 99 -177 -21 -105 90 -24 30 -60 107 23 172 68 86 140 -115 -7 56 -25 162 -50 -16 154 -60 -168
2843 -168 -49 -94 -109 89 -106 265 -41 -22 21 70 114 -90 -88 213 -41 -72 -42 -133 186 71 -51 -5 -52 -124 106
$$ packed form
2670d1M1M1j14K30j22k60K52j05M0p0J64j72K22j94N8q6J01P3q5J06j22M0l1k25
2694b59K75j3q3QO0k1J9l4J15j47K43j05k2J05j33j13K50l3j89J18nJr6j2j04
2719a75P3p6K78j07J35m3k49L10k68J97kr7J75k89J85r8K6o4k4K06q9o8K1P8K6
2744F1K2N7j51L7n8Q6L0j14J97l04J65k8j86N4J97j79Q0J14j76J37j34j6J34M1
2768F6m0n0P2o9O8j78J17J30j49J26k7j79r5K55p0K4O1l7q2NP6j22J7K4J19j27
2794f5L9j03J71j12J28NmQ8j1k46K18O5k50Mj4q2L58k06N1p6O8K49l59J51r1J23
2820I9k76J56q4J95j14N4r0J67q4J49j04J8N4k55J08O3q1J87k12L4J70k14j08
2843a68J19m5j5J98j95L71l06J9M3M9M4k04KL01k54l1L0r1L19j15j22M6m7p2K30
$$ plain form
2868 106 -8 -26 127 76 -32 -18 -152 130 -5 75 -16 91 -112 -78 68 -111 -79 -48 -37 -11 -27 -22 126 -140
2892 -140 133 -42 14 -25 14 58 -39 3 20 -7 -33 -34 69 83 31 89 4 -1 -149 46 56 52 61 37 187 -131 122 1
2920 1 -122 -8 -268 88 23 -125 46 47 -152 16 34 52 25 31 -4 -7 -48 -35 -115 -60 44 65 -13 -92 88 98 214
2947 214 110 -68 -215 -88 -8 -111 129 -30 -3 41 -148 -88 154 147 147 69 -88 -18 -20 193 -16 5 31 -124 -29
2972 -29 100 136 -121 92 44 -29 -8 -25 94 -91 -66 -102 40 -156 -21 -191 -101 206 -169 30 -104 18 -23
2995 -23 157 -16 36 149 -55 -12 -18 264 17 45 110 7 50 -51 -19 138 144 28 52 155 12 -36 -229 151
3019 151 131 42 -196 28 92 -16 0 -57 -170 -226 115 -98 -92 -59 -105 39 55 -153 -76 185 68 -205 199 -9
3043 -9 140 70 -73 -43 188 -5 68 12 262 66 -60 86 167 18 88 144 8 259 -131 101 -63 92 -71
$$ packed form
2868A06j14j8J53n1j08J4j34K82j35Q0r1J07k03L4J46j79L2L1J1K6j6NJ48k66
2892a40K73j75N6l9L9M4r7M2J7k7k6jJ03J4n2N8q5nj48J95J0mRk4J50l18K53j21
2920Aj23J14k60L56o5j48J71Jj99J68J8J8k7Ol5lm1J3q0N5J04K1p8p9J80J0J16
2947B14j04j78j47J27Q0j03K40j59K7M4j89O0K42p%p8j57P0kK13k09K1K6j55R5
2972b9J29L6k57K13m8p3K1j7J19j85K5l6J42j96J35j70R0L07l75J99j34J22m1
2995b3J80j73N2J13k04M3oK82k47K8O5j03M3j01L2J57Oj16K4J03j43m8j93L80
3019A51k0q9k38K24O4j08J6n7j13n6L41k13OL3m6J44J6k08P7K61j17k73M04k08
3043iJ49p0j43L0K31j93P3n6K50j96j26J46Q1j49P0N6j36K51l90K32j64J55j63
$$ plain form
3066 -71 28 142 -85 9 -116 -67 -39 77 -197 89 59 -157 187 -43 74 -173 -186 -32 -3 31 -24 71 46 -76
3090 -76 -123 -68 10 -101 142 -45 80 -84 -3 40 222 82 12 -36 49 121 -15 7 159 48 213 108 -51 -25
3114 -25 24 88 214 176 91 -7 26 40 -51 32 62 -154 -15 -18 -8 35 -78 -40 93 32 149 33 28 113 -40 -51 104
3141 104 74 -4 -65 106 160 -8 68 27 29 -202 18 -20 -89 56 45 45 -18 -74 62 36 -71 68 -148 -48 75
3166 75 -138 13 -12 -79 75 21 -66 -78 203 -93 37 44 -25 82 1 -70 -14 -95 15 67 42 197 1 84 138 -155
3192 -155 -52 -83 -34 116 90 51 -17 75 51 -148 140 122 -10 -21 136 -18 55 -93 66 -95 19 27 -105 49
3216 49 79 -31 -283 13 14 -70 -51 31 -17 137 -68 64 86 6 -123 -45 -105 118 38 73 -118 239 -84 54 113
3241 113 6 -62 37 -135 92 38 106 10 1 -77 -143 -5 114 28 -27 41 33 -50 0 6 -14 67 22 8 116 -67 -80 -25
$$ packed form
3066g1R9J14k27R4j25M9K8J16k74K86l0k16L44k30J17k47j3J54K9L4n5R5k5j22
3090g6m7N5P8j11K43j87J25j64Q1M3J82j40p0m8Q5P2j36K2J52j11J65j05j59K6
3114b5M9O4J26l8q5r8L3J4r1Q3L0k16J39lJ0M3j13L8J33o1J17j16nQ5j53j1J55
3141A04l0p8o1J71N4j68P6m1Kk31K20l8o9J45j1%o3n6J36k6j07J39k16J00J23
3166G5k13J51k5o7J54n4q7j2K81k96J30Po9J07q1p1N6q1J10N2k5J55j96Q3N4k93
3192a55J03l1M9J50k6l9o8R2k4j99K88j8j32j1J57j54P3j48J59j61J14Qj32J54
3216D9L0j10k52K96Jq4J9Q2m8J54k05J32K2q0j29P8o0K23q0L5j91L57l23J38N9
3241A13j07o8R9j72K27n4O8r6rp8o6J38J19q6n5O8qq3N0Ok0Q1m5j4J08j83j3N5
$$ plain form
3269 -25 -198 -7 -42 35 5 45 24 46 2 318 -163 172 -5 116 -53 137 148 -163 -47 -29 -88 -36 -6 -87 24
3294 24 -92 68 46 -31 162 57 55 -36 -87 12 30 82 -48 133 -20 35 156 46 267 256 -40 119 23 -265
3318 -265 110 -90 270 224 121 -64 -81 34 -86 -36 -58 -92 67 -63 50 96 119 -58 -126 -12 36 -201 41
3341 41 32 40 100 67 114 6 -21 23 107 -79 -59 41 6 45 -88 -132 -81 -42 -43 5 20 -31 10 101 -70 -15 -17 -164 -15
3370 -15 -55 31 76 32 -43 -87 -16 -30 -81 94 80 -156 -28 59 -65 -101 -23 -47 -50 -35 -23 37 -26 -136 155 103 193 -98
3398 -98 94 -16 -1 6 152 104 -80 -9 -7 171 40 73 37 2 92 -6 -39 -53 -99 -87 -9 124 70 -18 15 -1 148
3425 148 -23 149 122 -85 -91 92 -52 72 -5 -172 -37 49 -119 -88 -49 -109 -57 195 -37 -10 63 5 90 150 -69
3450 -69 15 32 -63 -19 -19 58 -88 157 -51 -34 20 129 -186 109 -118 -21 163 11 -5 166 199 -132 79 29 -52
$$ packed form
3269b5j73J91l5P7l0M0k1K2m4L16m81L35j77J21j69J90J1l11J16J8n9N2L0q1J11
3294B4j16J60k2p7J93j05kr1n1R9J8N2j30J81j53N5J21j10K21j1k96J59r6k88
3318b65L75k00L60m6j03j85j7J15j20N0k2l4J59j30J13M6K3j77o8J14M8k37K42
3341D1rQO0l3M7j08k7M4Q4j86K0J00l5L9j33m4N1L9jM8J5n1M1R1j71N5kj47J49
3370a5m0Q6M5m4p5m4P1j4n1J75j4k36J28Q7j24l6P8k4lJ5J2O0o3j10K91n2R0k91
3398i8J92j10J5PJ46m8j84P1KJ78j31L3l6l5R0r8l3j4m6J2P8J33n4q8L3j6J49
3425A48j71J72k7k07oJ83j44J24p7j67J35Q6j68L1L9o0N2K52k32K7P3n8Q5O0k19
3450f9Q4J7r5M4%P7j46K45k08J7N4J09l15K95k27R7J84j52j6J71L3l31K11n0q1
$$ plain form
3475 -52 -7 -142 231 126 -124 0 -71 56 33 23 163 29 -49 44 226 67 -197 78 -30 -59 -64 -182 -59
3498 -59 87 22 -8 -88 -124 106 89 22 -13 74 146 -19 -110 108 131 108 166 53 -107 -94 -115 -211 99 95 -101 84
3524 84 -36 65 113 74 221 199 25 111 -41 -124 42 38 -125 9 -159 -132 33 -129 -120 -95 -70 -50 -23 -209 -2
3549 -2 -7 -67 59 114 40 -158 105 92 36 73 24 110 23 13 168 -14 26 -9 -67 -138 -42 -93 21 -54 29 127 24 56
3577 56 -130 -156 -40 238 21 -11 -54 71 -75 115 -83 25 5 -30 10 3 63 -120 100 -7 -84 -69 2 58 -167
3602 -167 27 22 50 47 -65 77 -4 95 -26 31 48 180 120 140 32 -61 125 -143 10 11 23 -73 60 65 57 139 0
3629 0 -9 113 -41 -14 21 105 -48 -56 80 -45 39 2 -39 36 9 89 -41 95 -98 -235 165 94 57 43 -107 -127
3655 -127 104 -244 106 78 -84 27 -58 31 -32 19 36 -8 -48 -164 -61 9 -5 -61 36 -32 128 11 -98 182
$$ packed form
3475e2M5j35L73j05k50J24p1J27k3j0J40j34p8R3J82j59k64K75j08k9nj18J23
3498e9J46o5l0q0l6K30j7o7l5Q7P2j65r1K18K3k3N8j13j60J3k1r6L10mj96J85
3524H4j20J01M8l9J47k2j74Q6j52q3J66mj63J34j68K7J65j62RK5K5K0K7j86K07
3549bno0J26N5p4j98K63j3n6L7m9Q6q7j0J55j82M0l5n8p1R6n1J14p5Q3R8j03L2
3577E6j86k6J16K78k17l2m3J25j46J90j98J08k0l5M0pO0j83K20j07p7J5P1N6k25
3602a67J94nK8lj12J42q1R9j21N7J7J32o0K0j08r3J86k68J53JJ2r6J33NqQ2j39
3629@rJ22j54K7L5Q4j53qJ36j25Q4l7m1P5k7Q0j30J36j93j37M00p1l7j4j50k0
3655a27K31l48L50k8j62J11q5Q9o3N1J7m4m0j16J03P0j4n6R7o8J60j17j09K80
$$ plain form
3679 182 70 -181 -105 -23 -26 -72 -62 -45 -4 -33 -49 -152 -40 -54 -62 -167 184 38 -39 -52 61 -72 -70 -3 94 15 -22
3706 -22 -149 -119 -29 31 84 -26 -23 -17 -56 -100 -54 -98 -128 90 24 54 105 61 -13 5 100 -208 14 -41 69 18 -26 -48
3734 -48 54 -34 20 222 96 -25 51 -71 -76 -110 -129 -76 152 -56 122 88 -16 19 65 31 -13 214 235 112 21
3759 21 32 -16 -24 9 13 113 39 28 145 67 48 -52 -35 50 20 67 -40 -42 -47 -4 13 -198 69 81 19 11 -65 5 77 137
3789 137 113 13 -60 -58 -72 -118 17 43 17 64 -20 -6 82 -85 150 33 -139 183 -210 -117 -128 -44 22 94 258 143
3815 143 -52 -11 -21 138 -28 -22 2 -137 -14 19 -8 117 115 -14 14 116 63 43 31 38 -60 -260 -84 19 -35 -5
3841 -5 -15 -75 -75 -19 -37 -78 50 -6 -77 24 -99 108 -65 132 55 112 -50 -75 -14 -123 -76 18 137 -92 116 66
3867 66 -97 110 38 8 29 -51 69 -166 25 -81 -42 -16 -32 10 90 81 130 -15 -8 30 21 143 35 13 -203 -73
$$ packed form
3679A82j12k51P6Q2lm6J0J7M1k9j6j03J12j4qj05L51j46p7j3J13j33KO7R7p9l7
3706b2j27L0R0O0N3j10LOl9m4M6m4l0K18o6L0N1m4p4J8R5l08K22n5J10n1m4k2
3734d8J02q8N4K02j26j21P6j22nl4j9N3K28k08J78l4j04L5M6l4m4K27K1j23r1
3759B1J1m8qL3MJ00p4j1J17p8j9j00J7Q5l0M7j07knM3J7k11K67J2o2qp6P0P2O0
3789A37k4j00p3Kj4m6J35K6k6M7q4J4Q8j67K35j17j72L22l93R3j1Q4O6P2J64j15
3815A43j95M1j0J59j66OK4j39J23L3k7J25kj29K8J02n3k0j2Pr8k00J76J03n4L0
3841ej0o0%N6j8m1J28n6p1J01j23K07j73J97p7N7j62k5O1j09M7R4J19k29K08n0
3867F6j63K07p2l0K1q0J20k35J91j06L9K6j6M2Q0rM9j45PL8rJ22j08k2k16J30
$$ plain form
3893 -73 17 -205 -154 45 104 -32 168 269 -111 54 2 82 -74 136 -19 -72 -18 15 81 153 -19 -89 256 -83
3917 -83 -15 26 19 -60 -63 -136 123 54 95 -42 86 -31 -25 -3 89 49 -64 45 -94 64 -75 -27 -38 92 87 35 -117
3944 -117 123 -52 -190 -64 7 -79 20 56 169 59 45 23 -23 -27 60 60 105 38 -88 180 -43 -6 141 129 -75
3969 -75 -33 31 -88 -30 48 170 -12 38 197 -82 37 -150 77 -112 12 42 -13 38 -99 -63 43 -65 49
3992 49 -104 81 66 -39 -49 -11 -113 43 -76 8 -39 4 109 -64 62 -235 105 -2 2 29 89 -23 326 263
4016 263 -7 -31 -128 -33 147 99 -63 91 26 23 -58 -25 -78 -4 -107 -78 117 -160 60 138 30 -47 -64 -97 -29 10
4042 10 -17 -63 72 -83 50 21 39 270 93 -122 1 83 -87 -151 -36 10 91 -9 -3 -66 27 -146 -143 -5 51
4067 51 58 -41 41 -8 31 11 -14 34 14 4 0 135 54 179 24 2 -70 -88 164 -214 27 -111 -19 23 3 39 -179
$$ packed form
3893g3R0k22N1J99N9j36K00J01l80J65n2Q0j56K10j55n3N4L3O6P2j72p0L45l39
3917h3O8M1pp9lp3K59o9M1j37J28j17OK2R2m0j13J09j39J58j39M8j1J30nn2j52
3944a17K40j75j38J26P1q6R9L6J13j10j4k2m6mQ7%M5o7j26K68k23L7J47j2k04
3969g5M2O4j19N8P8J22j82N0J59k79J19j87K27j89J24L0n5N1j37L6J06j08J14
3992D9j53J85j5j05j0L8j02J56j19Q4m7M3J05j73J26k97L40j07MK7O0j12L49o3
4016B63k70k4r7R5J80m8j62J54o5lq1L3n3P4j03K9J95k77K20P8j08p7j7l3O8L9
4042A0k7m6J35j55J33k9J8K31j77k15J23Q2j70o4J15M6Q1j00Oo3R3j73LJ38N6
4067E1Pr9Q2m9L9k0k5M8k0j0mJ35q1J25j55k2p2j8K52l78K41j38R2M2k0L6k18
$$ plain form
4094 -179 -1 15 -80 11 180 -57 40 135 -21 272 188 19 24 -24 -51 -41 148 -71 42 -21 -268 99 -28 12
4118 12 -77 43 163 39 19 30 -8 -48 162 51 98 -15 -9 -11 87 -53 -46 26 -45 89 -5 -154 -15 -107 -142 -53 -32
4145 -32 -23 0 -107 39 94 -84 81 -98 106 68 78 -14 22 -258 -38 -58 -104 108 98 -144 20 150 -74 -104
4169 -104 14 76 -36 211 -66 -105 -48 56 -126 -64 -4 -23 -84 -147 -149 74 80 -139 -33 0 66 -179 -87 -33 124
4194 124 177 38 46 73 87 2 4 30 -93 -33 28 24 -102 21 75 21 24 -206 -252 -40 87 -212 -68 116 58 39 -56
4221 -56 21 108 69 28 -107 -21 109 79 -39 37 -140 19 -134 241 -88 -71 6 -75 5 165 -55 54 -30 4 3
4246 3 -111 177 -39 -22 -27 106 61 27 157 -67 -43 -7 76 -32 1 -84 -177 -84 -97 -63 22 -59 66 -114 -13 47
4272 47 129 201 113 93 -131 58 1 1 100 83 164 57 -47 60 95 196 -152 -37 48 -9 -124 -3 -33 13 -137
$$ packed form
4094a79J78J6r5R1J69k37R7R5j56K93q4j69Nm8k7J0J89k19J13o3k47L67j27M0
4118A2q9J20J20j24k0J1l8m0K10j11M7j13OkR8j40PP2p1J34r4j49J39r2l5Q9K1
4145c2RK3j07J46N5j78J65j79K04l8J0r2L6k80K20k0m6K12j0k42J64J30k24l0
4169a04J18O2j12K47k77l9N7J04j82O2O0j9o1o3kK23Ok19J06L3O6k45R2N4J57
4194A24N3j39QK7J4q5KK6j23O0O1mj26J23N4n4Lk30m6K12J27k99J44J84n8j9r5
4221e6P7Q7l9m1j35Q6J30l0j18P6j77J59j53L75l29J7P7q1Q0J60k20J09q4L4j
4246Cj14K88k16J7nJ33m5l4J30k24K4L6Q3j08L3q5r3R3j3L4Q5q1J25j80J01O0
4272D7Q2P2q8k0k24J89n7%R9j7Q1j07j04J07L5J01l48J15Q5n7j15J21l0M6j50
$$ plain form
4297 -137 145 -52 -144 130 -109 -52 8 -52 -23 21 173 1 -37 15 171 97 -16 171 -95 -86 8 144 -7 29
4321 29 -31 -93 -172 -12 24 114 -41 18 118 84 48 -93 67 -54 -132 -177 -72 23 -10 -208 -104 -170 -109 76 69 88
4347 88 41 133 -25 66 -32 -10 -184 -182 -122 10 81 130 76 243 -22 -103 -10 146 -90 85 23 48 -21 -34 -66 8 39
4374 39 167 83 -159 35 78 58 -148 -23 -24 55 -4 59 77 -66 104 104 -123 36 -7 -74 -12 -133 107 110 39 64
4400 64 -66 -43 146 -21 145 216 53 78 43 116 57 -6 63 -47 -48 -130 18 -113 -94 -46 -6 221 43 -29 -128 69
4426 69 -42 135 85 202 138 -20 24 -64 205 63 16 -5 272 -80 -38 25 83 18 -141 -181 -123 49 188 -45
4450 -45 0 -249 -141 -16 -10 -20 119 25 56 15 96 -93 -131 21 156 7 -153 -14 -3 52 -22 0 100 76 114
4475 114 42 -68 1 -48 -42 0 -8 -36 -3 -54 142 -17 95 -34 -20 30 -65 -3 -47 -46 45 -24 -21 75 -50 8 11 -194 34
$$ packed form
4297a37K82j97r2K74k39N7O0o0K9M4J52j72l8N2J56p4j13J87k66RR4J36j51L6
4321B9o0o2p9J60L6R0j55N9J00l4l6j41J60j21p8m5J05R5l3j98J04o6O1J85pJ9
4347H8m7R2j58R1r8K2j74KO0J32P1M9n4J67k65q1R3J56k36J75o2K5o9j3l2P4L1
4374C9J28q4k42J94M3k0k06J25jP9n9O3J8j43J70%k27J59m3o7O2j21K40Lp1K5
4400F4j30K3J89j67J66P1j63K5l5P3n9o3O9j10jq2J48j31J9M8M0K27j78p2r9J97
4426F9j11J77n0J17o4j58M4q8K69j42m7k1K77l52M2O3N8o5j59m0N8J72J39k33
4450d5M5k49J08J25Oj0J39r4L1m1Q1j89l8J52J35j49j60J39J1N5p4K2J00k4L8
4475A14p2j10O9m9OM2qk8L3n1J96j59J12j29J4N0r5O2m4JR1o9LR6j25N8Lk05K28
$$ plain form
4504 34 -183 -157 -194 -225 15 18 24 76 -30 79 -72 -100 117 39 -92 29 99 -92 -99 -93 6 -46 61 -6 53 55 77 -89
4532 -89 148 -38 -51 55 3 57 -93 68 106 -81 -54 105 64 248 -275 32 9 -90 44 47 -14 -88 -64 -10 50
4557 50 41 97 -77 2 -128 21 -167 -139 25 -114 78 -12 14 -230 78 81 -106 14 -110 -96 -119 -60 2 133 -54
4582 -54 -21 -47 -78 -15 -51 -73 -56 65 8 -83 -96 -40 154 114 139 -22 -122 -125 -113 124 -160 -17 55 -118 29 68
4608 68 -25 175 42 -49 -88 -34 -31 123 206 -20 35 25 73 21 27 -85 137 -64 -23 -30 22 -2 106 40 -65 -47 -47 -131
4636 -131 -62 31 129 -15 65 225 68 -97 146 54 -16 178 9 54 27 -61 2 55 102 -11 -53 72 -78 -33 55
4661 55 -111 -3 -98 104 -83 -35 285 -164 47 63 32 -26 103 66 83 -15 154 -37 64 31 -57 73 31 -46
4685 -46 48 23 48 -86 -210 -9 35 151 -38 -62 -60 -58 -21 -24 -149 62 -91 35 -154 68 -74 76 136 89 44
$$ packed form
4504C4k17K6l7l1K40LON2j06J09j51k8K17p8j31J21P0j91pOR9n2J07o7N9KK2j66
4532h9K37j86j3J06n2N4j50J61L8j87K7J59m1J84n23L07k3r9J34Lo1p4K4N4O0
4557E0rN6j74P9j30J49j88K8J64j39J92r0K6k44L08Lj87J20j24J4k3N9O2J31j87
4582e4L3k6l1O3l6k2J7J21n7r1j3N6J94m0K5j61j00lJ2K37k84J43P2j73J47L9
4608F8r3K00j33r1l9N4LJ54Q3k26N5j0M8n2Oj12K22k01M1pN2k4J08o6j05J8%q4
4636a31O9R3R8j44Q0J60j57j65K43r2p0J94j69M5k7q8O3N3M7j13m2J25j50M5Q8
4661E5j66J08r5K02j87M8L20m49K11J6l1n8J29l7J7r8J69j91J01l3q8J30m2p7
4685d6R4k5K5j34j24K01M4J16j89k4KKL7lj25K11j53J26j89K22j42J50O0m7m5
$$ plain form
4710 44 -5 -149 -23 62 64 95 -33 36 40 -158 -157 87 -17 -8 48 46 -48 101 -89 32 16 -29 -100 -96 265 -61 50
4737 50 -55 -15 57 69 -8 -132 65 -35 -76 159 70 19 152 -154 -66 -40 24 -32 -119 59 -121 -35 -31 128 38 -200
4763 -200 86 31 94 43 123 57 -128 -17 22 -121 83 -233 44 111 -10 135 29 34 25 4 -103 43 -58 3
4787 3 82 -51 75 88 -67 158 -53 66 -31 -195 -26 32 60 18 18 -77 201 -178 132 117 39 -120 -36 -97 -57
4812 -57 211 -39 -4 -140 -69 96 91 -93 -39 -71 -217 -51 26 43 50 -89 -84 -101 73 85 182 58 34 -100 167 87
4838 87 76 -129 98 -104 -120 -21 -124 -108 103 102 111 -162 111 58 -127 -40 114 -69 114 -87 -149 6 83 37 -19
4863 -19 -138 -38 -165 -105 -15 -84 88 -45 52 -29 134 -11 -240 -13 -75 178 -99 -1 202 -44 -139 -95 -14 72
4887 72 -117 25 -32 20 57 197 106 37 90 128 127 -9 176 -15 -225 -18 195 -21 8 24 23 -41 144 -40 -158
$$ packed form
4710D4m9j44J26Q5KL1j28O9Mj98JK44j04RN6kr4J49j90J21j6m5p1ML61l26J11
4737E0j05M0P2J2p7j24J97j00m1K35q9n1J33l06Q8K6O4n6q7J78j80Q6MJ59r0k38
4763b00K86n5O3n1Q0o6j85J11L9j43K04l16K77O7j21J45j06Nrk1j07J46j01O1
4787CP9j33J26J3j55K25k11J19r7j64J69N8K8m2%r5K78l79L10j5p8j59Q4o1M0
4812e7K68k50L5j36P1J65nj84N4l2j46J66P7J7Pj39Nj7J74J2R7j24k4j34K67q0
4838H7j1k05K27k02j6R9j03J6K11jRk73K73n3j85Q7J54j83J83k01o2J55P7m6n6
4863a9j19J00j27O0R0o9J72j33R7q1J63j45k29K27o2K53k77R8K03k46r5M4Q1Q6
4887G2j89J42n7N2L7J40r1o9N3L8jj36J85j91k10K07K13k16K9J6jo4J85j84j18
$$ plain form
4912 -158 -102 21 -10 212 2 57 -133 -61 -59 27 11 -23 157 191 35 -121 67 -74 116 -182 -25 -181 -70
4935 -70 61 -109 116 145 144 -49 233 188 -69 111 20 76 91 -68 3 64 -60 223 -11 78 122 -140 -198 145
4959 145 124 33 -71 -110 -203 -132 40 150 110 -36 -167 163 49 88 136 139 95 -77 -21 18 3 4 38 -46 -67 72
4985 72 -22 -83 -113 20 -48 183 -26 75 145 72 213 -111 -51 -78 17 -4 4 -29 3 -79 -29 -27 -163 31 62 80 -159
5012 -159 58 124 145 67 -166 -44 -131 68 9 154 -77 -138 -193 -82 92 94 38 -92 194 -51 -74 -101 -4 28 87
5037 87 178 132 170 0 -36 -29 -81 26 -116 -96 67 -34 -78 52 54 -71 -111 70 -14 43 -178 106 -100 63 107
5062 107 -118 22 -73 114 65 168 81 -44 34 3 71 77 -165 -81 205 72 -67 -118 4 -181 -67 -21 -98 3
5086 3 -153 -87 22 -179 -41 -66 54 -25 122 -70 7 -18 -98 40 -90 2 -47 171 24 114 -72 88 -16 -113
$$ packed form
4912a58N6J23l1K22k10N5j90P2KQ6j6l4J80L4j56j56J88j41J90k98J57j56J11
4935g0J31j70K25K9jj93K82m5k57J80r1N6J5j59P1O1j24K83k34Q9M4k62n8L43
4959A45k1r1j04l9r3P1J72J10m0j46j31L30j14L9M8Lm4j72N6L9j5JL4q4k1J39
4985G2r4o1l0J33o8K31k09J01P0p3J41l24O0k7R5k1Ql3L2q2N0Kj36J94L1J8k39
5012a59K17O6K1p8k33J22q7J99n9J45k31o1n5J11J74Kn6j30K86k45k3k7R7L2N9
5037H7R1m6L8j70l6Pn2J07j42K0J63j01m4J30Kj25m0J81q4N7k21K84k06J63M4
5062A07k25J40r5J87m9J03q7j25P8l1O8Ok42Q4K86j33j39n1J22j85J14M6p7J01
5086Cj56O6J09k01J38k5J20p9J47j92P7k5q0J38j30R2m9K18j47R0j86J60j04r7
$$ plain form
5110 -113 -186 -30 111 -47 -28 -118 -10 42 -210 43 -30 -83 111 -42 -78 -13 -195 -197 -154 -152 62 20 74 -163 -64
5135 -64 -38 157 -66 -7 105 139 8 -138 34 -15 -72 -62 180 73 139 11 -9 -92 186 -31 8 -50 -100 48
5159 48 -232 -174 -120 -163 -7 21 53 -17 -70 34 -197 17 26 16 -36 0 -74 -44 -36 -106 -47 -59 -10 12 55 172 -12 41
5187 41 304 10 57 98 -39 33 -22 -99 83 -73 -60 95 104 -94 -48 123 229 66 -132 -98 -133 -177 18 -165
5211 -165 -59 -75 -126 109 -13 -123 59 -30 -109 -88 101 -43 -167 -154 -98 -44 -54 -38 -19 -182 39 190 -67 31
5235 31 -145 -42 -82 -12 -10 11 -33 89 -45 -87 176 -88 -140 30 0 63 4 47 -17 -13 -1 -15 59 -31 -131 17 41
5262 41 -151 79 132 41 105 131 -21 -55 -89 79 16 -127 -117 116 -110 15 39 118 108 47 -7 11 233 131 -2
5287 -2 11 224 -118 69 -88 -47 54 -93 94 49 -134 -27 136 -162 -9 -59 -11 -50 29 99 -46 4 -189 -34
$$ packed form
5110a13p3J56J41j58J9r0J08N2k52K53p3n3J94j53l6O5j82kM3KK14m2N4k37R9
5135f4K6J95k23N9J12L4j31j46J72m9n7J0K42j07O6j28k0q3K78k17L9n8n0J48
5159D8k80N8N4m3J56K8L2p0n3J04k31K14Rj0n2L6p4L0Qp0N9j2M9K2M3J17j84N3
5187D1K63k94M7M1j37P2n5p7J82j56J3J55Rj98M6J71J06j63j98L4l5m4J95j83
5211a65J06j6n1K35j22j10J82q9p9K1J89j44j24J3N6N4j0J6J9j63K21J51k57R8
5235C1j76J03m0P0KK1m4J22j34m2K63k64n2J70l0O3n9M3o4MJ2j4P4r0j00J48K4
5262D1j92K30N3r1O4K6j52l4l4J68o3j43J0K33k26J25K4P9j0o1n4J8K22j02j33
5287bJ3K13l42J87j57M1J01j47J87m5j83J07J63k98J53n0M8l9P9P0j45N0j93J55
$$ plain form
5311 -34 -288 -50 151 29 220 96 92 24 -14 102 -34 -40 -50 71 -149 -55 149 113 18 -11 -28 -112 38 190 40
5336 40 13 178 -140 -42 3 80 -83 36 148 16 26 -60 -49 27 10 64 -26 57 69 18 -43 -152 6 114 -64
5361 -64 -158 130 -67 -157 -72 -63 -80 -202 -70 36 -152 1 57 -81 -111 -20 -110 141 -143 -36 -106 92 9 -61 67
5386 67 -11 -29 -28 182 -169 -2 -15 85 6 129 36 70 113 32 -7 102 193 -3 -150 -63 252 -182 68 20 122
5411 122 18 3 -143 -17 -165 74 23 -7 26 -35 242 -198 165 82 93 -125 -77 23 -145 -8 -232 -127 83
5434 83 -53 -36 70 -78 24 -115 -158 69 -112 -26 65 270 20 45 153 -87 179 -11 102 -47 38 50 191
5457 191 8 -75 3 -28 63 -184 -81 -16 19 -26 34 -80 123 34 40 76 65 -153 95 48 -31 94 -142 -112 -29 201
5483 201 -64 147 -146 29 7 -38 7 101 69 31 -54 -93 97 39 -46 -63 -29 40 147 -53 67 36 45 33 25 86 -18
$$ packed form
5311c4k54K38K01j22J91j24mo8l8J16j36oj0J21k20R4K04l6r5k9j7q4J50J52j50
5336D0k7J65l18R8M5P7j63J19J12j32J0q6J1P6j7N4r0Q3J2n1o1j09J58J08j78
5361f4r4K88j97r0Q5Rj7j22J32J06j88J53N6j38l0R1r0K51k84J07p0J98q3p0J28
5386F7p8j8JK10l51J67j3J00p9J23r3L4M3q1l9J09R1j96j47Q7L15m34K50m8J02
5411A22j04j5j46J26j48K39n1l0L3o1K77m40L63q3J1k18M8J00j68J37k24J05K10
5434H3j36J7J06j48J02j39m3K27j81Q6R1K05k50K5J08k40K66j90J13j49Q5J2J41
5457A91j83q3P8l1R1k47J03O5L5m5O0j14K03q9OL6j1k18K48m7p9J25k36L0Q3K30
5483B01k65K11k93J75k2m5M5R4l2l8q5l9J90n8q5j7L4O9J07k00J20l1Rj2qO1j04
$$ plain form
5510 -18 46 -121 -117 -242 -114 115 -66 2 137 -132 -56 -6 -123 118 73 89 122 108 -116 114 -111 40 49 -264
5534 -264 -2 -49 -76 -111 78 -109 -337 -49 157 200 -113 94 48 -78 45 136 30 22 -60 11 -46 64 -162 23
5558 23 55 -18 47 -168 -19 -99 16 -66 -6 -10 206 128 -55 -105 16 -68 -8 5 123 28 199 -58 -70 -100 -206 -50
5584 -50 45 94 76 -127 -88 -130 57 -79 -20 70 101 -67 22 20 171 57 75 54 60 -96 -232 31 -59 10 127 162
5610 162 144 -101 103 -129 -58 -173 -29 -66 -48 148 -18 6 -36 54 -230 -183 -33 -5 51 -122 99 -129 -43 11
5634 11 140 79 34 3 -12 -13 -41 -139 -64 111 38 -274 203 5 134 -143 77 -39 92 99 176 102 72 -33 -148
5659 -148 -61 -78 -3 17 -21 -122 -13 -38 -229 -68 0 -89 -66 19 -32 -41 42 6 54 -10 -78 -62 90 -2 10 126 -9
5686 -9 104 -6 -67 86 -92 -21 42 29 79 114 52 -176 21 281 37 107 31 85 -38 -60 13 31 29 -117 63 221
$$ packed form
5510a8O4j67Mj25J28K29j81O8J35k69P6N0j17K41m5J6L3j4k24K30k25J51Rl13
5534b64K62m7k7l5J89j87k28K88K06M3l13K07m6j26J23R1j06qq2P1n7J10k26J85
5558B3L2p3O5k15J49q0J15q2O0mK16p8j83n0J21q4O0J3J18r5J71k57j2l0j06J56
5584e0R5M9j8k03L9m2J87j36N9R0L1j68Q9kJ51j14J8k1Oj56j36K63r0O9J17L5
5610A62j8k45K04k32P1j15J44l7J8J96j66K4m2R0k84M7J50K8N6j73K21k28Q6N4
5634A1J29o1m5l1j5jk8r8P5J75p3l12M77j98J29k77K20j16J31PP7p4l0j05j15
5659a48Q7j7P5K0l8j01J09k5j91J61O8q9K3Q5n1rQ3l6M8o4o8J6J52r2J2J16j35
5686iJ13j10o1J53j78P1O3j3N0L5o2k28J97K60k44P0p6N4j23k2P3J8kj46J80J58
$$ plain form
5712 221 -87 35 25 264 122 -108 28 -197 49 50 52 0 52 -38 -47 25 -100 -5 0 -221 -24 76 -6 214 -131
5737 -131 -97 -53 -16 -122 45 49 -119 139 -125 -74 91 161 -32 -5 29 202 -41 96 12 79 90 38 -39 83 -105
5762 -105 -91 138 -170 -36 -65 97 -124 128 -37 -10 53 168 88 74 -22 -92 -1 -38 -8 11 -106 -29 70 -19 22
5787 22 -15 66 126 124 -26 -82 -5 -11 -245 -70 -113 -87 -41 -102 43 146 -47 98 74 23 76 105 -8 -77 -110 -31 -62
5814 -62 63 -35 0 63 7 -55 -64 100 71 -120 -79 2 -76 26 -79 -16 -17 -38 7 -25 27 37 74 -47 -15 104 47 82
5842 82 -56 -47 -36 39 130 37 -147 93 74 -88 -100 68 -71 12 120 -79 -28 77 132 -49 -152 213 -28 -51
5866 -51 -16 -117 -97 -66 -83 101 -57 -55 -17 -53 47 -116 -93 13 -11 9 -87 24 77 136 -73 25 81 41 -91 63
5892 63 40 7 -36 45 28 -83 75 -34 -9 76 228 364 101 -1 210 195 -104 79 60 -25 -90 -116 132 -52
$$ packed form
5712B21l08J22j0K39j42k30J36k25K46JKn2N2r0rP2j25R5Nk21J97J00q2K20l45
5737a31L4M4L7j06J67Mj68K58k64N1J65P0j93K7L4J73k43J37q4O7J1n2p7J22j88
5762a05J4K29l08J34k9J62k21K52j65K7O3J15q0j4r6p0R1l7L0J9j17P7R9q9M1
5787B2l7Q1O0kj50n6P7ok34J75m3K6M6o1J45J03j93J45k4n1N3K9j13o9l3P9l1
5814f2J25r8L5O3n6o2rJ64k9j91M1Q1p8J02j05O3jk1M5l2N2J0L7j21L2J19n7L5
5842H2j38RJ1P5R1r3j84K40j9j62j2J68j39Q3J08j99N1J05N5j81j03L65k41k3
5866e1L5j01K0L1j7J84j58KL8l6J00j63K3J06k4K0r6J11N3N9k09R8N6m0j32J54
5892F3k3l3m3Q1j7j11J58j09K5Q5J52J36k63j02K11j5k99J83j9q5o5k6K48j84
$$ plain form
5916 -52 -71 49 -58 72 -184 -87 16 -191 52 -2 47 -68 -258 -107 106 32 -106 95 28 26 -191 16 -7
5939 -7 30 -161 -92 -68 82 6 -113 -77 -209 -54 -65 36 -24 92 14 -54 -149 -129 -68 -148 38 -121 71 -26 -233
5964 -233 238 -15 -47 -65 -112 -261 31 47 -97 217 21 146 -33 -25 -46 -47 7 -184 -29 -30 97 -4 30 -21 110
5989 110 -36 185 -19 30 127 -73 -99 212 59 -24 -78 141 -67 -105 34 4 32 103 68 -36 -132 -30 71 -18
6013 -18 0 -164 -4 -64 50 -91 -49 -147 23 -106 -189 -107 -250 213 -41 -175 58 45 26 -87 -50 147 -10
6036 -10 -113 103 -94 6 -60 -68 -124 89 40 72 229 75 -70 -33 -44 180 -24 -77 -38 24 -22 121 4 -91 36
6061 36 -31 -55 196 145 -141 1 136 72 -225 141 15 91 -90 133 -16 110 -151 2 3 77 25 10 152 43
6085 43 -92 -40 -14 13 -136 -42 34 -97 59 23 29 -68 -140 88 17 -48 23 -73 6 -110 -18 46 34 120 -71 44 -92
$$ packed form
5916e2j9J20j07J30k56R7J03k07K43n4M9j15j90J51K13p4j38K01o7kk17K07k3
5939gL7j91O9K4J50p6j19L6j32J55j1J01o0J16p8o8r5K0O1q0J86j59J92r7k07
5964b33M71k53l2j8m7j49K92J6j44L14j96J25j79Qk1jN4j91J55jJ27j01L4n1J31
5989A10j46K21k04M9R7k00k6L11j53q3n4K19k08l8J39l0K8P1l5j04r6J02J01q9
6013a8J8j64J60o0J14j41M2r8J70j29q3Q2j43M63k54j34K33j3j9j13L7J97j57
6036a0j03K16j97J00o6qn6K13m9L2J57j54j45L7j1K24k04n3L9O2m6J43j17r5J27
6061C6o7k4K51n1k86J42J35o4k97L66j26P6j81K23j49J26k61J53JP4n2j5J42j09
6085D3j35N2K6K7j49R4P6j31J56l6Or7p2K28p1o5P1r6P9j16R2O4j2Q6j91J15j36
$$ plain form
6112 -92 -78 167 120 -21 1 49 -20 39 -40 86 -110 -120 22 -68 -19 -83 -94 20 -15 -3 39 41 -47 40 -76 138 79
6139 79 -173 -146 43 27 -137 -128 -179 108 3 -101 76 -37 7 -68 65 -68 16 43 3 -120 2 99 29 101 90
6164 90 228 -30 80 61 -50 199 -29 32 30 -71 -173 140 -25 -75 -72 -65 45 46 -42 51 136 69 -146 -4 2 148
6190 148 111 165 86 -189 -138 -117 11 -214 103 -34 14 -85 81 -38 -137 76 36 0 -116 -42 -4 50 110 70 -141
6215 -141 37 46 -42 -174 113 58 -230 51 42 103 -78 -62 80 -87 -118 120 114 -69 -28 -59 67 -280 -147 -102 -144
6240 -144 21 83 3 14 6 39 -15 -39 19 55 -153 -71 63 80 -71 136 107 -69 -139 189 -97 23 -139 -58 -130
6265 -130 -157 76 -64 -102 -117 -11 -77 -129 151 103 -26 56 70 -92 -155 78 234 -24 -12 6 -52 -49 -75 -93 -17 48
6291 48 -10 -108 44 13 48 -62 26 -141 -126 -46 107 -51 -58 -1 -73 -104 113 -104 125 23 -58 -100 70 62 46 64
$$ packed form
6112i2J4K45m7j41K2M8o9N9p9J26j96j0J42r0M9o4j1J14l5J2M2Kq8Q7j16K14n9
6139G9k52K7J89j6j64Rn1K87j05j04J77j13M4p5J33j33Q4K7m0j23J22R7p0P2j1
6164I0J38k58J10j9j11K49k28O1kj01j02L13j65n0LPJ10Jq8R3Q5o7k15J42OJ46
6190A48l7N4p9k75N1K1J28k25L17j37M8r9J66j19r9K13m0l6j16P4L8N4O0m0k11
6215a41J78Rq8j32K87n5k88K81rO1j81J6J42j67l1K38oj83M1l1J26l47J33M5m2
6240a44J65O2q0J1qL3n4k4N8L6k08Q2J34J7j51K07k9j76p0L28k86J20j62Q1p2
6265a30k7K33j40l8j5J06o6n2K80m8j29Q2J4j62o3K33J56k58J2J8n8Lk6j8P6O5
6291D8n8r8J52l1L5j10Q8j67J5Q0J53j58pN7p2l1K17k17K29j02q1m2J70qj6J8
$$ plain form
6317 64 39 -7 180 -27 81 -17 -135 -58 46 22 -112 -26 30 -23 11 199 -98 -72 -34 56 -70 -17 -72 -40 44 -131
6343 -131 23 -18 -231 105 -48 -105 -75 -66 114 -52 46 -58 89 -6 -148 119 -2 45 -16 154 -123 -131 105 -15
6367 -15 79 34 43 -8 31 -40 8 -162 -60 -1 -187 151 61 -65 43 -86 29 5 -36 -106 -128 -38 72 17 -142 -97
6393 -97 21 40 196 -148 148 3 -38 40 -30 -10 268 -28 10 147 86 -189 -92 -69 1 135 -89 5 -135 72
6417 72 132 -41 11 64 -6 47 93 105 28 55 26 49 93 -142 -160 110 36 -13 -11 54 89 29 -21 -55 -130 44 47 34 66
6446 66 -80 160 -9 35 -86 -185 143 -110 -152 163 -68 132 -103 -120 188 12 124 -28 -32 -47 58 72 -18
6469 -18 -15 83 -82 194 -78 159 -4 9 -301 48 -51 151 77 -58 -16 -129 -55 -73 120 132 -102 60 90 -111
6493 -111 0 -57 -127 105 -24 -55 1 -86 36 42 -3 -75 16 86 -66 86 93 73 69 120 55 118 21 198 -107 4 -43
$$ packed form
6317F4k5m6J87k07J08r8j18P7J04k4j34Q6N6n3L4J88k97K6L8R0j26N3n5L2Q4j75
6343a31J54m1k13L36j53n7L0RJ80j66R8j04J47r5j42K67j21M7o1J70k77qK36j20
6367a5R4m5Rn1L9p1M8j70J02N9j86L38r0j26J08j29J15k4m1p0k2R0J10n5j59M5
6393i7J18J9J56l44K96j45m1P8p0K0K78k96L8J37o1k75R7K3P0J34k24R4j40K07
6417G2O0j73N2N3p0N3M6J2p7K7k9K3M4k35j8K70p4m9KO5L5o0n0l4p5J74Lj3L2
6446F6j46K40j69M4j21r9L28k53m2L15k31K00k35j7L08j76J12j52mj5J05J4r0
6469a8LR8j65K76k72K37j63J3l10L49r9K02p4j35M2j13P4j8J93J2k34J62L0k01
6493a11J11n7p0K32j29l1N6q7J22Om5p2R1P0j52J52Pk0mN1o5O3r7J77l05J11m7
$$ plain form
6520 -43 -184 35 -256 10 28 -52 -169 52 66 23 35 89 -67 -63 -108 -82 -114 -91 -37 -123 -81 25 -186 -31 4 -137
6546 -137 39 -68 -9 -10 -48 -87 -33 43 136 -4 -10 105 -36 -3 -142 11 -66 178 4 -41 -52 214 -35 146 -77
6571 -77 -150 55 67 -40 131 -283 250 -10 17 -67 -86 -145 -228 -104 -55 -31 32 92 -18 -107 74 161 -133 -167 -153
6596 -153 -26 -79 -191 39 -6 28 -121 63 -162 -101 -27 129 -55 -117 21 12 -178 -26 101 59 201 146 24
6619 24 3 -91 -58 -95 -29 11 -5 -16 47 40 81 169 125 -17 1 -61 50 -53 -73 44 -70 -230 123 -185 150 76
6645 76 40 -20 112 -74 -174 32 94 -90 82 117 -83 74 -7 82 92 26 -37 81 94 43 -139 -78 -5 -55 16
6670 16 148 -77 21 167 -104 75 -86 -164 -173 -117 45 84 74 -61 4 40 69 36 5 -3 -123 94 104 -94 16
6695 16 50 65 -141 -38 25 -71 -73 -148 -15 39 -129 152 31 -20 -61 -87 -95 49 19 -173 85 -80 -58 -3 -21 -20 -40
$$ packed form
6520d3j41K19k91K66J8q0j17K21J4m3J2N4j56Mm5K6l2K3N4q6M2J06k11J55L5j41
6546a37J76j07N9jl8l9N4P6R3j40oJ15j41L3j39J53p7K44j74m5j1K66k49J81k23
6571g7p3K05J2j07J71m14N33k60K7q4j9n9q3J24M9K4O3O0j10q9J81Q7k94l4J4
6596a53J27n3j12K30m5L4j49J84k25O1P4J56j84o2J38rj90J52J27m2J42n5j22
6619B4k1r4L3l7O6M0j6j1O3pM1Q8m4j42J8o2J11j03k0J17j14j60L53l08L35p4
6645G6l6o0J32j86j00K06O2j84J72L5k00J57q1Q9J0o6o3J18J3n1j82O1P3n0P1
6670A6J32k25R8J46k71J79j61p8rN6J62L9j0j35O5L6K9l3l1qj20K17J0j98J10
6695A6L4J5k06J03O3r6kp5J33N4j68K81j21n1m1k6qJ44l0j92K58j65K2N5j8Jk0
$$ plain form
6722 -40 81 63 -141 -170 -63 137 120 -155 31 -17 15 -90 -79 34 160 38 -17 -90 -141 81 154 -122 -24 73
6746 73 73 -163 182 -150 -48 22 37 -163 -139 -88 -23 -119 -154 -197 9 -20 -92 -106 -117 153 -18 -67 -98 8 -63 29
6772 29 -22 49 -58 200 87 3 92 -45 99 123 -31 46 26 220 12 -126 -32 -28 147 196 -106 110 -4 -132
$$ packed form
6722d0J21j8k04k9J07K00j7k75J86m8L2j05J1J13J26j22n5p3n1K22P3k76R8R7
6746G3%k36L45l32J02P0J5k00K4N1O5r6l5m3K06k9p2j4j1K70j71m9l1J06p1R2
6772B9n1P1j07K58j13q4Q9j37J44K4j54P7k0J94k08j38R4MJ75M9l02K16j14j28
$$ [...]
8191A8
##END NTUPLES=NMR FID
##END=
