##TITLE=1H ikalashn
DE-54H
11.12.2024
##JCAMPDX= 6.0         $$ Bruker NMR JCAMP-DX V2.0
##DATA TYPE= NMR FID
##DATA CLASS= NTUPLES
##ORIGIN= UXNMR, Bruker Analytische Messtechnik GmbH
##OWNER= root
$$ TOPSPIN		Version 1.3
$$ 2024-12-11 16:18:58.234 +0400  Irina@DPX200
$$ Compression mode = diff/dup
##.OBSERVE FREQUENCY= 200.131300845
##.OBSERVE NUCLEUS= ^1H
##.DELAY= (6, 6)
##.ACQUISITION MODE= SIMULTANEOUS
##.ACQUISITION SCHEME= undefined
##.AVERAGES= 64
##.DIGITISER RES= 18
##SPECTROMETER/DATA SYSTEM= spect
##.PULSE SEQUENCE= zg
##.SOLVENT NAME= D2O
##.SHIFT REFERENCE= INTERNAL, D2O, 1, 17.49637
##AUDIT TRAIL= $$ (NUMBER, WHEN, WHO, WHERE, WHAT)
$$ ##TITLE= Audit trail, TOPSPIN		Version 1.3
$$ ##JCAMPDX= 5.01
$$ ##ORIGIN= Bruker BioSpin GmbH
$$ ##OWNER= Irina
$$ $$ F:/spectra/data/iren/nmr/1H/4/audita.txt
$$ ##AUDIT TRAIL=  $$ (NUMBER, WHEN, WHO, WHERE, VERSION, WHAT)
(   1,<2024-12-11 16:16:50.281 +0400>,<Irina>,<DPX200>,<TOPSPIN 1.3>,
      <created by zg
	started at 2024-12-11 16:12:37.453 +0400,
	POWCHK disabled, PULCHK disabled
       configuration hash MD5:
       BE 6D 3F 07 2A EA 11 49 91 17 2B D3 AF B3 58 0D
       data hash MD5: 16K
       47 CF 82 F1 D2 D0 F1 9B 2E 39 51 20 B4 75 B2 A8>)
$$ ##END=
$$ 
$$ $$ hash MD5
$$ $$ 25 4C B5 C1 5E 07 18 74 64 06 43 CE 96 6B 19 47
##$RELAX= 
##$RELAX= 
##$RELAX= 
##$RELAX= 
##$RELAX= 
##$RELAX= 
##$RELAX= 
##$RELAX= 
##$RELAX= 
$$ Bruker specific parameters
$$ --------------------------
##$DU= <F:/spectra>
##$EXPNO= 4
##$NAME= <1H>
##$PROCNO= 1
##$TYPE= <nmr>
##$USER= <iren>
##$AMP= (0..31)
100 100 100 100 100 100 100 100 100 100 100 100 100 100 100 100 100 100 
100 100 100 100 100 100 100 100 100 100 100 100 100 100 
##$ANAVPT= -1
##$AQSEQ= 0
##$AQ_mod= 1
##$AUNM= <au_zg>
##$AUTOPOS= <>
##$BF1= 200.13
##$BF2= 200.13
##$BF3= 200.13
##$BF4= 200.13
##$BF5= 200.13
##$BF6= 200.13
##$BF7= 200.13
##$BF8= 200.13
##$BYTORDA= 1
##$CFDGTYP= 0
##$CFRGTYP= 5
##$CHEMSTR= <none>
##$CNST= (0..63)
1 1 145 1 1 1 1 1 1 1 1 1 1 1 1 1 1 1 1 1 1 1 1 1 1 1 1 1 1 1 1 1 1 1 
1 1 1 1 1 1 1 1 1 1 1 1 1 1 1 1 1 1 1 1 1 1 1 1 1 1 1 1 1 1 
##$CPDPRG= <>
##$CPDPRG1= <>
##$CPDPRG2= <>
##$CPDPRG3= <>
##$CPDPRG4= <mlev>
##$CPDPRG5= <mlev>
##$CPDPRG6= <mlev>
##$CPDPRG7= <mlev>
##$CPDPRG8= <mlev>
##$CPDPRGB= <>
##$CPDPRGT= <>
##$D= (0..63)
0 2 0 0 0 0 0 0 0 0.06 0 0.03 0 0 0 0 0.0002 0 0 0 0 0 0 0 0 0 0 0 0 0 
0 0 0 0 0 0 0 0 0 0 0 0 0 0 0 0 0 0 0 0 0 0 0 0 0 0 0 0 0 0 0 0 0 0 
##$DATE= 1733919409
##$DBL= (0..7)
120 120 120 120 120 120 120 120 
##$DBP= (0..7)
150 150 150 150 150 150 150 150 
##$DBP07= 0
##$DBPNAM0= <>
##$DBPNAM1= <>
##$DBPNAM2= <>
##$DBPNAM3= <>
##$DBPNAM4= <>
##$DBPNAM5= <>
##$DBPNAM6= <>
##$DBPNAM7= <>
##$DBPOAL= (0..7)
0.5 0.5 0.5 0.5 0.5 0.5 0.5 0.5 
##$DBPOFFS= (0..7)
0 0 0 0 0 0 0 0 
##$DE= 6
##$DECBNUC= <off>
##$DECIM= 32
##$DECNUC= <off>
##$DECSTAT= 4
##$DIGMOD= 1
##$DIGTYP= 9
##$DL= (0..7)
0 120 120 120 120 120 120 120 
##$DP= (0..7)
150 150 150 150 150 150 150 150 
##$DP07= 0
##$DPNAME0= <>
$$ [...]
##$SW= 21.9926040160658
##$SWIBOX= (0..15)
0 0 2 0 0 0 0 0 0 0 0 0 0 0 0 0 
##$SW_h= 4401.40845070422
##$TD= 16384
##$TD0= 1
##$TE= 300
##$TE2= 300
##$TE3= 300
##$TEG= 300
##$TL= (0..7)
0 120 120 120 120 120 120 120 
##$TP= (0..7)
150 150 150 150 150 150 150 150 
##$TP07= 0
##$TPNAME0= <>
##$TPNAME1= <>
##$TPNAME2= <>
##$TPNAME3= <>
##$TPNAME4= <>
##$TPNAME5= <>
##$TPNAME6= <>
##$TPNAME7= <>
##$TPOAL= (0..7)
0.5 0.5 0.5 0.5 0.5 0.5 0.5 0.5 
##$TPOFFS= (0..7)
0 0 0 0 0 0 0 0 
##$TUNHIN= 0
##$TUNHOUT= 0
##$TUNXOUT= 0
##$USERA1= <user>
##$USERA2= <user>
##$USERA3= <user>
##$USERA4= <user>
##$USERA5= <user>
##$V9= 5
##$VALIST= <valist>
##$VCLIST= <CCCCCCCCCCCCCCC>
##$VD= 0
##$VDLIST= <DDDDDDDDDDDDDDD>
##$VPLIST= <PPPPPPPPPPPPPPP>
##$VTLIST= <TTTTTTTTTTTTTTT>
##$WBST= 1024
##$WBSW= 25
##$XGAIN= (0..3)
0 0 0 0 
##$XL= 0
##$YL= 0
##$YMAX_a= 1101588
##$YMIN_a= -1667499
##$ZGOPTNS= <>
##$ZL1= 120
##$ZL2= 120
##$ZL3= 120
##$ZL4= 120
##$ABSF1= 10
##$ABSF2= 0
##$ABSG= 5
##$ABSL= 3
##$ALPHA= 0
##$AQORDER= 0
##$ASSFAC= 0
##$ASSFACI= 0
##$ASSFACX= 0
##$ASSWID= 0
##$AUNMP= <proc_1d>
##$AXLEFT= 0
##$AXRIGHT= 0
##$AXTYPE= 0
##$AXUNIT= <>
##$AZFE= 0.1
##$AZFW= 0.1
##$BCFW= 1
##$BC_mod= 2
##$BYTORDP= 1
##$COROFFS= 0
##$CY= 7568.61572265625
##$DATMOD= 1
##$DC= 2
##$DFILT= <>
##$DTYPP= 0
##$F1P= 17.9538593292236
##$F2P= -4.03888763876832
##$FCOR= 0.5
##$FTSIZE= 32768
##$FT_mod= 4
##$GAMMA= 1
##$GB= 1
##$INTBC= 1
##$INTSCL= 1
##$ISEN= 128
##$LB= 0.02
##$LEV0= 0
##$LPBIN= 0
##$MAXI= 945.577
##$MC2= 0
##$MEAN= 0
##$ME_mod= 0
##$MI= -402.1523
##$NCOEF= 0
##$NC_proc= 0
##$NLEV= 6
##$NOISF1= 8.587773
##$NOISF2= 6.764455
##$NSP= 1
##$NTH_PI= 0
##$NZP= 0
##$OFFSET= 17.49637
##$PC= 1
##$PHC0= -25.12355
##$PHC1= -10.82497
##$PH_mod= 0
##$PKNL= yes
##$PPARMOD= 0
##$PPDIAG= 0
##$PPIPTYP= 0
##$PPMPNUM= 100
##$PPRESOL= 1
##$PSCAL= 0
##$PSIGN= 0
##$REVERSE= no
##$SF= 200.13
##$SI= 32768
##$SIGF1= 18.5376
##$SIGF2= -6.396296
##$SINO= 400
##$SIOLD= 32768
##$SREGLST= <1H.CDCl3>
##$SSB= 3
##$STSI= 0
##$STSR= 0
##$SW_p= 4401.40845070422
##$SYMM= 0
##$S_DEV= 0
##$TDeff= 0
##$TDoff= 0
##$TI= <>
##$TILT= no
##$TM1= 0
##$TM2= 0
##$TOPLEV= 0
##$USERP1= <user>
##$USERP2= <user>
##$USERP3= <user>
##$USERP4= <user>
##$USERP5= <user>
##$WDW= 1
##$XDIM= 8192
##$YMAX_p= 0
##$YMIN_p= 0
$$ End of Bruker specific parameters
$$ ---------------------------------
##NTUPLES= NMR FID
##VAR_NAME=  TIME,          FID/REAL,        FID/IMAG
##SYMBOL=    X,             R,               I
##VAR_TYPE=  INDEPENDENT,   DEPENDENT,       DEPENDENT
##VAR_FORM=  AFFN,          ASDF,            ASDF
##VAR_DIM=   8192,          8192,            8192
##UNITS=     SECONDS,       ARBITRARY UNITS, ARBITRARY UNITS
##FACTOR=    0.0002272,     1,               1
##FIRST=     0,             0,               0
##LAST=      1.8609952,     133,             194
##MIN=       0,             -1667499,        -1667499
##MAX=       1.8609952,     1101588,         1101588
$$ Real data points
##PAGE= N=1
##DATA TABLE= (X++(R..R)), XYDATA
0 0 0 0 0 0 0 0 0 0 0 0 0 0 0 64 -64 64 -64 64 -128 128 -128 192 -192 256 -320 321 -384 448 -531 638
30 638 -704 819 -898 1025 -1154 1336 -1473 1664 -1856 2071 -2308 2564 -2847 3155 -3489 3861
46 3861 -4252 4695 -5168 5701 -6277 6913 -7624 8409 -9293 10289 -11412 12713 -14213
59 -14213 15991 -18108 20714 -23984 28243 -34041 42430 -55751 80211 -140182 605394 404144
71 404144 -760051 -316125 -377641 -1015076 -1216155 -312232 236797 253682 479744 1049453
81 1049453 928530 362767 71758 -67779 -688428 -1127343 -788739 -244568 -182452 14360
91 14360 646238 949480 558713 353921 519474 182115 -726181 -1039568 -580201 -362699
101 -362699 -547774 -182437 685358 986049 590756 397739 473532 134531 -513867 -756067
111 -756067 -634692 -607314 -496814 -316 479095 578562 608527 712953 459991 -127520
121 -127520 -407159 -332920 -497115 -801300 -550853 107552 364997 255488 446026 780661
131 780661 566848 -14787 -255186 -241946 -475909 -724670 -506093 -86665 81834 217594
141 217594 561167 723066 443555 123704 7520 -219027 -584309 -637604 -357964 -202644
151 -202644 -153086 192512 634065 618944 301611 219871 220290 -153296 -613464 -589391 -283795
162 -283795 -213088 -213866 103148 478090 490399 337533 328637 243226 -118570 -429101 -430347 -364339
174 -364339 -381230 -228435 132892 351760 338239 366349 432372 248276 -105620 -275222 -285190
185 -285190 -399577 -489898 -261328 110638 259212 262899 376385 454398 249795 -58160 -186548
196 -186548 -232520 -367596 -434260 -264479 -20085 123539 247029 394256 406669 236224
206 236224 54498 -70212 -229037 -378155 -366031 -226367 -110942 2651 202744 373594
216 373594 360489 238725 143721 21472 -189608 -353511 -341847 -243626 -159569 -35541 158051
227 158051 300992 316469 268226 194684 49394 -139039 -263196 -297550 -287774 -215711 -52369
238 -52369 123735 223442 268517 292378 233590 69159 -98291 -189634 -247856 -292925 -246901
249 -246901 -89926 72079 169542 237878 283874 242189 107078 -38711 -145051 -228557 -274064
260 -274064 -233413 -121117 3176 117661 218385 266708 227996 132838 25246 -90938 -203834
271 -203834 -258016 -225969 -142724 -44016 69759 181772 241578 225749 155759 59919 -51689
282 -51689 -158917 -225254 -226648 -169370 -73083 37294 138088 207131 224111 177410 82984 -22897
294 -22897 -116041 -187429 -217491 -183546 -95316 5968 96900 171741 208322 183254 107545 15044
306 15044 -79217 -162047 -200419 -176120 -113500 -36599 56506 149829 194025 173550 120616 52582
318 52582 -41166 -136620 -182015 -167756 -128699 -69012 25781 125312 171188 162017 131946 79012
330 79012 -11913 -106283 -155072 -160665 -142798 -86994 6540 91765 134325 151527 150065 99529
342 99529 4032 -78734 -120881 -145726 -150585 -103194 -15498 58755 105967 144952 155112 104752
354 104752 21143 -43326 -90722 -137333 -154129 -108421 -32934 28523 81737 132504 146375 105148
366 105148 45144 -9062 -70198 -129921 -142825 -103610 -53178 -5285 59199 121288 135933 104519
378 104519 64152 16634 -51811 -113355 -127373 -104455 -74020 -27553 43698 103780 118765 105294
390 105294 82292 34150 -37194 -91850 -108528 -106206 -90576 -41417 31500 82654 100103 104182
402 104182 92973 46673 -20137 -69097 -92945 -105699 -95710 -48591 11940 54469 83051 105523
414 105523 99697 53762 -3705 -45514 -76888 -101124 -97246 -57801 -8624 33508 73185 101918
426 101918 95539 58437 15966 -23051 -65910 -98360 -95499 -61993 -22611 16835 59479 90650
438 90650 91098 65854 31556 -9599 -55129 -85156 -86800 -67597 -38672 2534 48267 79335 83646
451 83646 69196 43027 4508 -39863 -71830 -81048 -72043 -48104 -9829 33607 65146 77841
463 77841 73387 51404 15096 -26600 -59242 -75078 -72670 -53215 -20157 18536 52211 72231
475 72231 72794 55147 24912 -12432 -46700 -67954 -71061 -56061 -29408 6720 41104 62975 68132
488 68132 57929 34999 -883 -36268 -58794 -65582 -58782 -38571 -4538 31340 54704 62522 58947
501 58947 41044 8680 -25165 -48292 -60274 -60301 -43749 -12950 19576 43561 57769 59932 44962
514 44962 16824 -13774 -38825 -55792 -59630 -45331 -19349 7402 32763 52564 59257 46498
526 46498 23241 -2931 -29012 -49934 -56994 -47399 -27248 -2237 26228 47301 53256 45626 30444
539 30444 7501 -22414 -43592 -49583 -45146 -34793 -13200 18594 41107 47200 45520 37081 14758
552 14758 -17584 -37202 -42015 -43521 -39708 -18458 12752 32331 39436 45182 42637 20435 -9978
565 -9978 -28583 -37800 -46180 -42216 -18843 7452 20897 31778 45376 44158 21119 -2871 -16031
578 -16031 -29731 -47044 -45843 -21985 1813 14744 28633 43472 41697 21873 3179 -8509
590 -8509 -24508 -41361 -42043 -25742 -9010 5693 25415 41761 40319 25674 10619 -4766 -23720
603 -23720 -36689 -34494 -25821 -16351 -1237 20573 35581 35692 28523 19493 2571 -19705 -33914
616 -33914 -34688 -27941 -18424 -3018 15317 27971 31911 29810 21424 5993 -11740 -25622 -33556 -32583
630 -32583 -21498 -5058 9920 21943 31547 31962 21381 5885 -5641 -16867 -28849 -32506 -23688
643 -23688 -9674 2929 16263 28068 31558 23190 10988 -1037 -15544 -27097 -28555 -21637 -13789
656 -13789 -3610 12405 25595 27245 22412 16603 6088 -11652 -25305 -26764 -21692 -17270 -7552
669 -7552 10273 23495 24317 19647 18047 10370 -5954 -20118 -23509 -21955 -19013 -11018 4412 18108
683 18108 22941 22383 18520 9667 -2638 -13588 -19396 -21634 -20151 -11646 606 11511 18236 22849
697 22849 21638 13213 22 -11359 -17675 -20499 -19514 -13029 -2253 8555 15354 18723 19596 16234
711 16234 5612 -7732 -15931 -18190 -18921 -16565 -6789 7170 14952 15707 16566 16326 9211 -3321 -12534
726 -12534 -15214 -17141 -17925 -10800 2935 12124 15262 17205 17525 9318 -2134 -8726 -12046 -16731 -18417
741 -18417 -10173 135 6225 10378 17604 19550 10148 -257 -4751 -9929 -17325 -18238 -9491 -327 2591
756 2591 7958 16072 17811 11222 3897 -789 -7808 -16087 -16800 -10923 -5185 159 8271 14669 14477 10340
772 10340 7307 1719 -7136 -13725 -13859 -11609 -9244 -2966 7159 13279 12812 11569 9368 2672 -6780
787 -6780 -10531 -11114 -11758 -10665 -3747 4464 8729 10954 13290 11027 3208 -3947 -7122 -10791 -14035 -10380
803 -10380 -2256 2659 4714 9684 13845 10711 3273 -487 -3045 -9779 -14530 -10400 -3465 -611 2667
818 2667 9695 13521 9082 4017 2657 -1479 -9517 -12880 -8663 -5422 -4102 1068 9720 12016 7995
833 7995 5641 5780 -1022 -9629 -10388 -7014 -7075 -6289 630 8636 9388 6720 7881 6880 -271 -7963 -8118
850 -8118 -7320 -8825 -6912 448 6152 6674 6863 9308 7227 -490 -4826 -5483 -7494 -9823 -6773 438
866 438 3645 4729 7587 10263 6437 439 -1986 -3622 -7943 -9123 -5667 -971 1151 3345 8030
881 8030 9362 5341 2482 710 -3108 -8017 -8100 -4683 -2768 -1568 3022 7911 7411 4627 4109 2196
897 2196 -3378 -7366 -6672 -4604 -4726 -2167 2674 6878 5739 5457 5520 2569 -2896 -5421 -5021 -5850 -5751
914 -5751 -2784 2668 4926 4361 5655 6345 2643 -2209 -3648 -4058 -6213 -6788 -2524 1885 2626 3602 6357
931 6357 6321 2523 -716 -1870 -3626 -6442 -5703 -2575 4 758 3573 6301 5503 2518 570 -331 -3504
948 -3504 -6062 -5135 -3052 -1464 28 3647 5772 5048 3011 2065 353 -3459 -5006 -4451 -3514 -2641 -320
965 -320 3262 4686 3942 3680 2981 428 -2643 -4340 -4320 -3854 -3235 -217 2430 3294 3615 4100 3408 401
983 401 -1909 -2928 -3611 -4464 -2987 -1037 1140 2535 3432 4828 3508 698 -745 -1919 -3484 -3945
999 -3945 -3420 -1067 668 1747 3304 4167 3368 1270 -97 -1562 -3148 -4091 -2943 -1913 -193 1210
1015 1210 2830 3706 3011 1676 808 -735 -2931 -3477 -3150 -1973 -988 1369 2543 3119 2809 2241 1034
1032 1034 -903 -2232 -2753 -2910 -2177 -1214 230 1879 2642 2744 2388 1745 -308 -1657 -2906 -2437 -2895
1049 -2895 -1405 69 1273 2365 2560 2381 1344 -15 -961 -2101 -2416 -2736 -1750 -389 1187 1774 2516
1066 2516 2366 1365 786 -525 -1712 -2719 -2631 -1882 -1026 386 1500 2449 2361 1889 1104 -437 -1478 -1730
1084 -1730 -2190 -2207 -1132 -55 1304 1704 2258 1935 958 -7 -1095 -1746 -1918 -2017 -1358 85 462 1398 1983
1103 1983 1999 1343 233 -433 -1631 -2113 -2251 -1392 -419 447 1579 1531 1726 1540 619 -363 -1073 -1479 -2130
1122 -2130 -895 -471 633 909 1630 1782 1588 662 -178 -454 -1246 -1885 -1340 -819 -132 620 1426 1484 1469 943
1142 943 108 -570 -1198 -1186 -1633 -1040 -427 76 639 1535 1331 840 419 -168 -696 -1264 -1137 -801 -546 80
1162 80 697 1429 1357 1259 650 -143 -666 -1097 -997 -797 -361 368 -1 1031 1130 945 755 69 -905 -1029 -1004
1183 -1004 -684 -560 -501 279 784 967 998 777 419 -37 -932 -1084 -1091 -443 -597 267 1054 1172 1032 853 282
1204 282 115 -470 -626 -1047 -522 -425 -77 421 653 719 703 474 79 -413 -361 -853 -825 -596 -338 480 360 300
1226 300 930 747 379 -264 -281 -720 -227 -565 -180 -144 403 549 890 624 138 -292 -325 -530 -357 -494 -176
1247 -176 84 145 221 639 389 81 161 -223 -311 -643 -796 -504 -122 152 361 369 854 638 216 353 -74 -825
1269 -825 -674 -225 147 118 365 779 426 356 -155 122 -88 -235 -267 -417 -142 -127 170 432 247 517 11
1290 11 11 -458 -158 -875 -453 51 -190 -129 228 426 501 339 181 -153 -333 -222 -231 -408 -95 122 191 287 419
1313 419 332 135 24 153 -262 -192 -353 -160 271 -82 774 294 251 124 -154 158 -198 -511 -485 -140 169
1334 169 -336 310 136 134 340 359 -138 -149 -118 -198 -418 -473 74 202 -317 152 275 166 268 89 -291 114
1356 114 -222 -274 -310 318 428 94 193 -126 -345 100 -167 4 -339 -97 -16 -114 41 25 375 198 50 25
1378 25 176 -75 -210 -128 -188 -69 128 -121 298 234 132 172 -167 -12 -258 -10 -12 99 -27 26 451 -7 26
1401 26 -253 214 94 -137 -19 -32 27 -196 92 4 215 42 533 296 25 -205 -60 -204 -21 186 53
1422 53 -138 112 -33 174 109 207 186 86 -224 -123 254 139 342 367 195 53 175 -48 350 119 189 -135
1444 -135 -233 -91 -122 263 310 81 569 138 -187 280 -187 -86 -132 19 -242 79 -277 -118 298 320 145 104
1466 104 -223 -299 -35 35 -374 202 -400 126 41 277 184 -43 -390 -299 -250 -169 -54 -71 19 482 313 208 -215
1489 -215 -4 174 121 -115 -204 -45 -21 -74 176 60 396 94 -8 109 -95 -85 -368 -91 18 -367 12 106
1511 106 514 120 -138 546 230 54 -39 44 -126 65 -144 -14 98 211 -22 103 212 75 214 -176 -136
1532 -136 -237 74 -33 119 122 160 -45 374 -155 -161 -181 -153 -62 85 -136 -24 -223 54 238 30 120 199 132 -277
1556 -277 31 4 247 37 300 0 605 50 391 -16 -161 15 406 -217 -79 71 -60 177 127 -23 -236
1577 -236 48 -276 2 -155 -61 26 -92 -108 -123 -21 -245 147 227 -16 -343 159 235 -49 44 -205 -74 324
1599 324 -143 -142 95 -363 374 -43 -245 293 -352 51 33 305 214 292 1 -163 35 -547 -390 -85 -37 -140
1621 -140 -120 -20 -125 38 -91 -150 -307 -369 -171 16 159 -77 -188 84 14 425 178 57 62 -93 -6 -270
1643 -270 100 -224 -55 -94 125 -119 327 261 -289 -191 -118 -65 -118 -175 -99 11 207 55 70 88 22 -468 -220 -479
1667 -479 -57 231 576 100 169 101 16 140 -4 236 -190 -378 136 153 169 23 55 2 203 133 113 -169 -48
1690 -48 -310 109 9 389 283 248 213 252 177 254 -281 -30 -134 -154 -332 171 -62 -329 -82 -83 12 149 160 -10
1714 -10 41 -330 14 -303 -140 -7 -109 311 -4 54 110 -239 190 -134 110 -161 -55 2 106 -216 23 -321
1736 -321 -258 -67 -324 38 178 112 -91 4 177 -122 -95 309 -13 207 -638 55 -227 -299 -405 -184 -114 -174
1758 -174 33 249 -20 113 -102 -141 -214 -60 -216 -185 0 297 167 -69 -37 51 -146 -176 -5 31 -415 -263
1780 -263 -471 -215 12 -125 199 51 111 206 -15 -153 -223 -180 -245 -169 136 -255 43 -193 -5 -259 43 -186
1802 -186 -73 172 -280 -36 -97 529 -142 179 -17 -160 170 -143 83 -32 390 -187 404 419 246 350 283
1823 283 -183 -200 309 -415 -3 -120 -23 -35 69 94 470 49 162 151 399 -83 -107 12 -270 -342 -132 229
1845 229 239 231 -242 92 269 -148 -128 38 119 69 -4 147 315 -280 -82 247 71 -160 179 -10 -165 179
1867 179 -386 -129 -57 17 -55 53 -188 -192 -112 -111 -199 34 198 216 406 374 185 13 -111 -202 287 131 -493 -59
1891 -59 -17 -260 163 52 -324 -114 -14 -361 -273 -61 -451 285 91 -25 185 -229 441 67 1 -28 -182 107
1913 107 -460 34 -160 -445 -102 34 -85 -12 -13 124 -74 49 185 63 40 14 -38 -258 383 -229 232 174
1935 174 141 -52 -1 -63 61 22 -15 -367 238 -117 115 -218 63 -178 6 119 -48 -171 -264 -244 -40 -10 224
1958 224 -111 176 -8 232 -197 -235 -17 104 177 254 -48 236 68 -109 -21 -308 -314 -133 -383 -286 -45 -36 414
1981 414 -237 285 -191 -245 436 189 -213 -70 -193 64 33 57 23 -153 -188 -133 78 -241 -81 -182 35 40 -80
2004 -80 -132 180 -217 140 -116 61 -269 204 123 -234 46 115 28 98 305 55 352 -142 90 33 -166 -15
2026 -15 -165 353 125 221 -99 73 101 48 -185 146 -223 -250 -89 172 -353 -255 -4 -193 -45 106 118 -135
2048 -135 -20 37 90 -269 110 373 13 56 116 111 346 -275 -209 -205 -26 -291 141 -29 -98 256 -279 -135 92
2071 92 275 -290 -89 123 210 164 -124 -124 -126 -58 -108 -18 -11 -163 35 86 -67 -89 138 -278 -524 -26 281 25 -44
2096 -44 83 -223 -94 -278 40 -371 -65 -127 -115 250 316 78 -406 170 -180 -296 379 447 -149 -34 194 -323
2118 -323 15 265 -247 -78 26 -66 -448 167 -56 -279 215 -50 241 -51 -149 -8 112 27 157 -176 24
2139 24 30 -55 69 -87 185 75 57 -196 -90 222 105 80 18 31 132 -212 -307 264 -32 61 -38 -166 69 -37
2163 -37 -104 19 28 -37 337 79 307 279 334 493 -366 84 -357 -22 394 108 -198 124 239 109 -263 -210 14
2186 14 -26 -39 -50 156 -200 252 186 3 19 20 38 -356 -311 300 -114 -97 -35 -9 -145 357 -143 -266 -218 -178 148
2211 148 100 28 288 -141 75 -39 -39 436 -107 -84 -113 -69 -54 269 176 301 3 60 179 -510 -84 -177 -358 8
2235 8 -273 157 80 -126 -145 -230 -207 -73 -57 -502 51 216 244 15 -215 -216 118 -266 22 202 -132 369 67
2258 67 2 219 16 120 29 150 -360 115 167 -184 -231 176 85 -136 -135 -107 -371 277 -278 59 187 28 -541
2281 -541 129 45 -147 378 16 219 29 80 -115 -85 257 -169 -100 -53 -135 586 -52 -272 275 -42 41 -126
2303 -126 -96 -194 179 -141 38 -129 124 223 -35 -27 192 316 22 -289 -139 -158 236 170 -77 -15 -9 84 14 -55
2327 -55 -316 -18 -230 -146 -164 -248 -252 -41 87 486 146 -145 119 -244 -61 -230 144 171 50 21 -363 -77 25
2350 25 -192 5 -96 122 152 -240 -161 116 89 -34 -208 58 250 -372 345 119 597 -200 125 60 119 51
2372 51 -287 16 105 77 469 70 21 -224 -28 -85 -54 269 -34 -151 9 114 172 42 -173 151 -1 -197
2394 -197 -126 208 -246 -299 288 47 -181 -140 128 240 -245 -66 -99 -61 -85 -137 -11 -168 134 184 -21 32 -73
2417 -73 -29 59 -22 113 308 232 230 -182 -21 15 -31 -67 -12 275 40 40 -3 -118 -122 95 -26 27 78 -408 6 25
2443 25 33 -43 -10 45 93 -256 -31 364 -103 416 -1 -29 147 -30 43 263 -73 30 -137 104 87 169 1 -60
2467 -60 474 259 227 238 -136 259 343 156 -239 237 246 -189 -173 -186 81 194 207 -106 -6 -134 117 74 164 -324
2491 -324 -155 99 56 47 62 -210 105 -61 26 -103 94 112 19 117 -194 -12 -134 103 -346 58 64 86 -48 344
2515 344 -104 43 312 155 -261 -79 -69 -307 245 -76 144 -132 123 -475 319 327 -166 409 -36 324 463
2536 463 -294 428 19 -73 159 -63 64 319 334 49 11 625 188 -41 307 -248 -115 -419 263 238 -230
2557 -230 -79 -65 10 -169 33 -238 162 9 -71 13 -222 159 10 -281 404 138 -68 -183 -52 -74 37 8
2579 8 -114 -107 -39 289 158 -93 -78 97 -158 -214 104 157 -259 -86 204 -218 -29 23 -357 179 -75 272 93
2602 93 210 184 -85 -191 -107 53 130 219 -19 99 203 14 -398 -155 -90 -350 87 98 -211 177 84 417 -143
2625 -143 0 -21 113 48 241 -127 -361 137 -169 7 558 -181 247 -3 -37 -81 -148 137 132 82 290 -33 89
2648 89 -195 4 -8 -63 -396 -81 258 -4 310 84 -191 22 48 -361 176 60 141 224 41 297 104 262
2670 262 256 101 -78 317 256 -110 -191 123 146 9 24 93 269 -158 96 -133 119 -51 -79 -80 165 -140 -230 119
2694 119 50 37 170 131 71 77 326 160 -293 -94 261 36 -23 382 -214 -38 -225 24 161 -174 83 466
2716 466 45 175 -138 -72 143 -155 -74 123 -16 28 93 169 -148 -129 -237 -34 -120 -264 1 -81 -273 -126 93
2739 93 -486 202 385 8 11 106 -22 -68 -152 292 -192 -163 390 -84 121 -74 98 -65 -166 360 95 -20
2761 -20 51 -187 -169 86 -96 -52 -61 -40 -294 -202 36 -256 -278 -308 58 9 281 -378 61 -114 -311 379 -158 -171
2785 -171 -126 125 233 -254 -247 -94 -151 47 -53 228 -259 -158 16 101 134 20 262 -298 271 124 147 153 382
2808 382 -272 -108 -200 -3 -155 99 150 -126 141 55 -78 -183 35 608 86 -14 -20 -104 16 -505 82 -294
2830 -294 -47 -8 121 -218 -262 0 74 -163 -54 -173 -440 80 16 88 74 -252 -23 -66 -169 19 -105 2
2852 2 -10 249 -10 72 -79 -180 148 -57 325 85 -264 -265 130 24 -10 286 179 49 -25 129 104 -463 45
2875 45 278 172 -145 39 86 94 166 -159 -287 -48 459 298 332 -13 109 -205 267 212 -76 -2 46 257 -37
2898 -37 325 375 17 -169 -153 -207 85 55 -15 -333 261 229 -124 172 -52 -87 87 56 137 -299 -357 -163 -79 -117
2922 -117 20 76 -324 -133 -249 185 1 378 2 126 82 -137 92 228 -244 -1 -185 -138 -122 -14 -174
2943 -174 143 -188 -130 136 -64 -410 54 94 344 -90 239 148 -82 -117 -105 -4 -17 341 -177 -105 37 -91
2965 -91 -158 -157 148 53 23 5 -51 166 361 -254 -185 -264 -319 40 183 75 -63 4 -4 -199 -356 -212 143 -25 -71
2990 -71 -220 -68 19 34 207 10 70 42 -44 12 -82 -52 -339 91 -146 0 42 -84 -6 -118 -262 28 415 171
3014 171 37 26 127 -179 -171 484 -366 96 -156 18 -163 172 514 -51 31 -267 188 8 -37 -25 -68 -207
3036 -207 -133 -86 161 -138 59 176 174 190 -70 154 50 89 361 -100 -137 -54 -95 116 349 -126 -114 -63 -551 260
3060 260 -48 -186 -229 85 107 -105 -256 22 -133 379 -346 53 72 119 -33 54 -32 -92 87 -163 -280 -49
3082 -49 -18 -230 -251 -74 -161 -14 -279 175 113 257 31 139 -150 44 44 -191 90 -214 -59 -232 -38 60 -107
3105 -107 -296 125 -239 58 503 42 -286 -133 139 -23 19 47 120 -99 -202 9 -89 343 -50 -150 299
3126 299 413 -210 197 -237 -266 98 244 -310 -114 276 -60 -156 -189 10 -174 -120 -224 -320 -226 -260 -241 180 -252
3149 -252 -197 -150 -153 -197 54 -10 -31 6 -147 115 141 30 -133 178 -41 190 31 173 -226 -16 20 65 -141 48
3173 48 450 94 -56 146 -151 -256 12 -85 -151 16 -1 -27 -283 -318 62 291 -68 122 -19 -290 202 6
3195 6 236 -159 -196 -7 -248 107 -210 -219 -139 126 -97 -53 -110 -204 266 -178 -205 -188 -27 54 -440 177 12 48
3219 48 249 128 57 176 -60 -152 148 20 3 102 184 252 68 -205 104 -212 46 -11 221 -142 -47 -225 -169
3242 -169 -149 176 -9 -234 -141 321 114 -190 70 -26 33 -252 -284 -261 129 106 -12 -359 302 -19 -129 130
3264 130 -107 -97 153 -34 -2 -54 49 54 159 -282 167 91 -147 221 -151 -227 -276 103 105 -116 -70 -316 87 -102
3288 -102 -25 78 -107 -46 -43 -123 154 -140 -149 -10 -239 142 -411 -47 -189 103 322 -114 -135 128 -58 149 37
3311 37 152 -240 -52 -137 -136 138 142 -57 132 120 -202 150 426 -49 394 158 92 198 120 163 449 -35 230
3334 230 -45 -33 116 135 204 329 -65 -13 -200 351 -165 -158 -70 54 20 -92 -185 205 -266 -182 159 44 316
3357 316 -184 136 -11 -188 -2 -25 132 61 -18 -76 -195 -84 -6 -230 55 111 15 -196 -76 209 198 350 -214
3380 -214 54 221 -168 -40 103 -324 -77 331 -145 -60 -15 27 285 -85 -26 71 -157 -212 20 -17 -174 377
3402 377 -13 -175 125 29 89 -308 139 190 -35 -44 97 -4 -119 355 -135 -182 -107 98 145 217 171 40 339
3425 339 -7 92 90 101 208 128 -255 98 -266 209 311 124 -94 -179 89 132 66 -283 250 36 -58 20 -133
3448 -133 195 -135 138 -367 101 20 -147 -209 187 106 336 312 -238 370 -250 -98 120 -174 28 -388 -31
3469 -31 247 165 -182 250 -296 -379 -135 -23 -90 -106 -109 -159 73 75 277 -425 76 -138 172 293 129 157 -4 -63
3493 -63 -135 -60 70 191 -311 340 189 27 -8 -431 160 -275 -48 -29 177 -294 -35 181 203 -6 239 55
3515 55 -479 -175 105 -33 -178 66 -45 -63 -47 191 -26 -186 -216 -98 -224 51 -297 368 -112 -99 93 -155
3537 -155 -266 -75 150 22 -128 -157 153 -15 16 147 -13 356 -101 192 98 380 -13 118 156 -180 136
3558 136 221 -205 -181 -15 -183 -8 241 -101 27 469 25 0 61 56 20 36 -91 71 7 -6 85 183 288 186
3582 186 103 -321 113 -314 69 233 -397 -150 257 -127 215 -189 28 202 -72 -22 123 -20 -431 158 14
3603 14 -166 -64 44 28 -432 472 -19 188 -285 -84 -52 132 -4 33 -416 -154 139 110 -47 203 54 -48
3625 -48 -48 69 145 174 81 -159 -168 99 -91 -527 49 -439 -112 -103 -250 -147 -163 -97 224 -178 24 -108 -397 149
3649 149 363 -57 117 26 -173 9 54 -191 -394 142 291 -20 240 -188 -150 56 21 295 29 85 -331 -168
3671 -168 -31 150 -54 -207 -186 -172 0 -174 -140 -360 -3 31 -74 156 -66 -175 -60 424 -9 40 124 114
3693 114 -155 344 270 233 16 197 -163 -389 167 -11 89 -76 -74 13 -154 215 118 -114 -347 292 -25 148
3715 148 153 60 140 143 93 -28 -147 -177 47 254 -43 -154 86 226 -243 -26 -35 1 -133 -214 185 -157 -229 55
3739 55 133 13 30 191 29 -23 115 500 -10 56 -80 -83 -218 216 10 -375 -222 91 114 -21 -36 168 -81
3762 -81 -143 -20 303 -391 -148 -262 -213 -236 -40 -34 -188 -347 -48 10 -247 307 128 157 237 -206 -69 127 78
3785 78 326 267 -76 47 -60 -21 -256 195 171 -306 176 205 -113 -12 -347 -128 72 -105 18 102 1 88
3807 88 82 -275 56 235 47 -275 94 24 -158 74 -80 -53 280 -262 -67 291 -730 -12 179 -269 -109
3828 -109 97 -181 -60 134 -13 44 -130 -128 302 63 -65 -28 -375 146 450 403 -182 -85 -207 -191 -210 -388 140
3851 140 45 160 24 128 -20 106 40 246 208 -72 253 204 107 -39 -244 -120 -155 75 -250 10 -264 153
3873 153 -165 -191 -152 -190 316 -233 263 56 171 90 -364 -4 44 -50 -25 -116 -259 24 -87 -87 -357 -55 119
3896 119 -77 130 -480 167 -511 -85 86 108 -47 -25 210 15 34 -99 65 -174 -248 -184 -182 -106 -127 -108 134
3919 134 -63 -100 49 189 129 -107 -104 -128 287 151 400 425 -154 133 -92 -179 123 240 -3 -144 -43 98
3941 98 227 134 -27 -332 126 263 69 310 -104 -131 186 70 11 108 -148 -26 -6 -160 186 -741 255 110
3963 110 223 274 -246 -128 -139 -14 -136 -105 -109 283 58 277 -99 17 -258 -408 68 -13 77 98 -172 63 316
3986 316 17 187 89 254 -190 -40 -54 143 58 11 -47 52 151 162 22 -594 -23 -19 -313 276 -143 -27 -75 219
4010 219 -10 -238 -76 94 -30 -40 179 266 93 -43 497 95 -106 -54 -112 174 -365 60 60 251 159 30
4032 30 273 -119 95 285 -253 -139 15 173 104 -48 -179 151 116 -114 126 165 -27 -112 -343 34 -219 55
4054 55 -44 300 217 80 57 -126 263 -311 78 -309 -89 214 -10 170 218 -89 -393 198 -194 -132 -134 -161 79
4077 79 3 -3 -201 -120 244 91 25 -38 -132 120 -31 43 12 -52 -173 293 20 55 -408 -219 82 15 28 250 -79
4102 -79 -192 -57 188 -195 -110 -206 68 52 82 172 95 -47 85 159 -188 -249 88 -282 205 76 -223 131 265
4125 265 281 -229 -119 -164 -325 -257 181 68 400 -67 -113 -164 137 -112 -27 119 19 -303 -334 -216 -83 33
4147 33 -150 -133 -48 359 232 163 25 335 106 -76 56 13 -137 148 -121 116 -39 15 181 -301 33 92
4169 92 -103 -6 69 -62 -226 163 97 -170 50 -78 -67 79 205 -27 -232 189 -246 246 4 163 435 17
4191 17 406 33 -50 -53 -48 113 -263 263 81 161 64 -154 -159 -7 -90 -189 -424 112 125 -576 -268 111 388 64
4215 64 211 -166 -37 58 44 -50 169 54 145 -128 -60 101 -35 122 412 -101 98 81 87 -12 -27 -95 -385 -12
4239 -12 8 -167 -40 -303 72 -66 600 -96 -183 70 -69 130 166 -23 -69 107 144 207 233 -300 -29 -189 221
4262 221 -210 223 413 -2 171 -33 -137 111 -173 -109 11 140 -136 171 62 77 133 -106 424 -336 19
4283 19 345 -79 56 -69 28 97 -387 -144 68 365 -3 86 282 94 195 182 56 -260 -232 13 48 102 16
4306 16 44 88 -216 197 166 -2 -198 175 242 180 113 -79 -175 33 -98 67 168 41 -57 49 -180 -218 -56
4329 -56 63 -65 73 15 -92 242 -101 -44 -53 -111 -28 -97 -104 36 -11 188 357 238 143 192 55 332 -166 127
4353 127 206 -358 128 129 -260 -74 -14 98 67 -230 -348 181 194 -131 -303 214 -319 3 325 149 21 32
4375 32 -90 2 526 363 -417 -133 -117 -8 -258 473 79 -42 -77 -60 534 -206 190 -69 129 114 105 276 -35
4398 -35 -107 39 -236 42 97 -186 81 150 -319 55 29 -335 150 256 -186 -208 51 80 16 105 174 12 -177
4421 -177 -354 226 39 16 358 5 208 133 -379 -86 -131 -106 -447 -91 184 -169 -23 -177 46 439 510 -192
4443 -192 -111 -1 -287 -92 -183 260 -184 24 9 289 -38 101 -100 -27 -163 110 22 300 -58 -37 -7 -136
4465 -136 404 -91 166 -185 -12 -103 -166 -70 -90 -27 -456 233 -60 -183 -129 -166 121 413 140 -202 -87 -165 42
4488 42 79 -57 -318 -122 -49 -167 149 -25 -27 103 247 -140 16 -1 -685 -167 97 -76 133 -45 262 -100
4510 -100 -149 419 34 -90 -68 -110 11 -245 84 -62 -133 -48 -9 -161 -118 454 62 -35 -336 72 -62 247 200
4533 200 103 12 -132 -254 52 188 -3 171 -122 -95 -202 103 -19 -120 32 96 -148 -175 -264 29 132 -157
4555 -157 236 -106 -306 94 -83 -218 -293 76 136 156 -47 26 101 97 -119 48 -83 -351 111 -61 3 -151 34
4578 34 -65 -317 -186 12 -243 -66 -49 230 -67 181 -190 144 -6 -99 119 145 -10 -55 -342 -219 -38 -125
4600 -125 174 105 58 -36 -19 63 -153 185 -242 -47 21 -182 -401 -158 -154 7 -281 -229 59 34 -7 -368 -99 -12
4624 -12 -5 370 460 57 40 -382 105 13 -29 -203 -12 153 168 48 -5 -282 -183 91 -37 -161 -72 -19 102 213
4648 213 46 -165 -109 85 289 217 -28 125 85 -94 -165 -216 17 119 -3 -31 -7 -82 95 73 99 134 -243 55
4672 55 255 173 -24 415 -146 1 -80 455 277 98 157 232 211 134 121 248 467 80 -217 137 119 53 -39 -72
4696 -72 -12 254 -34 28 -112 -164 -200 109 -232 -14 120 -242 -176 -343 -348 -87 -159 -30 37 18 53 550 48 32
4720 32 25 -102 -233 218 137 25 -400 -43 196 181 -87 129 -57 -138 154 -285 -114 -99 319 16 90 -41 140
4743 140 -392 365 -165 137 176 288 -13 305 -228 -71 270 -69 -314 60 462 152 -100 114 391 4
4763 4 175 -28 -66 -96 184 172 -248 203 -89 -123 377 399 225 -215 -202 -135 321 185 -144 42 64 -8 -47 -349
4787 -349 204 17 18 260 -304 44 -274 -86 -211 228 233 -144 -300 47 -182 143 265 -171 383 -42 79
4808 79 274 360 -270 64 -246 51 -263 -103 125 -13 14 -117 28 -234 351 -58 -301 185 -87 268 -128
4829 -128 87 235 -443 -198 202 142 -54 156 57 152 231 38 -52 -209 54 65 31 125 -283 -161 -188 -61 92
4852 92 -82 -25 -139 -24 -8 -80 -47 -8 165 -310 169 -231 -40 36 -141 22 158 -29 -240 -86 -341 -114
4874 -114 -5 -175 141 -36 -31 25 -287 -40 -34 -339 178 231 163 -215 153 20 140 -85 -26 -7 11 -92 183
4897 183 72 256 -27 562 -192 -4 19 137 -116 -278 -303 8 214 -120 77 -122 100 -355 48 -115 165
4918 165 -330 211 147 -43 425 275 11 -154 -362 -400 143 -257 256 -302 68 131 1 147 359 -13 -87
4939 -87 93 -8 121 -274 -108 230 -147 11 -90 -165 -241 -69 -69 25 35 -54 102 -118 49 -174 -244 -108 32
4962 32 -107 -7 -220 90 12 165 220 -205 246 -304 496 -232 158 140 59 127 3 -168 186 -178 -262 228
4984 228 228 -153 -18 -56 156 149 143 -171 -73 236 4 124 -185 155 -321 70 -37 121 -188 -11 121 -9 -21
5007 -21 -129 144 -284 -139 -127 -73 30 42 -42 -89 -139 -207 -91 295 -47 -248 -83 -121 138 -267 130 -95 131
5030 131 -143 113 -198 104 31 130 287 -172 -94 22 -155 143 90 66 403 74 -128 -47 186 -364 -23 66
5052 66 104 -285 -93 130 -60 -208 320 86 -18 29 -114 -254 189 -30 -193 58 -88 20 -229 -248 154
5073 154 -118 -81 54 52 381 -16 47 24 270 -42 57 428 269 252 -232 187 -100 29 -355 -113 -86 -149 34
5096 34 -164 -86 -87 -61 -43 42 -5 69 306 -83 340 59 184 308 33 247 190 122 105 -148 318 -211 -331 244
5120 244 -236 -190 -106 29 12 -186 -117 -188 -183 193 365 183 -47 -33 13 -2 281 123 99 182 -106 -137 65 273
5144 273 87 25 90 243 -167 142 -208 -223 -233 -40 79 -40 -33 -407 1 399 62 101 -245 -535 -200 246
5166 246 510 -213 -38 -23 -274 -228 41 37 37 8 218 175 299 -76 357 184 139 -317 -442 -239 -62 101 142
5189 142 52 -92 60 361 191 268 454 39 120 -80 -328 -26 501 -170 -102 367 -333 177 -23 43 59 24
5211 24 -257 -399 138 -222 48 -61 66 46 18 -318 -193 87 252 -18 33 -58 25 190 142 215 -46 -169 333
5234 333 -152 92 -1 -83 -212 94 7 323 76 180 -21 -6 27 33 -518 -46 101 106 28 -154 -26 202 144 -120
5258 -120 -195 -222 -114 -301 28 179 -22 -49 77 122 -80 -80 -175 42 133 118 29 -33 196 -138 8 80 -42 -247
5282 -247 86 54 308 247 434 -4 -8 -213 432 433 -28 -79 -34 -186 219 -86 -282 17 219 -25 -212 144 26
5305 26 -59 36 135 -125 -128 -311 32 -60 -16 -251 186 166 -81 -46 69 99 80 257 -140 108 -266 -141 -253 61
5329 61 -24 90 -96 -163 193 225 -177 -336 177 104 -215 358 158 261 -69 91 78 43 80 70 -87 -32 21 24
5353 24 -254 86 127 6 52 337 75 -274 16 244 -53 -33 -220 86 151 -64 96 -289 209 -194 -33 -197
5375 -197 -161 102 83 242 383 15 -103 -378 -24 85 166 -60 75 -35 300 7 -251 43 153 63 -365
5396 -365 -137 -87 -63 -197 -61 8 17 -222 44 233 46 -140 -394 -172 13 -277 -71 -42 -26 -40 -384 156 -256
5419 -256 -65 81 -26 -17 99 29 361 102 53 -221 8 -168 70 3 18 -261 -36 15 -146 -174 125 51 49 293
5443 293 -113 104 -51 208 -36 -92 -18 14 311 101 -310 76 -235 23 -109 91 -265 293 -124 141 330
5464 330 188 -59 40 -2 -119 -108 75 558 -54 -76 124 -198 150 -78 -104 -191 -223 -404 -240 226 -54 511
5486 511 13 -91 -5 77 38 -44 247 -423 -156 156 0 -95 -142 282 166 188 -63 -8 -304 141 -112 155 -44
5509 -44 -163 -281 -113 191 -30 -71 17 -44 22 2 150 -277 197 -94 85 199 202 -294 -75 -139 24 38 -140
5532 -140 251 -169 -69 72 299 43 -129 30 -146 -73 -170 246 -263 -232 -92 234 281 260 -410 31 151 119
5554 119 514 210 -57 418 203 -260 -176 173 -66 -124 -127 -16 -39 9 125 176 -78 -35 -155 68 271 -39 -172
5577 -172 89 -61 -182 -57 -324 287 114 161 183 37 -149 49 -135 -247 179 -52 -137 -37 -271 205 50
5598 50 -78 167 -68 -202 -172 154 -339 52 111 111 315 -218 127 248 158 -94 -176 -48 -12 -352 397 320 -134
5621 -134 87 47 69 -181 49 152 -115 150 134 79 -136 -62 -79 130 44 -2 37 142 48 75 392 -188 78 122
5645 122 -460 361 -182 395 -222 128 40 59 -259 77 356 6 204 -112 -91 63 6 275 152 239 4 -289
5667 -289 -89 -82 -53 62 -205 -65 -194 -356 -67 -220 116 34 -235 143 -162 104 21 29 108 31 -66 59 61 -399
5691 -399 -314 -50 -36 -192 -182 -62 203 -56 -12 -61 329 -195 46 -113 -172 166 -223 143 -330 1 -27 7 -5
5714 -5 -139 56 398 161 293 -167 -70 -54 125 -94 -373 -81 70 -6 10 -74 262 -90 -243 -270 54 -118 36
5737 36 -84 -254 -92 -146 -215 35 369 259 85 139 91 -6 15 -15 -280 169 119 40 -23 -383 -8 264 88 -205
5761 -205 166 -176 166 -79 -175 -142 112 -91 308 -213 14 -44 251 82 132 -33 41 142 111 250 -168 208
5783 208 -110 -91 97 -431 220 250 -18 31 -139 -28 59 -85 -221 70 -40 -58 167 -40 -8 37 -56 -205 148
5806 148 -75 55 -63 35 182 11 -448 -64 -317 -390 -70 258 -122 57 -8 -102 -145 -69 294 -8 -66 -193
5828 -193 100 243 -117 -195 61 -101 -87 -87 -268 336 247 227 -168 97 35 -15 -54 -40 41 -195 -198 -228 -118 -547 296
5853 296 -288 -170 21 -53 -46 4 -235 90 -71 -43 -223 -202 88 150 -130 -398 -211 208 178 66 -204 -92 5
5876 5 -317 125 6 -89 -130 -119 -34 308 47 -224 -71 293 218 -143 -203 -1 82 223 -20 119 18 -86 29
5899 29 -341 -390 264 -407 -167 -145 -57 -7 -72 231 -57 41 -114 182 549 -210 -53 -176 -23 -93 -1 -107 -61
5922 -61 -298 -420 -149 485 -90 222 363 103 -80 277 70 -231 -77 157 -278 15 -325 3 198 -13
5942 -13 -121 152 259 -57 40 383 1 106 170 -304 39 305 56 -42 -176 -35 28 -307 192 327 111 -161
5964 -161 -264 -356 217 -276 33 84 167 202 91 95 -334 -48 144 8 -336 -16 -16 81 -83 388 129 90 285
5987 285 276 -32 -130 -118 282 267 240 -22 224 -198 14 -199 -275 -264 -68 226 -241 66 -133 19 -94 182 -89
6010 -89 -145 -335 -108 -69 8 123 -39 134 66 76 -22 -65 10 385 -141 -163 -119 -109 -199 205 -167 172 -78 115
6034 115 -386 -18 -393 -314 -399 -362 -34 -34 86 82 -19 297 57 104 -425 -538 194 338 236 -156 15 186 354
6057 354 8 404 -206 -174 179 -271 -195 -326 -4 85 312 295 115 110 -125 119 -13 -259 -118 -22 -121 97 86
6080 86 336 -258 39 -443 232 -107 9 46 -120 -172 255 9 -327 7 71 -130 -121 198 -199 -120 -23 70 -84
6103 -84 52 67 14 447 -53 9 162 -300 123 258 -90 169 -24 -301 -511 182 54 -74 -133 222 66 121
6125 121 -152 -63 323 194 57 53 143 7 -123 -118 -166 290 342 -43 226 311 112 88 -127 50 16 -23 -307 32
6149 32 -114 143 123 35 -396 -93 -9 -113 -179 -176 63 151 -298 68 62 -56 156 226 -120 231 -62 229 53 138
6173 138 208 -51 233 396 285 27 -139 -84 -294 -66 22 -32 191 252 -169 -88 -65 466 112 -71 238 306 -163
6196 -163 50 324 -18 -498 1 -39 76 -112 -455 182 294 -383 -497 150 -56 60 -302 19 180 -148
6216 -148 -182 12 30 148 -117 -104 209 56 150 54 234 417 3 9 201 -293 49 -184 -172 -29 31 45 8 -183
6240 -183 -213 284 122 -105 -108 -25 -120 -54 -192 90 90 46 -268 77 291 42 293 -80 14 -261 -383 -131 167
6263 167 126 50 142 64 88 144 -382 61 277 -191 -356 52 -55 -139 -489 -151 113 -249 155 32 -182 241
6285 241 -112 191 -103 -197 248 268 370 178 -148 -146 -99 262 -378 -218 261 256 -455 414 -95 -156 88 -165 37
6308 37 -309 17 -112 -153 -51 129 -196 100 5 137 -100 7 -126 -270 -184 -144 190 120 162 -160 171 136 -25
6331 -25 125 -15 16 -512 -463 -245 286 104 -175 -229 -187 -430 121 -14 -42 131 181 147 -110 111 17 149 -124
6354 -124 69 151 22 -197 -161 -121 -269 89 -3 56 216 -236 -85 107 -314 46 113 -1 473 12 -204 -62
6376 -62 173 155 -37 111 83 189 159 -44 -195 -52 -142 -53 -280 55 -234 211 -414 -85 -237 119 274 -127
6398 -127 128 -58 56 -6 -303 -56 149 -213 100 52 -126 -14 15 -24 60 -316 -400 -345 381 36 228 -306
6420 -306 -68 75 270 -41 -486 -31 -81 -8 8 34 -128 -188 -249 -157 -176 -122 102 -53 41 19 100 -41 -101 23
6444 23 -417 -42 252 -209 53 -41 -1 -79 80 132 -95 21 135 -79 -90 -72 299 -304 159 49 41 -43 -116 125
6468 125 225 19 85 67 327 275 30 341 -21 298 -445 144 -350 -327 -11 342 89 -363 -144 -366 -4
6489 -4 -222 -10 205 122 -79 238 -100 437 76 238 -15 -41 -261 -204 -250 -501 -77 -107 -219 264 188 -467 -13
6512 -13 -174 229 -72 52 81 -347 -14 66 47 -178 -176 307 -2 53 111 -3 -179 74 48 176 94 -36 -72 85
6536 85 -53 188 -125 -122 -223 49 14 152 -42 -91 -165 -327 71 -198 -106 -101 -62 206 -131 325 47 30 -164 63
6560 63 132 68 -215 28 135 -133 300 68 92 7 145 30 -114 -132 270 79 244 -296 -301 321 226 222 182 -220
6584 -220 205 -23 585 -322 109 373 -488 -13 -61 278 21 87 -264 54 306 -204 100 -31 -163 -147 59
6605 59 363 62 -172 -94 -284 111 -49 74 -60 -558 151 79 217 -18 -1 60 -174 -48 1 88 -4 -139 -117
6628 -117 -79 101 -53 -185 148 94 -233 266 -6 -11 -111 152 286 14 -12 -11 -113 162 -70 -29 -96 -380 -62
6651 -62 -20 100 -68 -44 207 -328 -149 385 -94 41 161 -68 114 -254 -206 98 2 -170 -21 -20 51 402 -144
6674 -144 -41 -395 -229 -162 128 72 234 60 177 9 -149 172 32 235 266 -261 376 39 -50 60 -54
6695 -54 -200 -261 137 -114 327 -83 -183 -2 -312 91 350 343 -446 26 19 97 330 -10 -20 69 -39 124 88
6718 88 495 52 -138 -119 332 27 202 237 -87 304 26 138 -13 212 -28 152 -103 -78 -371 -2 37 199
6740 199 -159 -19 -331 -371 40 81 73 -176 232 -71 84 211 280 155 324 38 -308 -79 -41 320 -191 -276
6762 -276 -73 -39 -53 103 -80 -102 244 284 -224 149 -23 43 -176 79 47 -169 8 11 17 -438 -125 151 -193
6785 -193 -46 409 -1 121 -67 -487 -12 207 -87 284 -341 -72 115 -372 -45 -40 116 -225 77 -23 -316
6806 -316 16 -61 133 -219 -104 84 -90 -116 -118 239 93 -156 187 57 -286 -208 5 29 -129 -365 142 662
6828 662 118 -241 -27 -74 -4 3 -321 173 -53 114 100 114 -55 68 -512 88 46 -94 46 -224 329 102
6850 102 73 -189 -35 107 336 143 -47 85 274 -165 -63 -340 265 94 -404 -193 -228 113 -158 -75 17
6871 17 75 -100 -304 207 69 -223 -242 -101 57 -6 -430 65 159 315 142 -373 84 150 54 -114 -33 300 -177
6894 -177 61 91 259 -98 145 -213 445 -175 214 271 -202 -346 -146 -80 141 -184 255 -200 114 58 80 -192
6916 -192 -27 51 80 291 -64 118 62 -244 -21 -163 88 -222 -321 13 -98 -92 -219 234 8 -220 -195 227
6938 227 6 124 256 -246 -35 172 452 109 -277 370 58 189 129 -80 -200 -18 -176 421 -6 240
6958 240 -77 -31 -335 294 -175 271 -85 131 12 -94 134 221 -110 -41 173 57 182 -36 -222 -27 138
6979 138 77 8 -16 120 -20 -38 -436 69 111 8 192 -180 -288 -335 -18 -175 -253 -163 -52 -56 -143 -1 147 -31
7003 -31 124 -32 318 11 -156 -350 264 -80 -384 469 -175 -136 0 265 -42 -51 -57 -17 -96 374 -282 -213 -306
7026 -306 273 -37 84 -72 39 106 50 -33 67 243 77 294 -279 290 -411 -107 494 -80 37 1 -47 -10
7048 -10 -91 149 174 357 8 -104 -54 4 -42 141 99 -24 -79 -262 149 -103 -156 -105 98 6 114 134 33 -45
7072 -45 150 95 31 93 -159 -219 102 262 152 185 -72 -348 90 -281 -95 -168 -265 160 -102 185 444 -794
7094 -794 57 155 96 -97 56 285 135 -209 165 -208 -316 115 -438 309 -322 -108 317 241 40 232 -76
7115 -76 158 0 -179 87 -113 -33 -15 -87 -8 -84 -213 266 37 -270 200 192 355 56 14 3 -108 -552 -313
7138 -313 -111 -297 78 158 -375 -67 -108 -216 54 -93 -119 -95 77 -25 167 -49 73 374 132 49 -9 7
7160 7 -271 61 97 -299 47 303 478 226 -127 170 8 368 251 16 -35 218 -225 -231 -116 -68 152 -162
7182 -162 15 56 -172 -315 -111 23 38 125 276 146 114 -311 -246 238 -173 -311 212 -71 35 27 4 63 -10
7205 -10 88 122 -73 -48 85 61 127 264 -186 -176 -155 -13 -358 -32 -100 111 33 -326 -310 -230 302 240 232 75 -180
7230 -180 189 165 168 -184 -98 -15 322 -94 20 3 -316 139 -260 -135 -26 -3 90 109 -1 172 -113 299 91
7253 91 60 265 -172 118 -75 -238 219 89 215 69 -51 -55 -91 -57 151 204 -208 -143 101 11 -184 -98 178
7276 178 -60 248 -150 6 61 66 349 245 -82 -79 -310 -192 -22 -200 -343 -43 6 -225 -28 208 -321 180
7298 180 -4 -77 200 149 -26 57 257 95 -88 -129 -118 429 39 79 -138 -56 27 614 -168 174 -300 130 259
7321 259 258 131 -240 -182 -147 -72 206 347 55 241 -54 123 234 187 -372 308 -231 -144 183 -95 -266 -404
7343 -404 30 -66 -42 260 -102 192 -147 -38 -143 -53 -348 149 84 -48 109 -567 -94 112 20 -222 -130 -29
7365 -29 -132 145 328 496 136 -382 -450 359 99 338 231 -343 -121 -41 99 86 222 -170 -323 -45 -105 137
7387 137 -125 109 159 -97 23 -119 -347 292 10 267 -355 87 -130 -5 -78 248 74 52 115 290 298 14
7409 14 -163 49 400 -179 204 43 33 -214 349 -168 -525 299 -55 118 185 153 -191 426 -206 22 76 -101
7431 -101 32 116 92 -82 159 104 170 -3 243 -31 -451 190 -245 319 286 27 74 -64 203 -1 -93 94
7453 94 -224 -46 -16 -270 187 50 -115 -82 -397 113 132 7 168 60 230 -116 72 -223 185 -269 296
7474 296 325 56 -10 -19 -210 -88 110 9 204 -248 124 -179 185 -453 -180 -159 383 -202 -163 -72 213 371
7496 371 -213 -29 270 -145 -23 -139 -49 227 -79 -84 -208 -312 301 57 -141 339 -5 -162 -316 -174 129
7517 129 -269 125 -186 166 112 145 -206 -140 -17 360 -31 -24 -22 -346 -20 -95 2 -301 49 -317 46 -301 79
7540 79 254 -104 -261 -600 -97 -6 172 164 -249 -88 139 -3 -144 -37 -83 143 150 98 -33 103 220 351 -41
7563 -41 32 -158 -69 -210 386 -102 -268 29 -86 461 -209 -340 171 217 66 -36 91 22 -183 64 -75 335
7585 335 -45 -169 47 -134 159 -50 19 268 92 19 26 193 -91 108 63 -213 -39 131 80 -50 36 -1 -102
7608 -102 -81 -42 -226 181 186 -70 -31 -127 142 253 91 211 -127 -38 170 126 179 -120 303 -176 -148 84 194
7631 194 -133 168 164 -116 -18 -131 75 83 -81 14 2 -58 63 -57 -218 -87 283 106 147 -362 -12 -231 -23
7654 -23 -9 -436 -279 299 -168 -88 60 227 -183 156 261 15 43 -62 -157 -105 -22 17 295 72 190 181 -55
7677 -55 -8 -112 -177 -164 -101 128 21 51 310 -93 147 365 -11 182 -145 338 18 62 -72 -213 164 275
7699 275 224 185 50 168 97 -43 -246 174 -283 90 -68 194 -183 482 150 -21 146 330 -109 281 308
7720 308 173 -127 163 59 -125 -121 -166 -350 146 -306 86 53 207 -46 202 -21 243 -193 -332 59 41 222
7742 222 -250 324 -71 237 327 -88 -18 -67 290 -346 234 61 267 392 -15 -134 65 82 -143 -292 17
7763 17 310 -15 -78 -299 13 172 -154 -371 64 258 190 216 133 -60 -89 33 241 2 -70 154 -390 -65
7785 -65 8 284 290 146 -238 -206 -170 -315 75 -125 228 118 -21 131 -153 -88 244 -38 113 -196 125 11
7807 11 -7 50 -132 188 -176 -349 -300 -64 140 -75 -42 52 76 -145 -157 -114 54 -58 -291 168 102 88 -193 -33
7831 -33 -132 -55 -95 -168 30 -124 249 -58 -61 275 21 -412 361 107 1 -199 156 -16 -428 100 173 -22 -167
7854 -167 355 -115 -89 -245 -44 -36 -198 -40 -16 -25 65 -222 -10 155 10 -34 -275 138 -234 -19 90 -73 -366
7877 -366 -111 -155 91 328 -214 -13 179 -319 -178 68 -242 43 285 -314 -277 -244 308 -157 267 -33 14
7898 14 -37 -55 101 44 -347 -25 -146 -282 118 41 -250 -157 -80 145 -42 94 103 -35 20 51 387 -95 229 -113
7922 -113 -203 299 -86 441 34 80 -69 216 -6 203 182 282 118 250 259 88 479 -179 -85 -175 16 42 249
7945 249 -166 -72 -313 156 -251 102 14 -41 13 -149 -215 -45 -29 -323 -103 75 -438 -216 68 -42 354 -165
7967 -165 248 310 58 -149 -22 119 315 -51 28 32 -301 -207 -192 -261 173 180 -82 -59 -209 105 -188 125 132 -238
7991 -238 -248 -356 -90 15 514 -93 -153 28 71 -169 360 -55 353 256 163 330 229 380 -129 -25 49 157
8013 157 -134 -231 -219 -117 338 -180 -103 -75 -319 386 -178 -143 -10 102 358 209 -66 -175 -51 109 -723 -141
8035 -141 -19 54 99 71 -123 -79 -340 195 126 -109 133 29 177 232 -148 -45 48 -71 327 -264 -174 -416 77
8058 77 -43 -179 -75 -56 -146 -34 -79 -110 242 292 55 -258 117 176 -78 7 120 114 -24 20 -42 -96 -357 112
8082 112 362 -263 54 -258 238 166 200 -38 76 234 372 -220 84 -51 -67 60 57 -142 126 -87 -1 179
8104 179 54 -103 -178 -260 -362 56 -248 179 -121 -139 241 104 -310 -56 -189 -153 45 134 -112 118 115 -17
8126 -17 162 193 235 92 124 -171 86 -87 -141 65 122 -30 65 -94 -270 148 -221 -31 440 -2 369 125
8148 125 -145 -537 52 196 384 -238 -46 136 -427 43 4 73 -267 -510 -156 239 136 312 -61 335 186
8169 186 129 74 101 -144 -276 41 -163 -317 -158 105 35 -5 219 -109 207 241 -72 -95 110 -160 -47 133
8191A33
$$ Imaginary data points
##PAGE= N=2
##DATA TABLE= (X++(I..I)), XYDATA
0 0 0 0 0 0 0 0 0 0 0 0 0 0 0 0 0 -64 64 -64 64 -64 126 -128 128 -156 192 -195 256 -310 320 -384 448 -512
32 -512 576 -640 709 -814 901 -1022 1133 -1269 1411 -1557 1734 -1911 2119 -2336 2580 -2843
48 -2843 3124 -3447 3792 -4184 4614 -5093 5635 -6246 6945 -7744 8690 -9802 11156 -12832
62 -12832 14966 -17801 21754 -27672 37500 -56725 108678 -539386 -1667499 -782900 -286268
73 -286268 -550286 -448028 596566 1101588 758963 522008 672205 266376 -505080 -785117
83 -785117 -649127 -804307 -807539 -128924 593228 618647 537779 799161 751764 66022 -375202
94 -375202 -279098 -461775 -1030160 -934348 -85964 389841 256827 462565 1019243 913115
104 913115 119040 -326003 -275924 -473044 -875494 -770291 -247012 75766 256522 628175
114 628175 862170 614275 257003 80082 -238718 -712883 -776821 -410004 -244198 -279879
124 -279879 91611 706596 776565 376235 253380 336327 -22815 -616460 -709067 -414130
134 -414130 -338007 -341019 36159 508181 574329 453070 483634 376721 -86693 -470774 -485293
145 -485293 -464861 -540495 -344442 118747 359635 345152 479254 640816 361646 -152853
155 -152853 -321728 -265731 -455867 -660628 -372290 136844 287883 233393 404252 579700
165 579700 359218 -13013 -145953 -218479 -457500 -572813 -333231 -41469 70953 221117
175 221117 475979 518716 282657 96167 24434 -187287 -470355 -485720 -279948 -170161
185 -170161 -100221 181213 493020 481128 267066 172003 105707 -156759 -428090 -423501 -274000
196 -274000 -213887 -130332 121643 360100 390633 323375 268869 122869 -134999 -314635 -338483
207 -338483 -325462 -290689 -125070 111636 245444 285439 337708 330163 150918 -85248 -210988
218 -210988 -269309 -343910 -335497 -157600 60160 179493 251679 327977 316306 169073 -5684
229 -5684 -131893 -244273 -330194 -306893 -178593 -36095 97336 239520 324888 286791 176284
240 176284 69515 -59472 -219680 -312075 -275504 -184527 -97967 29006 196920 298047 273953
251 273953 196560 112248 -13796 -171322 -268109 -265116 -211053 -127823 1594 145689 235189
262 235189 253516 225142 145577 12056 -123460 -207571 -240874 -232395 -160791 -28602 102798
273 102798 187527 228693 229913 168637 48988 -76843 -168358 -219508 -225574 -173449 -69992 50764
285 50764 152762 212235 219728 174896 86173 -28473 -136745 -202189 -210255 -173450 -100193 5952
297 5952 117642 187972 202793 175380 110930 10883 -96392 -169184 -196007 -181573 -120481 -20286
309 -20286 79654 146625 182647 185764 133112 32568 -64353 -129281 -173045 -186678 -138188 -42861
321 -42861 45792 110088 163664 187628 143527 51246 -30970 -94022 -152766 -180218 -143895 -65695
333 -65695 10054 81893 149288 173890 137138 73090 11362 -63537 -141230 -170714 -136581 -80997
345 -80997 -24712 51552 129691 158533 134740 94141 40087 -43110 -122711 -147922 -128758 -100713
357 -100713 -52426 31182 109471 138151 129048 107675 57893 -23808 -93346 -122012 -127621 -117344
369 -117344 -66030 17285 81691 109369 124132 121606 72378 -6482 -66848 -99224 -123344 -124008
381 -124008 -75295 -2407 51344 88368 121411 124710 77617 12072 -38273 -80842 -119008 -121544
393 -121544 -78478 -23203 23033 72576 116695 119337 78389 30372 -12676 -64213 -109717 -113900
405 -113900 -82095 -41849 2851 59005 102407 105681 81582 52210 9059 -51320 -96718 -102426
417 -102426 -83146 -57118 -14605 42420 85403 96258 88515 66638 19788 -38469 -77312 -88991
429 -88991 -87994 -71293 -26529 30312 69595 85110 87706 72233 31070 -20783 -58808 -80496 -89145
442 -89145 -73922 -34067 13043 49274 74696 87705 75341 38306 -5711 -41565 -69348 -84386
454 -84386 -75707 -43754 -3331 34610 65017 82066 75430 47587 9975 -27950 -59712 -78893
466 -78893 -75038 -50781 -15297 22055 53697 73395 74698 54750 21501 -16402 -48672 -69358
478 -69358 -72975 -56808 -25779 10446 42972 64356 71195 58027 29528 -3975 -35131 -60107
490 -60107 -70878 -59604 -32921 -1355 29353 56074 68813 59804 35399 6494 -23859 -51011
502 -51011 -65499 -59642 -38335 -12032 18451 47248 63100 58929 41559 16858 -13773 -43104
514 -43104 -58857 -58004 -44340 -20820 10692 38911 54088 55731 46060 25579 -5372 -34408 -50515
527 -50515 -54536 -47982 -28113 1726 28771 46648 54909 49093 28694 931 -23300 -41179 -53547
540 -53547 -50580 -30156 -4448 16668 36378 52775 51963 31594 7835 -12591 -34058 -51675 -50356
553 -50356 -30268 -10935 6193 28931 49314 49157 32320 15559 -1264 -27311 -48174 -47957 -33627
566 -33627 -19055 -527 26993 45244 42620 31600 23430 6729 -22655 -42258 -40741 -33357 -27833
579 -27833 -9884 21599 41412 39901 32816 28068 10176 -18338 -35128 -34986 -33173 -30961 -13923
592 -13923 13139 30574 34956 37408 32916 13643 -11911 -27892 -33833 -36200 -30777 -12550 7590
605 7590 20269 29159 36905 33902 16712 -4561 -17934 -29130 -37854 -34165 -16905 2586 16736
618 16736 27315 34127 31529 18351 2840 -12029 -25193 -33099 -32136 -22298 -7075 11786 26254
631 26254 31926 29355 22264 8988 -9146 -23970 -28594 -26537 -23562 -13287 4764 21123 27599
644 27599 28041 25122 14218 -4030 -19414 -25727 -28008 -25216 -13655 2772 14791 21216 26920 27476
658 27476 15361 -829 -11189 -19248 -27572 -29261 -16435 312 9862 17715 26460 28075 15899
671 15899 950 -6946 -13849 -24022 -27411 -18327 -4714 5023 13874 23532 26890 19252 6318 -4526
685 -4526 -14137 -21725 -23435 -17559 -9614 287 11092 20490 22912 19403 11797 2425 -10047 -20644
699 -20644 -23717 -19025 -11117 -1868 7920 17240 21456 18518 12021 4349 -4548 -14470 -21999 -21071 -13161
714 -13161 -4043 3634 13159 21739 20998 12160 3532 -1379 -9663 -18966 -20352 -13641 -6576 -1324 8645
729 8645 18584 20557 14559 7501 720 -8951 -17949 -17866 -12729 -9256 -3620 6990 16080 16586 13427 11478
745 11478 6089 -6861 -16158 -16334 -13087 -11939 -6237 6061 14751 13994 12105 12741 7783 -3729 -12205
760 -12205 -13472 -13495 -14061 -7618 3407 10663 12930 14265 13773 6662 -2256 -7494 -10730 -14239 -14405 -7468
776 -7468 582 5561 10248 15876 14617 7175 17 -4592 -9900 -14724 -13147 -6741 -1467 2501 8655
791 8655 13556 12291 8303 4367 -1652 -9572 -13826 -11717 -8780 -5403 1051 9371 12253 9816 8851
806 8851 7178 740 -8718 -10959 -9506 -9753 -8631 -750 8187 9915 9297 10591 8852 320 -7264 -7862
822 -7862 -8172 -10750 -9477 -732 5486 6143 8814 12213 9316 650 -4606 -4950 -8120 -12371 -8781 -246
838 -246 3161 3628 8218 12423 8986 1434 -897 -2598 -8494 -12218 -7873 -2218 -388 2071 8441 11255
854 11255 7377 3104 1951 -2180 -8909 -10664 -6838 -4089 -3249 1970 8529 9211 6299 4923 3965 -1819
870 -1819 -7937 -8347 -6285 -5847 -4510 1746 6960 7049 6521 7031 4355 -1992 -6055 -6017 -6681 -7357 -4605 1582
888 1582 4884 4555 6695 8153 4649 -1261 -3559 -4272 -7087 -8056 -3801 744 2594 4092 7465 8128
904 8128 3724 -115 -1401 -3312 -7240 -7476 -3643 -527 326 3560 7656 7108 3385 1843 371 -3781
920 -3781 -7071 -6412 -3532 -2687 -1145 3593 6802 5849 3822 3612 1281 -3627 -5829 -4952 -4196 -3933 -1627
937 -1627 3123 5244 4317 4246 4392 1522 -2771 -4347 -4479 -4709 -4760 -1405 2187 3763 4079 4867 4588 1342
955 1342 -1985 -2807 -3581 -5316 -4826 -1672 1510 1934 3851 5342 4339 1613 -586 -1698 -3712 -5202
971 -5202 -4150 -2105 1 1301 3306 5076 4098 2266 683 -842 -3139 -5020 -4118 -2214 -913 656
987 656 3566 4540 3414 2661 1401 -272 -3177 -4238 -3601 -3096 -1753 232 2509 3769 3076 3218 2001
1004 2001 -40 -2324 -3152 -3536 -3385 -2231 -451 1865 2941 3395 3302 2076 194 -1480 -2668 -3732
1020 -3732 -3471 -2581 -599 994 1949 2583 3494 2654 500 -858 -2275 -2923 -3425 -2413 -1132 282 1924
1037 1924 2917 3451 2199 1265 -204 -1469 -2505 -3116 -2145 -1214 -550 1541 2522 3432 2279 1513 548 -1115
1055 -1115 -2397 -3062 -2310 -1489 -541 847 1944 2674 2509 1835 546 -984 -1651 -2628 -2628 -1716 -928 534
1073 534 1655 2399 2422 1614 1078 -579 -1725 -2224 -2078 -1839 -1559 450 1326 1849 2379 1722 1422 76 -931
1092 -931 -2037 -1976 -1874 -1269 -263 858 1706 2196 2077 1472 600 -625 -1597 -1882 -2075 -1127 -812 664 1327
1111 1327 1771 1875 1491 328 -77 -1405 -1691 -1496 -1701 -1007 410 1184 1389 1661 1315 613 -87 -1086 -1169
1130 -1169 -1714 -1489 -793 -216 763 1026 1792 1215 1364 301 -854 -1052 -1259 -1520 -1095 -75 522 1074 1314
1149 1314 1307 994 316 51 -1040 -1629 -1369 -1383 -463 -11 812 1036 1429 1013 212 159 -845 -937 -894 -861 -621
1170 -621 -34 645 1034 1327 990 446 10 -556 -618 -931 -998 -539 -208 292 663 1013 831 721 52 -502 -522
1191 -522 -1049 -1042 -886 11 50 837 1095 577 928 408 28 -737 -713 -1401 -739 -588 445 309 615 1068 727
1212 727 385 1 -101 -560 -1069 -878 -333 -62 434 513 843 647 -102 93 -132 -816 -683 -837 -400 -469 386
1233 386 456 872 726 316 595 417 13 -839 -621 -516 -315 -29 367 792 724 456 39 75 59 -417 -755
1254 -755 -699 -360 -234 287 334 448 535 209 -29 19 -549 -802 -477 -424 -404 279 419 376 467 566 -32 62 -276
1277 -276 -474 -972 -483 -52 155 377 269 403 426 529 185 -67 -307 -216 -322 -373 -29 225 76 538 848
1298 848 129 -62 39 -337 -685 -358 176 78 -102 329 288 217 381 330 186 -103 25 -405 -429 -89 28 -80
1320 -80 250 -111 188 575 109 -212 -199 -272 -258 71 -604 -101 182 -29 317 200 61 -25 1 62 -50 -299
1342 -299 -75 123 282 -133 223 602 242 312 -206 346 -195 222 204 65 547 226 112 -156 196 -164 49
1363 49 -87 -32 -453 -472 -259 114 38 -21 27 31 -8 494 -170 -60 -77 -448 23 -71 -223 121 425 -96 147 -95
1387 -95 39 9 -355 -351 -76 35 -33 115 -19 240 298 -17 141 25 -21 114 -331 -65 -71 -82 -99 342 156 -41
1411 -41 83 -29 -57 150 -194 -110 164 -345 18 131 203 -347 182 151 -21 -304 -263 -50 -100 58 279 347 -64
1434 -64 301 -400 -269 -62 174 -39 -479 305 -122 -56 117 84 177 277 8 162 153 86 -372 -260 -112 91
1456 91 -179 74 -236 -16 -252 68 -25 -63 4 -45 -150 136 50 261 -6 100 -85 72 -22 -386 42 -58
1478 -58 -180 -449 -28 60 -73 -79 -116 -153 113 175 -200 -133 35 -118 -6 -119 22 -66 45 157 579 -88 174
1501 174 228 -245 -119 276 -91 146 122 147 106 -113 -143 -10 7 40 -234 -40 205 140 446 191 332 306 196
1524 196 70 -192 -20 -220 -160 -151 -130 0 -84 -114 -81 332 30 -185 40 -53 -92 208 -142 277 -121 200 65
1547 65 74 256 47 -214 -62 60 76 244 16 243 -144 220 505 137 -27 55 -252 -90 -325 83 -16 -35
1569 -35 340 284 -109 -170 148 336 330 -259 93 -123 174 -191 -128 252 327 -87 -35 87 51 -201 -216 -340 -187
1592 -187 -37 401 168 25 19 131 -260 -90 141 -27 -198 -121 89 -288 412 134 357 -69 124 -56 78
1613 78 -140 -57 182 248 129 -110 122 -39 -341 -159 290 -41 146 -84 183 -62 94 147 144 78 68 27 -271
1636 -271 -237 -245 -359 -132 -142 -434 -6 138 -102 -103 342 -256 -26 181 -263 -139 240 -191 -239 -83 229 244 -143
1659 -143 28 2 373 -172 20 -352 -74 -146 -50 130 492 336 230 69 166 -146 -356 -335 -261 -212 -168 351 193
1682 193 229 91 -213 142 -226 -248 -179 -183 -22 473 -278 117 188 234 -161 -17 -529 155 413 -57 184 9
1704 9 24 164 376 134 42 -169 338 7 -57 -145 356 202 118 227 -112 -94 -36 -56 19 -102 117 -34 -301 -23
1728 -23 201 -322 106 10 -54 191 290 254 -255 25 -246 156 97 -198 187 168 -91 10 222 -131 -196 -5 85
1751 85 -23 -318 42 5 21 247 96 81 -89 -293 -140 -448 -50 -211 -34 14 286 -13 617 -180 -119 -128 240
1774 240 -36 -164 198 -183 -159 293 171 149 198 -236 -176 -261 5 300 -91 -187 165 -147 252 163 245 -32 33
1797 33 -122 -112 -54 98 -49 280 104 92 499 103 -191 -254 -117 12 -278 -198 -234 -262 243 107 407 27 27
1820 27 280 -127 98 50 -202 -32 -364 161 -353 253 -67 -511 -39 -141 126 -368 -267 -419 -100 35 -89
1841 -89 53 258 199 -121 171 -374 -149 -419 28 -103 82 -335 267 269 549 318 -291 -200 -55 -109 17 -56
1863 -56 -90 445 -154 95 444 40 128 37 -198 -29 23 -20 -147 211 24 273 171 299 15 -83 -277 -81
1885 -81 -42 -222 -309 252 44 253 -80 143 28 -93 -70 -95 -5 53 2 -465 -137 -138 177 47 177 76 -2 -257
1909 -257 -1 -282 -16 -18 370 -57 -30 -301 -8 669 -104 19 -243 18 73 118 41 -154 299 75 65 224
1931 224 -74 -63 -36 -503 -304 -162 -438 307 -201 38 162 -223 -244 73 5 -97 -73 -47 197 278 -100 -36 -8
1954 -8 -38 106 -206 -213 -334 137 122 118 11 256 346 -205 3 144 -61 339 210 481 -68 118 -7 -267 -59
1977 -59 213 -101 387 -302 -143 169 -7 16 -233 16 201 -78 -114 312 -22 -222 170 -341 175 -217 100
1998 100 -100 -64 107 -54 208 286 272 -281 -266 -390 -438 -54 42 190 -27 101 5 130 197 -190 -104 84 -86
2021 -86 -264 36 63 4 140 212 244 -83 24 350 -232 70 -438 -341 -227 -32 -33 7 499 -177 2 -67 -402
2044 -402 -273 -196 -325 -163 215 -34 -232 7 33 161 131 263 -64 -125 95 -204 -163 -284 22 -259 -73 80
2066 80 237 -205 24 -79 -110 -165 175 -178 198 77 257 423 -99 12 225 -163 -67 127 157 -281 300 321
2088 321 -235 84 -42 239 -117 141 -245 23 552 319 -13 113 -77 94 117 -207 304 -66 193 -162
2108 -162 -247 1 -91 199 155 422 54 -321 -11 -8 249 127 -132 -43 -24 -57 -75 223 -97 -110 233 122 220 -98
2132 -98 46 -243 -260 298 327 232 114 -88 -15 -6 -106 -89 -28 -361 -153 -98 30 -37 -88 63 -128 -93 -1 71 -242
2157 -242 -28 190 -152 -249 216 87 22 -51 -29 -42 -219 503 -63 -231 -130 -155 89 290 -104 100 139 -23
2179 -23 -132 -25 -3 -94 -103 126 -96 -147 274 -93 -133 151 30 366 242 -151 59 262 -66 104 -80 28
2201 28 -77 176 -145 227 -356 77 -214 -1 -270 228 -63 -62 -169 116 -104 -335 -185 -241 -46 7 -8 -41
2223 -41 278 12 27 -464 -255 -286 -24 -111 166 149 -35 -76 -392 -284 125 210 47 225 226 185 -218 -227 -162 213
2247 213 -32 98 299 -71 64 -92 269 127 151 94 -368 207 -29 53 -72 171 99 -205 40 55 -68 -134
2269 -134 -50 120 214 15 -18 168 -152 91 -28 208 66 16 103 62 45 166 216 -147 120 -232 -287 -77 303
2292 303 265 62 -76 505 45 139 -64 30 72 -34 -60 7 -348 207 -64 -38 78 44 93 507 -13 -116 137
2315 137 -380 162 151 266 -294 153 161 43 337 172 49 105 -53 -13 202 -188 189 -92 -34 -360 141 -113
2337 -113 -5 380 247 136 131 -45 152 -19 295 -134 -64 56 393 -164 -1 -10 -254 -437 -174 -9 14 -336
2359 -336 39 118 102 275 -162 330 -176 -293 -252 193 173 178 -220 150 128 -117 277 183 -42 -21 -213 -276 79
2382 79 20 -105 89 -53 64 -50 -69 338 -55 -32 -39 294 0 167 -318 380 -133 106 -63 164 210 -224
2404 -224 -102 -70 120 -124 21 -319 -264 366 62 136 -296 172 -242 -133 -253 -36 150 -194 -20 -229 -149
2425 -149 49 31 -127 -159 128 -63 -179 -277 -312 -274 -225 -27 28 17 -293 -132 178 191 -73 363 13 -71 4 -88
2449 -88 124 151 -37 19 0 202 -4 707 -173 66 -138 113 93 -93 302 238 208 166 -238 64 61 4 -299 29
2473 29 -179 117 -211 -299 122 103 -3 109 246 148 -24 32 78 282 191 73 323 -81 72 -173 -253 -623 111
2496 111 -3 -93 328 331 -331 359 -186 32 207 -81 257 57 223 77 -206 -139 -11 93 173 -528 41 159
2518 159 5 -113 -99 -24 -303 279 190 335 202 160 62 -162 -122 97 476 6 -7 -41 191 159 -200 591 391
2541 391 -134 -109 200 133 57 224 105 -89 168 197 1 412 310 328 -313 -251 -204 -56 -17 -264 350 -135 88
2564 88 -18 -367 10 205 207 192 -140 159 -413 37 -64 -120 -280 194 217 -14 220 -65 96 88 -57 -283 -183
2587 -183 220 -122 97 289 63 -5 -29 -241 170 -96 -337 188 -72 -97 103 -204 -96 40 38 135 93 95 436
2610 436 15 6 -81 126 -159 400 -26 65 588 25 122 -147 -76 -26 53 -23 -100 -208 220 65 104 -201 54 173
2634 173 7 116 -41 -46 -228 180 210 -164 70 167 302 128 -98 -31 -186 -17 -4 219 334 39 -107 -335
2656 -335 245 219 -26 -13 -164 -118 -60 177 -169 256 -229 -193 -15 -30 -274 -6 -343 -300 -433 16 34 28 236
2679 236 -144 -159 105 -119 167 -118 -421 504 119 201 -154 102 -141 109 -69 -432 29 -3 204 -253 209
2700 209 107 -5 432 30 -97 88 -113 15 333 209 -29 -231 -264 -151 196 -242 -240 -8 -23 -50 33 -373
2722 -373 127 -227 -7 -77 255 249 -118 -502 9 -92 -207 83 -179 -59 -93 319 -14 -296 486 26 -160
2743 -160 -118 285 78 -114 310 -228 99 140 239 164 -139 -170 57 -360 150 -12 -361 46 290 -250 -55 -217
2765 -217 438 -15 46 49 -177 108 72 -4 -71 -280 -54 60 -40 -203 194 -239 8 -135 179 121 241 199 -264
2788 -264 98 -25 252 -166 399 37 286 0 -86 -61 8 128 578 291 -5 -67 67 134 -74 -128 150 -49
2810 -49 69 -11 406 300 -73 11 10 -28 -86 -298 262 -140 -100 -12 -65 34 -61 109 -405 225 -3 -221 8 559
2834 559 54 -364 -139 71 -45 86 61 113 312 -5 220 181 -74 32 -203 -220 -586 127 42 4 164 63
2856 63 82 -77 323 208 -406 53 197 376 -373 -166 -76 -58 14 -217 -210 329 184 -60 80 -215 118 -198
2878 -198 -72 263 -122 -155 -344 -412 38 94 -90 49 0 -146 45 -250 137 396 97 -213 -21 -169 -258 -92
2900 -92 23 66 -151 -20 -71 -18 -26 188 -20 12 202 128 182 149 -227 45 234 -259 -109 147 152 -206 99 -161
2924 -161 -367 24 42 101 -334 -272 -169 -330 180 -159 -187 -306 316 -243 134 -118 253 -82 161 -48 -117 62
2946 62 63 86 50 -277 -145 -289 47 85 -240 112 -108 -74 281 32 97 265 -95 -187 -258 102 165 -23 -81 69
2970 69 83 74 -237 69 -92 16 68 3 -72 -55 197 -7 58 51 92 90 66 -61 38 238 -226 120 98 -2 190 -305
2996 -305 135 -55 -330 2 -95 44 234 394 -117 186 -4 181 254 428 455 97 36 -372 314 -82 -259
3017 -259 -180 104 -112 -13 -99 318 202 39 -307 -262 -287 -72 310 20 -107 -15 28 -67 -68 327 216 127 38 36 102
3042 102 -98 -32 90 -141 253 -163 -374 22 35 54 153 222 403 -20 -73 112 -124 233 9 159 -212 23
3064 23 409 -17 -84 203 226 113 96 70 -269 77 -46 114 -229 261 -51 -415 -266 59 -108 248 96 -58
3086 -58 -131 -149 -95 265 87 -122 -79 -132 136 -85 483 115 71 -49 -122 88 -333 -226 -303 287 -96 64 -11
3109 -11 -271 -437 277 -268 -89 184 43 211 96 -33 -43 -324 -98 6 -300 -46 235 334 -281 43 -73
3130 -73 -22 13 49 -243 190 -163 -147 41 -195 -256 -88 -238 -38 31 -284 -186 121 234 65 157 60 243 2
3153 2 272 -21 275 92 215 352 184 -179 34 -244 92 -17 155 135 180 94 -277 181 146 -20 64 96 -93
3176 -93 323 2 91 -26 -75 -7 -388 98 388 -152 182 -190 -74 260 323 42 482 21 -33 5 154 -25
3198 -25 166 -301 -7 -56 54 -268 33 110 -60 -180 32 -91 -269 -188 -254 72 -116 307 309 1 -173 418
3220 418 285 165 -144 -293 -193 85 -125 344 156 48 -138 82 -374 -217 24 105 261 103 167 -711 -160
3241 -160 -179 405 162 -276 160 8 74 -200 -59 83 -74 -199 97 284 222 -187 125 -6 235 38 29 270
3263 270 362 215 37 258 -92 28 -296 0 84 -86 267 72 212 26 -359 -88 153 251 160 116 109 -268
3285 -268 227 -70 -365 -241 -58 84 -48 -187 -85 -279 -108 -299 27 50 -22 -3 -53 120 -163 -227 -123 -288
3307 -288 34 376 -262 -181 -138 313 -35 204 97 -131 -32 280 -191 -35 276 -15 38 -82 -77 405 -358 -183
3329 -183 288 -10 99 156 -126 -60 -125 -186 -35 -77 -131 -335 282 -123 8 -12 158 25 -146 30 274 -71
3351 -71 -90 415 91 -75 191 -273 -144 13 48 41 -18 91 -24 21 260 229 -140 200 -161 -16 34 28 0 52
3375 52 -488 -179 97 63 80 -126 251 -52 -78 -275 -39 204 -248 0 -398 -28 218 -57 -24 12 -2 -174
3397 -174 81 9 -32 -318 189 -141 1 -376 43 79 274 187 186 -150 -49 75 4 254 -170 247 241 279 37
3420 37 169 180 255 229 -250 68 -164 32 142 -43 -349 -231 136 -8 77 86 -285 -14 -10 -180 -216 7 55 -172
3444 -172 331 -80 -75 -423 194 151 143 -367 -330 -173 -40 -4 -42 323 68 -42 -149 411 254 610 -202 -483 -94
3467 -94 -36 28 66 2 -9 4 199 460 -12 -68 171 99 -183 19 228 -255 -2 -9 -51 -66 284 -80 30 -225
3491 -225 104 -129 207 55 160 -201 -20 -4 -148 -247 110 308 -181 8 -36 265 -244 242 134 210 -255
3512 -255 215 190 -342 -281 98 80 83 97 -16 -3 27 387 -141 117 -23 85 318 -8 -11 -199 265 151 -109
3535 -109 132 15 -217 -88 -100 129 68 -363 70 -46 18 101 -85 -1 22 -71 219 -77 20 -46 -114 -537 -313
3558 -313 8 -176 -164 -206 139 19 17 139 60 -271 90 -56 -123 48 -129 229 -200 165 291 -135 222 66
3580 66 107 -404 48 102 10 295 92 -79 -133 -270 -63 -125 -38 143 -135 -427 -103 -115 -221 49 88 210 103
3603 103 30 255 -60 263 -325 -456 45 200 21 -77 114 -194 -212 -220 -16 229 69 -113 -93 -128 306 121
3625 121 -90 -63 -356 -34 -59 157 529 -309 -151 203 -68 -60 -179 255 488 -367 233 -17 -181 52 -164
3646 -164 -373 -451 182 329 104 -226 -21 80 -303 55 72 337 128 245 15 -151 132 -54 -291 74 116
3667 116 -20 402 -79 31 -18 255 108 92 275 98 154 -163 35 -334 318 -14 252 116 33 -236 -64
3688 -64 115 -84 259 -89 -99 117 224 54 -58 90 -100 220 208 -200 35 22 -47 -576 166 82 -171 -113
3710 -113 66 -133 145 -181 83 -287 -265 -209 203 -43 82 77 140 19 76 -124 -106 221 -3 23 -32 471 2
3733 2 141 -62 41 -32 -7 -178 50 332 -28 105 42 158 98 111 -39 218 -272 72 -140 -120 124 355 -103
3756 -103 50 103 78 135 -167 211 -102 123 153 -21 -119 363 -101 156 -2 -437 -81 121 64 249 -188 237
3778 237 132 209 -2 -75 -77 207 -76 -144 -141 57 37 -115 38 -159 -4 113 146 160 78 531 -202 -169 -166 219 161
3803 161 180 -542 -6 -40 -258 -54 -156 293 -60 52 -149 -308 -237 150 -82 378 -102 -89 -213 -87 330
3824 330 -79 -128 -21 -16 370 258 224 -6 55 39 -125 85 49 -20 -187 -111 123 -33 66 -150 183 72 222
3847 222 149 150 148 -92 -154 -208 -7 -13 -159 214 -234 190 223 -154 -4 178 -223 -140 260 94 13 -41 213 -194
3871 -194 -110 -2 -174 -28 323 -69 -140 287 -128 -154 -86 -167 348 73 -40 391 403 69 -439 84 63 -226
3893 -226 227 -367 -303 -79 143 326 -11 164 20 61 259 119 -139 191 162 161 65 16 -123 33 35 237 -344
3916 -344 260 68 -487 186 203 -191 -5 303 192 -19 148 -13 241 -7 23 57 -284 123 81 -3 19 -46
3938 -46 -165 400 -2 413 91 -43 248 36 -598 -267 -124 120 -168 211 -77 78 -105 -140 131 -247 516
3959 516 4 -88 206 99 -223 -122 3 81 368 167 -384 167 -333 -386 -97 -120 56 257 89 -186 -26
3980 -26 -18 -23 224 182 262 55 474 218 106 200 -83 -69 278 146 102 -25 -154 179 -2 199 -231 259 -57
4003 -57 -71 -286 -305 7 23 87 148 -270 172 -268 -19 25 -163 -17 76 202 236 -64 -32 204 -18 212 -358
4026 -358 160 125 -227 94 -51 29 -56 131 113 262 17 192 5 129 -13 -303 88 87 37 89 24 -108 20
4049 20 -191 -279 -55 149 -105 -194 -68 -88 -37 -134 9 41 247 -288 256 10 59 -57 146 131 50 -55 149
4072 149 94 -151 -85 -155 214 -312 336 -79 348 115 -44 -149 121 -39 207 125 123 -388 -8 -81 -164 -164 168
4095 168 -127 183 31 283 -39 184 176 153 -201 96 -130 43 -61 94 -197 66 -49 -13 -70 217 -197 -165
4117 -165 299 -254 238 -83 357 86 173 -314 -260 37 -224 308 144 112 -76 216 0 215 -54 -147 80
4138 80 132 -8 401 -141 -2 117 80 -115 -82 292 14 218 -455 -101 -75 106 -289 -187 295 55 -136 -11
4160 -11 -120 -402 40 -37 83 255 -40 52 231 -141 -256 -290 72 125 113 1 -109 245 -36 -357 -18 308
4182 308 -141 515 135 134 123 -21 272 241 -17 340 309 48 159 -384 211 318 -6 275 104 89 -231 -288
4204 -288 1 -17 -305 -171 190 -54 -217 238 281 -44 399 277 -88 176 226 -367 111 -88 153 93 -88
4225 -88 9 -98 -143 -155 -223 209 153 167 283 -162 309 154 81 -44 164 69 101 245 41 -258 -78 79 107 135
4249 135 -92 -97 -155 -316 -276 337 109 -85 -218 324 124 -323 -417 260 48 38 158 67 6 165 -215 -344 -77
4272 -77 -24 438 -132 -15 -30 60 214 177 335 -162 -16 -264 297 57 -185 -261 -69 84 -163 108 -186 137
4294 137 93 204 33 -70 -266 281 -78 259 1 160 -201 4 -205 93 341 -41 -143 226 155 340 198
4315 198 476 107 -81 -326 -68 66 -78 -205 192 -227 -143 29 -168 200 -329 164 437 137 -170 -68
4335 -68 -381 262 92 150 -66 54 -179 302 -85 6 -78 -185 -357 -120 -2 67 181 -87 -175 -69 -106 173
4357 173 145 -261 297 156 -61 108 40 102 154 226 157 302 28 -84 89 91 279 -39 28 -85 -128 107 -17
4380 -17 224 -13 -185 238 40 -117 86 107 -160 251 71 -63 -50 -234 -114 194 -194 -99 72 266 21
4401 21 110 -317 -179 73 128 298 -123 -49 205 87 50 137 -158 16 -24 -23 -89 -267 139 -21 -17 -81 -52 -52 43 -204
4427 -204 87 279 -303 293 -22 149 -12 -151 102 -183 218 88 -135 12 -50 72 -263 88 323 -262
4447 -262 -300 -195 -481 240 133 -9 165 136 141 35 -330 42 -220 7 242 705 536 -59 -83 50 218 245
4469 245 -25 -87 133 -80 -215 -36 -102 211 -209 -112 -137 -117 112 33 18 -34 -395 -112 -26 -16 -226 -182 -82 205
4493 205 -113 -231 119 -40 -261 339 -223 -445 -63 100 -130 33 -84 258 -103 -8 334 103 32 -139 -242
4514 -242 67 7 33 226 185 255 -166 176 -18 140 180 405 325 232 -136 175 -56 186 67 -292 201 -301
4536 -301 -138 278 39 -267 317 39 -9 -140 224 260 -199 12 -118 346 -158 -133 -226 -95 364 175 -134
4557 -134 -127 155 -73 257 50 398 96 125 34 -630 -396 -88 198 -112 177 -58 313 -13 124 36 168 -396
4579 -396 -24 330 215 133 14 -125 -221 208 -49 -228 -118 -308 102 30 -130 -99 -243 -154 163 -70 -199 -357
4601 -357 -148 381 -393 -398 -161 8 231 137 -142 78 379 -71 -11 277 -49 148 34 41 -298 -177 44 150
4623 150 -481 245 -178 -374 40 353 -157 98 85 -267 124 -151 79 -343 204 173 -199 11 70 -235 -47
4644 -47 -190 288 71 -88 -35 264 -466 -172 -117 -173 -51 56 -19 37 136 -105 150 -314 -368 -53 -160 98 -10
4667 -10 331 251 242 52 -215 38 249 -426 -89 99 -227 12 298 350 -358 122 51 133 -500 95 -71 391
4689 391 344 20 -30 147 -106 -72 -225 278 -1 342 115 -51 -232 -126 -321 66 -23 193 318 27 -134
4710 -134 -166 -143 85 69 -22 1 -61 -52 117 129 24 124 70 244 -86 -206 86 -139 236 -32 31 -203 -33 -217
4734 -217 -257 -456 -211 -75 -157 -127 -95 235 125 12 -148 -260 -243 165 162 -120 -19 52 32 -7 133 25 -180
4757 -180 15 -245 233 95 -318 -63 207 -15 -87 75 -147 247 -187 370 281 -85 -266 -209 283 -110 -45
4778 -45 400 114 -223 -108 182 -64 -283 -117 89 59 -152 -157 -262 108 -82 169 -34 139 245 181 -125 10
4800 10 130 65 -27 43 407 -355 45 125 189 177 40 47 310 81 91 -255 292 -115 99 504 -90 400 320 286
4824 286 -33 63 190 498 323 -42 32 -270 17 22 -230 -147 -189 124 140 195 235 328 98 -214 -271 193 68 104
4848 104 17 37 301 159 60 -149 -120 -84 258 -264 114 79 120 -111 -23 -132 130 178 -86 181 279 254 -51 237
4872 237 -11 -74 -172 7 130 190 13 103 95 79 46 -94 192 39 387 239 -28 -207 274 -84 -37 -46 -232 323
4896 323 -280 -162 130 -48 107 37 -33 189 -48 -27 248 -184 -164 -96 158 -391 -148 -34 -222 425 132 -33
4918 -33 89 -215 -159 -43 -15 -229 213 -135 -15 -80 99 -22 343 -150 -193 -51 335 -274 3 59 -30 -185
4940 -185 -52 236 50 -390 -49 254 -148 -264 -81 -312 -327 -464 -106 137 101 -177 -73 36 124 -123 121
4961 121 -136 102 19 203 163 -59 -69 50 104 -311 106 -112 203 231 -88 237 -161 -237 205 168 290 14
4983 14 -322 -70 204 183 30 -104 268 444 162 33 106 38 -16 -145 -140 206 -78 -114 -289 -84 -248 -234 -57
5006 -57 134 77 -435 -329 93 -140 74 -29 74 406 76 33 69 63 -202 -46 -158 147 105 72 -309 209 153
5029 153 131 194 157 135 -1 284 159 -64 193 147 129 -56 -166 -46 326 -33 132 -228 30 325 143 127
5051 127 148 245 487 87 413 -56 198 -153 -338 -222 96 242 321 -122 259 201 113 -80 -82 197 -75 38
5073 38 -83 391 233 102 407 122 -161 144 100 -261 278 168 -29 230 365 391 -138 65 -236 430 19
5094 19 -58 48 -28 -83 -134 -180 -123 -217 -184 221 -270 135 232 -25 32 211 103 -29 70 89 457 27 2 -124 -44
5119 -44 -111 127 14 151 390 423 -210 -43 337 -57 -2 -61 91 -56 227 -173 342 277 283 -91 300 27 293
5142 293 -130 -1 250 -197 15 -32 239 -37 -119 15 13 -203 -27 -19 43 -118 280 143 -65 -257 11 -147
5164 -147 130 282 -201 175 117 200 37 -220 25 -374 327 101 -235 -293 145 -153 -375 297 -55 -116 47
5185 47 49 358 -217 -28 6 80 -10 -131 -396 95 46 -82 139 38 -215 -106 95 -209 -409 -286 185 -323
5207 -323 -201 -16 -130 69 -130 -239 -408 65 -253 17 142 30 73 -194 -68 -110 162 195 -56 102 -268
5228 -268 -68 280 241 10 151 242 63 138 189 302 -69 39 -272 314 58 -4 183 152 213 373 -86 -58 -16
5251 -16 -114 -83 -145 214 122 -185 -59 -179 -11 -337 97 -53 -86 -146 43 -171 25 -263 -327 8 105 -381 65
5274 65 249 43 -45 -171 -352 33 -20 -312 229 36 40 -71 125 97 142 184 65 -47 -64 -249 -111 579 128
5297 128 54 -18 -60 164 -315 -107 -62 145 107 252 -28 169 16 43 13 -1 -102 62 -406 101 29 -49 -404
5320 -404 -93 -67 324 176 -407 -106 4 101 375 204 -124 93 98 -159 260 -23 49 -149 182 163 -102 66
5342 66 48 237 -110 -145 70 357 -226 -88 35 -206 -118 126 -80 86 268 341 -174 8 150 126 36 -140
5364 -140 36 39 -224 -164 127 193 -39 42 -108 264 6 -289 198 -187 39 -63 129 -147 -216 29 -67 122
5386 122 -6 77 342 325 327 -117 211 -152 -67 143 -215 -358 189 -49 261 -230 446 150 -41 127 13 -315
5408 -315 -44 -72 -240 286 331 218 -94 -107 -230 18 -395 68 -157 -185 319 -177 39 -351 157 -150 -180 75
5430 75 -96 45 5 -160 186 -43 268 13 115 -263 -64 -20 228 93 -276 -65 -206 96 64 -100 281
5451 281 40 196 137 337 308 59 -154 228 261 -407 -223 -156 283 47 -215 -89 -55 -100 -6 91 143 -46 203
5474 203 235 -138 -44 4 25 172 -138 -99 39 -45 83 -442 -19 179 -162 161 -53 70 305 -257 -384 -256
5496 -256 -206 142 82 30 198 -87 -17 119 228 64 -243 22 51 67 -329 58 66 147 -188 -210 -88 -241 -174 113
5520 113 -318 -30 -86 -119 -265 326 -314 58 352 -282 -58 -162 -152 337 115 -204 -139 -67 -101 296 16 331
5542 331 341 303 -47 -45 43 -277 231 -157 363 -53 -101 279 -91 34 86 53 83 53 -21 -64 452 -212 36 253
5566 253 -362 -144 -47 -224 -17 -25 147 -85 122 104 126 167 -401 -489 124 -169 -421 62 -225 319 171 -117
5588 -117 300 140 136 129 43 187 -123 -131 70 -368 320 -88 -4 41 66 -258 381 -97 -142 202 66 344 59 -248
5612 -248 261 -59 -102 3 8 22 24 -136 15 -110 -106 33 266 50 -167 234 79 445 219 100 -143 75 -161
5635 -161 18 -119 18 -43 130 220 -8 -259 -39 181 -198 -526 136 -68 107 41 -43 -34 195 279 -60 114
5657 114 -239 183 -213 100 -180 -248 -186 -129 -205 -116 -92 67 77 147 -91 -217 -96 -318 -60 -344 -206 171 -194
5680 -194 45 -100 19 -181 -254 -37 -383 -430 -186 41 116 74 238 -50 -89 137 137 277 -133 -231 -78 -69 -67 -32
5704 -32 131 181 275 39 -47 132 32 -161 -97 372 17 -10 45 236 -388 -85 -64 168 323 -304 -334 26 113
5727 113 32 392 -12 -343 -205 -33 -56 34 -80 -131 -21 -49 -63 165 -473 222 47 187 183 -265 -194 58 39
5750 39 364 -58 -2 286 227 103 156 156 221 174 248 173 -122 -34 -86 -147 -47 -174 -138 34 185 -61 -151 -6 -183
5775 -183 -111 51 135 -208 241 73 35 -319 345 -128 235 -65 18 76 -162 101 -175 78 317 -191 187 293
5797 293 193 -260 -49 36 123 -16 188 158 102 66 -16 -77 430 49 -161 -110 -231 -205 -354 295 -267 69 -60
5820 -60 321 246 -151 -136 -120 -407 -111 -162 -128 -75 -249 143 -426 -287 366 -278 45 -241 52 208 202 -330 -49
5843 -49 151 -126 -179 105 338 24 241 -50 -11 324 13 40 251 -148 363 261 -168 144 127 -63 253 -184
5865 -184 0 -8 -206 92 162 152 18 113 73 -52 85 152 105 141 -133 -45 -7 -76 318 -123 290 -168 -15 172
5889 172 -372 -253 -127 20 121 -16 -160 383 -218 178 42 145 -1 194 65 283 -229 -331 246 129
5909 129 -62 82 -56 206 94 215 -226 -425 -72 144 -112 -94 112 20 -70 20 -86 270 -87 -10 113 44
5931 44 -235 109 -72 11 287 -282 -37 -86 235 -120 -277 263 21 10 92 -61 185 -3 -129 -307 402 19
5953 19 -264 -106 -113 109 123 -221 177 152 183 108 -26 165 -10 39 -84 -156 326 -231 13 250 -163 -276 -220
5976 -220 -310 32 -59 -152 -93 -27 313 99 57 -311 -168 -107 334 230 -254 -267 80 -159 -111 107 -275 48 8
5999 8 297 56 206 101 -48 -295 -113 18 232 -281 36 63 102 160 7 62 -33 46 119 353 -225 -33 -83
6022 -83 -65 171 -56 137 193 168 -190 -102 153 262 -38 131 -69 -216 -357 -32 148 10 228 -226 -266 204
6044 204 15 55 208 148 -208 106 12 58 -30 251 227 -287 177 -86 -27 112 137 319 -79 -176 -304 116 150
6067 150 -105 234 -99 141 47 -41 -64 98 63 -160 -163 -75 30 -71 -229 335 195 -149 73 125 -46 68 107
6090 107 -51 209 15 -134 76 -143 298 80 -208 -107 -39 -108 -270 52 -173 173 -140 -130 -133 -68 123 -324
6112 -324 298 -225 6 -38 -239 64 188 236 297 298 -97 -105 53 -91 58 36 -83 190 -220 -353 -292 -191 -473
6135 -473 145 173 -115 183 -119 244 -518 497 -388 117 203 163 89 -176 132 206 20 -244 162 -142 -245
6156 -245 -116 -62 -312 -65 173 387 92 543 -50 -261 -84 -75 -107 111 -102 116 -49 -278 -124 -32 -70 -229
6178 -229 -61 -5 114 -2 -119 262 58 -374 -273 134 -99 -86 -83 -43 -173 -188 -617 -81 -125 -69 -316 95 -156
6201 -156 -181 292 251 -33 -199 -115 117 -170 -14 -277 -126 -213 90 200 103 109 -166 -51 -266 243 100 18 -288
6224 -288 225 -340 -130 475 165 166 -154 77 232 45 -232 -241 333 -217 169 -145 -281 115 126 -105 -114 217
6246 217 185 295 -188 326 196 93 -102 234 -67 146 326 -151 -86 -240 361 -71 -143 -124 -22 -41 -137 351
6268 351 -152 13 -171 -202 140 -329 301 155 -87 68 -34 -4 -118 -27 86 129 -509 -78 -171 -154 -178 23
6290 23 -399 269 228 -17 27 -163 -201 277 349 215 -199 -38 -53 28 -199 245 -116 85 501 5 -6 -70 245
6313 245 41 178 -303 184 -1 -300 193 162 -158 30 -183 58 -143 138 146 -105 89 185 104 -377 180 -64
6335 -64 -174 13 57 8 -322 242 -238 44 -146 -120 291 92 284 77 78 118 -462 12 -39 33 -36 344 -17
6358 -17 -58 6 -243 105 -271 -138 212 -79 51 55 228 155 -107 62 311 -111 63 128 250 -62 391 351 178
6381 178 58 192 57 19 79 356 41 -259 -445 -119 -20 -367 -237 32 -49 -84 -302 -218 -207 25 472 287
6403 287 -154 -233 -150 -288 108 -243 433 -104 -103 149 142 1 -58 29 18 -114 247 381 -52 -144 -117 368 188 189
6427 189 -16 103 -7 141 -372 -44 -116 21 194 -197 10 543 75 -269 16 5 155 -106 81 -72 37
6448 37 196 49 -87 -518 -173 23 -234 165 73 28 -262 211 139 104 -77 -312 16 7 137 -18 -19 -127 160
6471 160 -96 -102 76 -106 -31 -1 61 -230 -88 -284 430 72 3 -172 4 333 61 116 229 -247 -191 -30 9
6494 9 310 167 -120 -8 -74 81 -208 163 -75 -80 -269 -22 221 -195 268 -372 64 -90 -9 -61 -269 -325 164
6517 164 217 337 310 -111 -246 237 265 -70 -184 173 -37 -193 74 -127 127 -387 72 90 219 31 -148
6538 -148 38 273 -79 325 5 9 -179 342 100 -165 66 116 177 68 -278 -254 -92 -350 347 240 -130 200
6560 200 -72 58 60 56 -147 78 -367 -172 212 -316 -142 212 149 435 -47 61 -245 -69 171 -88 204 54
6582 54 2 -73 -11 180 -12 108 -51 -37 -133 -253 -43 166 -15 112 -337 96 183 41 -526 -103 105 118 -6
6605 -6 50 -91 -166 539 217 4 -46 -327 71 -43 -85 -250 -56 140 82 -31 120 23 45 292 70 -46 155
6628 155 403 97 57 474 310 140 100 143 -110 275 469 18 132 -375 -151 -101 283 82 -114 -138 173 -16
6650 -16 24 364 178 92 75 162 68 -284 -194 -31 -219 -264 -400 -15 -69 -247 303 -71 -438 -363 -289 -146 97 322
6674 322 162 97 -215 78 -50 468 -31 21 -15 -52 -95 40 -170 216 21 -184 28 -102 65 -57 -263 -128
6696 -128 149 321 369 -104 336 -181 -54 -6 230 45 107 40 -50 32 -58 -121 156 -277 -50 269 137 180 -486
6719 -486 77 92 -122 -310 1 -198 183 -102 -238 -397 205 14 278 -175 106 -356 -95 -78 -165 -141 -242
6740 -242 -255 166 40 -31 -130 96 45 24 -141 109 6 173 23 -334 0 -21 -156 -85 58 -59 242 -70
6762 -70 -96 245 0 -36 -136 344 -59 208 31 -290 382 -133 -193 -119 190 -408 46 226 -136 64 -213 -241
6784 -241 -89 143 292 -69 55 -19 -317 -292 115 123 216 -149 -149 -359 4 239 -82 56 59 -170 239 64 86
6807 86 -18 -116 152 -31 7 -46 -22 -71 -113 164 -9 -200 85 254 -307 44 62 -90 -43 -254 354 55 -169
6830 -169 -106 75 -50 543 -81 260 149 379 308 -240 -35 16 9 -547 11 143 75 317 -92 453 -13 163
6852 163 139 43 -155 484 -78 -39 73 -85 -86 -176 117 -224 -260 -273 10 392 307 -435 46 228 -26 -127 239
6875 239 42 245 143 -90 21 -146 268 220 -71 149 -206 426 82 -33 191 -68 167 141 127 73 -215
6896 -215 -104 248 -21 446 -417 76 212 -217 -186 -242 80 23 23 78 56 -75 -176 -104 174 87 -33 140 86
6919 86 -35 -20 100 -103 18 -223 -89 -278 21 -9 -377 -441 122 -74 46 -137 -301 256 -130 34 18 -152
6941 -152 320 75 287 -214 192 1 2 -193 -38 315 -23 154 -234 15 157 -142 43 146 -276 39 -40
6962 -40 -5 -273 -64 116 66 230 -209 53 242 244 -332 -104 35 -74 -69 18 117 213 127 7 -417 -273 4 1
6986 1 -240 27 233 87 62 1 232 278 -230 194 -165 203 -177 201 6 56 35 -168 241 175 143 -563 53
7009 53 23 -90 17 -116 91 -314 14 -13 177 -93 -123 41 38 156 78 -190 -33 -178 -68 -345 26 144
7031 144 -292 -191 -238 -65 -5 294 -189 161 155 121 143 -35 248 -58 -157 166 328 300 102 296 303 -166 24
7054 24 -222 291 278 456 -54 -348 -38 -113 -35 -23 -223 -357 72 -241 232 -1 -151 -14 -345 -579 -131 51
7076 51 -239 355 -315 2 113 -246 -3 96 -38 57 -198 206 129 86 132 287 64 40 -228 72 -27 -179 -9
7099 -9 136 -132 287 -107 127 8 -208 -45 -100 45 258 279 149 200 284 -61 -3 -293 194 3 -199 152
7121 152 -111 268 -300 105 -465 29 0 -236 -22 25 208 -124 54 -563 -305 -383 100 -74 143 -56 245
7142 245 19 11 -142 -308 158 148 214 295 -146 252 -158 -39 277 -194 -248 437 176 420 150 279 -97 -71
7164 -71 101 -226 212 -219 406 21 6 139 -98 80 -97 -337 -289 -35 -142 -144 -55 -416 -153 -460 177 163
7186 163 6 -52 -170 181 63 -76 -63 98 -350 116 142 -83 77 -404 10 76 153 210 110 99 12 -314 203
7209 203 186 22 -26 38 -51 19 120 74 230 -187 239 154 240 141 140 -147 329 -289 -6 22 1 -281 -377 10 81
7234 81 -71 -277 -30 112 433 251 -294 -186 -226 341 184 9 -71 -433 -126 -56 182 27 -33 465 -98 114
7256 114 85 129 4 -22 220 -329 221 -323 -37 -365 82 104 586 285 44 66 -28 -67 -22 26 297 -375 393
7279 393 87 -5 -468 187 -675 134 -191 -18 -191 -64 338 125 414 -228 52 78 -344 97 448 -38 -198
7300 -198 -52 -321 146 -343 128 298 28 131 -125 -171 -90 208 -54 158 -229 161 -87 289 -28 224 -285
7321 -285 -142 76 239 -98 -9 -200 -269 -3 257 -12 358 71 281 85 -65 -81 -204 91 -441 -155 -233
7342 -233 -8 -35 270 -109 -113 59 85 302 -141 -226 -190 58 -217 113 -143 -517 -203 -55 167 -211 73 48
7364 48 286 -416 277 138 164 123 -7 242 -188 24 -147 -150 -51 60 -255 102 80 142 152 94 -238 198 -19
7387 -19 -79 -91 -71 -18 79 -16 -118 -23 39 321 -182 60 192 33 -310 265 -26 166 57 -27 35 35 -147 -19
7411 -19 98 -153 46 -401 265 -352 391 17 49 -84 28 -71 -121 219 18 194 122 65 -92 36 -168 -60
7433 -60 -125 11 308 -166 -6 138 18 -45 71 -262 76 426 -71 171 30 111 62 -267 -53 62 578 169
7455 169 115 301 62 -55 92 160 -63 -14 131 184 -35 140 191 -108 -315 219 -163 160 -164 96 -350 -437
7477 -437 -69 -42 -200 440 -83 133 293 157 -419 -105 -174 -339 -71 -169 109 -226 205 -423 -271 101 -245
7498 -245 18 307 -35 -346 -91 108 -95 -129 49 117 -39 242 130 159 205 164 -141 -339 50 74 -36 112
7520 112 5 170 234 119 -294 -124 28 -75 5 178 -196 96 -7 -95 -52 -159 124 -38 -232 -289 65 -72
7542 -72 8 -70 221 118 3 332 72 360 430 -110 -163 341 60 -368 -2 -21 75 -187 -202 77 246 238 357
7565 357 411 73 102 -146 -37 361 -147 189 315 -19 -37 -99 69 -127 -164 107 -115 72 -77 -121 -245 -94
7587 -94 -104 -14 -244 100 111 -163 -60 164 106 35 -71 -146 -204 -39 91 101 -79 158 -42 -354 12 -78 -258
7610 -258 221 9 145 115 -281 -58 22 -239 166 -5 -157 -66 154 25 259 -156 70 201 190 -157 -144 -238
7632 -238 -370 44 -28 31 263 -169 -281 216 -23 380 -271 266 -172 281 -231 -62 11 201 47 25 -90
7653 -90 -6 314 -128 34 -172 -214 -29 155 -132 -90 -96 15 -33 12 235 168 -339 -76 -197 233 466 -151 29
7676 29 145 32 38 77 -299 -76 81 150 -146 140 -206 -210 -233 104 -263 -134 122 -110 -208 -275 -100 -15 246 294
7700 294 249 90 326 93 -366 -252 -159 -482 277 -19 -199 -158 200 -21 70 217 300 -341 279 -255 -195 -100
7722 -100 2 173 -311 118 -40 213 -142 217 -225 286 -114 314 -111 565 -145 -228 -141 285 249 -239 -18
7743 -18 -118 224 -259 180 -26 124 -150 -69 -15 147 173 379 426 -87 207 -248 -107 255 91 -174 384 -25
7765 -25 137 -46 -134 326 314 84 -133 -87 -164 201 394 152 -151 -36 -49 146 233 -52 -148 1 -184 -189 24
7788 24 -100 202 249 -329 -113 44 59 -238 -427 481 179 -237 -45 167 -226 1 -241 148 -83 -41 98
7809 98 -93 -212 -416 77 -229 -23 -55 439 82 -1 102 -244 69 -252 162 142 -264 -330 225 460 -126 212
7831 212 309 -35 100 -201 193 334 51 -188 -304 49 330 -5 -303 64 155 20 99 -130 217 178 -249
7852 -249 -34 -474 -89 -32 115 107 -129 157 110 91 -234 -119 91 61 -266 43 282 57 142 -5 182 -164
7874 -164 167 -340 68 -79 -139 -68 273 113 471 215 329 301 -72 126 292 -403 74 93 110 179 224 65
7896 65 -244 -389 -237 1 -117 237 -110 70 -169 25 -4 126 286 68 230 132 164 -316 109 -293 55
7917 55 -354 459 26 -505 133 -37 -91 97 164 298 214 78 236 118 -145 99 275 96 183 -510 -160 -11
7939 -11 112 246 -99 -186 114 93 -15 -25 360 105 -163 97 -32 137 55 263 13 65 297 -38 -97 -21 146
7962 146 -41 252 70 402 -213 -85 449 -84 375 152 -49 -270 143 366 -381 283 -71 19 73 502 -52
7983 -52 337 -211 -108 -15 -255 -293 24 40 46 20 -53 497 -343 -109 -181 407 55 -5 188 -201 -196 108 103 126 144
8008 144 -157 -319 428 27 -159 87 -77 113 -360 86 -250 73 -48 -115 -256 119 -186 -342 -370 354 32
8029 32 62 35 37 236 -362 -183 68 34 -65 -186 -230 247 -89 336 97 15 -50 -44 -30 -313 -64 -356 232 -42
8053 -42 -48 -213 156 140 -30 214 -334 -140 -230 123 -85 14 -295 16 184 -148 -144 -165 -159 -60 -125 -94 143 -53 -366
8078 -366 217 -208 87 -169 169 68 152 -165 291 92 -32 9 236 -4 257 97 -180 -200 -423 -37 145
8099 145 229 39 -236 47 -180 -554 -215 38 -292 -108 -67 -337 14 238 -169 -1 -16 24 -139 2 -104
8120 -104 28 -179 -150 352 -67 -2 -187 -20 -44 115 -333 204 236 43 186 407 63 117 104 180 -23 -50 52
8143 52 -110 243 253 28 -90 -66 101 15 -78 -34 -186 10 -290 -112 107 26 -70 8 177 -91 -36 52 271 -33
8167 -33 -121 117 -218 -168 45 92 225 98 213 10 23 -61 -97 -266 7 -432 102 -19 336 77 102 -93 82
8190 82 194
8191A94
##END NTUPLES=NMR FID
##END=
