##TITLE=c13 ikalashn
DE2_HCl
27.7.2023
##JCAMPDX= 6.0         $$ Bruker NMR JCAMP-DX V2.0
##DATA TYPE= NMR SPECTRUM
##DATA CLASS= NTUPLES
##ORIGIN= UXNMR, Bruker Analytische Messtechnik GmbH
##OWNER= root
$$ TOPSPIN		Version 1.3
$$ 2023-07-27 08:54:10.734 +0400  Irina@DPX200
$$ Compression mode = diff/dup
##.OBSERVE FREQUENCY= 50.3282639994
##.OBSERVE NUCLEUS= ^13C
##.ACQUISITION MODE= SIMULTANEOUS
##.ACQUISITION SCHEME= undefined
##.AVERAGES= 17380
##.DIGITISER RES= 17
##SPECTROMETER/DATA SYSTEM= spect
##.PULSE SEQUENCE= zgpg
##.SOLVENT NAME= D2O
##.SHIFT REFERENCE= INTERNAL, D2O, 1, 229.5227
##AUDIT TRAIL= $$ (NUMBER, WHEN, WHO, WHERE, WHAT)
$$ ##TITLE= Audit trail, TOPSPIN		Version 1.3
$$ ##JCAMPDX= 5.01
$$ ##ORIGIN= Bruker BioSpin GmbH
$$ ##OWNER= Irina
$$ $$ F:/spectra/data/iren/nmr/c13zvl/1/pdata/1/auditp.txt
$$ ##AUDIT TRAIL=  $$ (NUMBER, WHEN, WHO, WHERE, VERSION, WHAT)
(   1,<2023-07-27 08:47:30.406 +0400>,<Irina>,<DPX200>,<TOPSPIN 1.3>,
      <created by zg
	started at 2023-07-26 16:13:54.593 +0400,
	POWCHK disabled, PULCHK disabled
       terminated by command 'halt'
       configuration hash MD5:
       BE 6D 3F 07 2A EA 11 49 91 17 2B D3 AF B3 58 0D
       data hash MD5: 32K
       85 22 81 D9 74 02 95 A1 B1 E8 23 55 12 5A 7E F9>)
(   2,<2023-07-27 08:49:19.390 +0400>,<Irina>,<DPX200>,<TOPSPIN 1.3>,
      <Start of raw data processing
       efp BC_mod = 2 LB = 2 FT_mod = 6 PKNL = 1 PHC0 = -189.577 PHC1 = -0.9445732 SI = 32K 
       data hash MD5: 32K
       14 B9 17 CC F9 FE FF 6A 47 9A 2A 3D 3F 15 9B C2>)
(   3,<2023-07-27 08:49:36.062 +0400>,<Irina>,<DPX200>,<TOPSPIN 1.3>,
      <pk fgphup PHC0 = 8.661181 PHC1 = -5.2 
       data hash MD5: 32K
       E0 53 0F 01 56 B6 0F BB 47 D6 E7 81 90 36 8F 12>)
(   4,<2023-07-27 08:49:37.781 +0400>,<Irina>,<DPX200>,<TOPSPIN 1.3>,
      <abs n ABSG = 5 
       data hash MD5: 32K
       2C 4C 6A 61 1A 80 7E EA F8 66 55 78 D6 E4 0A 7F>)
(   5,<2023-07-27 08:53:08.093 +0400>,<Irina>,<DPX200>,<TOPSPIN 1.3>,
      <abs n ABSG = 5 
       data hash MD5: 32K
       88 DE 17 62 27 D8 E4 6D 7E A4 D9 9C 60 8E 05 FE>)
(   6,<2023-07-27 08:53:12.328 +0400>,<Irina>,<DPX200>,<TOPSPIN 1.3>,
      <abs n ABSG = 5 
       data hash MD5: 32K
       53 4D E8 4B 88 0F 9F 3A F5 3D 86 C4 1E 14 87 AE>)
(   7,<2023-07-27 08:53:15.953 +0400>,<Irina>,<DPX200>,<TOPSPIN 1.3>,
      <abs n ABSG = 5 
       data hash MD5: 32K
       4B B3 82 8E 7A EB D5 52 D9 A9 6E 97 5C 9A 08 F9>)
(   8,<2023-07-27 08:53:19.562 +0400>,<Irina>,<DPX200>,<TOPSPIN 1.3>,
      <abs n ABSG = 5 
       data hash MD5: 32K
       C5 DA 04 0D E6 CD 3D 04 27 B2 E5 AC FE B1 FC 58>)
(   9,<2023-07-27 08:53:29.500 +0400>,<Irina>,<DPX200>,<TOPSPIN 1.3>,
      <abs n ABSG = 5 
       data hash MD5: 32K
       9D 44 6C 98 FE 2A 73 5C 7E 1F 4E 83 A6 88 09 D4>)
$$ ##END=
$$ 
$$ $$ hash MD5
$$ $$ 88 60 DF 03 56 9D 2D F9 8B C2 0A CB 69 27 24 20
##$RELAX= 
##$RELAX= 
##$RELAX= 
##$RELAX= 
##$RELAX= 
##$RELAX= 
##$RELAX= 
##$RELAX= 
##$RELAX= 
$$ [...]
##$SW= 238.244014814496
##$SWIBOX= (0..15)
0 1 3 0 0 0 0 0 0 0 0 0 0 0 0 0 
##$SW_h= 11990.4076738609
##$TD= 32768
##$TD0= 1
##$TE= 300
##$TE2= 300
##$TE3= 300
##$TEG= 300
##$TL= (0..7)
120 120 120 120 120 120 120 120 
##$TP= (0..7)
150 150 150 150 150 150 150 150 
##$TP07= 0
##$TPNAME0= <>
##$TPNAME1= <>
##$TPNAME2= <>
##$TPNAME3= <>
##$TPNAME4= <>
##$TPNAME5= <>
##$TPNAME6= <>
##$TPNAME7= <>
##$TPOAL= (0..7)
0.5 0.5 0.5 0.5 0.5 0.5 0.5 0.5 
##$TPOFFS= (0..7)
0 0 0 0 0 0 0 0 
##$TUNHIN= 0
##$TUNHOUT= 0
##$TUNXOUT= 0
##$USERA1= <user>
##$USERA2= <user>
##$USERA3= <user>
##$USERA4= <user>
##$USERA5= <user>
##$V9= 5
##$VALIST= <valist>
##$VCLIST= <CCCCCCCCCCCCCCC>
##$VD= 0
##$VDLIST= <DDDDDDDDDDDDDDD>
##$VPLIST= <PPPPPPPPPPPPPPP>
##$VTLIST= <TTTTTTTTTTTTTTT>
##$WBST= 1024
##$WBSW= 4
##$XGAIN= (0..3)
0 0 0 0 
##$XL= 0
##$YL= 0
##$YMAX_a= 8003462
##$YMIN_a= -25672641
##$ZGOPTNS= <>
##$ZL1= 120
##$ZL2= 120
##$ZL3= 120
##$ZL4= 120
##$ABSF1= 229.5227
##$ABSF2= -8.747604
##$ABSG= 5
##$ABSL= 3
##$ALPHA= 0
##$AQORDER= 0
##$ASSFAC= 0
##$ASSFACI= 0
##$ASSFACX= 0
##$ASSWID= 0
##$AUNMP= <proc_1d>
##$AXLEFT= 0
##$AXRIGHT= 0
##$AXTYPE= 0
##$AXUNIT= <>
##$AZFE= 0.1
##$AZFW= 0.5
##$BCFW= 0
##$BC_mod= 2
##$BYTORDP= 0
##$COROFFS= 0
##$CY= -3
##$DATMOD= 1
##$DC= 0
##$DFILT= <>
##$DTYPP= 0
##$F1P= 0
##$F2P= 0
##$FCOR= 0.5
##$FTSIZE= 32768
##$FT_mod= 6
##$GAMMA= 0
##$GB= 0
##$INTBC= 1
##$INTSCL= 1.406111e-010
##$ISEN= 30
##$LB= 2
##$LEV0= 0
##$LPBIN= 0
##$MAXI= 7.640843
##$MC2= 0
##$MEAN= 0
##$ME_mod= 0
##$MI= 1.154659
##$NCOEF= 0
##$NC_proc= -3
##$NLEV= 6
##$NOISF1= 0
##$NOISF2= 0
##$NSP= 0
##$NTH_PI= 0
##$NZP= 0
##$OFFSET= 229.5227
##$PC= 1.4
##$PHC0= -180.9158
##$PHC1= -6.144573
##$PH_mod= 1
##$PKNL= yes
##$PPARMOD= 0
##$PPDIAG= 0
##$PPIPTYP= 0
##$PPMPNUM= 100
##$PPRESOL= 1
##$PSCAL= 0
##$PSIGN= 0
##$REVERSE= no
##$SF= 50.322709
##$SI= 32768
##$SIGF1= 0
##$SIGF2= 0
##$SINO= 80
##$SIOLD= 32768
##$SREGLST= <13C.CDCl3>
##$SSB= 0
##$STSI= 32768
##$STSR= 0
##$SW_p= 11990.4076738609
##$SYMM= 0
##$S_DEV= 0
##$TDeff= 32768
##$TDoff= 0
##$TI= <>
##$TILT= no
##$TM1= 0
##$TM2= 0
##$TOPLEV= 0
##$USERP1= <user>
##$USERP2= <user>
##$USERP3= <user>
##$USERP4= <user>
##$USERP5= <user>
##$WDW= 1
##$XDIM= 32768
##$YMAX_p= 175773744
##$YMIN_p= -145834006
$$ End of Bruker specific parameters
$$ ---------------------------------
##NTUPLES= NMR SPECTRUM
##VAR_NAME=  FREQUENCY,     SPECTRUM/REAL,   SPECTRUM/IMAG
##SYMBOL=    X,             R,               I
##VAR_TYPE=  INDEPENDENT,   DEPENDENT,       DEPENDENT
##VAR_FORM=  AFFN,          ASDF,            ASDF
##VAR_DIM=   32768,         32768,           32768
##UNITS=     HZ,            ARBITRARY UNITS, ARBITRARY UNITS
##FACTOR=    0.365929370215793, 1,           1
##FIRST=     11990.4076738609, -1018753,     16472311
##LAST=      0,             -145834006,      -32495879
##MIN=       0,             -145834006,      0
##MAX=       11990.4076738609, 175773744,    0
$$ Real data points
##PAGE= N=1
##DATA TABLE= (X++(R..R)), XYDATA
$$ [...]
##PAGE= N=2
##DATA TABLE= (X++(I..I)), XYDATA
28508A44453850k79550q819J80103K15796K15592J23144K7061M1675J08229J61898
$$ 144453850 144174300 144165481 144345584 144561380 144776972 144900116 144927177 144968852 145077081 145238979
28498A45238979K28813J18496j22397k17669j25502R4308K73817K67565J41579
$$ 145238979 145467792 145586288 145463891 145246222 145120720 145215028 145488845 145756410 145897989
28489A45897989k2017j64501k40095k70919k35944j30251M8551J72130J62476
$$ 145897989 145875972 145711471 145471376 145200457 144964513 144834262 144882813 145054943 145217419
28480A45217419Q7746j6894k5478R8413J50489J02945R8803M6519m1152k8940
$$ 145217419 145305165 145288271 145262793 145361206 145511695 145614640 145713443 145759962 145718810 145689870
28470A45689870P002M0654J02730K01041J74664m7171j84919j77691k43288l18396
$$ 145689870 145696872 145737526 145840256 146041297 146215961 146168790 145983871 145806180 145562892 145244496
28460A45244496k20973j05073r2344j08723j05490n1207O3218J26669N2680o4677
$$ 145244496 145023523 144918450 144826106 144717383 144611893 144560686 144623904 144750573 144803253 144738576
28450A44738576J42J14452J08351M1058p2245j85609l24173l95075k01898Q3170
$$ 144738576 144738718 144853170 144961521 145002579 144930334 144744725 144420552 144025477 143823579 143906749
28440A43906749J11354j03572l38962m34583l32699q2642J77689L20731K75757
$$ 143906749 144018103 143914531 143575569 143140986 142808287 142725645 142903334 143224065 143499822
28431A43499822J70526J27995P3626j1979p5203j02730j23837j10815N7606L06054
$$ 143499822 143670348 143798343 143871969 143859990 143784787 143682057 143558220 143447405 143505011 143811065
28421A43811065M67331M69996K31243M169j7481Q9555K17283K24353J70896K19874
$$ 143811065 144278396 144748392 144979635 144983804 144966323 145055878 145273161 145497514 145668410 145888284
28411A45888284K73827K66238J53314o5551k89052m47394m79055l56494j39485
$$ 145888284 146162111 146428349 146581663 146516112 146227060 145779666 145300611 144944117 144804632
28402A44804632J0142p743j73652l20480m12015m02911j85312J39718L14721J78490
$$ 144804632 144814774 144807031 144633379 144312899 143900884 143497973 143312661 143452379 143767100 143945590
28392A43945590m2244j35293q4986O822P2502J12450J22954J57864J98072J65568
$$ 143945590 143903346 143768053 143683067 143689889 143762391 143874841 143997795 144155659 144353731 144519299
28382A44519299J00909R8868K7829j64868k69460j56380J01499K89768K85399
$$ 144519299 144620208 144719076 144746905 144582037 144312577 144156197 144257696 144547464 144832863
28373A44832863K18837M9967k04849m11206n64054n39331k67041L3820K23345
$$ 144832863 145051700 145101667 144896818 144485612 143921558 143382227 143115186 143149006 143372351
28364A43372351K54995J54222J07601J25352J63800J57858K9890k5245n1989l5263
$$ 143372351 143627346 143781568 143889169 144014521 144178321 144336179 144366069 144340824 144288835 144253572
28354A44253572J38077K21255J79630R5927Q72j36893k46744k44768j32427p2370
$$ 144253572 144391649 144612904 144792534 144888461 144889333 144752440 144505696 144260928 144128501 144056131
28344A44056131k25908l79971l82225k61458j83583j83303j37049l8190J52794
$$ 144056131 143830223 143450252 143068027 142806569 142622986 142439683 142302634 142264444 142417238
28335A42417238M68088O84247O59485N00894M05475L70731L37770K78760K02762
$$ 142417238 142885326 143569573 144229058 144729952 145135427 145506158 145843928 146122688 146325450
28326A46325450J69624K63205L06353Q9353k48003n06456m95367l26971k36654
$$ 146325450 146495074 146758279 147064632 147153985 146905982 146399526 145904159 145577188 145340534
28317A45340534j58266j34294k15053l45735l97531k85944j16374l9185j7734
$$ 145340534 145182268 145047974 144832921 144487186 144089655 143803711 143687337 143648152 143630418
28308A43630418J48939M45901O68985O74017M76583J71087j09100l56987m37156
$$ 143630418 143779357 144225258 144894243 145568260 146044843 146215930 146106830 145749843 145312687
28299A45312687l38185k67344k42256k57211j54342J68604L49075J54910j40874
$$ 145312687 144974502 144707158 144464902 144207691 144053349 144221953 144571028 144725938 144585064
28290A44585064l23447m12854l23815j28471q9122j82338k13722j37324M4784
$$ 144585064 144261617 143848763 143524948 143396477 143307355 143125017 142911295 142773971 142818755
28281A42818755K38736L19192K59467J56257J18871K24398L64141L78643K10621
$$ 142818755 143057491 143376683 143636150 143792407 143911278 144135676 144499817 144878460 145089081
28272A45089081q0461k93812l17015k59786k20266j88715m4407K02597K95774
$$ 145089081 145008620 144714808 144397793 144138007 143917741 143729026 143684619 143887216 144182990
28263A44182990K50663J57651L7903j0124n2828j95490l09228l35716l15283k02676
$$ 144182990 144433653 144591304 144629207 144619083 144566255 144370765 144061537 143725821 143410538 143207862
28253A43207862P39K76289M83922M31576J18401k33636k68031L5368L88876N20312
$$ 143207862 143208601 143484890 143968812 144400388 144518789 144285153 144017122 144052490 144441366 144961678
28243A44961678L30627K4247j83343k66747k86012j51596J0622M7934j1113j88532
$$ 144961678 145292305 145316552 145133209 144866462 144580450 144428854 144439476 144487410 144476297 144287765
28233A44287765l55525l86418l09531k25797j72333j15098n1449J7774J01093
$$ 144287765 143932240 143545822 143236291 143010494 142838161 142723063 142671614 142689388 142790481
28224A42790481J74093K12456J98700N4794j44291k67384k65602j48141j6719
$$ 142790481 142964574 143177030 143375730 143430524 143286233 143018849 142753247 142605106 142588387
28215A42588387J9718l0025n3824m0712o57Q8936R7879j5787j31655j45973p2112
$$ 142588387 142608105 142578080 142524256 142483544 142482887 142571823 142669702 142653915 142522260 142376287 142304175
28204A42304175p611N9267K03891K75905J20702j29095k85641k17655J5269K41011
$$ 142304175 142296564 142355831 142559722 142835627 142956329 142827234 142541593 142323938 142339207 142580218
28194A42580218L82371M14184K81443J08456K8727n5592k42409l07106j16629
$$ 142580218 142962589 143376773 143658216 143766672 143795399 143739807 143497398 143190292 143073663
28185A43073663J38125L08999L06856J72604k4352k80723l96976k28269O8465
$$ 143073663 143211788 143520787 143827643 144000247 143975895 143695172 143298196 143069927 143138392
28176A43138392J90472L8090j28660j10700J0170J37999K42919K21282J4462k42153
$$ 143138392 143328864 143366954 143238294 143127594 143137764 143275763 143518682 143739964 143754426 143512273
28166A43512273l65291l03816j19684R0710K03280K10109J86125R0535K3805O6307
$$ 143512273 143146982 142843166 142723482 142814192 143017472 143227581 143413706 143504241 143528046 143594353
28156A43594353J89986L11701K18392J0244o0357q1138j42426k25038k25524j79707
$$ 143594353 143784339 144096040 144314432 144324676 144264319 144183181 144040755 143815717 143590193 143410486
28146A43410486j61749l554K94487M70865M05164J80566K8131P8277J93767K15113
$$ 143410486 143248737 143245183 143539670 144010535 144415699 144596265 144624396 144702673 144896440 145111553
28136A45111553K19904K19965M0951j43186j94291j14553R3288J81072J6436k43741
$$ 145111553 145331457 145551422 145592373 145449187 145254896 145140343 145233631 145414703 145431139 145187398
28126A45187398l13577k36204k36338j86400Q2196L41941J87728j80107k98468
$$ 145187398 144873821 144637617 144401279 144214879 144297075 144639016 144826744 144646637 144348169
28117A44348169k76054k73094k05160q4213M2868J64406J50775L7239p4154j48918
$$ 144348169 144072115 143799021 143593861 143509648 143552516 143716922 143867697 143904936 143830782 143681864
28107A43681864j27782p1472p1940p9023K6654J70962K37263J05671j31138l11178
$$ 143681864 143554082 143482610 143410670 143331647 143358301 143529263 143766526 143872197 143741059 143429881
28097A43429881m28486l72399j25395P8511J16060N0661l9130r7765p6248M9268
$$ 143429881 143001395 142628996 142503601 142582112 142698172 142748833 142709703 142611938 142535690 142584958
28087A42584958J39616O8456N9927J50808K20691J83621K4389j13233m9584J11077
$$ 142584958 142724574 142793030 142852957 143003765 143224456 143408077 143432466 143319233 143269649 143380726
28077A43380726N7555l0156R664Q401n5154j02502o0192K3077O2878O5526J13610
$$ 143380726 143438281 143408125 143417789 143426190 143371036 143268534 143208342 143231419 143294297 143359823 143473433
28066A43473433K78681L84529K36329l741j18651n2808J00019J45221K5758j52607
$$ 143473433 143752114 144136643 144372972 144369231 144250580 144197772 144297791 144443012 144468770 144316163
28056A44316163k29224j16505J36700L45038K73993l2954k79050k33364m223N6936
$$ 144316163 144086939 143970434 144107134 144452172 144726165 144693211 144414161 144180797 144176574 144233510
28046A44233510m9405m2732N2153Q1868O467j0910m163o3002J3086J35567R9906
$$ 144233510 144184105 144141373 144193526 144275394 144281861 144270951 144266788 144203786 144216872 144352439 144452345
28035A44452345M3982Q3697M6131j74562m75038o00412m54909l53938m21122m22921
$$ 144452345 144496327 144580024 144626155 144451593 143976555 143376143 142921234 142567296 142146174 141723253
28025A41723253l07223j31632M701P7840K29037L25069K68280J44690J6981j33859
$$ 141723253 141416030 141284398 141289099 141366939 141595976 141921045 142189325 142334015 142350996 142217137
28015A42217137k64983k59143q4736J45661L32404M07685L90450K92271J16654
$$ 142217137 141952154 141693011 141608275 141753936 142086340 142494025 142884475 143176746 143293400
28006A43293400Q159n509K0158J47320K93665K62201L8653k04728l01204j97310
$$ 143293400 143301559 143296050 143316208 143463528 143757193 144019394 144058047 143853319 143552115 143354805
27996A43354805l0381j0657r5967j74849j60298l6229J27847J26165r1537j76263
$$ 143354805 143324424 143313767 143217800 143042951 142882653 142846424 142974271 143100436 143008899 142832636
27986A42832636K142N5735j63146m16260m52488j96599P7226K24829L06918K99137
$$ 142832636 142834778 142890513 142727367 142311107 141858619 141662020 141739246 141964075 142270993 142570130
27976A42570130K36987K77277L61836L53489L00584K78225K15547J14107O5522
$$ 142570130 142807117 143084394 143446230 143799719 144100303 144378528 144594075 144708182 144773704
27967A44773704p4853k08153l4953K98725M69237M09694J52756j96866n38639
$$ 144773704 144698851 144490698 144455745 144754470 145223707 145633401 145786157 145589291 145050652
27958A45050652q11724q08156n35527k50280q4950K5367J60920L14016L69303
$$ 145050652 144238928 143430772 142895245 142644965 142560015 142585382 142746302 143060318 143429621
27949A43429621J59599j28174k08678j76513j47110j82613j87702m9014P9161
$$ 143429621 143589220 143461046 143252368 143075855 142928745 142746132 142558430 142509416 142588577
27940A42588577J17901P2206L6591J32817L04722L94044K84555L9839n7061m619
$$ 142588577 142706478 142778684 142815275 142948092 143252814 143646858 143931413 143971252 143914191 143909572
27930A43909572N3928J02084P8199n470o0567j04231j30772j47645j96544k45867
$$ 143909572 143963500 144065584 144143783 144138313 144077746 143973515 143842743 143695098 143498554 143252687
27920A43252687k03504k9939J06695M0757j16404k18900k69966k89073k41201
$$ 143252687 143049183 143019244 143125939 143166696 143050292 142831392 142561426 142272353 142031152
27911A42031152j26813m5553j34023k25701j96123m1765J84651L50890L72340
$$ 142031152 141904339 141858786 141724763 141499062 141302939 141261174 141445825 141796715 142169055
27902A42169055L14465K76551K53049K42626J84421L0103m5561q1670j30198o1330
$$ 142169055 142483520 142760071 143013120 143255746 143440167 143470270 143424709 143343039 143212841 143151511
27892A43151511O8363R8173n8599k09909k18540j21956o2291j22707j00669J2308
$$ 143151511 143219874 143318047 143259448 143049539 142830999 142709043 142646752 142524045 142423376 142435684
27882A42435684J13829J28243K3365K5205J57677K21462J46467n2914j85306j60404
$$ 142435684 142549513 142677756 142701121 142726326 142884003 143105465 143251932 143199018 143013712 142853308
27872A42853308o2754J11807L32161L85970J61682o6123k22032l21112k17007
$$ 142853308 142790554 142902361 143234522 143620492 143782174 143716051 143494019 143172907 142955900
27863A42955900K4805K33231K73084J59168J22359K08559J52949r5669k13616
$$ 142955900 142980705 143213936 143487020 143646188 143768547 143977106 144130055 144034386 143820770
27854A43820770j20708l2192J35812L24197M30101L83946Q0783j86570j28774
$$ 143820770 143700062 143667870 143803682 144127879 144557980 144941926 145022709 144836139 144707365
27845A44707365O6039R0215m4279j55855j93544j82214j25815j3608N8712n7345
$$ 144707365 144773404 144863619 144819340 144663485 144469941 144287727 144161912 144148304 144207016 144149671
27835A44149671k39796k78775j85296r0519j7674K995N8927J57852J47368J51319
$$ 144149671 143909875 143631100 143445804 143355285 143337611 143340606 143399533 143557385 143704753 143856072
27825A43856072K12545J08364j19472k63902j27682P6620N8507n1132j20918j60546
$$ 143856072 144068617 144176981 144057509 143793607 143665925 143742545 143801052 143749920 143629002 143468456
27815A43468456n9248J68487L43357M50587L55558n913l14591l60260k22014M4735
$$ 143468456 143409208 143577695 143921052 144371639 144727197 144721284 144406693 144046433 143824419 143869154
27805A43869154K36235J20045j19117k03804j25334M579r530j95842l11188k45816
$$ 143869154 144105389 144225434 144106317 143902513 143777179 143781758 143772228 143576386 143265198 143019382
27795A43019382k62291l71515l82464l72517k87609o9525J25138K58261L34188
$$ 143019382 142757091 142385576 142003112 141630595 141342986 141273461 141398599 141656860 141991048
27786A41991048K97366K14329J56608J75395J65955M5332J0930J1462j9548L0861
$$ 141991048 142288414 142502743 142659351 142834746 143000701 143046033 143056963 143068425 143048877 143079738
27776A43079738J11476P1743k3327k4762J38653L53998L74536K70723J18655j6946
$$ 143079738 143191214 143262957 143239630 143214868 143353521 143707519 144082055 144352778 144471433 144454487
27766A44454487j47813k02357n6878J55502J81194j0971j95715k78430l63795
$$ 144454487 144306674 144104317 144047439 144202941 144384135 144373164 144177449 143899019 143535224
27757A43535224m50656m42057l08126q5301Q6577J18980N3166L9194K02300L31159
$$ 143535224 143084568 142642511 142334385 142249084 142335661 142454641 142507807 142547001 142749301 143080460
27747A43080460K26111L3519r7386j8289J63690J41113J3146N734O6640R8693
$$ 143080460 143306571 143340090 143242704 143224415 143388105 143529218 143542364 143548098 143614738 143713431
27737A43713431k4273l29511n28499m37315j49848l0435n9791L3590M3500j52666
$$ 143713431 143689158 143359647 142831148 142393833 142243985 142213550 142153759 142187349 142230849 142078183
27727A42078183l08953j91960J54797M23161M53716L94684L19953J49172j09082
$$ 142078183 141769230 141577270 141732067 142155228 142608944 143003628 143323581 143472753 143363671
27718A43363671l07389m18460l69115j86200k832J87755K77520J41094j42275
$$ 143363671 143056282 142637822 142268707 142082507 142079675 142267430 142544950 142686044 142543769
27709A42543769k60168j24873j4747J8877R2137J99491K30244J24758N9770N0411
$$ 142543769 142283601 142158728 142143981 142162858 142254995 142454486 142684730 142809488 142869258 142919669
27699A42919669n5492j76939j39272j00887r8945l5360R775j3612k6397P1553
$$ 142919669 142864177 142687238 142547966 142447079 142348134 142312774 142322549 142308937 142282540 142354093
27689A42354093K33414L90844M53972L62550K94392K19028P356k51398l89868
$$ 142354093 142587507 142978351 143432323 143794873 144089265 144308293 144315649 144064251 143674383
27680A43674383l42496j45228Q3771J33446n905q8327N0315K16664K27929O3768
$$ 143674383 143331887 143186659 143270430 143403876 143397971 143309644 143359959 143576623 143804552 143868320
27670A43868320j69554k50375j59136m5157j0118j48294l15345l73392l48335
$$ 143868320 143698766 143448391 143289255 143244098 143233980 143085686 142770341 142396949 142048614
27661A42048614j92656l5806m0774Q642K39147N17686O80942N55947K20074J5316
$$ 142048614 141855958 141820152 141779378 141788020 142027167 142544853 143225795 143781742 144001816 144017132
27651A44017132m3427j47404j82698q6437q4640k59643l14699j38222J862N3053
$$ 144017132 143973705 143826301 143643603 143557166 143472526 143212883 142898184 142759962 142761824 142814877
27641A42814877J55497K14912J57467k3708k97133m26966l25395o9611J15898
$$ 142814877 142970374 143185286 143342753 143319045 143021912 142594946 142269551 142199940 142315838
27632A42315838J05974J04213J80011J83401Q5803m9332k35455l56985l33868
$$ 142315838 142421812 142526025 142706036 142889437 142975240 142925908 142690453 142333468 141999600
27623A41999600k71678j86580o198K16763L22286K33212L2310r0924p1867P3690
$$ 141999600 141727922 141541342 141535144 141751907 142074193 142307405 142339715 142248791 142176924 142250614
27613A42250614K63042L78401M43918N82486O84284N77773K60436j14540m12739
$$ 142250614 142513656 142892057 143335975 143918461 144602745 145180518 145440954 145326414 144913675
27604A44913675n08587m75709n09487m44936k28455J3889K05336K30375K18190
$$ 144913675 144405088 143929379 143419892 142974956 142746501 142760390 142965726 143196101 143414291
27595A43414291L75384M71064M16216L70750K11069j48196m50918m43948k79182
$$ 143414291 143789675 144260739 144676955 145047705 145258774 145110578 144659660 144215712 143936530
27586A43936530j54847n9269K0571l7650j91927l15082l29950k44279j59549q2184
$$ 143936530 143781683 143722414 143742985 143705335 143513408 143198326 142868376 142624097 142464548 142382364
27576A42382364j3697K4443M1074O8911N9793N2402J62289K98480L28422K26086
$$ 142382364 142368667 142393110 142434184 142503095 142562888 142615290 142777579 143076059 143404481 143630567
27566A43630567l3134k05816k01828k60927m10988m56832m34191m05736k94198
$$ 143630567 143597433 143391617 143189789 142928862 142517874 142061042 141626851 141221115 140926917
27557A40926917l1025K81295M55040M87960N20843M62162K80709P3935j27020
$$ 140926917 140895892 141177187 141632227 142120187 142641030 143103192 143383901 143457836 143330816
27548A43330816k34313l13506l53429k82831k20818j65998o2438P3202J83357
$$ 143330816 143096503 142782997 142429568 142146737 141925919 141759921 141697483 141770685 141954042
27539A41954042K30343K46079J92761J04675P7877M8658j5311p6893j48060j82871
$$ 141954042 142184385 142430464 142623225 142727900 142805777 142854435 142839124 142762231 142614171 142431300
27529A42431300j60520j25246q8909K7910J92481K73002K19335J72521K07677
$$ 142431300 142270780 142145534 142056625 142084535 142277016 142550018 142769353 142941874 143149551
27520A43149551J83575J5236j66336j79554m4582L4258o7341j95526j03722J86555
$$ 143149551 143333126 143348362 143182026 143002472 142957890 142992148 142924807 142729281 142625559 142812114
27510A42812114L55184L01601J29920p6214k17125k07208j02398o4542j65716
$$ 142812114 143167298 143468899 143598819 143522605 143305480 143098272 142995874 142931332 142765616
27501A42765616l35246m25513k85031N4168L19530K95342J47063J17127J81830
$$ 142765616 142430370 142004857 141719826 141773994 142093524 142388866 142535929 142653056 142834886
27492A42834886J95232K36366L61801M05469J96247k00173m26282l91140k90527
$$ 142834886 143030118 143266484 143628285 144033754 144230001 144029828 143603546 143212406 142921879
27483A42921879k50371j44335q578k899M597L8950k4211p9702l9921N1476J10195
$$ 142921879 142671508 142527173 142518595 142515696 142520293 142559243 142535032 142455330 142415409 142466885 142577080
27472A42577080K7949j37247k97947l89932l50241k85815k32705j17925k4195
$$ 142577080 142605029 142467782 142169835 141779903 141429662 141143847 140911142 140793217 140769022
27463A40769022l6956l2211N9535J53005K12537J63697J36587K50042L46498L88831
$$ 140769022 140732066 140699855 140759390 140912395 141124932 141288629 141425216 141675258 142021756 142410587
27453A42410587L35835J51237o2028k02568k77046l29504l18937k57743j66887
$$ 142410587 142746422 142897659 142835631 142633063 142356017 142026513 141707576 141449833 141282946
27444A41282946j32807j10423J5894R9008R3845P9996J36660K65946M90486O03596
$$ 141282946 141150139 141039716 141055610 141154618 141248463 141328459 141465119 141731065 142221551 142825147
27434A42825147M22752K05262Q6763q1333k58808l53034m83868n83214m72674
$$ 142825147 143247899 143453161 143539924 143458591 143199783 142846749 142362881 141779667 141306993
27425A41306993j56773J77420L70165L71910K84016J57915L4786N9829K11476
$$ 141306993 141150220 141327640 141697805 142069715 142353731 142511646 142546432 142606261 142817737
27416A42817737K91382K03413R5540P2307Q4593n1909k71321m42915m98255l37374
$$ 142817737 143109119 143312532 143408072 143480379 143564972 143513063 143241742 142798827 142300572 141963198
27406A41963198k8895J26771l186q1766J35307L43025L44293K02229O2639L9664
$$ 141963198 141934303 142061074 142057888 141976122 142111429 142454454 142798747 143000976 143063615 143103279
27396A43103279o62r2415k36913m18481m85965l46209q0762m3046j74057j13564
$$ 143103279 143102617 143010202 142773289 142354808 141868843 141522634 141441872 141398826 141224769 141111205
27386A41111205N7141L4178j75698l12345k94714k51359k63089l12325l31409
$$ 141111205 141168346 141202524 141026826 140714481 140419767 140168408 139905319 139592994 139261585
27377A39261585k83236j9329L57002N17309M41763K05580j98790n07276m18254
$$ 139261585 138978349 138959020 139316022 139833331 140275094 140480674 140281884 139774608 139356354
27368A39356354k9732K88352L74567L55243K90444K15517J50738K9240j38224
$$ 139356354 139326622 139614974 139989541 140344784 140635228 140850745 141001483 141030723 140892499
27359A40892499k64190k90269j44573R4432L27931M64943M00643K05481P8907
$$ 140892499 140628309 140338040 140193467 140287899 140615830 141080773 141481416 141686897 141765804
27350A41765804L9741Q308k8350J6121L9173o3733j17729j40774j86758j17998
$$ 141765804 141805545 141813853 141785503 141801624 141840797 141777064 141659335 141518561 141331803 141213805
27340A41213805l2667N193J35136L34695L96411J82502j44080k16630n9757j1128
$$ 141213805 141181138 141186331 141321467 141656162 142052573 142235075 142090995 141874365 141814608 141803480
27330A41803480o9858p739P7421M6946N1272K1037q4544l9056J82785L85863M77172
$$ 141803480 141733622 141725883 141803304 141850250 141901522 141922559 141838015 141798959 141981744 142367607 142844779
27319A42844779M32372J92569j39797m02526m03017k31747j31419j31630p2069
$$ 142844779 143277151 143469720 143329923 142927397 142524380 142292633 142161214 142029584 141957515
27310A41957515J29209L12903M13366M34285L78159L01151K42331J96647J61083
$$ 141957515 142086724 142399627 142812993 143247278 143625437 143926588 144168919 144365566 144526649
27301A44526649K1745k36361m10788m38752m00260l12148j70096l9682p1447k90837
$$ 144526649 144548394 144312033 143901245 143462493 143062233 142750085 142579989 142540307 142468860 142178023
27291A42178023l65154k20700j13718p2368q0119j78424k02295j9373K43421M36755
$$ 142178023 141812869 141592169 141478451 141406083 141325964 141147540 140945245 140925872 141169293 141606048
27281A41606048M66369K53106p4441l22284m97379o28730n90561m03942j89950
$$ 141606048 142072417 142325523 142251082 141928798 141431419 140802689 140212128 139808186 139618236
27272A39618236K100J09655J52522K15170L26618L77850L30036K46462J51721
$$ 139618236 139620336 139729991 139882513 140097683 140424301 140802151 141132187 141378649 141530370
27263A41530370K7961r5804j38911j44389j39382j27082j14558j31302j46929
$$ 141530370 141558331 141462527 141323616 141179227 141039845 140912763 140798205 140666903 140519974
27254A40519974j69633k27421j55089L1515J73837K74079K56616J04049o5366
$$ 140519974 140350341 140122920 139967831 139999346 140173183 140447262 140703878 140807927 140742561
27245A40742561r9114N2136K37516J78599j83973n16029m86904q4203L09276M20918
$$ 140742561 140643447 140695583 140933099 141111698 140927725 140411696 139924792 139840589 140149865 140570783
27235A40570783L43471K41641J72585J12647J26791J36718O7360J5862L122J4321
$$ 140570783 140914254 141155895 141328480 141441127 141567918 141704636 141771996 141787858 141790980 141805301
27225A41805301k824l9520o587O0756O9833J26642K80564L51732K30104m4690
$$ 141805301 141802477 141762957 141756370 141817126 141886959 142013601 142294165 142645897 142876001 142831311
27215A42831311k81171k93083j56228J0332O2973p6652k40120k90947j78101J35656
$$ 142831311 142550140 142257057 142100829 142111161 142174134 142097482 141857362 141566415 141388314 141523970
27205A41523970L99252L23634R7285Q4608J23383J1646j42426k30852k10419j03992
$$ 141523970 141923222 142246856 142344141 142428749 142552132 142563778 142421352 142190500 141980081 141876089
27195A41876089J24453M50335N81039M30905J87692L5681m7093j74380k15960
$$ 141876089 142000542 142450877 143031916 143462821 143650513 143686194 143639101 143464721 143248761
27186A43248761j55044j90233k45930k57366k40871k00967j20118J6400J07204
$$ 143248761 143093717 142903484 142657554 142400188 142159317 141958350 141838232 141854632 141961836
27177A41961836O4201o7906k47929l68085k73922j21682k8442M4642K04903K99129
$$ 141961836 142026037 141958131 141710202 141342117 141068195 140946513 140918071 140962713 141167616 141466745
27167A41466745J80014R0922J04452J49968J42192L1405j05541j52330j10031
$$ 141466745 141646759 141737681 141842133 141992101 142134293 142165698 142060157 141907827 141797796
27158A41797796j41345k73156l74817l45204k56854k37887l46766m22227j89800
$$ 141797796 141656451 141383295 141008478 140663274 140406420 140168533 139821767 139399540 139209740
27149A39209740J82848K91263J67886N3607N0984J76455L44304L62209J80576
$$ 139209740 139392588 139683851 139851737 139905344 139956328 140132783 140477087 140839296 141019872
27140A41019872k3970j87527l19929k89613J749K81717L23684K51287N9379k00709
$$ 141019872 140995902 140808375 140488446 140198833 140200582 140482299 140805983 141057270 141116649 140915940
27130A40915940k70089k30604k16555j12454J42545M10064N35035M57208K39059
$$ 140915940 140645851 140415247 140198692 140086238 140228783 140638847 141173882 141631090 141870149
27121A41870149L1475j08069j25371O931J17512K04504K20310m5155l38809l52526
$$ 141870149 141901624 141793555 141668184 141675115 141792627 141997131 142217441 142172286 141833477 141480951
27111A41480951j63823M8230K59234L83424J85817j86466l37377k34880n3580
$$ 141480951 141317128 141365358 141624592 142008016 142193833 142007367 141669990 141435110 141381530
27102A41381530J66965L35668K99734K20206J18051j6238j07770j24290o6385
$$ 141381530 141548495 141884163 142183897 142404103 142522154 142505916 142398146 142273856 142207471
27093A42207471k2237j40533k87318k23482p8001o0782p4216N9299K69277L99251
$$ 142207471 142185234 142044701 141757383 141533901 141455900 141395118 141320902 141380201 141649478 142048729
27083A42048729L33708J41445n9144k56219l06295j66403L7420J66619J27186
$$ 142048729 142382437 142523882 142464738 142208519 141902224 141735821 141773241 141939860 142067046
27074A42067046k3761j94642m52193o50793n93049l57307j29178m6952J4498J30064
$$ 142067046 142043285 141848643 141396450 140745657 140152608 139795301 139666123 139619171 139633669 139763733
27064A39763733J09601J4650Q8244K93428L44541K56678K00270J61511J56197
$$ 139763733 139873334 139887984 139976228 140269656 140614197 140870875 141071145 141232656 141388853
27055A41388853J51954P9503R5367K93030M47828L86738J67135M4544L8093j41832
$$ 141388853 141540807 141620310 141715677 142008707 142456535 142843273 143010408 143054952 143093045 142951213
27045A42951213m23317n71350n51090m41857l49870k67220j33168n3805o6849
$$ 142951213 142527896 141956546 141405456 140963599 140613729 140346509 140213341 140159536 140092687
27036A40092687o0067j605K1480J2191L3102K0500n4836j54719k29714q6757J50614
$$ 140092687 140032620 140031015 140052495 140064686 140097788 140118288 140063452 139908733 139679019 139592262 139742876
27025A39742876K63198L01213L02104L09405K44379M9460j2325J20461K59247
$$ 139742876 140006074 140307287 140609391 140918796 141163175 141212635 141200310 141320771 141580018
27016A41580018L14693J54398r5288k51018l40574m12585l71430k22193j60925
$$ 141580018 141894711 142049109 141953821 141702803 141362229 140949644 140578214 140356021 140195096
27007A40195096k56888k98669k56305k63911k12048j12474k08559l04943j75713
$$ 140195096 139938208 139639539 139383234 139119323 138907275 138794801 138586242 138281299 138105586
26998A38105586J42559L97220M10968L50932L32675L44719M17746N31764N42959
$$ 138105586 138248145 138645365 139056333 139407265 139739940 140084659 140502405 141034169 141577128
26989A41577128L36459J5078k50355l51089k11427R2686K16279Q3103o2629k35368
$$ 141577128 141913587 141928665 141678310 141327221 141115794 141208480 141424759 141507862 141445233 141209865
26979A41209865m60431n27202l84878k04743q0308l829k8268m2690J87591N42637
$$ 141209865 140749434 140222232 139837354 139632611 139552303 139548474 139520206 139477516 139665107 140207744
26969A40207744O94217O24873M49707K22846J8650p0770J8143J09054M8602j21380
$$ 140207744 140901961 141526834 141976541 142199387 142218037 142147267 142165410 142274464 142323066 142201686
26959A42201686k26062j23501o0879j95677k94851l25028l58206k78308j56709
$$ 142201686 141975624 141852123 141791244 141595567 141300716 140975688 140617482 140339174 140182465
26950A40182465q2976n7368q4045j63067k62146k67246j38613O7358K95334M07142
$$ 140182465 140099489 140042121 139958076 139795009 139532863 139265617 139127004 139194362 139489696 139896838
26940A39896838L22855J60585M7668P6455L01342M93583L49656r802k82073l29494
$$ 139896838 140219693 140380278 140427946 140504401 140805743 141299326 141648982 141639180 141357107 141027613
26930A41027613j96228n5167O4757K43320L97526M34889L92191K27409j31116
$$ 141027613 140831385 140776218 140840975 141084295 141481821 141916710 142308901 142536310 142405194
26921A42405194n02475o57231n57735k66156Q7680L08099L41156K06717O8667
$$ 142405194 141902719 141245488 140687753 140421597 140509277 140817376 141158532 141365249 141433916
26912A41433916P6175L3177j09952k09666j99671o3853n42j03082k25034j22477
$$ 141433916 141510091 141543268 141433316 141223650 141023979 140960126 140959584 140856502 140631468 140508991
26902A40508991K97630O48844O27747K94143j35494l65468l89871l35978k45630
$$ 140508991 140806621 141455465 142083212 142377355 142241861 141876393 141486522 141150544 140904914
26893A40904914k23420k33411j16480K4662L9709o721p5052j84310k79440l06419
$$ 140904914 140681494 140448083 140331603 140356265 140395974 140389253 140314201 140129891 139850451 139544032
26883A39544032k11371q4958J16414M17517M91338M09300L46876K59538J95738
$$ 139544032 139332661 139247703 139364117 139781634 140272972 140682272 141029148 141288686 141484424
26874A41484424J56034k4012j81270k16822k49879j74204P430l2197k84614m33895
$$ 141484424 141640458 141616446 141435176 141218354 140968475 140794271 140801701 140769504 140484890 140050995
26864A40050995l34645j38349n2122k3071Q4039K01607J75337J20122J47083R6988
$$ 140050995 139716350 139578001 139525879 139502808 139586847 139788454 139963791 140083913 140230996 140327984
26854A40327984P1849J33283P8351q5971k27026l19402l47608k31139m5401K7620
$$ 140327984 140399833 140533116 140611467 140525496 140298470 139979068 139631460 139400321 139354920 139382540
26844A39382540k2007j01802q0903L3312J16867J98925K21621J66871R6052J5290
$$ 139382540 139360533 139258731 139177828 139211140 139328007 139526932 139748553 139915424 140011476 140026766
26834A40026766q4947j60364j25378K4491J41028K01656K60985L13724K78926
$$ 140026766 139941819 139781455 139656077 139680568 139821596 140023252 140284237 140597961 140876887
26825A40876887N9758k11439k55603j32674J1342Q7601J15558K37172M00015M48903
$$ 140876887 140936645 140725206 140469603 140336929 140348271 140435872 140551430 140788602 141188617 141637520
26815A41637520L59983J48621k3433l044J02341K44878M21252N42565N71037M11337
$$ 141637520 141997503 142146124 142122691 142119647 142221988 142466866 142888118 143430683 144001720 144413057
26805A44413057k9582m18515n35432n44823m71048k79485r2489n2017k8166Q5535
$$ 144413057 144383475 143964960 143429528 142884705 142413657 142134172 142041683 141989666 141961500 142047035
26795A42047035J34894M5095j21162j35762O1412J46805j5774k03885k25004m7316
$$ 142047035 142181929 142227024 142105862 141970100 142031512 142178317 142162543 141958658 141733654 141686338
26785A41686338L07028M63244K35681j18474k88775k75481o6017L37264N42694
$$ 141686338 141993366 142456610 142692291 142573817 142285042 142009561 141943544 142280808 142823502
26776A42823502L03982m8440j88498k16127k80237l05492k26044r7552m743j12618
$$ 142823502 143127484 143079044 142890546 142674419 142394182 142088690 141862646 141765094 141760351 141647733
26766A41647733l00983l14074k80113m08577n39357m88266j95078J75231L36916
$$ 141647733 141346750 141032676 140752563 140343986 139804629 139316363 139121285 139296516 139633432
26757A39633432L54530M12832L71347J80129L7189j04773k51187k82226k16842
$$ 139633432 139987962 140400794 140772141 140952270 140989459 140884686 140633499 140351273 140134431
26748A40134431j23567K254J84627L53541L99595L06747K20615K52345J33900
$$ 140134431 140010864 140013118 140197745 140551286 140950881 141257628 141478243 141730588 141864488
26739A41864488k12795m23701l48757r4960R2966J47484J99736K57520M08008
$$ 141864488 141651693 141227992 140879235 140784275 140877241 141024725 141224461 141481981 141889989
26730A41889989O01222N66787K35868r7514j80387j46675j50566k28113k83845
$$ 141889989 142491211 143057998 143293866 143196352 143015965 142869290 142718724 142490611 142206766
26721A42206766k79333j18868J71664K55688J13003K6409K6292J594j07703q0929
$$ 142206766 141927433 141808565 141980229 142235917 142348920 142375329 142401621 142403215 142295512 142214583
26711A42214583J95781L44798J94897m5153k01503k71030m09565n80040n45846
$$ 142214583 142410364 142755162 142950059 142904906 142703403 142432373 142022808 141442768 140896922
26702A40896922l57845j80392r35K73505O19031Q38062Q50725P12926M03697M362
$$ 140896922 140539077 140358685 140357750 140631255 141250286 142088348 142939073 143651999 144055696 144060058
26692A44060058l69508m40535j38784J21869J11323j07746m86069p62105o12046
$$ 144060058 143690550 143250015 143111231 143233100 143344423 143236677 142750608 141988503 141376457
26683A41376457k93633k27178m03672n31219m75082k79851M5203L62629M89133
$$ 141376457 141082824 140855646 140451974 139920755 139445673 139165822 139211025 139573654 140062787
26674A40062787L34418J6037k00574k26545j50731M9250K09591K24388L08955
$$ 140062787 140397205 140413242 140212668 139986123 139835392 139884642 140094233 140318621 140627576
26665A40627576M06495L73475L51754L12317Q2302j46300k59291l77111l76931
$$ 140627576 141034071 141407546 141759300 142071617 142153919 142007619 141748328 141371217 140994286
26656A40994286j57533N5366Q1513R0032K33050M01778M73939M58872L60258J77930
$$ 140994286 140836753 140892119 140973632 141063664 141296714 141698492 142172431 142631303 142991561 143169491
26646A43169491O1017M7125L1844j9154j32341l08539l41142j63720o4184j29495
$$ 143169491 143230508 143277633 143309477 143290323 143157982 142849443 142508301 142344581 142280397 142150902
26636A42150902k02971k25448j27491N0211J58671J32382N9215n7435k85017m20329
$$ 142150902 141947931 141722483 141594992 141645203 141803874 141936256 141995471 141938036 141653019 141232690
26626A41232690l63733k12084p4243q7256j08446n9104k3417N602J06039J64249
$$ 141232690 140868957 140656873 140582630 140495374 140386928 140327824 140304407 140310009 140416048 140580297
26616A40580297J18157L3795r0473j71824p8177N2724R109j08119j38528p2966
$$ 140580297 140698454 140732249 140641776 140469952 140391775 140444499 140453608 140345489 140206961 140133995
26606A40133995K4846K9783j46737l24331k38775K9190K21179K39910O9436q4947
$$ 140133995 140158841 140188624 140041887 139717556 139478781 139507971 139729150 139969060 140038496 139953549
26596A39953549K5800K39849K71829Q1120j70856j99524L1264K04595K19666K36790
$$ 139953549 139979349 140219198 140491027 140572147 140401291 140201767 140233031 140437626 140657292 140894082
26586A40894082K66605L13948L02834J72467Q7306m188j69565j88415m7487L5590
$$ 140894082 141160687 141474635 141777469 141949936 142037242 142033054 141863489 141675074 141627587 141663177
26576A41663177k6622j46191k29483j29017J2738k7189j31517j24908J461J86402
$$ 141663177 141636555 141490364 141260881 141131864 141144602 141117413 140985896 140860988 140862449 141048851
26566A41048851L15385L36835L15360K67055J14685p4002j06567P347M7593p3558
$$ 141048851 141364236 141701071 142016431 142283486 142398171 142324169 142217602 142224949 142272542 142198984
26556A42198984j77672k15841k95871l27367j99174m6593n8797j13959n9083j0889
$$ 142198984 142021312 141805471 141509600 141182233 140983059 140936466 140877669 140763710 140704627 140693738
26546A40693738m0071m3743O5618J93174J58080k3442j80064k28870j59320L6600
$$ 140693738 140653667 140609924 140675542 140868716 141026796 141003354 140823290 140594420 140435100 140471700
26536A40471700J84398J99539J08403j9847j7385K3315P693K5173K7515n9291
$$ 140471700 140656098 140855637 140964040 140944193 140926808 140950123 140957816 140982989 141010504 140951213
26526A40951213j41458q5791K5046l3496k22630k15623J11613L67755L18933R8501
$$ 140951213 140809755 140723964 140749010 140715514 140492884 140277261 140388874 140756629 141075562 141174063
26516A41174063q5537j75592q2317J77528L92700L67056J63654J3308n9213j85691
$$ 141174063 141088526 140912934 140830617 141008145 141400845 141767901 141931555 141944863 141885650 141699959
26506A41699959k92691k38523p0335J30559L66974M06047R9393k79917n50427
$$ 141699959 141407268 141168745 141098410 141228969 141595943 142001990 142101383 141821466 141271039
26497A41271039n19612j44720K92876N06514L06638j77342n64517o46447n16818
$$ 141271039 140751427 140606707 140899583 141406097 141712735 141535393 140970876 140324429 139807611
26488A39807611k86581R710J73018K26920L18566L25338K65986J97204J35482
$$ 139807611 139521030 139530740 139703758 139930678 140249244 140574582 140840568 141037772 141173254
26479A41173254P9405J1334o4082q7487j17335k04988j70249n9512n0022p469
$$ 141173254 141252659 141263993 141199911 141112424 140995089 140790101 140619852 140560340 140510318 140502849
26469A40502849J63210K96998K44029O2147l1627J276L2108o670j29119k83953
$$ 140502849 140666059 140963057 141207086 141269233 141237606 141238882 141270990 141264320 141135201 140851248
26459A40851248k62870K0653K54893K31457O5961j24702k33063j36522N6279J61131
$$ 140851248 140588378 140609031 140863924 141095381 141161342 141036640 140803577 140667055 140723334 140884465
26449A40884465K9444j77781j66301p5927q0440k1518J39526J52857J1249j32114
$$ 140884465 140913909 140736128 140569827 140493900 140413460 140391942 140531468 140684325 140695574 140563460
26439A40563460j43620o8004q165N4165j4047k53899l01780m9397J94348L45004
$$ 140563460 140419840 140351836 140343671 140397836 140383789 140129890 139828110 139778713 139973061 140318065
26429A40318065N42739O79708N70145M73411N31859M21061N8587k73215m06553
$$ 140318065 140860804 141540512 142110657 142584068 143115927 143536988 143595575 143322360 142915807
26420A42915807l91710l03466l34491m56115m91716m28093k68228m9008L1572
$$ 142915807 142524097 142220631 141886140 141430025 140938309 140510216 140241988 140192980 140224552
26411A40224552r4523j17026J37619L91977L91835L08661J94692p192k93158m91455
$$ 140224552 140130029 140013003 140150622 140542599 140934434 141243095 141437787 141430595 141137437 140645982
26401A40645982l40744J5659K94451L96270M04194M12970L47555J55173r4330
$$ 140645982 140305238 140320897 140615348 141011618 141415812 141828782 142176337 142331510 142237180
26392A42237180j97137m3512K13749L48494K06389j33298m31795n40108n25366
$$ 142237180 142040043 141996531 142210280 142558774 142765163 142631865 142200070 141659962 141134596
26383A41134596n27169n27847l81464j94364k5199J71247L14117M11751N05045
$$ 141134596 140607427 140079580 139698116 139503752 139478553 139649800 139963917 140375668 140880713
26374A40880713N36982N69667N41911L51175J68612J14225J32744Q9447j9793
$$ 140880713 141417695 141987362 142529273 142880448 143049060 143163285 143296029 143385476 143365683
26365A43365683k26256m41951m29073k37937q1589R147M8029m668N028K6429J8388
$$ 143365683 143139427 142697476 142268403 142030466 141948877 141958024 142006053 142001385 142006413 142032842 142051230
26354A42051230J57934L49807K85094j2602k37567k31985j14043n7724j52687
$$ 142051230 142209164 142558971 142844065 142831463 142593896 142361911 142247868 142190144 142037457
26345A42037457l40031l80537k36717o3613P8710J15434O5234J9323r1260j46016
$$ 142037457 141697426 141316889 141080172 141016559 141095269 141210703 141275937 141295260 141204000 141057984
26335A41057984j0983J16221Q8494L1734K9292L8835P5903J14696J04090R5004
$$ 141057984 141047001 141163222 141251716 141283450 141312742 141351577 141427480 141542176 141646266 141741270
26325A41741270N1808j09573j63470l0229J64498L39876M36246L46217J5574l40239
$$ 141741270 141793078 141683505 141520035 141489806 141654304 141994180 142430426 142776643 142792217 142451978
26315A42451978m93837m55904l52071j90654N7279L63462N66370N29410K67196
$$ 142451978 141958141 141502237 141150166 140959512 141016791 141380253 141946623 142476033 142743229
26306A42743229M1327M11J9008N3799k926j67153k42814j42226p4273j38388j97419
$$ 142743229 142784556 142784967 142803975 142857774 142854848 142687695 142444881 142302655 142228382 142089994 141892575
26295A41892575j61146q1259r7641k09819k77853j70105L3056J64438K48272L03938
$$ 141892575 141731429 141650170 141552529 141342710 141064857 140894752 140927808 141092246 141340518 141644456
26285A41644456K61168J21650m771j2029Q009O4060J98464J65863p3305k75166
$$ 141644456 141905624 142027274 142022503 142010474 142018483 142082543 142281007 142446870 142373565 142098399
26275A42098399l20910j24232K92737O54247O70302L43312L6860n8955k9634J17187
$$ 142098399 141777489 141653257 141945994 142600241 143270543 143613855 143650715 143591760 143562126 143679313
26265A43679313K25922Q8768j60795k66611j75010l4283N2267J20079J35831J18367
$$ 143679313 143905235 143994003 143833208 143566597 143391587 143357304 143409571 143529650 143665481 143783848
26255A43783848L6426l7838m4205j40920j95367m3647J45964J11763j05241l19121
$$ 143783848 143820274 143782436 143738231 143597311 143401944 143358297 143504261 143616024 143510783 143191662
26245A43191662m35528m55064l94742k26074O6659L65874N22767N21222L47047
$$ 143191662 142756134 142301070 141906328 141680254 141746913 142112787 142635554 143156776 143503823
26236A43503823O3029j80328l01984l07926q0358K64050M20577L73387K75675
$$ 143503823 143566852 143386524 143084540 142776614 142696256 142960306 143380883 143754270 144029945
26227A44029945K00750J51647J70511K39815K28905J28277R2161J68731J90588
$$ 144029945 144230695 144382342 144552853 144792668 145021573 145149850 145242011 145410742 145601330
26218A45601330J20434O6889O6659J41488K65755K90687J62163l0968k80406n01372
$$ 145601330 145721764 145788653 145855312 145996800 146262555 146553242 146715405 146684437 146404031 145902659
26208A45902659m60392k86653r6205Q8951J57476J7906j77812o5416K62618M12010
$$ 145902659 145442267 145155614 145059409 145148360 145305836 145323742 145145930 145080514 145343132 145755142
26198A45755142L24185K12070R9009j80855n10926p45943p28319m46465k85490
$$ 145755142 146079327 146291397 146390406 146209551 145698625 144952682 144224363 143777898 143492408
26189A43492408k47612j97523j86414k45622k31851l6799K08400M03016M86394
$$ 143492408 143244796 143047273 142860859 142615237 142383386 142346587 142554987 142958003 143444397
26180A43444397L53242P3603q5890K5237K79126M58399N26348M61337K65923L9731
$$ 143444397 143797639 143871242 143785352 143810589 144089715 144548114 145074462 145535799 145801722 145841453
26170A45841453j22751j89350j81803j50419k40822l61993l13693k31785k63757
$$ 145841453 145718702 145529352 145347549 145197130 144956308 144594315 144280622 144048837 143785080
26161A43785080k07366J1350K73506M09188M46197M29721L42358K23529P8258
$$ 143785080 143577714 143589064 143862570 144271758 144717955 145147676 145490034 145713563 145791821
26152A45791821k2967k953O4030J37583J51343J04917J17635J11463P2342N4183
$$ 145791821 145768854 145765901 145829931 145967514 146118857 146223774 146341409 146452872 146525214 146579397
26142A46579397J4530r8616k46766l42442j87142J64767L53594L28088K22910
$$ 146579397 146593927 146495311 146248545 145906103 145718961 145883728 146237322 146565410 146788320
26133A46788320l2533l45152l59971j77332j1349K22950M79370O55433N77279
$$ 146788320 146755787 146410635 146050664 145873332 145861983 146084933 146564303 147219736 147797015
26124A47797015K29520j09038k64154l13867k32006k1463J65722K49507J38807
$$ 147797015 148026535 147917497 147653343 147339476 147107470 147086007 147251729 147501236 147640043
26115A47640043r3246k58900j82986j412l4293j79709j55618R8835M18892N82988
$$ 147640043 147546797 147287897 147104911 147103499 147069206 146889497 146733879 146832714 147251606 147834594
26105A47834594M37413J35337q1673j39636j9909L09349P18744R19870P68553
$$ 147834594 148272007 148407344 148325671 148186035 148166126 148475475 149194219 150114089 150882642
26096A50882642M16251J13683j09832k67850l31008k21552o5153J4162Q6227K5396
$$ 150882642 151298893 151412576 151302744 151034894 150703886 150482334 150417181 150431343 150517570 150542966
26086A50542966j49487k10060l2550L75066O87945O36890M24395L45414M33903
$$ 150542966 150393479 150183419 150150869 150525935 151213880 151850770 152275165 152620579 153054482
26077A53054482M59448K87707N2875k2866J31376L26789L89186L96448L42417
$$ 153054482 153513930 153801637 153854512 153831646 153963022 154289811 154678997 155075445 155417862
26068A55417862K84512K92924L08339M05533N24928N14072L45970M3821j88195
$$ 155417862 155702374 155995298 156303637 156709170 157234098 157748170 158094140 158137961 157949766
26059A57949766j57174N793J74504L77614O24416P90632Q65838R02915R16566
$$ 157949766 157792592 157798385 157972889 158350503 158974919 159765551 160631389 161534304 162450870
26050A62450870R55629J001061J031799J065096J099341J194936J318613J294057
$$ 162450870 163406499 164407560 165439359 166504455 167603796 168798732 170117345 171411402
26042A71411402J274549J535210J864448K012753K087656K161036K103898J905880
$$ 171411402 172685951 174221161 176085609 178098362 180186018 182347054 184450952 186356832
26034A86356832J745813J713411J734929J697175J329391K98631j390170l690632
$$ 186356832 188102645 189816056 191550985 193248160 194577551 194876182 193486012 189795380
26026A89795380o518075r099394j0299592r524980p303144m781127k657926r61498
$$ 189795380 183277305 174177911 163878319 154353339 147050195 142269068 139611142 138649644
26018A38649644K81553J022191J426849J683759J815384J802000J834629J928698
$$ 138649644 138931197 139953388 141380237 143063996 144879380 146681380 148516009 150444707
26010A50444707J863201J505576Q72768J0797j371130l564933o338147r032216
$$ 150444707 152307908 153813484 154686252 154697049 153325919 149760986 143422839 134390623
26002A34390623j0496869r802510p475378m823061k652909j119439j27338N31561
$$ 134390623 123893754 114091244 106615866 101792805 99139896 98020457 97893119 98424680
25994I8424680R18855J069798J193029J321471J303370J160131J084398J178780
$$ 98424680 99343535 100413333 101606362 102927833 104231203 105391334 106475732 107654512
25986A07654512J301215J285911J109280R20486R03075R77999R75012Q37477O43649
$$ 107654512 108955727 110241638 111350918 112271404 113174479 114152478 115127490 115964967 116608616
25977A16608616N36056N69855O53541P50199Q02577O93780M64563J39902j99208
$$ 116608616 117144672 117714527 118368068 119118267 119920844 120614624 121079187 121219089 121019881
25968A21019881l17915k53973j10026J31014L90048N03730L70870J53322Q4678
$$ 121019881 120701966 120447993 120337967 120468981 120859029 121362759 121733629 121886951 121971629
25959A21971629P4749P9294J47396K58984N11416Q63772R11504O60538M00271
$$ 121971629 122046378 122125672 122273068 122532052 123043468 123907240 124818744 125479282 125879553
25950A25879553J63416l4217j68951l69082o50739q21885o82242m17575l72834
$$ 125879553 126042969 126008752 125839801 125470719 124819980 123998095 123315853 122898278 122525444
25941A22525444m77926m34435k42666n6818J62277L36839K91608Q3665J8168K38754
$$ 122525444 122047518 121613083 121370417 121313599 121475876 121812715 122104323 122187988 122206156 122444910
25931A22444910M50287M60315L66262K70229K58403L00006L61745L65630K25584
$$ 122444910 122895197 123355512 123721774 123992003 124250406 124550412 124912157 125277787 125503371
25922A25503371L0282K0597J97306L91635M90750M84322L75215J47562j24314
$$ 125503371 125533653 125554250 125751556 126143191 126633941 127118263 127493478 127641040 127516726
25913A27516726l62043n41316n20448j34650M37504Q77881R40591P05835M32306
$$ 127516726 127154683 126613367 126092919 125958269 126395773 127273654 128214245 128920080 129352386
25904A29352386J81480K0387M5953J59037K66190K86568J37044q6967k14376j17567
$$ 129352386 129533866 129554253 129600206 129759243 130025433 130312001 130449045 130362078 130147702 130030135
25894A30030135O9105L4299k30090m75886m94295k97950j16694n735J43959K23119
$$ 130030135 130099240 130133539 129903449 129427563 128933268 128635318 128518624 128512889 128656848 128879967
25884A28879967J49210P6184J79860L94721M01824J39095K1269K47746N33554
$$ 128879967 129029177 129105361 129285221 129679942 130081766 130220861 130242130 130489876 131023430
25875A31023430N97311M87580L72844K36238N4611o6089o1954l6958q1831j13100
$$ 131023430 131620741 132108321 132481165 132717403 132772014 132705925 132643971 132607013 132525182 132412082
25865A32412082j09375j26307q6771J14728L77283M44038K34315J03989O2907
$$ 132412082 132302707 132176400 132089629 132204357 132581640 133025678 133259993 133363982 133426889
25856A33426889r0380j64781j82125l23543m42720m21814l42481k13831l781J91618
$$ 133426889 133336509 133171728 132989603 132666060 132223340 131801526 131459045 131245214 131241433 131433051
25846A31433051J67397P1033J69268L70957M22588K80210N0410r5544j0226K93687
$$ 131433051 131600448 131671481 131840749 132211706 132634294 132914504 132964914 132869370 132859144 133152831
25836A33152831M46212J96623k22128m40256l65117j96930j29174n0282K6499
$$ 133152831 133599043 133795666 133573538 133133282 132768165 132571235 132442061 132391779 132418278
25827A32418278M9778J23454J46529l6710k48416j80552J14384L15831L33328
$$ 132418278 132468056 132591510 132738039 132701329 132452913 132272361 132386745 132702576 133035904
25818A33035904K69269J29267q7169k80685k55882j14063J8918J79601L93640
$$ 133035904 133305173 133434440 133347271 133066586 132810704 132696641 132715559 132895160 133288800
25809A33288800M96481L98152K55601J86031J15565l8254j41736r7834J1R6238
$$ 133288800 133785281 134183433 134439034 134625065 134740630 134702376 134560640 134462806 134462817 134559055
25799A34559055J73837K09498J85813L1294k24252m29854n60861n61580m47888
$$ 134559055 134732892 134942390 135128203 135159497 134935245 134505391 133944530 133382950 132935062
25790A32935062l01618p3310K17640L10704J64059J2022k1496l2953j09058j51665
$$ 132935062 132633444 132560134 132777774 133088478 133252537 133264559 133243063 133210110 133101052 132949387
25780A32949387j77706j32695p5586j78923l23332k04890O9218L15875M99574
$$ 132949387 132771681 132638986 132563400 132384477 132061145 131856255 131925473 132241348 132740922
25771A32740922M10319J44288k4204l5427L3116J19895J64865J62758J30118J38119
$$ 132740922 133151241 133295529 133271325 133235898 133269014 133388909 133553774 133716532 133846650 133984769
25761A33984769K84491M75259M40818K75212J82436J05271P8322J31566K02156
$$ 133984769 134269260 134744519 135185337 135460549 135642985 135748256 135826578 135958144 136160300
25752A36160300K44079K34886J15004p1171k92420m34567l86245k47419j44452
$$ 136160300 136404379 136639265 136754269 136683098 136390678 135956111 135569866 135322447 135177995
25743A35177995r8597k8958J49062L25548L55876L37309L37968K80166J14906
$$ 135177995 135079398 135050440 135199502 135525050 135880926 136218235 136556203 136836369 136951275
25734A36951275o8691j28619o3712K2958J04447J44803O3443j67249l90748m56888
$$ 136951275 136882584 136753965 136690253 136713211 136817658 136962461 137025904 136858655 136467907 136011019
25724A36011019l55339j75714Q862J08252O2291o7515j36044p4990J9363J00319
$$ 136011019 135655680 135479966 135488828 135597080 135659371 135591856 135455812 135380822 135400185 135500504
25714A35500504K01085L39919M27701L47333J68720p3606k17580j60801m221N6072
$$ 135500504 135701589 136041508 136469209 136816542 136985262 136911656 136694076 136533275 136529054 136585126
25704A36585126L8736J12364J57620J20932M1966m8804k22462m75997o33717m56310
$$ 136585126 136623862 136736226 136893846 137014778 137056744 137007940 136785478 136309481 135675764 135219454
25694A35219454q3888J4180j87817k82359k25748j82430n2241J90149L54895L07173
$$ 135219454 135135566 135149746 134961929 134679570 134453822 134271392 134219151 134409300 134764195 135071368
25684A35071368R9506K4400J13527K23618K99283K55671N5301r9368j91441l49161
$$ 135071368 135170874 135195274 135308801 135532419 135831702 136087373 136142674 136043306 135851865 135502704
25674A35502704m48025k85018Q8050L32218K69608J43608J88526K73818K49362
$$ 135502704 135054679 134769661 134857711 135189929 135459537 135603145 135791671 136065489 136314851
25665A36314851K15037J69145L8898q7627r6325p060P099p6542j99595k86540
$$ 136314851 136529888 136699033 136737931 136650304 136553979 136546919 136554018 136477476 136277881 135991341
25655A35991341l58956n01313n39804l31949p2226O833n9852o0511J40266M64764
$$ 135991341 135632385 135131072 134591268 134259319 134187093 134193926 134134074 134073563 134213829 134678593
25645A34678593P53739P89014N57204L67434K64550J38521R8450P6501l4713k20968
$$ 134678593 135432332 136221346 136778550 137145984 137410534 137549055 137647505 137724006 137689293 137468325
25635A37468325l69869l28341k54616k86077k24680m1005J34830J72557J06924
$$ 137468325 137098456 136770115 136515499 136229422 136004742 135963737 136098567 136271124 136378048
25626A36378048J006k43735m88219n45161n13108m44082l05238k72076m02909
$$ 136378048 136379054 136135319 135647100 135101939 134588831 134144749 133839511 133567435 133164526
25617A33164526l33718R705K63715K77664J47606K09705N21762P51150Q06186
$$ 133164526 132830808 132840513 133104228 133381892 133529498 133739203 134260965 135012115 135818301
25608A35818301O45101J76746l18859n10671m11605k80318k60533l30788m07894
$$ 135818301 136463402 136640148 136321289 135810618 135399013 135118695 134858162 134527374 134119480
25599A34119480m17202l33167k33431j54359J5193K45969L41580K69914K51949
$$ 134119480 133702278 133369111 133135680 132981321 132996514 133242483 133584063 133853977 134105926
25590A34105926L20092M00954N24461N54327M07441K58587J37993p607j83190
$$ 134105926 134426018 134826972 135351433 135905760 136313201 136571788 136709781 136702174 136518984
25581A36518984k65665j32658O9258J27705m4585l01796m16151k95311q4892P5202
$$ 136518984 136253319 136120661 136189919 136317624 136273039 135971243 135555092 135259781 135174889 135250091
25571A35250091J40918Q4564j0519l5219L9136J12209J9568j02467j04332k25939
$$ 135250091 135391009 135475573 135465054 135429835 135468971 135581180 135600748 135498281 135393949 135168010
25561A35168010m85397o03817m54848j44083P2655L2760l9937J21056L60421M82307
$$ 135168010 134682613 134078796 133623948 133479865 133552520 133585280 133545343 133666399 134026820 134509127
25551A34509127M16594K56240P1376o1118k6322N9989Q4852J44344J28212r111
$$ 134509127 134925721 135181961 135253337 135192219 135165897 135225886 135310738 135455082 135583294 135574183
25541A35574183k2165J05132J741k79450l13967j99315j71385k30893k93548k44413
$$ 135574183 135552018 135657150 135658891 135379441 135065474 134866159 134694774 134463881 134170333 133925920
25531A33925920q6142L6355J46724L19835M60127M66741L93002K76559Q8863k9785
$$ 133925920 133839778 133876133 134022857 134342692 134802819 135269560 135662562 135939121 136027984 135998199
25521A35998199p0204j27376j86905j58194M107J72508K33156J86021K2090j22678
$$ 135998199 135927995 135800619 135613714 135455520 135459627 135632135 135865291 136051312 136073402 135950724
25511A35950724j08592p8061j73424k57622p1199L27302M54918K07544j17682
$$ 135950724 135842132 135764071 135590647 135333025 135261826 135589128 136044046 136251590 136133908
25502A36133908k75996j39851O9722J01762m9957j55604p5982o997j6235r3358
$$ 136133908 135857912 135718061 135787783 135889545 135839588 135683984 135608002 135601005 135584770 135491412
25492A35491412j48114n9668J34802K52832J66098r408j04960o8731l8227p4452
$$ 135491412 135343298 135283630 135418432 135671264 135837362 135827954 135722994 135654263 135616036 135541584
25482A35541584p1728O9905J68947P9234j3869J07488L37891M08691K79421P7537
$$ 135541584 135469856 135539761 135708708 135787942 135774073 135881561 136219452 136628143 136907564 136985101
25472A36985101q3933j84545j07233J89644L70633J64395k80403n51554m93020
$$ 136985101 136901168 136716623 136609390 136799034 137169667 137334062 137053659 136502105 136009085
25463A36009085l46611k20673r8729n3752r7211k69745m90891n14527k98587N8627
$$ 136009085 135662474 135441801 135343072 135289320 135192109 134922364 134431473 133916946 133618359 133676986
25453A33676986L34147L47777K15650J94337K75382L05222K82233K73480L54204
$$ 133676986 134011133 134358910 134574560 134768897 135044279 135349501 135631734 135905214 136259418
25444A36259418M25225L63511K82414K58122J79477l7748k78533k69038j24790
$$ 136259418 136684643 137048154 137330568 137588690 137768167 137730419 137451886 137182848 137058058
25435A37058058j24430l06536n46432o41924n25893k39215O3371K45665K66006
$$ 137058058 136933628 136627092 136080660 135438736 134912843 134673628 134736999 134982664 135248670
25426A35248670J77386J83006K58483K54737K32315K73925K47379R2737r3231
$$ 135248670 135426056 135609062 135867545 136122282 136354597 136628522 136875901 136968638 136875407
25417A36875407j72927j1150J97887K00876M0863j30468k71067l51091k73186
$$ 136875407 136702480 136691330 136889217 137090093 137130956 137000488 136729421 136378330 136105144
25408A36105144r7803K7325R5818J26122J06488P1227J07096J74430J68497J08097
$$ 136105144 136007341 136034666 136130484 136256606 136363094 136434321 136541417 136715847 136884344 136992441
25398A36992441J50371K77845L00723K34134J45427P3193l970n1311j49076k83928
$$ 136992441 137142812 137420657 137721380 137955514 138100941 138174134 138170164 138118853 137969777 137685849
25388A37685849k84903j18608R2696J58186J00766j3380n9198O7276K18254K74617
$$ 137685849 137400946 137282338 137375034 137533220 137633986 137620606 137561408 137628684 137846938 138121555
25378A38121555K15431J07573N9698R2195P7408o6772k38529l37237l66409l18723
$$ 138121555 138336986 138444559 138504257 138596452 138673860 138607088 138368559 138031322 137664913 137346190
25368A37346190k69923j86844l6493N8312N5430P6058J9643j20988j72223j65874
$$ 137346190 137076267 136889423 136852930 136911242 136966672 137042730 137062373 136941385 136769162 136603288
25358A36603288p4830Q3134J69797J21669j3814j14436o7089m22k762M1977J60186
$$ 136603288 136528458 136611592 136781389 136903058 136889244 136774808 136707719 136707297 136704535 136746512 136906698
25347A36906698K84658M09476L72313K34911K16201J39827k8804j44448j78015
$$ 136906698 137191356 137600832 137973145 138208056 138424257 138564084 138535280 138390832 138212817
25338A38212817j65362r6551N726J04158J50567K06111L54935M39848L73284K27091
$$ 138212817 138047455 137950904 137956630 138060788 138211355 138417466 138772401 139212249 139585533 139812624
25328A39812624M026j92473k34289k47262j85837N4388J51373N1531o4919j65613
$$ 139812624 139816650 139624177 139389888 139142626 138956789 139011177 139162550 139214081 139149162 138983549
25318A38983549k33712k32540j50396n6113Q5013K18901K75305K31533M0794k27777
$$ 138983549 138749837 138517297 138366901 138310788 138395801 138614702 138890007 139121540 139162334 138934557
25308A38934557k22614R7743K94134K61095J57665j8223q6994J08632L13028L33138
$$ 138934557 138711943 138809686 139103820 139364915 139522580 139504357 139417363 139525995 139839023 140172161
25298A40172161K20979R957k78196l54263q8089J11135J9943j30837k22420j71238
$$ 140172161 140393140 140403097 140124901 139770638 139682549 139793684 139813627 139682790 139460370 139289132
25288A39289132j9767r7271m02942n27711l46836j28498R8915M55252P23578P21046
$$ 139289132 139269365 139172094 138769152 138241441 137894605 137766107 137865022 138320274 139043852 139764898
25278A39764898N80941L76742J50116P0544K22593L91784M30550M19390L57740
$$ 139764898 140345839 140722581 140872697 140943241 141165834 141557618 141988168 142407558 142765298
25269A42765298J76833J25387K83391L21413J65617K4251j3623j18395l10914
$$ 142765298 142942131 143067518 143350909 143672322 143837939 143862190 143848567 143730172 143419258
25260A43419258l29835j91756p9840J5246J65905J87362Q9120J11258K08297K13636
$$ 143419258 143089423 142897667 142817827 142833073 142998978 143186340 143275460 143386718 143595015 143808651
25250A43808651J99844K22631J84703Q5708Q4305J02279j57355n90905p70071
$$ 143808651 144008495 144231126 144415829 144501537 144585842 144688121 144530766 143939861 143169790
25241A43169790p51959o86390n29587l71482l09835k50444j81073p9373J37917
$$ 143169790 142417831 141731441 141201854 140830372 140520537 140270093 140089020 140009647 140147564
25232A40147564L53667L95175L92130L55272J79396L831j48427j90716j00857
$$ 140147564 140501231 140896406 141288536 141643808 141823204 141827035 141678608 141487892 141387035
25223A41387035M9963K33882M23058N77506O25724M71206K70884L28768N55546
$$ 141387035 141436998 141670880 142093938 142671444 143297168 143768374 144039258 144368026 144923572
25214A44923572N66447K37408m150P5732J14665j8465j31164j55499q8183M4955
$$ 144923572 145490019 145727427 145723277 145799009 145913674 145895209 145764045 145608546 145520363 145565318
25204A45565318J53267Q1726l8059k732l8413k32575l12951j93893j25676k03592
$$ 145565318 145718585 145800311 145762252 145759520 145721107 145488532 145175581 144981688 144856012 144652420
25194A44652420k18757q9301Q3564K08192K51535K29621K63155L51183M64219
$$ 144652420 144433663 144344362 144427926 144636118 144887653 145117274 145380429 145731612 146195831
25185A46195831O57748P53156O89374N60021M29990K46693Q4552J70990M22968
$$ 146195831 146853579 147606735 148296109 148856130 149286120 149532813 149617365 149788355 150211323
25176A50211323N87308N53308M63172M37009M75116N77294O73468O93643O77517
$$ 150211323 150798631 151351939 151815111 152252120 152727236 153304530 153977998 154671641 155349158
25167A55349158O46357O32511P58625R63420J096661J188751J273860J272048
$$ 155349158 155995515 156628026 157386651 158350071 159446732 160635483 161909343 163181391
25159A63181391J341044J603316J839435J803994J567969J443720J613256J910989
$$ 163181391 164522435 166125751 167965186 169769180 171337149 172780869 174394125 176305114
25151A76305114K135434K172554J950237J381795L43378j363234l886405p065107
$$ 176305114 178440548 180613102 182563339 183945134 184288512 182925278 179038873 171973766
25143A71973766r961224j1293075j0566549q379810n809100l455666j707505p74921
$$ 171973766 162012542 150719467 140152918 131773108 125964008 122508342 120800837 120025916
25135A20025916k22582L46551Q85251J402659J836977K024637K153537K281479
$$ 120025916 119803334 120149885 121035136 122437795 124274772 126299409 128452946 130734425
25127A30734425K225502K144512K170192K178979K096928K027439K030065K083436
$$ 130734425 132959927 135104439 137274631 139453610 141550538 143577977 145608042 147691478
25119A47691478K163927K137989J903769J360803L77893j192551l408221o146361
$$ 147691478 149855405 151993394 153897163 155257966 155635859 154443308 151035087 144888726
25111A44888726q963948j0836842j0957511r457364p002942m413186k228599n90671
$$ 144888726 135924778 125087936 114130425 104673061 97670119 93256933 91028334 90437663
25103I0437663M62995R14604R68280R31978J040388J289627J479620J474962J377800
$$ 90437663 90900658 91815262 92783542 93715520 94755908 96045535 97525155 99000117 100377917
25094A00377917J259149J197714J230197J289988J251815J114087Q95336O21480
$$ 100377917 101637066 102834780 104064977 105354965 106606780 107720867 108616203 109237683
25086A09237683M22211M43106N26992M97360M32872M46963N81541O95696O89049
$$ 109237683 109659894 110103000 110629992 111127352 111560224 112007187 112588728 113284424 113973473
25077A13973473N93790M26469J62883j04565k38202k18061q1965J77630N28292
$$ 113973473 114567263 114993732 115156615 115052050 114813848 114595787 114513822 114691452 115219744
25068A15219744O91312O01889M56568M11777M71008N23480M50312K51132J38985
$$ 115219744 115911056 116512945 116969513 117381290 117852298 118375778 118826090 119077222 119216207
25059A19216207J01764P3406J31129K94549M17102M00416L51967L54883L18375
$$ 119216207 119317971 119391377 119522506 119817055 120234157 120634573 120986540 121341423 121659798
25050A21659798J86174O6259q1024l11061m01427j87495J46385L76575M52490
$$ 121659798 121845972 121912231 121831207 121520146 121118719 120931224 121077609 121454184 121906674
25041A21906674M33898L01994J19628J7705r483J3156k0668j95957l40707k95397
$$ 121906674 122340572 122642566 122762194 122779899 122770416 122783572 122762904 122566947 122226240 121930843
25031A21930843j69611n8612P1351K46030K89521J39694J40768M00180N19571
$$ 121930843 121761232 121702620 121773971 122020001 122309522 122449216 122589984 122990164 123509735
25022A23509735L63303J86661O4669j1436p762m0668j32307k16310j42309J32876
$$ 123509735 123873038 124059699 124124368 124112932 124105170 124064502 123932195 123715885 123573576 123706452
25012A23706452M23354N18160L58063R5280o1153r6313O767K06253K02343O3431
$$ 123706452 124129806 124647966 125006029 125101309 125040156 124943843 124950610 125156863 125359206 125422637
25002A25422637N2400J32112Q9788j10252k34234k39073k29450k03542j40160
$$ 125422637 125475037 125607149 125696937 125586685 125352451 125113378 124883928 124680386 124540226
24993A24540226N4618L12935L74680K71781K19571K39138K29357K23878K17251
$$ 124540226 124594844 124907779 125282459 125554240 125773811 126012949 126242306 126466184 126683435
24984A26683435J50274L4261n9450l9428J9692J7680J00220K34345K41619J03559
$$ 126683435 126833709 126867970 126808520 126769092 126788784 126806464 126906684 127141029 127382648 127486207
24974A27486207r2814l11254l67330j08672K74766M13822K61963J12308M8133
$$ 127486207 127393393 127082139 126714809 126606137 126880903 127294725 127556688 127668996 127717129
24965A27717129k5110j56541k35922j87593j29691j09001r2460j08293j30534
$$ 127717129 127692019 127535478 127299556 127111963 126982272 126873271 126780811 126672518 126541984
24956A26541984j30321r3796J4375M9050J73212L65181L80034L01619K81983K21659
$$ 126541984 126411663 126317867 126332242 126381292 126554504 126919685 127299719 127601338 127883321 128104980
24946A28104980J09491J25063J71722P7983l9982j0620R3958J04353l6361j80390
$$ 128104980 128214471 128339534 128511256 128589239 128549257 128538637 128632595 128736948 128700587 128520197
24936A28520197j32886M9493K12339K82031K71473J54026l5902q4784m5688m0338
$$ 128520197 128387311 128436804 128649143 128931174 129202647 129356673 129320771 129235987 129190299 129149961
24926A29149961K4437J57579K47196J77278j8260j18721r0088j5403k8550j60708
$$ 129149961 129174398 129331977 129579173 129756451 129738191 129619470 129529382 129513979 129485429 129324721
24916A29324721k39016j84650n1496J63564L72931L73300K23659k1292l58853
$$ 129324721 129085705 128901055 128849559 129013123 129386054 129759354 129983013 129961721 129602868
24907A29602868n18084l61328j60679j82519k61234k03209j12536k4204O2981
$$ 129602868 129084784 128723456 128562777 128380258 128119024 127915815 127803279 127779075 127842056
24898A27842056J07123J89037L32562M43658M32655K75079J16899J64387K94284
$$ 127842056 127949179 128138216 128470778 128914436 129347091 129622170 129739069 129903456 130197740
24889A30197740J94538j12802l05698k32287r2382o2744j02148j34099j18656
$$ 130197740 130392278 130279476 129973778 129741491 129649109 129586365 129484217 129350118 129231462
24880A29231462p1221k809M7198M6677K5336Q2020J66132J01973r5187l07678
$$ 129231462 129160241 129157432 129204630 129251307 129276643 129358663 129524795 129626768 129531581 129223903
24870A29223903m58072m50921l06167k5510K64585L06222J52102M7869Q3319K33262
$$ 129223903 128765831 128314910 128008743 127983233 128247818 128554040 128706142 128754011 128837330 129070592
24860A29070592L30674K50036Q1278J943P4931J11038J14489Q2109m0659j46790
$$ 129070592 129401266 129651302 129732580 129734523 129809454 129920492 130034981 130117090 130076431 129929641
24850A29929641j01279l3315J7693R1241J7596j39894j37671J259J15128K21733
$$ 129929641 129828362 129795047 129812740 129903981 129921577 129781683 129644012 129645271 129760399 129982132
24840A29982132K13852O4847N0910J74290J85214J4273l07454n31180n41855m55011
$$ 129982132 130195984 130260831 130311741 130486031 130671245 130685518 130378064 129846884 129305029 128850018
24830A28850018l45031k81888k29273k10762k96537l21722j41130J61423L91545
$$ 128850018 128504987 128223099 127993826 127783064 127486527 127164805 127023675 127185098 127576643
24821A27576643M48184L00847J10357Q8894R3159p7955k54422k55945j50631r4125
$$ 127576643 128024827 128325674 128436031 128524925 128618084 128540129 128285707 128029762 127879131 127785006
24811A27785006j40933j88315k98575m16931l43686j68377M8277K94787L23785
$$ 127785006 127644073 127455758 127157183 126740252 126396566 126228189 126276466 126571253 126895038
24802A26895038J57096J35146K70493L05242J97006P0061j38876l13947k24322
$$ 126895038 127052134 127187280 127457773 127763015 127960021 128030082 127891206 127577259 127352937
24793A27352937p3239j08423k07199j82224j5248J52649J81001J51487K51786
$$ 127352937 127279698 127171275 126964076 126781852 126766604 126919253 127100254 127251741 127503527
24784A27503527L51396K50958J21867J08062Q778k15855k83500k09278p5819J32147
$$ 127503527 127854923 128105881 128227748 128335810 128344588 128128733 127845233 127635955 127560136 127692283
24774A27692283L73476M68395L99790K79934K17270J16601j11861l98028n64118
$$ 127692283 128065759 128534154 128933944 129213878 129431148 129547749 129435888 129037860 128473742
24765A28473742m62686k49931p4350j5905L5385J93713K37355K8637k70632m16883
$$ 128473742 128011056 127761125 127686775 127670870 127706255 127899968 128137323 128165960 127895328 127478445
24755A27478445k91898r5645n961J48002M42525P28116P39729L69743j21731l00405
$$ 127478445 127186547 127090902 127084941 127232943 127675468 128403584 129143313 129513056 129391325 129090920
24745A29090920l3670K95631M02004K48588o0080k21891p0233K09423L68636K67573
$$ 129090920 129057250 129352881 129754885 130003473 129943393 129721502 129651269 129860692 130229328 130496901
24735A30496901p0416l93083m46738k48125k6710M4224l4912j15291q8369L3976
$$ 130496901 130426485 130033402 129586664 129338539 129311829 129356053 129321141 129205850 129117481 129151457
24725A29151457K00863K66152J82214P2686L2332l0014k09254l99101l66492j21795
$$ 129151457 129352320 129618472 129800686 129873372 129905704 129875690 129666436 129267335 128900843 128779048
24715A28779048N9609J11959R9253o533J5186L26503O64198P36224L62303k14846
$$ 128779048 128838657 128950616 129049869 129043336 129058522 129385025 130049223 130785447 131147750 130932904
24705A30932904m28723k74447j09276j11241k76184m42074l96726j57839J3355
$$ 130932904 130504181 130229734 130120458 130009217 129733033 129290959 128894233 128736394 128749749
24696A28749749K5383M1743J56799K10248J44550L1013j75912m27162o09723m80609
$$ 128749749 128775132 128816875 128973674 129183922 129328472 129359485 129183573 128756411 128146688 127666079
24686A27666079n7974L42652N85388O39291L79643j8501j89098j07593O4403J78762
$$ 127666079 127608105 127950757 128536145 129175436 129555079 129536578 129347480 129239887 129304290 129483052
24676A29483052J06057K557m4370q6294j06517q2898O9467K55477L38177L05737
$$ 129483052 129589109 129591666 129547296 129461002 129354485 129271587 129341054 129596531 129934708 130240445
24666A30240445K21582J00948m8797k04424l91361m32241k76699j11119O0602
$$ 130240445 130462027 130562975 130514178 130309754 129918393 129486152 129209453 129098334 129158936
24657A29158936L38019N23044M77455K99506J26516R9393K34286K78568J51128
$$ 129158936 129496955 130019999 130497454 130796960 130923476 131022869 131257155 131535723 131686851
24648A31686851M4268k7759j15817k39049l04716l19112l13719k40164j40932
$$ 131686851 131731119 131703360 131587543 131348494 131043778 130724666 130410947 130170783 130029851
24639A30029851o428J24356J30737P8189q3587l04709l62137j94047Q7271K35698
$$ 130029851 130023423 130147779 130278516 130356705 130273118 129968409 129606272 129412225 129499496 129735194
24629A29735194J36560J5290n9032j64997j37706K4102K264k51102m03005k73676
$$ 129735194 129871754 129887044 129828012 129663015 129525309 129549411 129551675 129300573 128897568 128623892
24619A28623892P073J73570K30959K70585K30833J23249J23035J82042J14908
$$ 128623892 128630965 128804535 129035494 129306079 129536912 129660161 129783196 129965238 130080146
24610A30080146M0382M4127Q0527J84377L21046L21634J78156N8825M9552M9948
$$ 130080146 130120528 130164655 130245182 130429559 130750605 131072239 131250395 131309220 131358772 131408720
24600A31408720k422m8484k8505l698p4091j87314j91638j64524j59921j47827
$$ 131408720 131406298 131357814 131329309 131325611 131251520 131064206 130872568 130708044 130548123 130400296
24590A30400296j58885k01342k58101k35308p7692L0490j7719j51612j91156p3754
$$ 130400296 130241411 130040069 129781968 129546660 129468968 129499458 129481739 129330127 129138971 129065217
24580A29065217M5659K3118m7547j9290j5716j14739k17344j82702j30458j80777
$$ 129065217 129110876 129133994 129086447 129067157 129051441 128936702 128719358 128536656 128406198 128225421
24570A28225421k22065j58341m2272J04237K42852L19984L63825L45676K51222
$$ 128225421 128003356 127845015 127802743 127906980 128149832 128469816 128833641 129179317 129430539
24561A29430539Q2010j03958k05170k32796j35606O7954K08276J96846J28333
$$ 129430539 129512549 129408591 129203421 128970625 128835019 128902973 129111249 129308095 129436428
24552A29436428O3858p562n6567r1704j34523j74627j35552n6006j2057L46M6612
$$ 129436428 129500286 129492724 129436157 129344453 129209930 129035303 128899751 128843745 128831688 128832034 128878646
24541A28878646J60264J51877m4690j93440j70244O7554M17830N93567M99557
$$ 128878646 129038910 129190787 129146097 128952657 128782413 128849967 129267797 129861364 130360921
24532A30360921K37733n3274l03490m22655l97691l15076k06585j48677j82234
$$ 130360921 130598654 130545380 130241890 129819235 129421544 129106468 128899883 128751206 128568972
24523A28568972j66141k455R9536J36844K51908L75475L07341J1758k63809l71382
$$ 128568972 128402831 128400376 128499912 128636756 128888664 129264139 129571480 129583238 129319429 128948047
24513A28948047m30906n14902l52269P051J28368J13049J82536J68047P9597N9830
$$ 128948047 128517141 128002239 127649970 127657021 127785389 127898438 128080974 128249021 128328618 128388448
24503A28388448J58829K17845J99225J96056K48116K44153J26905L7566o724o1136
$$ 128388448 128547277 128765122 128964347 129160403 129408519 129652672 129779577 129817143 129810419 129749283
24493A29749283j36574j16661o9947j59098k47715k75231l25783l09312q2214
$$ 129749283 129612709 129496048 129426101 129267003 129019288 128744057 128418274 128108962 128026748
24484A28026748K03934L35441L49619L51586L42636K52748J24409P5372Q1652
$$ 128026748 128230682 128566123 128915742 129267328 129609964 129862712 129987121 130062493 130144145
24475A30144145M2150j5329N1458J49365J14460r617j73040m23771n84422m30510
$$ 130144145 130186295 130170966 130222424 130371789 130486249 130476632 130303592 129879821 129295399 128864889
24465A28864889j17839J27612J84473R4952M6813K0683n5311j48380k24423k24925
$$ 128864889 128747050 128874662 129059135 129154087 129200900 129221583 129166272 129017892 128793469 128568544
24455A28568544j61646m4133L1412J4089O9085K14830K63274K43027K55535K01498
$$ 128568544 128406898 128362765 128394177 128408266 128477351 128692181 128955455 129198482 129454017 129655515
24445A29655515O3925M5845J43211J84637J42333N2637j25979m07227n79814m81893
$$ 129655515 129719440 129765285 129908496 130093133 130235466 130288103 130162124 129754897 129175083 128693190
24435A28693190k06163L2058P9026Q1596J45179J47232R9238J52299K61134J85182
$$ 128693190 128487027 128519085 128598111 128679707 128824886 128972118 129071356 129223655 129484789 129669971
24425A29669971p475j83741l14588k89424j80984k15538l06587k44864q2034J12605
$$ 129669971 129662496 129478755 129164167 128874743 128693759 128478221 128171634 127926770 127844736 127957341
24415A27957341K81595M18431M77274M45482K53914n0739k63387k70300j92892
$$ 127957341 128238936 128657367 129134641 129580123 129834037 129783298 129519911 129249611 129056719
24406A29056719j16808K8572K21448K96296J81894P0982j9196j36471k25553l54105
$$ 129056719 128939911 128968483 129189931 129486227 129668121 129739103 129719907 129583436 129357883 129003778
24396A29003778m80829m35828k32375n6684m5105j35057o2220J97302L90093L88953
$$ 129003778 128522949 128087121 127854746 127798062 127752957 127617900 127555680 127752982 128143075 128532028
24386A28532028L13978K23801Q1724j4971m3710j7848P4512J30714J41225J85491
$$ 128532028 128846006 129069807 129151531 129136560 129092850 129075002 129149514 129280228 129421453 129606944
24376A29606944K30061K03131K7333j75291j63136M600K12241L29785L44585K22546
$$ 129606944 129837005 130040136 130067469 129892178 129729042 129733642 129945883 130275668 130620253 130842799
24366A30842799l9233j97216j67033j73764j67754q3445o5782j20685k12133k20934
$$ 130842799 130803566 130606350 130439317 130265553 130097799 130014354 129948572 129827887 129615754 129394820
24356A29394820j44570m1598p549r750N9846J62824K81861L50050L41868K73307
$$ 129394820 129250250 129208652 129201103 129191353 129251199 129414023 129695884 130045934 130387802 130661109
24346A30661109K7849l52330n64314n60223m60227k71245p8320P8533J96403K08525
$$ 130661109 130688958 130336628 129772314 129212091 128751864 128480619 128402299 128480832 128677235 128885760
24336A28885760K03113K06007J27611j584j19102j80797j19547N7943J55520J09485
$$ 128885760 129088873 129294880 129422491 129420907 129301805 129121008 129001461 129059404 129214924 129324409
24326A29324409l5956k56411m28750m19316j15290L88501P15947P49185O38490
$$ 129324409 129288453 129032042 128603292 128183976 128068686 128457187 129173134 129922319 130560809
24317A30560809M23562J59092q4190k52426l33751l29471k71846j60661l6152
$$ 130560809 130984371 131143463 131059273 130806847 130473096 130143625 129871779 129711118 129674966
24308A29674966q6527k35843k63441q6553J49880K09650J59287J52470J48850
$$ 129674966 129588439 129352596 129089155 129002602 129152482 129362132 129521419 129673889 129822739
24299A29822739n918k06357k10350K3417L67043N49456M66299K39250n648j85458
$$ 129822739 129816821 129610464 129400114 129423531 129790574 130340030 130806329 131045579 131039931 130854473
24289A30854473l36989l92108k11647M0281J62847J18073L7724j742j17764k30487
$$ 130854473 130517484 130125376 129913729 129954010 130116857 130234930 130272654 130270912 130153148 129922661
24279A29922661j15294J4912L6855J14187J58813J04380L2028J5863J6903m0861
$$ 129922661 129807367 129822279 129859134 129973321 130132134 130236514 130268542 130284405 130301308 130260447
24269A30260447j00979p9002J22710K70899J38031q7844j27619N5302L22387M18043
$$ 130260447 130159468 130080466 130203176 130474075 130612106 130524262 130396643 130451945 130774332 131192375
24259A31192375K01994j17545l15125l90292m74026n10426l53280j58591j75772
$$ 131192375 131394369 131276824 130961699 130571407 130097381 129586955 129233675 129075084 128899312
24250A28899312l81763l81176p4262J80815K89094L17210J72542j0045j15769
$$ 128899312 128517549 128136373 128062111 128242926 128532020 128849230 129021772 129011727 128895958
24241A28895958j96299j88403j24372m8637J23014K00531J20453O7213Q3124M8049
$$ 128895958 128699659 128511256 128386884 128338247 128461261 128661792 128782245 128849458 128932582 128980631
24231A28980631n5261j65628k68287k72262m9931K57643L28334J83458q050j94414
$$ 128980631 128925370 128759742 128491455 128219193 128169262 128426905 128755239 128938697 128930647 128736233
24221A28736233l47895l44921j56972p7787j92618j90432j1846K01897L74922
$$ 128736233 128388338 128043417 127886445 127808658 127616040 127425608 127413762 127615659 127990581
24212A27990581M35451M17036L18755J34349k9426q5074n8403J02379L35640L62411
$$ 127990581 128426032 128843068 129161823 129296172 129266746 129181672 129123269 129225648 129561288 129923699
24202A29923699J49837k7260r3771k13946k76970k26277k16718k21337j46543
$$ 129923699 130073536 130046276 129952505 129738559 129461589 129235312 129018594 128797257 128650714
24193A28650714l8983K1626L9310L1173o8476j49341m2229J41107L84909O11114
$$ 128650714 128611731 128633357 128672667 128703840 128635364 128486023 128443794 128584901 128969810 129580924
24183A29580924N33794K21558p4903k40467k03297n4742J748r9210k44475k97903
$$ 129580924 130114718 130336276 130261373 130020906 129817609 129762867 129764615 129665405 129420930 129123027
24173A29123027k90510k68714j85093o3384k9827M6320K32985M40926N59609M73537
$$ 129123027 128832517 128563803 128378710 128315326 128285499 128331819 128564804 129005730 129565339 130038876
24163A30038876J81405j74684l62503l53455k84641k10315j86044j28843l1730
$$ 130038876 130220281 130045597 129683094 129329639 129044998 128834683 128648639 128519796 128488066
24154A28488066j308o052k469p550n9159m9301N6024Q8943L9960O7790J56773
$$ 128488066 128486758 128480706 128478237 128470687 128411528 128362227 128418251 128507194 128547154 128614944 128771717
24143A28771717K65151L61554K46302p3434l19529m10121m57893m48401k46033
$$ 128771717 129036868 129398422 129644724 129571290 129251761 128841640 128383747 127935346 127689313
24134A27689313J14200L66886M85824M55045K02334q8175l03638l28070j02042
$$ 127689313 127803513 128170399 128656223 129111268 129313602 129225427 128921789 128593719 128491677
24125A28491677J88712M22409N18232L32741q2368m77783o43638n37518j90057
$$ 128491677 128680389 129102798 129621030 129953771 129871403 129393620 128749982 128212464 128022407
24116A28022407K36127M13082K35043o2790l28563l95685k90317r4096J44464
$$ 128022407 128258534 128671616 128906659 128843869 128515306 128119621 127829304 127735208 127879672
24107A27879672K12927R7857L4964J25595J72791Q3262j4999r489Q2508K11872
$$ 127879672 128092599 128190456 128225420 128351015 128523806 128607068 128592069 128582580 128665088 128876960
24097A28876960K19344R8800J86767L89893K70185j40866l53099j79576K7030
$$ 128876960 129096304 129195104 129381871 129771764 130041949 129901083 129547984 129368408 129395438
24088A29395438J8013j46129k83384l45450k59423p1137Q5817K54572L32271J90017
$$ 129395438 129413451 129267322 128983938 128638488 128379065 128307928 128393745 128648317 128980588 129170605
24078A29170605n7821k10352k38277k29817j75495n6203J17015K89730L77659
$$ 129170605 129112784 128902432 128664155 128434338 128258843 128202640 128319655 128609385 128987044
24069A28987044K93244R1200p8610j16534j19762j95606k17000j55869m1901J03845
$$ 128987044 129280288 129371488 129292878 129176344 129056582 128860976 128643976 128488107 128446206 128550051
24059A28550051K05682K61275K76819J73659l8587p6997P6756K29409J88542j30811
$$ 128550051 128755733 129017008 129293827 129467486 129428899 129351902 129428658 129658067 129846609 129715798
24049A29715798l66247k21444N0892J81628J24692m5466j99578l20208l14342
$$ 129715798 129349551 129128107 129178999 129360627 129485319 129439853 129240275 128920067 128605725
24040A28605725j40971R2996J35740q8487l03188k91131j00706J15629K20330
$$ 128605725 128464754 128557750 128693490 128605003 128301815 128010684 127909978 128025607 128245937
24031A28245937J81186J19465K7302r2300j57148j31499K8041K07393K51560K16807
$$ 128245937 128427123 128546588 128573890 128481590 128324442 128192943 128220984 128428377 128679937 128896744
24021A28896744J87771K06158K22715J79690Q3354M833o5730k06952l35229k34418
$$ 128896744 129084515 129290673 129513388 129693078 129776432 129781265 129715535 129508583 129173354 128938936
24011A28938936M5329J43983m5889j73256r691J42548q744l08423l65893j95123
$$ 128938936 128984265 129128248 129082359 128909103 128899412 129041960 129033216 128724793 128358900 128163777
24001A28163777r0951o3995m7923M8621K02436J93407n2350k96090k41585M9272
$$ 128163777 128072826 128008831 127960908 128009529 128211965 128405372 128353022 128056932 127815347 127864619
23991A27864619K68819K36291K12822L49839M80257M58462K46033k3346j44588
$$ 127864619 128133438 128369729 128582551 128932390 129412647 129871109 130117142 130093796 129949208
23982A29949208j54836j62150j68288j63930q7632K7605O4185j11851l52180m30282
$$ 129949208 129794372 129632222 129463934 129300004 129212372 129239977 129304162 129192311 128840131 128409849
23972A28409849l05698M5365L61519L48202K29531K79424L48164K28205J03470
$$ 128409849 128104151 128149516 128511035 128859237 129088768 129368192 129716356 129944561 130048031
23963A30048031J33170K02899J80955K18799K57537J01149p4105n3721O1655k1002
$$ 130048031 130181201 130384100 130565055 130783854 131041391 131142540 131068435 131014714 131076369 131055367
23953A31055367k71297m00893m14825n30334n59509l10384k7959Q4124Q1782N6617
$$ 131055367 130784070 130383177 129968352 129438018 128878509 128568125 128540166 128624290 128706072 128762689
23943A28762689O4627J74216K95343K09549l8841k93396m80596n24127m51489
$$ 128762689 128827316 129001532 129296875 129506424 129467583 129174187 128693591 128169464 127717975
23934A27717975l31507k27070j78747l8345J15941J13653K0594k7614N2621K37361
$$ 127717975 127386468 127159398 126980651 126942306 127058247 127171900 127192494 127164880 127217501 127454862
23924A27454862L78307M48136M65988M26123L24172K15037J46442O8653r3853
$$ 127454862 127833169 128281305 128747293 129173416 129497588 129712625 129859067 129927720 129833867
23915A29833867k90170l41776l05563l08046l08914k79304j55045P4191K62769
$$ 129833867 129543697 129201921 128896358 128588312 128279398 128000094 127845049 127919240 128182009
23906A28182009L15921L53356L26935J05553j53426k79512k58797j70202r3056
$$ 128182009 128497930 128851286 129178221 129283774 129130348 128850836 128592039 128421837 128328781
23897A28328781o532J16590J95919K13175K03928K34729K84449J55451l9014r1381
$$ 128328781 128322249 128438839 128634758 128847933 129051861 129286590 129571039 129726490 129687476 129596095
23887A29596095m4635m3266o2621J306O6205q863j87936k26173o4323J33641J91543
$$ 129596095 129551460 129508194 129445573 129446879 129513084 129504221 129316285 129090112 129025789 129159430 129350973
23876A29350973J22312K918j69214l07240k45882n55J26956N871j79810k41462
$$ 129350973 129473285 129476203 129306989 128999749 128753867 128753312 128880268 128886139 128706329 128464867
23866A28464867j26039M8353J67066K11408K74873K61735J09275r3344k19214
$$ 128464867 128338828 128387181 128554247 128765655 129040528 129302263 129411538 129318194 129098980
23857A29098980k09806j82463j49650q2315o6715r1973j55467l05805l72553k07878
$$ 129098980 128889174 128706711 128557061 128474746 128408031 128316058 128160591 127854786 127482233 127274355
23847A27274355J5470Q4319L0301j4086m8249o7084O1687J72281J40890J21705
$$ 127274355 127289825 127374144 127404445 127390359 127342110 127275026 127336713 127508994 127649884 127771589
23837A27771589J21747M4232j50468m04612n39556l59659K4873K28154J34627
$$ 127771589 127893336 127937568 127787100 127382488 126842932 126483273 126508146 126736300 126870927
23828A26870927p7004j86458j10371P4326K34238K63986J86526J85499L02895
$$ 126870927 126793923 126607465 126497094 126571420 126805658 127069644 127256170 127441669 127744564
23819A27744564L15186J61676M4544J21652K78490K78236J86007J90104K23736
$$ 127744564 128059750 128221426 128265970 128387622 128666112 128944348 129130355 129320459 129544195
23810A29544195J66540O5674J7457M3694J05550L3892j45765k38419p5443K78607
$$ 129544195 129710735 129776409 129793866 129837560 129943110 129977002 129831237 129592818 129517375 129795982
23800A29795982M43542K96653P5339R093N0682L3229o5202l09096o18177p50855
$$ 129795982 130239524 130536177 130611516 130620609 130671291 130704520 130639318 130330222 129712045 128961190
23790A28961190o31554l87350j52112j7285Q6706J75158J51795O8359P9872K15673
$$ 128961190 128329636 127942286 127790174 127772889 127859595 128034753 128186548 128254907 128334779 128550452
23780A28550452L02960K89817J41659n0780j17721j04318k2974P3940p373k27898
$$ 128550452 128853412 129143229 129284888 129234108 129116387 129012069 128989095 129063035 129055662 128827764
23770A28827764l00674k11581j40835j57806k13506j47881J9243J55265K58474
$$ 128827764 128527090 128315509 128174674 128016868 127803362 127655481 127674724 127829989 128088463
23761A28088463L39886M03856L84074J96572k264r816Q0166M1933j10950l07033
$$ 128088463 128428349 128832205 129216279 129412851 129410587 129400771 129480937 129522870 129411920 129104887
23751A29104887m28162l55251k38148j88047k37392k13381O2239K90368K60289
$$ 129104887 128676725 128321474 128083326 127895279 127657887 127444506 127506745 127797113 128057402
23742A28057402J63560N9072k1445K4637J01782R4808M9757J15989K50051K79467
$$ 128057402 128220962 128280034 128258589 128283226 128385008 128479816 128529573 128645562 128895613 129175080
23732A29175080K80676K89983K52440J47427l8275r3345K9012J51660J82227J09046
$$ 129175080 129455756 129745739 129998179 130145606 130107331 130013986 130042998 130194658 130376885 130485931
23722A30485931m5364j71590j78492j46502k18066k85099k68968k89112l81556
$$ 130485931 130440567 130268977 130090485 129943983 129725917 129440818 129171850 128882738 128501182
23713A28501182l24944j0959K85333M48496L83621K7136k94464m16069m41228
$$ 128501182 128176238 128165279 128450612 128899108 129282729 129309865 129015401 128599332 128158104
23704A28158104l42547j90750j81643j68068M7579L02128M03811M18002M37556
$$ 128158104 127815557 127624807 127443164 127275096 127322675 127624803 128028614 128446616 128884172
23695A28884172M39236M23486L31523J30541q7651k60508k39262n9073J7408L0044
$$ 128884172 129323408 129746894 130078417 130208958 130121307 129860799 129621537 129562464 129579872 129609916
23685A29609916J51442K91897K81330K09242J53442J6415j11543j41932k28071
$$ 129609916 129761358 130053255 130334585 130543827 130697269 130713684 130602141 130460209 130232138
23676A30232138m47106o05170m54831j77376m7187j12686j71564j02427L8604
$$ 130232138 129785032 129179862 128725031 128547655 128500468 128387782 128216218 128113791 128152395
23667A28152395K60738M02177K67294l1461k00814j62249j27613j69516j36010
$$ 128152395 128413133 128815310 129082604 129051143 128850329 128688080 128560467 128390951 128254941
23658A28254941m1848O913p9574k35534k00830q917L1695n7660j8342L2584n0087
$$ 128254941 128213093 128220006 128140432 127904898 127704068 127695151 127726846 127669186 127650844 127683428 127633341
23647A27633341j40160j47070j32231J0378K75425M52727M11418K69715J88630
$$ 127633341 127493181 127346111 127213880 127224258 127499683 127952410 128363828 128633543 128822173
23638A28822173J16680P651j18867k05611l04167m29442m77359k76123N6999K03166
$$ 128822173 128938853 128946504 128827637 128622026 128317859 127888417 127411058 127134935 127191934 127395100
23628A27395100J48767J86960L77191L93061J59714j22865k67041k57975k28479
$$ 127395100 127543867 127730827 128108018 128501079 128660793 128537928 128270887 128012912 127784433
23619A27784433j50746N2256K73644L60370K16723o3668j98097j07142m7132r8793
$$ 127784433 127633687 127685943 127959587 128319957 128536680 128473012 128274915 128167773 128120641 128021848
23609A28021848n7786J09194J80308N4559j15695j94386j86617j72335j84066
$$ 128021848 127964062 128073256 128253564 128308123 128192428 127998042 127811425 127639090 127455024
23600A27455024k50067j72905O0820J86001J39974P0359n2375k74620k58409J5694
$$ 127455024 127204957 127032052 127092872 127278873 127418847 127489206 127436831 127162211 126903802 126919496
23590A26919496J70087J60138R9005P0839J03564J33387J38819J84222K01081
$$ 126919496 127089583 127249721 127348726 127419565 127523129 127656516 127795335 127979557 128180638
23581A28180638K25k42074k47181n1990J10608J52412K07970M02568N60687M64645
$$ 128180638 128180863 127938789 127691608 127639618 127750226 127902638 128110608 128513176 129073863 129538508
23571A29538508J87180m9910j49632k03337k47531k27635q0322J64950K80681
$$ 129538508 129725688 129675778 129526146 129322809 129075278 128847643 128767321 128932271 129212952
23562A29212952N6907k87069m24208m03170k86819q3466J633j804k1134N445J69721
$$ 129212952 129269859 128982790 128558582 128155412 127868593 127785127 127786760 127784956 127763822 127769267 127938988
23551A27938988L50273L48068K33670J42604j8344j84647k06801j35824p8860
$$ 127938988 128289261 128637329 128870999 129013603 128995259 128810612 128603811 128467987 128389127
$$ [...]
##END NTUPLES=NMR SPECTRUM
##END=
