##TITLE=31P ikalashn
DE2_HCl
20.7.2023
##JCAMPDX= 6.0         $$ Bruker NMR JCAMP-DX V2.0
##DATA TYPE= NMR SPECTRUM
##DATA CLASS= NTUPLES
##ORIGIN= UXNMR, Bruker Analytische Messtechnik GmbH
##OWNER= root
$$ TOPSPIN		Version 1.3
$$ 2023-07-20 13:41:16.234 +0400  Irina@DPX200
$$ Compression mode = diff/dup
##.OBSERVE FREQUENCY= 81.01967998063
##.OBSERVE NUCLEUS= ^31P
##.ACQUISITION MODE= SIMULTANEOUS
##.ACQUISITION SCHEME= undefined
##.AVERAGES= 16
##.DIGITISER RES= 17
##SPECTROMETER/DATA SYSTEM= spect
##.PULSE SEQUENCE= zgpg
##.SOLVENT NAME= D2O
##.SHIFT REFERENCE= INTERNAL, D2O, 1, 298.5841
##AUDIT TRAIL= $$ (NUMBER, WHEN, WHO, WHERE, WHAT)
$$ ##TITLE= Audit trail, TOPSPIN		Version 1.3
$$ ##JCAMPDX= 5.01
$$ ##ORIGIN= Bruker BioSpin GmbH
$$ ##OWNER= Irina
$$ $$ F:/spectra/data/iren/nmr/P31dec/1/pdata/1/auditp.txt
$$ ##AUDIT TRAIL=  $$ (NUMBER, WHEN, WHO, WHERE, VERSION, WHAT)
(   1,<2023-07-20 13:37:46.781 +0400>,<Irina>,<DPX200>,<TOPSPIN 1.3>,
      <created by zg
	started at 2023-07-20 13:37:18.890 +0400,
	POWCHK disabled, PULCHK disabled
       configuration hash MD5:
       BE 6D 3F 07 2A EA 11 49 91 17 2B D3 AF B3 58 0D
       data hash MD5: 32K
       62 3E 56 7A 01 41 98 74 55 CE 13 F4 AF 83 38 A1>)
(   2,<2023-07-20 13:37:59.031 +0400>,<Irina>,<DPX200>,<TOPSPIN 1.3>,
      <Start of raw data processing
       efp BC_mod = 2 LB = 8 FT_mod = 6 PKNL = 1 PHC0 = 27.17697 PHC1 = 265.3444 SI = 32K 
       data hash MD5: 32K
       29 25 67 8D D0 60 F9 CE 42 08 F7 F7 3F B2 FF 69>)
(   3,<2023-07-20 13:38:01.250 +0400>,<Irina>,<DPX200>,<TOPSPIN 1.3>,
      <apk 
       data hash MD5: 32K
       B3 C1 25 0B F6 4B 7A 6F A7 92 F9 DE D2 79 B8 2F>)
(   4,<2023-07-20 13:41:04.125 +0400>,<Irina>,<DPX200>,<TOPSPIN 1.3>,
      <abs n ABSG = 5 
       data hash MD5: 32K
       5C 6C 3C A9 B5 08 07 A5 F6 AB 1E 1B D3 46 E9 58>)
$$ ##END=
$$ 
$$ $$ hash MD5
$$ $$ 6B 30 7E 8B D5 1E A7 D6 9E F3 F2 75 E0 D5 3F 6A
##$RELAX= 
##$RELAX= 
##$RELAX= 
##$RELAX= 
##$RELAX= 
##$RELAX= 
##$RELAX= 
##$RELAX= 
##$RELAX= 
##$RELAX= 
$$ Bruker specific parameters
$$ --------------------------
##$DU= <F:/spectra>
##$EXPNO= 1
##$NAME= <P31dec>
##$PROCNO= 1
##$TYPE= <nmr>
##$USER= <iren>
##$AMP= (0..31)
100 100 100 100 100 100 100 100 100 100 100 100 100 100 100 100 100 100 
100 100 100 100 100 100 100 100 100 100 100 100 100 100 
##$ANAVPT= -1
##$AQSEQ= 0
##$AQ_mod= 1
##$AUNM= <au_zg>
##$AUTOPOS= <>
##$BF1= 81.014009
##$BF2= 200.13
##$BF3= 200.13
##$BF4= 200.13
##$BF5= 200.13
##$BF6= 200.13
##$BF7= 200.13
##$BF8= 200.13
##$BYTORDA= 1
##$CFDGTYP= 0
##$CFRGTYP= 5
##$CHEMSTR= <none>
##$CNST= (0..63)
1 1 145 1 1 1 1 1 1 1 1 1 1 1 1 1 1 1 1 1 1 1 1 1 1 1 1 1 1 1 1 1 1 1 
1 1 1 1 1 1 1 1 1 1 1 1 1 1 1 1 1 1 1 1 1 1 1 1 1 1 1 1 1 1 
##$CPDPRG= <waltz16>
##$CPDPRG1= <>
##$CPDPRG2= <waltz16>
##$CPDPRG3= <>
##$CPDPRG4= <mlev>
##$CPDPRG5= <mlev>
##$CPDPRG6= <mlev>
##$CPDPRG7= <mlev>
##$CPDPRG8= <mlev>
##$CPDPRGB= <>
##$CPDPRGT= <>
##$D= (0..63)
$$ [...]
##$SW_h= 37037.037037037
##$TD= 32768
##$TD0= 1
##$TE= 300
##$TE2= 300
##$TE3= 300
##$TEG= 300
##$TL= (0..7)
0 120 53 12 22 120 120 120 
##$TP= (0..7)
150 150 150 150 150 150 150 150 
##$TP07= 0
##$TPNAME0= <>
##$TPNAME1= <>
##$TPNAME2= <>
##$TPNAME3= <>
##$TPNAME4= <>
##$TPNAME5= <>
##$TPNAME6= <>
##$TPNAME7= <>
##$TPOAL= (0..7)
0.5 0.5 0.5 0.5 0.5 0.5 0.5 0.5 
##$TPOFFS= (0..7)
0 0 0 0 0 0 0 0 
##$TUNHIN= 0
##$TUNHOUT= 0
##$TUNXOUT= 0
##$USERA1= <user>
##$USERA2= <user>
##$USERA3= <user>
##$USERA4= <user>
##$USERA5= <user>
##$V9= 5
##$VALIST= <valist>
##$VCLIST= <CCCCCCCCCCCCCCC>
##$VD= 0
##$VDLIST= <DDDDDDDDDDDDDDD>
##$VPLIST= <PPPPPPPPPPPPPPP>
##$VTLIST= <TTTTTTTTTTTTTTT>
##$WBST= 1024
##$WBSW= 4
##$XGAIN= (0..3)
0 0 0 0 
##$XL= 0
##$YL= 0
##$YMAX_a= 1994
##$YMIN_a= -5068
##$ZGOPTNS= <>
##$ZL1= 120
##$ZL2= 120
##$ZL3= 120
##$ZL4= 120
##$ABSF1= 298.5841
##$ABSF2= -158.5842
##$ABSG= 5
##$ABSL= 5
##$ALPHA= 0
##$AQORDER= 0
##$ASSFAC= 0
##$ASSFACI= 0
##$ASSFACX= 0
##$ASSWID= 0
##$AUNMP= <proc_1d>
##$AXLEFT= 0
##$AXRIGHT= 0
##$AXTYPE= 0
##$AXUNIT= <>
##$AZFE= 0.1
##$AZFW= 0.5
##$BCFW= 0
##$BC_mod= 2
##$BYTORDP= 0
##$COROFFS= 0
##$CY= 12.5935478210449
##$DATMOD= 1
##$DC= 0
##$DFILT= <>
##$DTYPP= 0
##$F1P= 47.1127640792319
##$F2P= -24.0371245302204
##$FCOR= 0.5
##$FTSIZE= 32768
##$FT_mod= 6
##$GAMMA= 0
##$GB= 0
##$INTBC= 1
##$INTSCL= 7.269226e-011
##$ISEN= 30
##$LB= 8
##$LEV0= 0
##$LPBIN= 0
##$MAXI= 12.09355
##$MC2= 0
##$MEAN= 0
##$ME_mod= 0
##$MI= 0.7550151
##$NCOEF= 0
##$NC_proc= -11
##$NLEV= 6
##$NOISF1= 298.5841
##$NOISF2= 270.0111
##$NSP= 0
##$NTH_PI= 0
##$NZP= 0
##$OFFSET= 298.5841
##$PC= 1.4
##$PHC0= -16.50385
##$PHC1= 293.2076
##$PH_mod= 1
##$PKNL= yes
##$PPARMOD= 0
##$PPDIAG= 0
##$PPIPTYP= 0
##$PPMPNUM= 100
##$PPRESOL= 1
##$PSCAL= 0
##$PSIGN= 0
##$REVERSE= no
##$SF= 81.014009
##$SI= 32768
##$SIGF1= 270.0111
##$SIGF2= -158.5842
##$SINO= 77.54984
##$SIOLD= 32768
##$SREGLST= <31P.CDCl3>
##$SSB= 0
##$STSI= 32768
##$STSR= 0
##$SW_p= 37037.037037037
##$SYMM= 0
##$S_DEV= 0
##$TDeff= 32768
##$TDoff= 0
##$TI= <>
##$TILT= no
##$TM1= 0
##$TM2= 0
##$TOPLEV= 0
##$USERP1= <user>
##$USERP2= <user>
##$USERP3= <user>
##$USERP4= <user>
##$USERP5= <user>
##$WDW= 1
##$XDIM= 32768
##$YMAX_p= 475060049
##$YMIN_p= -6169477
$$ End of Bruker specific parameters
$$ ---------------------------------
##NTUPLES= NMR SPECTRUM
##VAR_NAME=  FREQUENCY,     SPECTRUM/REAL,   SPECTRUM/IMAG
##SYMBOL=    X,             R,               I
##VAR_TYPE=  INDEPENDENT,   DEPENDENT,       DEPENDENT
##VAR_FORM=  AFFN,          ASDF,            ASDF
##VAR_DIM=   32768,         32768,           32768
##UNITS=     HZ,            ARBITRARY UNITS, ARBITRARY UNITS
##FACTOR=    1.13031516577767, 1,            1
##FIRST=     37037.037037037, -635647,       -2770726
##LAST=      0,             255029,          1793542
##MIN=       0,             -6169477,        0
##MAX=       37037.037037037, 475060049,     0
$$ Real data points
##PAGE= N=1
##DATA TABLE= (X++(R..R)), XYDATA
$$ [...]
$$ plain form
16781 1082650 223826 -634914 -1373807 -1879934 -2062852 -1940801 -1644209 -1295832 -955225
16772 -955225 -716719 -659530 -712694 -728828 -650545 -505856 -324467 -115434 94609 212229
16762 212229 133899 -181984 -687040 -1247368 -1694859 -1866984 -1653374 -1083555 -361735 230050
16752 230050 506255 494240 316424 31646 -360094 -847968 -1351664 -1738552 -1893607 -1747110
16742 -1747110 -1346434 -900573 -616122 -493333 -404335 -329037 -344565 -462296 -650746 -849757
16732 -849757 -896055 -695418 -368745 -31393 342078 733097 1006789 1075333 1012078 966393
16722 966393 1024651 1226294 1573119 1936818 2086841 1861861 1319940 713049 260700 -3115
16712 -3115 -170707 -313974 -400781 -342023 -126888 180255 554879 999249 1405243 1574247
$$ packed form
16781A082650q58824q58740p38893n06127j82918J22051K96592L48377L40607
16772i55225K38506N7189n3164j6134P8283J44689J81389K09033K10043J17620
16762B12229p8330l15883n05056n60328m47491j72125K13610N69819P21820N91785
16752B30050K76205j2015j77816k84778l91740m87874n03696l86888j55055J46497
16742a747110M00676M45861K84451J22789Q8998P5298j5528j17731j88450j99011
16732h49757m6298K00637L26673L37352L73471L91019K73692O8544o3255m5685
16722I66393N8258K01643L46825L63699J50023k24980n41921o06891m52349k63815
16712c115j67592j43267q6807N8758K15135L07143L74624M44370M05994J69004
$$ plain form
16702 1574247 1424208 1057182 638402 264240 -71941 -423434 -824997 -1211632 -1440154
16693 -1440154 -1427109 -1240829 -1080219 -1159394 -1531421 -2013433 -2359486 -2463487 -2388970 -2293216
16683 -2293216 -2285028 -2373862 -2494329 -2585823 -2670691 -2685664 -2472088 -1978912 -1270407 -449672
16673 -449672 353908 1066425 1697415 2218436 2543159 2659221 2678638 2730502 2831372 2892237
16663 2892237 2839625 2681232 2496671 2328487 2140354 2000172 2039689 2215372 2361751 2421760
16653 2421760 2431988 2341757 2067313 1632584 1160472 726745 276285 -276422 -927243 -1673340
16643 -1673340 -2538163 -3409443 -4093695 -4489895 -4623517 -4571725 -4357819 -3933009 -3363207 -2820784
16633 -2820784 -2393442 -2056818 -1778580 -1527630 -1262290 -996672 -780794 -643809 -564259 -484585
$$ packed form
16702A574247j50039l67026m18780l74162l36181l51493m01563l86635k28522
16693a440154J3045J86280J60610p9175l72027m82012l46053j04001P4517R5754
16683b293216Q188q8834j20467r1494q4868j4973K13576M93176P08505Q20735
16673d49672Q03580P12517O30990N21021L24723J16062J9417N1864J00870O0865
16663B892237n2612j58393j84561j68184j88133j40182L9517J75683J46379O0009
16653B421760J0228r0231k74444m34729m72112m33727m50460n52707o50821p46097
16643a673340q64823q71280o84252l96200j33622N1792K13906M24810N69802N42423
16633b820784M27342L36624K78238K50950K65340K65618K15878J36985P9550P9674
$$ plain form
16623 -484585 -409265 -402379 -477051 -603997 -781961 -1061899 -1464082 -1874911 -2187147 -2389673
16613 -2389673 -2492367 -2508460 -2451503 -2288004 -1950635 -1467067 -1029532 -851982 -948389 -1134429
16603 -1134429 -1202456 -1036126 -660107 -284782 -165136 -360916 -755982 -1147421 -1360193 -1424842
16593 -1424842 -1522555 -1737862 -1916876 -1873312 -1641883 -1393885 -1185647 -997297 -930680 -1086378
16583 -1086378 -1364414 -1594069 -1739090 -1890657 -2170559 -2603083 -3085889 -3481309 -3693729
16574 -3693729 -3734540 -3688860 -3639990 -3617848 -3612845 -3591136 -3417296 -2890925 -1951142 -746249
16564 -746249 494920 1541718 2190825 2404052 2379001 2381572 2520037 2725556 2915774 3032637
16554 3032637 3013952 2825387 2514359 2178404 1834656 1470623 1114719 784390 481394 211132
$$ packed form
16623d84585P5320O886p4672j26946j77964k79938m02183m10829l12236k02526
16613b389673j02694j6093N6957J63499L37369M83568M37535J77550r6407j86040
16603a134429o8027J66330L76019L75325J19646j95780l95066l91439k12772o4649
16593a424842r7713k15307j79014M3564K31429K47998K08238J88350O6617j55698
16583a086378k78036k29655j45021j51567k79902m32524m82806l95420k12420
16574c693729m0811M5680M8870K2142N003K1709J73840N26371R39783J204893
16564g46249J241169J046798O49107K13227k5051K571J38465K05519J90218J16863
16554C032637j8685j88565l11028l35955l43748l64033l55904l30329l02996k70262
$$ plain form
16544 211132 -18268 -211362 -413191 -634558 -774603 -804815 -829138 -943538 -1156214 -1403547
16534 -1403547 -1644872 -1856358 -1960241 -1919696 -1835537 -1830444 -1882047 -1849810 -1650824 -1356554
16524 -1356554 -1130460 -1046910 -1011153 -925005 -856118 -923883 -1157168 -1492728 -1812209 -1999874
16514 -1999874 -2043825 -2034274 -2061786 -2184578 -2458227 -2860549 -3252181 -3502504 -3556143 -3414606
16504 -3414606 -3135493 -2811041 -2531989 -2348415 -2268251 -2270728 -2307250 -2270181 -2002550 -1445211
16494 -1445211 -786077 -323259 -188621 -326321 -586745 -747262 -647998 -278719 314725 984460
16484 984460 1472429 1637012 1548423 1411329 1431967 1641827 1957138 2346066 2793910 3214848
16474 3214848 3471485 3466698 3170510 2621678 1973337 1447636 1146169 952853 659848 194811
$$ packed form
16544B11132k29400j93094k01829k21367j40045l0212k4323j14400k12676k47333
16534a403547k41325k11486j03883M0545Q4159N093n1603L2237J98986K94270
16524a356554K26094Q3550L5757Q6148O8887o7765k33285l35560l19481j87665
16514a999874m3951R551k7512j22792k73649m02322l91632k50323n3639J41537
16504c414606K79113L24452K79052J83574Q0164k477l6522L7069K67631N57339
16494a445211O59134M62818J34638j37700k60424j60517R9264L69279N93444O69735
16484I84460M87969J64583q8589j37094K0638K09860L15311L88928M47844M20938
16474C214848K56637m787k96188n48832o48341n25701l01467j93316k93005m65037
$$ plain form
16464 194811 -343598 -865479 -1376360 -1866666 -2239412 -2430820 -2458843 -2376056 -2254350 -2113649
16454 -2113649 -1921913 -1691044 -1497657 -1424764 -1459545 -1525499 -1613421 -1755478 -1874495 -1821261
16444 -1821261 -1563750 -1208847 -849186 -525993 -244398 -16426 53620 -89958 -302323 -395359
16434 -395359 -298375 -30807 341037 723613 1085257 1476653 1860400 2108147 2197052 2220757
16424 2220757 2251927 2238068 2091800 1867318 1701869 1626535 1509157 1190689 645703 -4657
16414 -4657 -541582 -754533 -569339 -67320 557388 1070344 1348378 1468624 1590195 1775747
16404 1775747 1978982 2123197 2156615 2052282 1792337 1388651 920645 467956 50366 -288975
16394 -288975 -488537 -534983 -434063 -200255 82935 258032 232880 100738 91660 376456
$$ packed form
16464A94811n38409n21881n10881m90306l72746j91408k8023Q2787J21706J40701
16454b113649J91736K30869J93387P2893l4781o5954q7922j42057j19017N3234
16444a821261K57511L54903L59661L23193K81595K27972P0046j43578k12365r3036
16434c95359R6984K67568L71844L82576L61644L91396L83747K47747Q8905K3705
16424B220757L1170j3859j46268k24482j65449p5334j17378l18468n44986o50360
16414d657n36925k12951J85194N02019O24708N12956K78034J20246J21571J85552
16404A775747K03235J44215L3418j04333k59945m03686m68006m52689m17590l39341
16394b88975j99562m6446J00920K33808K83190J75097k5152j32142r078K84796
$$ plain form
16384 376456 880714 1377119 1767236 2147529 2586957 2967776 3106781 2952434 2643266 2375668
16374 2375668 2174929 1955226 1732872 1604657 1596136 1635591 1630051 1543745 1456810 1502677 1736788
16363 1736788 2105147 2512142 2848430 2965708 2738300 2181926 1453718 747668 217153
16354 217153 -48680 -53759 70082 114702 -41643 -370170 -811753 -1360495 -2034590 -2814750
16344 -2814750 -3613890 -4304033 -4766978 -4947398 -4872370 -4584774 -4112709 -3558015 -3046524 -2555532
16334 -2555532 -1948320 -1162223 -296924 464063 1008225 1324946 1438692 1354315 1119605 823940
16324 823940 500909 167076 -125627 -332728 -495367 -739522 -1084177 -1349164 -1315466 -894825
16314 -894825 -194174 537758 1097769 1434650 1613782 1665229 1473679 991892 369539 -201022
$$ packed form
16384C76456N04258M96405L90117L80293M39428L80819J39005j54347l09168k67598
16374B375668k00739k19703k22354j28215q521L9455n540q6306q6935M5867K34111
16363A736788L68359M06995L36288J17278k27408n56374p28208p06050n30515
16354B17153k65833n079J23841M4620j56345l28527m41583n48742o74095p80160
16344b814750p99140o90143m62945j80420P5028K87596M72065N54694N11491M90992
16334b555532O07212P86097Q65299P60987N44162L16721J13746q4377k34710k95665
16324H23940l23031l33833k92703k07101j62639k44155l44655k64987L3698M20641
16314h94825P00651P31932N60011L36881J79132N1447j91550m81787o22353n70561
$$ plain form
16304 -201022 -606238 -807284 -791480 -568482 -254926 -40635 -22043 -147681 -252119 -142920
16294 -142920 254184 853061 1498791 2094587 2615566 2997885 3080240 2824295 2470271 2248573
16284 2248573 2138116 1983635 1689034 1330997 1067397 917461 751381 486182 164030
16275 164030 -159089 -500529 -902362 -1351624 -1806410 -2266123 -2706797 -3006525 -3071934 -2902250
16265 -2902250 -2562313 -2174654 -1839171 -1517524 -1120556 -645549 -124372 406908 875765
16256 875765 1194082 1383840 1548548 1744399 1932435 1983573 1865154 1743316 1768621 1920396
16246 1920396 2088016 2181903 2169889 2072652 1913110 1690914 1449994 1300903 1270883 1268721
16236 1268721 1266954 1329388 1465755 1613772 1744337 1855621 1954998 2052724 2139605 2260379
$$ packed form
16304b01022m05216k01046J5804K22998L13556K14291J8592j25638j04438J09199
16294a42920L97104N98877O45730N95796N20979L82319Q2355k55945l54024k21698
16284B248573j10457j54481k94601l58037k63600j49936j66080k65199l22152
16275A64030l23119l41440m01833m49262m54786m59713m40674k99728o5409J69684
16265b902250L39937L87659L35483L21647L96968M75007N21177N31280M68857
16256H75765L18317J89758J64708J95851J88036N1138j18419j21838K5305J51775
16246A920396J67620R3887j2014r7237j59542k22196k40920j49091l0020k162
16236A268721j767O2434J36367J48017J30565J11284R9377R7726Q6881J20774
$$ plain form
16226 2260379 2508509 2831171 2948699 2628939 1901269 1017132 296434 -116395 -300947
16217 -300947 -370066 -359397 -243037 -33282 216001 449801 560278 459005 223903 48961
16207 48961 59381 205858 321115 277127 12139 -525058 -1287942 -2100122 -2765750 -3208967
16197 -3208967 -3505452 -3684955 -3654499 -3365891 -2939263 -2577066 -2371702 -2284840 -2271669 -2354776
16187 -2354776 -2545912 -2764532 -2898172 -2894094 -2735499 -2367859 -1767858 -1042249 -322569 294749
16177 294749 696389 812526 699458 444607 84376 -329917 -689044 -851301 -791766 -652651
16167 -652651 -546658 -396617 -59831 436035 884720 1117801 1163176 1167464 1230074 1355470
16157 1355470 1494255 1610372 1756144 2008098 2289640 2405876 2264951 1970577 1722030
$$ packed form
16226B260379K48130L22662J17528l19760p27670q84137p20698m12829j84552
16217c00947o9119J0669J16360K09755K49283K33800J10477j01273k35102j74942
16207D8961J0420J46477J15257m3988k64988n37197p62884q12180o65628m43217
16197c208967k96485j79503L0456K88608M26628L62197K05364Q6862J3171q3107
16187b354776j91136k18620j33640M078J58595L67640O00001P25609P19680O17318
16177B94749M01640J16137j13068k54851l60231m14293l59127j62257N9535J39115
16167f52651J05993J50041L36786M95866M48685K33081M5375M288O2610J25396
16157A355470J38785J16117J45772K51954K81542J16236j40925k94374k48547
$$ plain form
16148 1722030 1696765 1875062 2026942 1957803 1637086 1147349 684218 460678 477558 523338
16138 523338 404449 124445 -148266 -245826 -116918 151342 374857 394749 178746 -200917
16128 -200917 -612063 -831832 -658286 -125712 494046 937484 1113415 1045145 759749 328370
16118 328370 -155100 -656855 -1138113 -1530384 -1787099 -1894936 -1848928 -1679264 -1463982 -1251438
16108 -1251438 -1042739 -866672 -797294 -902771 -1152749 -1428029 -1624158 -1668731 -1520391 -1272752
16098 -1272752 -1099897 -1024194 -917946 -759260 -693174 -782056 -902804 -933695 -894293 -908582
16088 -908582 -1034769 -1181785 -1236798 -1204273 -1139169 -1088601 -1116284 -1205682 -1197788 -934400 -501214
16077 -501214 -186891 -173941 -472866 -1023886 -1682845 -2198322 -2351622 -2107949 -1647815 -1243886
$$ packed form
16148A722030k5265J78297J51880o9139l20717m89737m63131k23540J6880M5780
16138E23338j18889k80004k72711r7560J28908K68260K23515J9892k16003l79663
16128b00917m11146k19769J73546N32574O19758M43438J75931o8270k85396m31379
16118C28370m83470n01755m81258l92271k56715j07837M6008J69664K15282K12544
16108a251438K08699J76067O9378j05477k49978k75280j96129m4573J48340K47639
16098a272752J72855P5703J06248J58686O6086q8882j20748l0891L9402j4289
16088i08582j26187j47016n5013L2525O5104N0568k7683q9398P894K63388M33186
16077e01214L14323J2950k98925n51020o58959n15477j53300K43673M60134M03929
$$ plain form
16067 -1243886 -986106 -816447 -711543 -670761 -658715 -606785 -444807 -138353 259648 609108
16057 609108 774291 712144 408846 -158211 -930093 -1700915 -2270114 -2602546 -2722161 -2643583
16047 -2643583 -2447663 -2266891 -2208298 -2293115 -2440813 -2546368 -2606066 -2740291 -2975660 -3154474
16037 -3154474 -3146643 -3014322 -2924434 -2937869 -2956977 -2859689 -2652795 -2447327 -2297894 -2160646
16027 -2160646 -1982950 -1730350 -1397179 -1016896 -664539 -371711 -103450 91170 28667 -398169
16017 -398169 -1006656 -1448647 -1452895 -961261 -178096 542978 936121 952544 730685 508895
16007 508895 436177 481442 573693 677746 739031 713773 636443 560811 460879 254378 -90159
15996 -90159 -465696 -707412 -766031 -759023 -859694 -1160907 -1640327 -2153099 -2521049 -2693300
$$ packed form
16067a243886K57780J69659J04904M0782J2046N1930J61978L06454L98001L49460
16057F09108J65183o2147l03298n67057p71882p70822n69199l32432j19615P8578
16047b643583J95920J80772N8593q4817j47698j05555n9698j34225k35369j78814
16037c154474P831J32321Q9888j3435j9108R7288K06894K05468J49433J37248
16027b160646J77696K52600L33171L80283L52357K92828K68261J94620o2503m26836
16017c98169o08487m41991m248M91634P83165P21074L93143J6423k21859k21790
16007E08895p2718M5265R2251J04053O1285k5258p7330p5632r9932k06501l44537
15996i0159l75537k41716n8619P008j00671l01213m79420n12772l67950j72251
$$ plain form
15986 -2693300 -2747187 -2792171 -2852237 -2836708 -2645154 -2246193 -1697891 -1091885 -579769 -363944
15976 -363944 -524773 -951104 -1409870 -1646865 -1547385 -1169793 -625765 -81648 287308 404219
15966 404219 304899 99204 -114695 -301861 -423825 -383706 -144042 140997 231648 25050
15956 25050 -377764 -778095 -1041665 -1112522 -966985 -678286 -365063 -97537 113984 324209
15946 324209 596836 926799 1213579 1359950 1341450 1148688 799628 385919 29246 -204851
15936 -204851 -375111 -634964 -1072180 -1619824 -2167899 -2646723 -3041313 -3355616 -3584827 -3756343
15926 -3756343 -3888175 -3916915 -3770907 -3407090 -2808689 -2063990 -1375498 -904003 -658439 -515825
15916 -515825 -335250 -33525 386690 830464 1148881 1214203 1038473 805930 736745 914441
$$ packed form
15986b693300n3887m4984o0066J5529J91554L98961N48302O06006N12116K15825
15976c63944j60829m26331m58766k36995R9480L77592N44028N44117L68956J16911
15966D04219r9320k05695k13899j87166j21964M0119K39664K85039R0651k06598
15956B5050m02814m00331k63570p0857J45537K88699L13223K67526K11521K10225
15946C24209K72627L29963K86780J46371j8500j92762l49060m13709l56673k34097
15936b04851j70260k59853m37216n47644n48075m78824l94590l14303k29211j71516
15926c756343j31832k8740J46008L63817N98401P44699O88492M71495K45564J42614
15916e15825J80575L01725M20215M43774L18417O5322j75730k32543o9185J77696
$$ plain form
15906 914441 1179827 1303535 1210156 940092 557949 86784 -489710 -1120455 -1634407 -1907446
15896 -1907446 -2004074 -2073938 -2174091 -2277555 -2296588 -2128248 -1790284 -1352740 -843649 -298958
15886 -298958 200203 576468 834963 1004426 1044562 939675 774784 607495 378114 18226
15876 18226 -446851 -940453 -1366725 -1591936 -1555463 -1401888 -1283074 -1185369 -1097906 -1085142
15866 -1085142 -1149893 -1185790 -1096161 -852637 -461055 54349 634199 1192654 1670679 2065483
15856 2065483 2434896 2787002 3041204 3126923 2970267 2557204 1936657 1162761 428038 -43866
15846 -43866 -276797 -439676 -545339 -491674 -274113 -4857 227870 426256 605772 731251
15836 731251 729245 564085 272706 -54323 -313905 -512643 -745032 -1047776 -1397153 -1758368
$$ packed form
15906I14441K65386J23708r3379k70064l82143m71165n76494o30745n13952k73039
15896a907446r6628o9864j00153j03464j9033J68340L37964M37544N09091N44691
15886b98958M99161L76265K58495J69463M0136j04887j64891j67289k29381l59888
15876A8226m65077m93602m26272k25211L6473J53575J18814R7705Q7463J2764
15866a085142o4751l5897Q9629K43524L91582N15404N79850N58455M78025L94804
15856B065483L69413L52106K54202Q5719j56656m13063o20547p73896p34723m71904
15846d3866k32931j62879j05663N3665K17561K69256K32727J98386J79516J25479
15836G31251k006j65160k91379l27029k59582j98738k32389l02744l49377l61215
$$ plain form
15826 -1758368 -2073011 -2292122 -2403437 -2395024 -2285981 -2172132 -2131280 -2141774 -2193765 -2310754
15816 -2310754 -2454064 -2547478 -2586111 -2629645 -2636811 -2489552 -2146695 -1616581 -935139 -252921
15806 -252921 197865 318397 182040 -128902 -532098 -893967 -1119422 -1181739 -1089333 -873076
15796 -873076 -602360 -394757 -336026 -435779 -625408 -811401 -926904 -937412 -868304 -738902
15786 -738902 -502789 -190552 4972 -111419 -526021 -1054712 -1518899 -1854402 -2169731 -2603884
15776 -2603884 -3102202 -3481139 -3649265 -3591920 -3261785 -2626166 -1794265 -989654 -354965 117951
15766 117951 494701 840685 1188625 1510773 1728854 1776394 1671506 1534685 1473387 1486166
15756 1486166 1526827 1554768 1517666 1381462 1200823 1068473 1019555 997149 877583 578844
$$ packed form
15826a758368l14643k19111j11315Q413J09043J13849M0852j0494n1991j16989
15816b310754j43310r3414l8633m3534p166J47259L42857N30114O81442O82218
15806b52921M50786J20532j36357l10942m03196l61869k25455o2317R2406K16257
15796h73076K70716K07603N8731r9753j89629j85993j15503j0508O9108J29402
15786g38902K36113L12237J95524j16391m14602n28691m64187l35503l15329m34153
15776b603884m98318l78937j68126N7345L30135O35619Q31901Q04611O34689M72916
15766A17951L76750L45984L47940L22148K18081M7540j04888j36821o1298J2779
15756A486166M0661K7941l7102j36204j80639j32350m8918k2406j19566k98739
$$ plain form
15746 578844 152854 -268695 -578359 -702567 -668934 -649145 -752700 -898813 -933173 -796333
15736 -796333 -544981 -239436 72687 292656 353073 329299 355260 446514 511364 493634 410192
15725 410192 297587 139111 -113722 -392687 -500056 -341832 -27400 287106 527060 691861
15715 691861 838565 1039844 1273965 1427885 1416635 1303157 1292930 1511061 1890778 2321055
15705 2321055 2776986 3238040 3604030 3737208 3569655 3168372 2704182 2350872 2203723
15696 2203723 2224514 2272374 2287815 2321890 2333534 2169755 1785779 1344569 1103570 1136560
15686 1136560 1268955 1342671 1371206 1467696 1644981 1771426 1714627 1411310 895282 316942
15676 316942 -148502 -457293 -661175 -750039 -688151 -509866 -264010 -12100 179976 348859
$$ packed form
15746E78844m25990m21549l09664j24208L3633J9789j03555j46113l4360J36840
15736g96333K51352L05545L12123K19969O0417k3774K5961R1254O4850j7730q3442
15725D10192j12605j58476k52833k78965j07369J58224L14432L14506K39954J64801
15715F91861J46704K01279K34121J53920j1250j13478j0227K18131L79717M30277
15705B321055M55931M61054L65990J33178j67553m01283m64190l53310j47149
15696B203723K0791M7860J5441L4075J1644j63779l83976m41210k40999L2990
15686A136560J32395P3716K8535R6490J77285J26445n6799l03317n16028n78340
15676C16942m65444l08791k03882q8864O1888J78285K45856K51910J92076J68883
$$ plain form
15666 348859 594989 975644 1478323 1998168 2383517 2516239 2376931 2038759 1613938 1257562
15656 1257562 1073994 1044263 1049470 943772 698460 413108 191141 56555 -29239 -52430
15646 -52430 76774 399593 861521 1351346 1734287 1972172 2152136 2330563 2456469 2467644
15636 2467644 2417517 2441320 2602754 2818056 2946464 2945276 2854946 2599508 2103048 1527177
15626 1527177 1076675 775223 555203 423029 437355 542265 577247 465317 260954 73416
15616 73416 -20466 -60379 -128467 -280039 -522187 -794292 -976979 -979970 -836171 -633104 -434596
15605 -434596 -256866 -74346 101065 178867 73283 -162601 -337233 -280748 739 351211
15595 351211 679983 1040555 1452497 1788805 1927600 1879220 1700023 1468786 1280314 1107560
$$ packed form
15666C48859K46130L80655N02679N19845L85349J32722j39308l38172m24821l56376
15656A257562j83568k9731N207j05698k45312k85352k21967j34586q5794k3191
15646e2430J29204L22819M61928M89825L82941K37885J79964J78427J25906J1175
15636B467644n0127K3803J61434K15302J28408j188r0330k55438m96460n75871
15626A527177m50502l01452k20020j32174J4326J04910L4982j11930k04363j87538
15616G3416r3882l9913o8088j51572k42148k72105j82687k991J43799K03067J98508
15605d34596J77730J82520J75411P7802j05584k35884j74632N6485K81487L50472
15595C51211L28772L60572M11942L36308J38795m8380j79197k31237j88472j72754
$$ plain form
15585 1107560 817231 400585 2692 -263604 -387768 -396093 -310941 -209784 -200843 -298280
15575 -298280 -375411 -270231 34566 442248 880078 1282758 1579691 1758907 1862920 1908042
15565 1908042 1865895 1740030 1610830 1555496 1570014 1598993 1613418 1601567 1539267 1422774 1259291
15554 1259291 998867 629221 279527 65485 20092 166301 468221 801569 1042710 1125859
15544 1125859 1066090 970968 981119 1117637 1191887 1059239 815445 616862 583920 786486
15534 786486 1164845 1507639 1591737 1435819 1298441 1369810 1601984 1837084 1951827 1889743
15524 1889743 1619198 1138170 521424 -116445 -662088 -1050690 -1286083 -1384963 -1316419 -1021005
15514 -1021005 -576560 -187019 45489 211412 440197 755724 1131474 1523980 1861642
$$ packed form
15585A107560k90329m16646l97893k66296j24164q325Q5152J01157Q941r7437
15575b98280p7131J05180L04797M07682M37830M02680K96933J79216J04013M5122
15565A908042m2147j25865j29200n5334J4518K8979J4425j1851o2300j16493j63483
15554A259291k60424l69646l49694k14042m5393J46209L01920L33348K41141Q3149
15544A125859n9769r5122J0151J36518P4250j32648k43794j98583l2942K02566
15534G86486L78359L42794Q4098j55918j37378P1369K32174K35100J14743o2084
15524A889743k70545m81028o16746o37869n45643l88602k35393r8880O8544K95414
15514a021005M44445L89541K32508J65923K28785L15527L75750L92506L37662
$$ plain form
15505 1861642 2102587 2210051 2102744 1735978 1173893 539398 -85613 -682283 -1189351
15496 -1189351 -1515913 -1660864 -1664748 -1575253 -1476699 -1411165 -1337842 -1213240 -1029936 -821959
15486 -821959 -715001 -831080 -1133757 -1485138 -1762931 -1912559 -1950316 -1947384 -1971879 -2003725
15476 -2003725 -1953768 -1745949 -1355028 -798902 -169710 376129 733986 873507 783588 534001
15466 534001 251659 -8124 -289283 -643214 -1039585 -1414191 -1720402 -1928054 -2015744 -2037452
15456 -2037452 -2102534 -2254661 -2434620 -2515056 -2473167 -2449418 -2533429 -2609239 -2559739 -2494997 -2552723
15445 -2552723 -2664915 -2604071 -2170350 -1383088 -464660 336878 915670 1299066 1523298 1557671
15435 1557671 1394158 1096102 765554 512671 321979 66389 -290508 -596924 -683612 -545404
$$ packed form
15505A861642K40945J07464j07307l66766n62085o34495o25011n96670n07068
15496a189351l26562j44951l884Q9495R8554O5534P3323J24602J83304K07977
15486h21959J06958j16079l02677l51381k77793j49628l7757K932k4495l1846
15476b003725M9957K07819L90921N56126O29192N45839L57857J39521q9919k49587
15466E34001k82342k59783k81159l53931l96371l74606l06211k07652q7690k1708
15456b037452o5082j52127j79959q0436M1889K3749q4011p5810M9500O4742n7726
15445b552723j12192O0844M33721P87262R18428Q01538N78792L83396K24232L4373
15435A557671j63513k98056l30548k52883j90692k55590l56897l06416q6688J38208
$$ plain form
15425 -545404 -276345 55753 438836 885596 1327388 1629972 1727327 1637219 1408496 1111014
15415 1111014 812863 521904 218433 -80288 -354559 -592899 -739507 -760643 -729200 -727445
15405 -727445 -725013 -646867 -537223 -554437 -752607 -1010327 -1214417 -1307837 -1233475 -1004601 -752941
15394 -752941 -626347 -645257 -706853 -715865 -647802 -543049 -495721 -552246 -664867 -788262 -907692
15383 -907692 -1035534 -1255499 -1615361 -1974334 -2185254 -2266387 -2257650 -2121627 -1810265 -1376996
15373 -1376996 -920359 -487193 -94325 295457 727086 1167423 1503874 1619362 1543090 1397053
15363 1397053 1211208 928756 489977 -123769 -850948 -1564815 -2102394 -2331689 -2177253
15354 -2177253 -1584094 -668987 264516 962820 1332164 1424667 1401069 1353316 1180167 758859
$$ packed form
15425e45404K69059L32098L83083M46760M41792L02584R7355r0108k28723k97482
15415A111014k98151k90959l03471k98721k74271k38340j46608k1136L1443J755
15405g27445K432P8146J09644j7214j98170k57720k04090r3420P4362K28874K51660
15394g52941J26594j8910o1596r012O8063J04753M7328n6525j12621j23395j19430
15383i07692j27842k19965l59862l58973k10920q1133Q737J36023L11362M33269
15373a376996M56637M33166L92868L89782M31629M40337L36451J15488p6272j46037
15363A397053j85845k82452m38779o13746p27179p13867n37579k29295J54436
15354b177253N93159R15107R33503O98304L69344R2503k3598m7753j73149m21308
$$ plain form
15344 758859 149796 -403526 -656442 -526712 -131280 242641 375351 346248 378593 554408
15334 554408 802790 1040268 1222625 1344030 1397130 1355941 1197127 921597 584318 291063
15324 291063 136559 128293 225099 406335 642488 919463 1221197 1411322 1337345 1039577
15314 1039577 700105 451963 294543 96548 -239958 -613354 -844798 -836792 -497213 197659
15304 197659 1041821 1756044 2201157 2330422 2137935 1745425 1365966 1123969 973014 823780
15294 823780 672495 541376 441766 449480 671805 1145171 1786657 2441531 2985696 3328595
15284 3328595 3441796 3377702 3225064 3091670 3103631 3341732 3770843 4305051 4847807 5279765
15274 5279765 5501746 5447137 5093365 4482764 3732484 3025723 2510300 2239053 2188038 2261551
$$ packed form
15344G58859o09063n53322k52916J29730L95432L73921J32710k9103L2345J75815
15334E54408K48382K37478J82357J21405N3100m1189j58814k75530l37279k93255
15324B91063j54504q266R6806J81236K36153K76975L01734J90125p3977k97768
15314A039577l39472k48142j57420j97995l36506l73396k31444Q006L39579O94872
15304A97659Q44162P14223M45113J29265j92487l92510l79459k41997j50955j49234
15294H23780j51285j31119r9610P714K22325M73366O41486O54874N44165L42899
15284C328595J13201o4094j52638j33394J1961K38101M29111N34208N42756M31958
15274E279765K21981n4609l53772o10601p50280p06761n15423k71247n1015P3513
$$ plain form
15264 2261551 2336262 2386179 2445208 2509784 2577282 2667077 2762222 2798274 2726639 2594983 2520506
15253 2520506 2550510 2636009 2669248 2521909 2129032 1565077 963478 475379 274320 430463
15243 430463 847555 1374396 1918847 2449240 2961441 3427301 3797875 4095570 4400814 4714313
15233 4714313 4955548 5045048 4864052 4267051 3288704 2205852 1293805 617343 61280
15224 61280 -441594 -832466 -1112052 -1360097 -1601304 -1761208 -1759780 -1595872 -1301709 -900748
15214 -900748 -474012 -144639 96679 367544 643879 760772 627277 358198 194145 274892
15204 274892 582594 1057284 1631265 2194274 2593062 2739367 2667446 2453523 2208599 2051716
15194 2051716 2008859 2013630 2016307 2023996 2077938 2241754 2471505 2562687 2353599 1881821 1317389
$$ packed form
15264B261551P4711M9917N9029O4576O7498Q9795R5145L6052p1635j31656p4477
15253B520506L0004Q5499L3239j47339l92877n63955o01599m88099k01059J56143
15243D30463M17092N26841N44451N30393N12201M65860L70574K97695L05244L13499
15233D714313K41235Q9500j80996n97001r78347j082852r12047o76462n56063
15224F1280n02874l90872k79586k48045k41207j59904J428J63908K94163M00961
15214i00748M26736L29373K41318K70865K76335J16893j33495k69079j64053Q0747
15204B74892L07702M74690N73981N63009L98788J46305p1921k13923k44924j56883
15194B051716m2857M771K677P689N3942J63816K29751R1182k09088m71778n64432
$$ plain form
15183 1317389 812113 429411 205740 166717 263653 410815 577151 760808 901701 887802
15173 887802 661222 293929 -68857 -313875 -434468 -521789 -652990 -853394 -1166040 -1543451
15163 -1543451 -1779033 -1757224 -1592517 -1478156 -1487176 -1512641 -1416193 -1213231 -1063442 -1078924
15153 -1078924 -1250442 -1536719 -1898071 -2282168 -2582110 -2625354 -2303185 -1655767 -828265 -28168
15143 -28168 549013 826777 840379 688965 494864 358238 264338 87430 -249802 -655750
15133 -655750 -955932 -1025561 -795962 -304172 295336 781626 1019814 1087512 1096990 1057557
15123 1057557 978648 903065 854330 829893 816877 816229 876754 1054180 1325133 1628122 1882617
15112 1882617 2022363 2036391 1917462 1704291 1472741 1291244 1218893 1251849 1306479 1333854
$$ packed form
15183A317389n05276l82702k23671l9023R6936J47162J66336J83657J40893j3899
15173H87802k26580l67293l62786k45018j20593q7321j31201k00404l12646l77411
15163a543451k35582K1809J64707J14361r020k5465R6448K02962J49789j5482
15153a078924j71518k86277l61352l84097k99942m3244L22169O47418Q27502Q00097
15143b8168N77181K77764J3602j51414j94101j36626r3900j76908l37232m05948
15133f55750l00182o9629K29599M91790N99508M86290K38188O7698R478l9433
15123A057557p8909p5583m8735k4437j3016o48O0525J77426K70953L02989K54495
15112A882617J39746J4028j18929k13171k31550j81497p2351L2956N4630K7375
$$ plain form
15102 1333854 1388388 1547614 1836429 2184572 2446329 2489755 2277697 1854352 1303851 730373
15092 730373 141599 -499890 -1071815 -1423629 -1622118 -1844356 -2166735 -2490154 -2645483 -2615503
15082 -2615503 -2532641 -2515729 -2578487 -2677109 -2812515 -2975425 -3153543 -3363047 -3528837 -3517631
15072 -3517631 -3304222 -2979035 -2641339 -2355694 -2142056 -1973977 -1826455 -1705029 -1624714 -1551017
15062 -1551017 -1438083 -1325822 -1298075 -1368132 -1426072 -1385641 -1354089 -1472359 -1684463 -1836396
15052 -1836396 -1882735 -1830027 -1650884 -1373581 -1080973 -839289 -667877 -583605 -621863 -738243
15042 -738243 -829754 -873939 -927330 -983727 -932896 -714261 -388531 -30502 359266 769046
15032 769046 1099133 1265449 1298381 1283353 1270450 1249724 1169925 1001594 737978 348227
$$ packed form
15102A333854N4534J59226K88815L48143K61757M3426k12058m23345n50501n73478
15092G30373n88774o41489n71925l51814j98489k22238l22379l23419j55329K9980
15082b615503Q2862J6912o2758r8622j35406j62910j78118k09504j65790J1206
15072c517631K13409L25187L37696K85645K13638J68079J47522J21426Q0315P3697
15062a551017J12934J12261K7747p0057n7940M0431L1552j18270k12104j51933
15052a836396m6339N2708J79143K77303K92608K41684J71412Q4272l8258j16380
15042g38243r1511m4185n3391n6397N0831K18635L25730L58029L89768M09780
15032G69046L30087J66316L2932j5028j2903k0726p9799j68331k63616l89751
$$ plain form
15022 348227 -110649 -433030 -482312 -278252 113078 602933 1058937 1378599 1556271 1616103
15012 1616103 1524324 1259149 922037 632923 397480 124923 -259501 -724259 -1147580 -1396367
15002 -1396367 -1415737 -1210513 -785163 -199028 390601 870179 1266422 1663520 2099744 2532303
14992 2532303 2905339 3218770 3507758 3818778 4164485 4515639 4852313 5168535 5445659
14983 5445659 5644318 5748317 5786576 5767614 5587498 5098295 4321618 3456712 2689164 2066153
14973 2066153 1558542 1203980 1104451 1336676 1880989 2559054 3087720 3295940 3202226 2903667
14963 2903667 2518792 2118407 1699748 1270390 920004 753159 760628 826309 839008 803531
14953 803531 878882 1297872 2122327 3120603 4005307 4677041 5164525 5492624 5639758 5562099
$$ packed form
15022C48227m58876l22381m9282K04060L91330M89855M56004L19662J77672N9832
15012A616103r1779k65175l37112k89114k35443k72557l84424m64758m23321k48787
15002a396367j9370K05224M25350N86135N89629M79578L96243L97098M36224M32559
14992B532303L73036L13431K88988L11020L45707L51154L36674L16222K77124
14983E445659J98659J03999L8259j8962j80116m89203p76677q64906p67548o23011
14973B066153n07611l54562r9529K32225N44313O78065N28666K08220r3714k98559
14963B903667l84875m00385m18659m29358l50386j66845P469O5681J2699l5477
14953H03531P5351M18990Q24455R98276Q84704O71734M87484L28099J47134p7659
$$ plain form
14943 5562099 5278659 4908624 4614096 4528368 4716776 5112410 5517008 5742562 5735499 5547786
14933 5547786 5305736 5195562 5313314 5535974 5643438 5530578 5229330 4885379 4694365
14924 4694365 4725125 4912784 5235965 5707402 6237090 6692267 7001955 7107377 6964081 6663625
14914 6663625 6415907 6370306 6597597 7129785 7873073 8630149 9242555 9677339 9955849 10138898
14904 10138898 10327527 10557180 10764812 10914044 11060312 11278611 11601640 12054002 12684785
14895 12684785 13451478 14257004 15147651 16250190 17594300 19102398 20684714 22287412
14887 22287412 23846422 25352823 26930650 28731339 30752771 32810801 34686698 36305496
14879 36305496 37769545 39265235 40868196 42422220 43695698 44511446 44797022 44654346
$$ packed form
14943E562099k83440l70035k94528q5728J88408L95634M04598K25554p063j87713
14933E547786k42050j10174J17752K22660J07464j12860l01248l43951j91014
14924D694365L0760J87659L23181M71437N29688M55177L09688J05422j43296l00456
14914F663625k47718m5601K27291N32188P43288P57076O12406M34784K78510J83049
14904A0138898J88629K29653K07632J49232J46268K18299L23029M52362O30783
14895A2684785P66693Q05526Q90647J102539J344110J508098J582316J602698
14887B2287412J559010J506401J577827J800689K021432K058030J875897J618798
14879C6305496J464049J495690J602961J554024J273478Q15748K85576j42676
$$ plain form
14871 44654346 44231664 43585604 42799432 41941011 40941820 39755775 38446384 37062228 35573694
14862 35573694 33877101 31868302 29597105 27270342 25138063 23329452 21770120 20341930
14854 20341930 19009716 17837369 16894090 16139555 15482934 14884720 14335317 13790302 13239371
14845 13239371 12766450 12421055 12136341 11882372 11709206 11623369 11562381 11501590 11518906 11705163
14835 11705163 12035763 12370396 12551879 12484304 12198960 11789301 11362543 11003498 10672776
14826 10672776 10295062 9961138 9853765 9985667 10193290 10315494 10276829 10071338 9767082
14817 9767082 9500307 9380641 9378587 9342943 9194705 8999455 8812120 8580146 8221350 7673748
14807 7673748 6902958 5999886 5121117 4302626 3531566 2837743 2205417 1613046 1152212
$$ packed form
14871D4654346m22682o46060p86172q58421r99191j186045j309391j384156j488534
14862C5573694j696593k008799k271197k326763k132279j808611j559332j428190
14854B0341930j332214j172347r43279p54535o56621n98214n49403n45015n50931
14845A3239371m72921l45395k84714k53969j73166q5837o0988o0791J7316J86257
14835A1705163L30600L34633J81483o7575k85344m09659m26758l59045l30722
14826A0672776l77714l33924j07373J31902K07623J22204l8665k05491l04256
14817I767082k66775j19666k054l5644j48238j95250j87335k31974l58796n47602
14807G673748p70790r03072q78769q18491p71060o93823o32326n92371m60834
$$ plain form
14798 1152212 971040 1127678 1528725 2023461 2485309 2792765 2946052 3072376 3185067
14789 3185067 3147022 2880057 2449472 2021187 1796646 1931065 2395209 2932620 3228698 3168199
14779 3168199 2906541 2646356 2435248 2225386 1998356 1788024 1634401 1489204 1206604
14770 1206604 704175 105965 -426165 -894895 -1357158 -1799650 -2199783 -2580447 -2923514
14761 -2923514 -3146228 -3226222 -3189133 -3044163 -2843341 -2660429 -2518906 -2404186 -2259435 -1966475
14751 -1966475 -1430183 -695049 94219 747824 1103870 1148242 995322 817299 719106 626968
14741 626968 341219 -226085 -906127 -1435775 -1679274 -1702111 -1644365 -1497982 -1186800 -829953
14731 -829953 -695644 -918367 -1420684 -2035795 -2576267 -2890975 -2975736 -2965641 -2900636 -2660712
$$ packed form
14798A152212j81172J56638M01047M94736M61848L07456J53287J26324J12691
14789C185067l8045k66965m30585m28285k24541J34419M64144N37411K96078o0499
14779C168199k61658k60185k11108k09862k27030k10332j53623j45197k82600
14770A206604n02429n98210n32130m68730m62263m42492m00133l80664l43067
14761b923514k22714p9994L7089J44970K00822J82912J41523J14720J44751K92960
14751a966475N36292P35134P89268O53605L56046M4372j52920j78023r8193r2138
14741F26968k85749n67304o80042n29648k43499k2837N7746J46383L11182L56847
14731h29953J34309k22723n02317o15111n40472l14708q4761J0095O5005K39924
$$ plain form
14721 -2660712 -2166890 -1487284 -746176 -57646 477540 860876 1219070 1645177 2094780
14712 2094780 2444039 2600363 2597481 2499496 2261873 1874286 1504062 1321835 1272370 1157316
14702 1157316 840989 302270 -371339 -1012284 -1477592 -1768476 -1982840 -2109580 -2016603 -1635590
14692 -1635590 -1054527 -420819 234324 931363 1569230 1986841 2133464 2102396 2022691 2008361
14682 2008361 2125671 2336815 2500437 2429843 2032214 1423722 850894 492015 327775 201912
14672 201912 13667 -206723 -386921 -492741 -545338 -543135 -396206 -63938 340908 665543
14662 665543 882925 1080642 1286293 1418996 1432227 1381427 1334436 1301098 1260255 1249326 1321745
14651 1321745 1468795 1618557 1639671 1400316 898381 323606 -147615 -519478 -839051 -1099883
$$ packed form
14721b660712M93822O79606P41108O88530N35186L83336L58194M26107M49603
14712B094780L49259J56324k882r7985k37623l87587l70224j82227m9465j15054
14702A157316l16327n38719o73609o40945m65308k90884k14364j26740R2977L81013
14692a635590N81063O33708O55143O97039O37867M17611J46623l1068p9705j4330
14682B008361J17310K11144J63622p0594l97629o08492n72828l58879j64240j25863
14672B01912j88245k20390j80198j05820n2597K203J46929L32268M04846L24635
14662F65543K17382J97717K05651J32703J3231n0800m6991l3338m0843j0929P2419
14651A321745J47050J49762K1114k39355n01935n74775m71221l71863l19573k60832
$$ plain form
14641 -1099883 -1280210 -1392391 -1536940 -1838847 -2294041 -2735516 -2992975 -3051327 -3020394 -3008773
14631 -3008773 -3021905 -2989348 -2895063 -2781528 -2649042 -2442256 -2098808 -1649097 -1225071 -940627
14621 -940627 -855100 -953926 -1093756 -1059867 -750089 -269024 230086 662288 1014663 1344615
14611 1344615 1732470 2222342 2781648 3326089 3740451 3936281 3914056 3695535 3345615 2951441
14601 2951441 2507921 1944254 1210181 332029 -520335 -1074219 -1130211 -726828 -143270 340995
14591 340995 627761 740865 710599 615235 563262 534310 420443 206640 -82584 -434770
14581 -434770 -764403 -963214 -1038226 -1077622 -1138897 -1288705 -1598083 -2020991 -2418317 -2662535
14571 -2662535 -2655530 -2424951 -2106244 -1786479 -1457683 -1085083 -664048 -228906 101609 186282
$$ packed form
14641a099883j80327j12181j44549l01907m55194m41475k57459n8352L0933J1621
14631c008773j3132L2557R4285J13535J32486K06786L43448M49711M24026K84444
14621i40627Q5527r8826j39830L3889L09778M81065M99110M32202L52375L29952
14611A344615L87855M89872N59306N44441M14362J95830k2225k18521l49920l94174
14601B951441m43520n63667p34073q78152q52364n53884n5992M03383N83558M84265
14591C40995K86766J13104l0266r5364n1973k8952j13867k13803k89224l52186
14581d34770l29633j98811p5012l9396o1275j49808l09378m22908l97326k44218
14571b662535P005K30579L18707L19765L28796L72600M21035M35142L30515Q4673
$$ plain form
14561 186282 -30150 -495511 -1048507 -1489642 -1638298 -1426325 -1035526 -805584 -950406 -1446563
14551 -1446563 -2141278 -2834760 -3381398 -3715272 -3801070 -3669300 -3390862 -3017617 -2646781 -2377654
14541 -2377654 -2196521 -2026432 -1862683 -1798873 -1877490 -1917146 -1657058 -1053657 -282717 384049
14531 384049 708267 673131 471758 254484 30089 -170301 -287789 -405895 -705089 -1215760
14521 -1215760 -1681414 -1807541 -1573359 -1173348 -849244 -748151 -807623 -875662 -921338 -1007639
14511 -1007639 -1118213 -1126515 -902258 -461162 -30480 153925 45115 -258742 -635417 -985683
14501 -985683 -1194147 -1156577 -808250 -154545 653519 1399767 1948464 2255954 2335528 2293473
14491 2293473 2310278 2429523 2504633 2413181 2208666 2039653 1950645 1876930 1812622 1835493 1945904
$$ packed form
14561A86282k16432m65361n52996m41135j48656K11973L90799K29942j44822m96157
14551a446563o94715o93482n46638l33874q5798J31770K78438L73245L70836K69127
14541b377654J81133J70089J63749O3810p8617l9656K60088O03401P70940O66766
14531C84049L24218l5136k01373k17274k24395k00390j17488j18106k99194n10671
14521a215760m65654j26127K34182M00011L24104J01093n9472o8039m5676q6301
14511a007639j10574q302K24257M41096M30682J84405j08810l03857l76675l50266
14501i85683k08464L7570L48327O53705Q08064P46248N48697L07490P9574m2055
14491B293473J6805J19245P5110r1452k04515j69013q9008p3715o4308K2871J10411
$$ plain form
14480 1945904 1957903 1715036 1326644 1019876 884760 876973 932956 970718 885644 607717
14470 607717 155611 -337487 -730618 -970711 -1089792 -1160795 -1155314 -955241 -582064 -179868
14460 -179868 165526 393756 386465 60188 -509383 -1104245 -1479147 -1505059 -1237705 -913960
14450 -913960 -814623 -1039284 -1434014 -1764842 -1933687 -1970477 -1909507 -1751377 -1515692 -1231098
14440 -1231098 -917849 -632840 -426360 -262995 -100236 11399 48963 74444 135420 252891
14430 252891 485208 913439 1521217 2131062 2569006 2822641 2935171 2834607 2456896 1942757
14420 1942757 1494612 1166201 916749 746640 647759 507430 283120 112797 82940 104574
14410 104574 101313 90845 60755 -62131 -292064 -535503 -665712 -621350 -442701 -237472
$$ packed form
14480A945904J1999k42867l88392l06768j35116p787N5983L7762q5074k77927
14470F07717m52106m93098l93131k40093j19081p1003N481K00073L73177M02196
14460a79868L45394K28230p291l26277n69571n94862l74902k5912K67354L23745
14450i13960R9337k24661l94730l30828j68845l6790O0970J58130K35685K84594
14440a231098L13249K85009K06480J63365J62759J11635L7564K5481O0976J17471
14430B52891K32317M28231O07778O09845M37944K53635J12530j00564l77711n14139
14420A942757m48145l28411k49452j70109r8881j40329k24310j70323k9857K1634
14410A04574l261j0468l0090j22886k29933k43439j30209M4362J78649K05229
$$ plain form
14400 -237472 -116522 -120242 -247637 -513655 -963301 -1621916 -2372948 -2943565 -3102338 -2810033
14390 -2810033 -2173860 -1385878 -684175 -218718 17123 70389 -26211 -202660 -370502 -454180
14380 -454180 -402880 -227925 58782 482668 1025307 1584615 2023883 2233260 2223262 2108667
14370 2108667 1954644 1755729 1504810 1249102 1111911 1143795 1257270 1352684 1374823 1325735
14360 1325735 1265800 1251294 1280267 1331843 1367854 1325648 1184202 971983 701040 411285
14350 411285 236060 276361 473317 680874 755831 589966 222323 -140728 -351149 -462789
14340 -462789 -604888 -788526 -908572 -898653 -763000 -539539 -303634 -135240 -22541 163831
14330 163831 475273 784923 950167 950539 851622 737346 688262 742857 900825 1132573 1366240
$$ packed form
14400b37472J20950l720j27395k66018m49646o58615p51032n70617j58773K92305
14390b810033O36173P87982P01703M65457K35841N3266r6600j76449j67842q3678
14380d54180N1300J74955K86707M23886N42639N59308M39268K09377r998j14595
14370B108667j54023j98915k50919k55708j37191L1884J13475R5414K2139m9088
14360A325735n9935j4506K8973N1576L6011m2206j41446k12219k70943k89755
14350D11285j75225M0301J96956K07557P4957j65865l67643l63051k10421j11640
14340d62789j42099j83638j20046R919J35653K23461K35905J68394J12699J86372
14330A63831L11442L09650J65244L72r8917j14276m9084N4595J57968K31748K33667
$$ plain form
14319 1366240 1533406 1565822 1398246 1110171 897214 840753 866034 936518 1085229 1344949
14309 1344949 1725145 2135857 2428977 2541390 2502473 2406148 2369212 2448127 2671436 2992494
14299 2992494 3241995 3297802 3181801 2936825 2560016 2092864 1645118 1321175 1143675 1059409
14289 1059409 959342 769845 562886 442545 442598 544771 691807 839611 966525 1089917
14279 1089917 1277222 1560907 1903157 2223830 2471628 2703942 3024479 3470987 3994845
14270 3994845 4493937 4944688 5360279 5629219 5573148 5090470 4226055 3151352 2094478
14261 2094478 1240904 695433 522788 753924 1271671 1845503 2307581 2596945 2713559
14252 2713559 2657582 2439826 2152400 1985158 2117075 2593197 3289045 3959175 4400021 4552705
$$ packed form
14319A366240J67166L2416j67576k88075k12957n6461K5281P0484J48711K59720
14309A344949L80196M10712K93120J12413l8917r6325l6936P8915K23309L21058
14299B992494K49501N5807j16001k44976l76809m67152m47746l23943j77500q4266
14289A059409j00067j89497k06959j20341N3J02173J47036J47804J26914J23392
14279A089917J87305K83685L42250L20673K47798K32314L20537M46508N23858
14270C994845M99092M50751M15591K68940n6071m82678q64415j074703j056874
14261B094478q53574n45471j72645K31136N17747N73832M62078K89364J16614
14252B713559n5977k17756k87426j67242J31917M76122O95848O70130M40846J52684
$$ plain form
14242 4552705 4435182 4097187 3624575 3109444 2632476 2321188 2297754 2493451 2654601 2598403
14232 2598403 2352132 2083582 1909401 1846887 1909951 2156768 2636639 3274357 3931256 4514597
14222 4514597 4932588 5103813 5029768 4796253 4488477 4170572 3945354 3923535 4075355 4198071
14212 4198071 4148714 3961057 3690353 3394289 3217612 3267462 3486629 3718100 3826229 3714090
14202 3714090 3371577 2941686 2612092 2486109 2523872 2592460 2643048 2740463 2930596 3160025
14192 3160025 3295906 3211970 2890353 2423117 1921137 1504587 1267938 1225595 1327489 1515171
14182 1515171 1785689 2155346 2560165 2851361 2913041 2751629 2548353 2530944 2744112 3102892
14172 3102892 3543737 3972293 4277473 4462019 4610956 4687513 4580883 4336207 4135440 4119663
$$ packed form
14242D552705j17523l37995m72612n15131m76968l11288k3434J95697J61150n6198
14232B598403k46271k68550j74181o2514O3064K46817M79871O37718O56899N83341
14222D514597M17991J71225p4045k33515l07776l17905k25218k1819J51820J22716
14212D198071m9357j87657k70704k96064j76677M9850K19167K31471J08129j12139
14202C714090l42513m29891l29594j25983L7763O8588N0588R7415J90133K29429
14192C160025J35881q3936l21617m67236n01980m16550k36649m2343J01894J87682
14182A515171K70518L69657M04819K91196O1680j61412k03276j7409K13168L58780
14172C102892M40845M28556L05180J84546J48937P6557j06630k44676k00767j5777
$$ plain form
14162 4119663 4280844 4465994 4518251 4429642 4309104 4202300 4065539 3876795 3705214 3671238
14152 3671238 3814662 4078542 4375294 4598760 4656716 4572506 4487258 4495989 4531376 4496747 4425291
14141 4425291 4417135 4473644 4537700 4597008 4680296 4761065 4778257 4761677 4805669 5007749 5398547
14130 5398547 5921076 6523001 7172384 7831175 8444576 8894468 9071380 9020885 8893369 8811767
14120 8811767 8811186 8844392 8882840 8979011 9209644 9589888 10035240 10450236 10789659 10981606
14110 10981606 10925632 10610095 10121411 9580895 9159033 8993335 9101398 9456344 10003901
14101 10003901 10624660 11201912 11659173 11945837 12051266 11997059 11811631 11568609 11385774
14092 11385774 11328525 11388993 11579660 11938107 12386907 12739633 12914312 12980080 12987098 12967084
$$ packed form
14162D119663J61181J85150N2257q8609j20538j06804j36761j88744j71581l3976
14152C671238J43424K63880K96752K23466N7956q4210q5248Q731L5387l4629p1456
14141D425291q156N6509O4056N9308Q3288Q0769J7192j6580M3992K02080L90798
14130E398547N22529O01925O49383O58791O13401M49892J76912n0495j27516q1602
14120H811767n81L3206L8448R6171K30633L80244M45352M14996L39423J91947
14110A0981606n5974l15537m88684n40516m21862j65698J08063L54946N47557
14101A0003901O20759N77252M57261K86664J05429n4207j85428k43022j82835
14092A1385774n7249O0468J90667L58447M48800L52726J74679O5768P018k0014
$$ plain form
14082 12967084 13022874 13158319 13227907 13164089 13015436 12812241 12531753 12233984 12087481 12220508
14072 12220508 12603810 13084522 13576687 14075145 14511473 14752818 14745407 14563745 14292316 13999580
14062 13999580 13835788 13992421 14468220 15021124 15450576 15790547 16180505 16677927 17285952
14053 17285952 18009617 18830038 19682884 20482680 21170569 21729115 22245520 22794414 23328366
14044 23328366 23790852 24127905 24310249 24441772 24677968 25129844 25819204 26583104 27206895
14035 27206895 27649883 28008636 28386813 28847236 29374166 29969177 30739432 31738153 32860645
14026 32860645 34002218 35130822 36234711 37306127 38392503 39564023 40785882 41931224
14018 41931224 42952313 43972774 45189964 46696955 48449883 50346221 52333468 54463338
$$ packed form
14082A2967084N5790J35445O9588o3818j48653k03195k80488k97769j46503J33027
14072A2220508L83302M80712M92165M98458M36328K41345p411j81662k71429k92736
14062A3999580j63792J56633M75799N52904M29452L39971L89958M97422O08025
14053A7285952P23665Q20421Q52846P99796O87889N58546N16405N48894N33952
14044B3328366M62486L37053J82344J31523K36196M51876O89360P63900O23791
14035B7206895M42988L58753L78177M60423N26930N95011P70255R98721J122492
14026C2860645J141573J128604J103889J071416J086376J171520J221859J145342
14018D1931224J021089J020461J217190J506991J752928J896338J987247K129870
$$ plain form
14010 54463338 56740284 59011880 61128303 63078372 64922817 66670128 68313480 69949453
14002 69949453 71743096 73820074 76241998 79041601 82236358 85801720 89647068 93596499
13994 93596499 97488267 101326466 105266944 109530015 114203325 119140226 124227415 129514364
13986 129514364 135052870 140927907 147316454 154303043 161824339 169798548 178237082 187242448
13978 187242448 196854634 207073252 217943024 229501002 241765135 254736106 268370478
13971 268370478 282648910 297522652 312799833 328265455 343774759 359224488 374543005
13964 374543005 389657195 404413102 418540302 431743337 443732479 454198788 462824019
13957 462824019 469287587 473374488 475060049 474444801 471629808 466672880 459645079 450704568
$$ packed form
14010E4463338K276946K271596K116423J950069J844445J747311J643352J635973
14002F9949453J793643K076978K421924K799603L194757L565362L845348L949431
13994I3596499L891768L838199L940478M263071M673310M936901N087189N286949
13986A29514364N538506N875037O388547O986589P521296P974209Q438534R005366
13978A87242448R612186J0218618J0869772J1557978J2264133J2970971J3634372
13971B68370478J4278432J4873742J5277181J5465622J5509304J5449729J5318517
13964C74543005J5114190J4755907J4127200J3203035J1989142J0466309Q625231
13957D62824019O463568M086901J685561o15248k814993m956928p027801q940511
$$ plain form
13949 450704568 440130410 428254885 415336311 401550663 387108325 372320104 357532855
13942 357532855 342979532 328738746 314804386 301170159 287932877 275297255 263412870
13935 263412870 252318224 241902980 231950987 222391414 213319082 204826052 196890072 189351054
13927 189351054 182055375 174994461 168229438 161762654 155540021 149541757 143809597 138376045
13919 138376045 133236441 128389115 123757886 119156421 114478822 109896241 105711903 101981078
13911 101981078 98506736 95109592 91707054 88296116 84943012 81743171 78736438 75878390
13903 75878390 73098501 70372621 67733335 65217941 62836177 60583731 58472348 56508556
13895 56508556 54667294 52896142 51144253 49406663 47745945 46271555 45052396 44034713
$$ packed form
13949D50704568j0574158j1875525j2918574j3785648j4442338j4788221j4787249
13942C57532855j4553323j4240786j3934360j3634227j3237282j2635622j1884385
13935B63412870j1094646j0415244r951993r559573r072332q493030p935980p539018
13927A89351054p295679p060914o765023o466784o222633n998264n732160n433552
13919A38376045n139604m847326m631229m601465m677599m582581m184338l730825
13911A01981078l474342l397144l402538l410938l353104l199841l006733k858048
13903G5878390k779889k725880k639286k515394k381764k252446k111383j963792
13895E6508556j841262j771152j751889j737590j660718j474390j219159j017683
$$ plain form
13887 44034713 43069328 42020283 40881340 39773679 38769982 37811171 36842789 35858872 34837898
13878 34837898 33778118 32689292 31532887 30298569 29079294 28026205 27249915 26750212
13870 26750212 26400296 26046579 25608047 25060635 24430596 23799490 23233249 22711401 22145197
13861 22145197 21491211 20815178 20261626 19952403 19842430 19799122 19786771 19826628 19823879 19601674
13851 19601674 19123589 18542059 18013256 17515591 16911224 16151674 15338243 14641719 14213222
13842 14213222 14119995 14304883 14614664 14857921 14835314 14414607 13662813 12852270 12195377 11713268
13832 11713268 11359190 11101107 10894449 10689936 10497351 10387868 10395684 10438791 10434336 10403797
13822 10403797 10371446 10261021 10020708 9746331 9614480 9723587 9980374 10157855 10101014 9835027
$$ packed form
13887D4034713r65385j049045j138943j107661j003697r58811r68382r83917j020974
13878C4837898j059780j088826j156405j234318j219275j053089p76290m99703
13870B6750212l49916l53717m38532n47412o30039o31106n66241n21848n66204
13861B2145197o53986o76033n53552l09223j09973m3308j2351L9857k749k22205
13851A9601674m78085n81530n28803m97665o04367p59550q13431o96524m28497
13842A4213222r3227J84888L09781K43257k2607m20707p51794q10543o56893m82109
13832A1713268l54078k58083k06658k04513j92585j09483P816M3107m455l0539
13822A0403797l2351j10425k40313k74377j31851J09107K56787J77481n6841k65987
$$ plain form
13812 9835027 9479072 9124509 8825120 8645548 8619534 8735027 8969327 9250355 9481018 9608950
13802 9608950 9590797 9394031 9100233 8868571 8735851 8569471 8258164 7847956 7459752 7119378
13792 7119378 6741410 6275518 5775869 5377154 5160696 5065050 4965162 4806595 4615364 4428115
13782 4428115 4312279 4374879 4725592 5368233 6096387 6654604 6977868 7153843 7239299 7249211
13772 7249211 7242205 7272894 7305822 7234434 7021403 6738601 6466622 6184826 5807903 5344301
13762 5344301 4874702 4434618 4012864 3582644 3163051 2864983 2775279 2819715 2862324 2918699
13752 2918699 3108236 3388093 3579046 3619469 3611340 3617258 3552910 3274855 2709177 1923213
13742 1923213 1111783 557781 515985 1038959 1937918 2940041 3831743 4502340 4955234
$$ packed form
13812I835027l55955l54563k99389j79572k6014J15493K34300K81028K30663J27932
13802I608950j8153j96766k93798k31662j32720j66380l11307m10208l88204l40374
13792G119378l77968m65892m99649l98715k16458r5646r9888j58567j91231j87249
13782D428115j15836O2600L50713O42641P28154N58217L23264J75975Q5456R912
13772G249211p006L0689L2928p1388k13031k82802k71979k81796l76923m63602
13762E344301m69599m40084m21754m30220m19593k98068q9704M4436M2609N6375
13752B918699J89537K79857J90953M0423q129N918o4348k78055n65678p85964
13742A923213q11430n54002m1796N22974Q98959J002123Q91702O70597M52894
$$ plain form
13733 4955234 5241400 5346416 5189001 4770589 4227841 3704128 3235022 2795509 2395607
13724 2395607 2094652 1896322 1743178 1628896 1565837 1534279 1500023 1457742 1427876 1397576
13714 1397576 1339714 1278013 1299876 1501396 1881618 2356848 2838514 3222564 3426932 3482556
13704 3482556 3518990 3620574 3746098 3770148 3609863 3350455 3131245 3009673 2958074 2898685
13694 2898685 2764257 2503801 2098657 1665872 1421763 1435764 1537777 1496900 1264107 1021159
13684 1021159 953863 1063894 1255983 1483643 1714521 1866299 1905533 1918173 2016707 2232786
13674 2232786 2492699 2704331 2850029 2931000 2866203 2611387 2281511 2052996 2021243 2184734
13664 2184734 2477833 2780064 2935533 2829730 2462900 1918119 1347897 945696 837278
$$ packed form
13733D955234K86166J05016j57415m18412n42748n23713m69106m39513l99902
13724B395607l00955j98330j53144j14282o3059l1558l4256m2281k9866l0300
13714A397576n7862o1701K1863K01520L80222M75230M81666L84050K04368N5624
13704C482556L6434J01584J25524K4050j60285k59408k19210j21572n1599n9389
13694B898685j34428k60456m05144m32785k44109J4001J02013m0877k32793k42948
13684A021159o7296J10031J92089K27660K30878J51778L9234J2640R8534K16079
13674B232786K59913K11632J45698Q0971o4797k54816l29876k28515l1753J63491
13664B184734K93099L02231J55469j05803l66830n44781n70222m02201j08418
$$ plain form
13655 837278 984152 1252321 1593125 2052845 2627880 3251693 3867051 4398290 4695372 4659076
13645 4659076 4362781 3937453 3469018 3021590 2641870 2304289 1943079 1580193 1345919
13636 1345919 1275927 1285472 1308674 1292299 1186218 997828 761980 504614 248133 17140
13626 17140 -116494 -76137 138727 457299 796368 1068100 1168331 1064014 856149 727428
13616 727428 771104 889163 947169 947752 988945 1178095 1547821 1977115 2270139 2389043 2484806
13605 2484806 2699003 3042935 3354400 3427401 3236909 2902516 2565996 2381790 2379117 2475172
13595 2475172 2680997 3034243 3399848 3509622 3177204 2488744 1749221 1197901 800184
13586 800184 376420 -116045 -550061 -782560 -767042 -567892 -348425 -252653 -251278 -254903 -262916
$$ packed form
13655H37278J46874K68169L40804M59720N75035O23813O15358N31239K97082l6296
13645D659076k96295m25328m68435m47428l79720l37581l61210l62886k34274
13636A345919o9992R545K3202j6375j06081j88390k35848k57366k56481k30993
13626A7140j33634M0357K14864L18572L39069K71732J00231j04317k07865j28721
13616G27428M3676J18059N8006N83M1193J89150L69726M29294K93024J18904R5763
13605B484806K14197L43932L11465P3001j90492l34393l36520j84206k673R6055
13595B475172K05825L53246L65605J09774l32418o88460p39523n51320l97717
13586H00184m23764m92465m34016k32499J5518J99150K19467R5772J375l625q013
$$ plain form
13575 -262916 -304376 -381121 -508092 -695516 -892608 -1022358 -1086164 -1196302 -1429390 -1655455
13565 -1655455 -1704713 -1605047 -1474422 -1345235 -1184441 -1012767 -899153 -802999 -577995 -207179
13555 -207179 125053 240739 96807 -231295 -579018 -763140 -690505 -392826 42879 529324
13545 529324 1018097 1495502 1907234 2137475 2102390 1825378 1401579 974915 690447 597271
13535 597271 617231 619279 562636 515045 517309 557223 640342 795667 1024966 1263893 1395715
13524 1395715 1323876 1067440 689067 185081 -419000 -990379 -1386304 -1519810 -1352005 -918829
13514 -918829 -340185 278070 868580 1343287 1691346 1985449 2226454 2375552 2440666 2413775
13504 2413775 2294548 2173700 2184142 2420587 2908484 3524238 4034448 4303134 4337087 4202964
$$ packed form
13575b62916m1460p6745j26971j87424j97092j29750o3806j10138k33088k26065
13565a655455m9258R9666J30625J29187J60794J71674J13614R6154K25004L70816
13555b07179L32232J15686j43932l28102l47723j84122P2635K97679M35705M86445
13545E29324M88773M77405M11732K30241l5085k77012m23799m26664k84468r3176
13535E97271J9960K048n6643m7591K264L9914Q3119J55325K29299K38927J31822
13524A395715p1839k56436l78373n03986o04081n71379l95925j33506J67805M33176
13514i18829N78644O18255N90510M74707L48059K94103K41005J49098O5114k6891
13504B413775j19227j20848J0442K36445M87897O15754N10210K68686L3953j34123
$$ plain form
13494 4202964 3961268 3631392 3240294 2870525 2613246 2539501 2681634 2955999 3272521 3682071
13484 3682071 4216635 4815059 5451763 6075488 6575628 6989712 7467229 8010576 8505778
13475 8505778 8922643 9323904 9790362 10431469 11349405 12489448 13583915 14394698 14965636
13466 14965636 15412309 15685710 15702598 15467581 15046044 14516236 13855438 12940203 11764902
13457 11764902 10551162 9546318 8855025 8496277 8425338 8543138 8759324 8965091 9016625
13448 9016625 8872415 8589439 8211422 7765973 7244268 6650204 6093649 5752672 5726401 5937862
13438 5937862 6169773 6178446 5938656 5639473 5384839 5124883 4812631 4444800 4025766 3591018
13428 3591018 3255086 3147235 3256254 3438392 3568240 3581438 3438630 3222062 3141822 3330524
$$ packed form
13494D202964k41696l29876l91098l69769k57279p3745J42133K74365L16522M09550
13484C682071N34564N98424O36704O23725N00140M14084M77517N43347M95202
13475H505778M16865M01261M66458O41107R17936J140043J094467Q10783N70938
13466A4965636M46673K73401J6888k35017m21537n29808o60798r15235j175301
13457A1764902j213740j004844o91293l58748p0939J17800K16186K05767N1534
13448I016625j44210k82976l78017m45449n21705n94064n56555l40977k6271K11461
13438E937862K31911Q673k39790k99183k54634k59956l12252l67831m19034m34748
13428C591018l35932j07851J09019J82138J29848J3198j42808k16568q0240J88702
$$ plain form
13418 3330524 3753255 4303730 4879695 5370932 5631127 5531899 5061019 4348297 3655745 3249501
13408 3249501 3203601 3411378 3668606 3755406 3580576 3269665 3076755 3165639 3471581 3863554
13398 3863554 4328238 4851301 5284042 5513638 5615780 5650032 5616964 5565349 5451059 5067805
13388 5067805 4319480 3411525 2652125 2208654 2045799 2015614 2030611 2080798 2153524 2227040
13378 2227040 2285789 2309322 2325639 2436298 2730232 3196036 3776052 4408689 4970898 5302623
13368 5302623 5299925 4972480 4410122 3698987 2936927 2245802 1673007 1214272 869281 621893
13358 621893 462219 437952 580107 783355 914649 994199 1109824 1255215 1373052 1440194
13348 1440194 1477263 1499861 1513413 1552604 1647217 1785431 1920018 2022367 2096994 2089798 1945600
$$ packed form
13418C330524M22731N50475N75965M91237K60195r9228m70880p12722o92552m06244
13408C249501m5900K07777K57228Q6800j74830l10911j92910Q8884L05942L91973
13398C863554M64684N23063M32741K29596J02142L4252l3068n1615j14290l83254
13388E067805p48325r07955p59400m43471j62855l0185J4997N0187P2726P3516
13378B227040N8749K3533J6317J10659K93934M65804N80016O32637N62209L31725
13368E302623k698l27445n62358p11135p62060o91125n72795m58735l44991k47388
13358F21893j59674k4267J42155K03248J31294P9550J15625J45391J17837O7142
13348A440194L7069K2598J3552L9191R4613J38214J34587J02349P4627p196j44198
$$ plain form
13337 1945600 1747771 1609558 1522525 1453265 1385345 1285562 1188268 1208009 1400462 1666427
13327 1666427 1849474 1846528 1677307 1540916 1678611 2126975 2653996 2990732 3054138 2918878
13317 2918878 2746400 2700168 2817325 2984325 3065957 3029115 2887697 2650721 2416592 2326277
13307 2326277 2444369 2723360 3040888 3265436 3311774 3194939 3010196 2833489 2642646 2336458
13297 2336458 1860888 1319782 896624 702435 755543 997898 1321392 1641706 1951339 2231309
13287 2231309 2391127 2351368 2100147 1662093 1086106 466521 -74565 -423158 -498224 -332323
13277 -332323 -63361 188762 330308 280820 33658 -341943 -748298 -1102354 -1281048 -1132504
13267 -1132504 -652704 22336 742196 1370051 1772236 1885575 1784315 1593950 1403407
$$ packed form
13337A945600j97829j38213q7033o9260o7920r9783r7294J9741J92453K65965
13327A666427J83047k946j69221j36391J37695M48364N27021L36736O3406j35260
13317B918878j72478m6232J17157J67000Q1632l6842j41418k36976k34129r0315
13307B326277J18092K78991L17528K24548M6338j16835j84743j76707j90843l06188
13297B336458m75570n41106m23158j94189N3108K42355L23494L20314L09633K79970
13287B231309J59818l9759k51221m38054n75987o19585n41086l48593p5066J65901
13277c32323K68962K52123J41546m9488k47162l75601m06355l54056j78694J48544
13267a132504M79800O75040P19860O27855M02185J13339j01260j90365j90543
$$ plain form
13258 1403407 1213499 918848 431199 -174358 -742294 -1204872 -1571316 -1829260 -1898907 -1706300
13248 -1706300 -1314970 -923096 -639230 -381344 -32872 356374 629447 746803 794284 839501
13238 839501 845925 775947 708694 715064 764579 842627 934230 943170 754521 395703 69145
13227 69145 -57302 3109 139995 280433 435970 650561 953570 1317770 1638883 1798845
13217 1798845 1721428 1396673 922818 502814 287438 241818 237965 191706 115235 154221 403599
13206 403599 706883 829092 732813 558004 413759 294714 145079 -50954 -238040 -360865
13196 -360865 -421396 -456285 -498321 -524157 -464106 -312271 -137677 1921 88716 122637 121970
13185 121970 101405 47850 -40528 -134349 -195541 -174379 -86901 -34272 -51908 -101008 -135295
$$ packed form
13258A403407j89908k94651m87649o05557n67936m62578l66444k57944o9647J92607
13248a706300L91330L91874K83866K57886L48472L89246K73073J17356M7481M5217
13238H39501O424o9978o7253O370M9515P8048R1603Q940j88649l58818l26558
13227F9145j26447O0411J36886J40438J55537K14591L03009L64200L21113J59962
13217A798845p7417l24755m73855m20004k15376m5620l853m6259p6471L8986K49378
13206D03599L03284J22209r6279j74809j44245j19045j49635j96033j87086j22825
13196c60865o0531l4889m2036k5836O0051J51835J74594J39598Q6795L3921o67
13185A21970k0565n3555q8378r3821o1192K1162Q7478N2629j7636m9100l4287
$$ plain form
13174 -135295 -114059 18279 290532 639293 973481 1272592 1570164 1853673 1997971 1894056
13164 1894056 1608941 1318534 1130463 986061 786654 535623 324062 235952 262782 260557
13154 260557 101321 -161803 -396766 -511178 -504232 -425798 -221539 220242 862177 1509947
13144 1509947 1986784 2214914 2154800 1807265 1287693 750931 278773 -105238 -384334 -533709
13134 -533709 -556472 -479514 -318610 -110543 43286 61669 -29892 -125970 -151404 -183830 -321011
13123 -321011 -535800 -749451 -920850 -1060034 -1193097 -1288978 -1259044 -1092677 -924875 -939484
13113 -939484 -1222087 -1682049 -2124855 -2400762 -2478374 -2451731 -2503704 -2748532 -3065496 -3284124
13103 -3284124 -3423890 -3522149 -3459654 -3126638 -2591504 -2047693 -1661317 -1479013 -1484444 -1642520
$$ packed form
13174a35295K1236J32338K72253L48761L34188K99111K97572K83509J44298j03915
13164A894056k85115k90407j88071j44402j99407k51031k11561q8110K6830k225
13154B60557j59236k63124k34963j14412O946P8434K04259M41781O41935O47770
13144A509947M76837K28130o0114l47535n19572n36762m72158l84011k79096j49375
13134e33709k2763P6958J60904K08067J53829J8383r1561r6078k5434l2426j37181
13123c21011k14789k13651j71399j39184j33063r5881K9934J66367J67802j4609
13113i39484k82603m59962m42806k75907p7612K6643n1973k44828l16964k18628
13103c284124j39766r8259O2495L33016N35134N43811L86376J82304n431j58076
$$ plain form
13093 -1642520 -1883457 -2121919 -2312799 -2477957 -2655035 -2783273 -2737161 -2456144 -1951455 -1286296
13083 -1286296 -552283 131984 668219 1026030 1216366 1274946 1250262 1166805 967726 591833
13073 591833 135149 -124621 113811 903187 1963367 2900665 3467021 3646699 3584729 3450438
13063 3450438 3363155 3362836 3308674 3034478 2622257 2255918 1938061 1575354 1223310 1066725
13053 1066725 1192272 1454469 1653290 1804158 2032009 2311513 2577070 2808084 2891889 2704429
13043 2704429 2281983 1817132 1473300 1248418 1034444 737354 384476 117328 22239 18395
13033 18395 -37491 -183829 -308077 -309705 -230435 -131905 -35549 -20524 -165393 -450329 -822791
13022 -822791 -1182278 -1332436 -1174977 -789089 -286568 193424 533284 736276 803901 706464
$$ packed form
13093a642520k40937k38462j90880j65158j77078j28238M6112K81017N04689O65159
13083a286296P34013O84267N36235L57811J90336N8580k4684q3457j99079l75893
13073E91833m56684k59770K38432P89376J060180R37298N66356J79678o1970j34291
13063C450438q7283l19n4162k74196m12221l66339l17857l62707l52044j56585
13053A066725J25547K62197J98821J50868K27851K79504K65557K31014Q3805j87460
13043B704429m22446m64851l43832k24882k13974k97090l52878k67148r5089l844
13033A8395n5886j46338j24248j628P9270R8530R6356J5025j44869k84936l72462
13022h22791l59487j50158J57459L85888N02521M79992L39860K02992O7625r7437
$$ plain form
13012 706464 486990 234032 -20466 -328609 -717504 -1156025 -1622808 -2097250 -2537205 -2901683
13002 -2901683 -3162529 -3311598 -3370713 -3409043 -3464139 -3455571 -3272602 -2886600 -2363157 -1813626
12992 -1813626 -1295012 -770107 -206289 328206 721328 932820 999070 994125 958336 863001
12982 863001 730523 620028 509709 408197 358272 287581 61852 -299865 -571303 -572278
12972 -572278 -367737 -129439 82134 278460 442818 559240 590265 432011 -5635 -605363
12962 -605363 -1077437 -1284246 -1335500 -1300930 -1111382 -756191 -375998 -141963 -113569 -286809
12952 -286809 -626361 -976830 -1123704 -973902 -593353 -77170 524998 1077607 1378556 1385324
12942 1385324 1229690 1008626 700116 290764 -172906 -661756 -1175019 -1655479 -1994261
$$ packed form
13012G06464k19474k52958k54498l08143l88895m38521m66783m74442m39955l64478
13002b901683k60846j49069n9115l8330n5096Q568J82969L86002N23443N49531
12992a813626N18614N24905N63818N34495L93122K11492O6250m945l5789r5335
12982H63001j32478j10495j10319j01512m9925p0691k25729l61717k71438r75
12972e72278K04541K38298K11573J96326J64358J16422L1025j58254m37646n99728
12962f05363m72074k06809n1254L4570J89548L55191L80193K34035K8394j73240
12952b86809l39552l50469j46874J49802L80549N16183O02168N52609L00949O768
12942A385324j55634k21064l08510m09352m63670m88850n13263m80460l38782
$$ plain form
12933 -1994261 -2181757 -2361797 -2698499 -3202168 -3714023 -4077446 -4220722 -4187602 -4146168 -4239053
12923 -4239053 -4430865 -4556112 -4463661 -4086153 -3521959 -2992622 -2704283 -2746494 -3039046 -3448683
12913 -3448683 -3887022 -4225071 -4255810 -3902000 -3397405 -3040349 -2871882 -2751803 -2550867 -2249272
12903 -2249272 -1966985 -1803085 -1683394 -1475883 -1158043 -805834 -496190 -274144 -213621 -368365
12893 -368365 -598792 -670210 -531955 -355042 -338385 -588011 -1035446 -1422927 -1512099 -1292812
12883 -1292812 -935755 -596011 -399531 -415419 -526786 -515792 -283033 59728 327748 468601
12873 468601 566295 677255 831359 1114304 1575036 2133209 2604595 2851828 2881703 2774857
12863 2774857 2629167 2587971 2763586 3102021 3437769 3573479 3384945 2923497 2353504 1852102
$$ packed form
12933a994261j87496j80040l36702n03669n11855l63423j43276L3120M1434r2885
12923d239053j91812j25247R2451L77508N64194N29337K88339m2211k92552m09637
12913c448683m38339l38049l0739L53810N04595L57056J68467J20079K00936L01595
12903b249272K82287J63900J19691K07511L17840L52209L09644K22046O0523j54744
12893c68365k30427p1418J38255J76913J6657k49626m47435l87481q9172K19287
12883a292812L57057L39744J96480j5888j11367J0994K32759L42761K68020J40853
12873D68601R7694J10960J54104K82945M60732N58173M71386K47233K9875j06846
12863B774857j45690m1196J75615L38435L35748J35710j88534m61448n69993n01402
$$ plain form
12853 1852102 1504768 1315139 1308241 1461357 1620263 1540127 1062548 312759 -450675 -1060222
12843 -1060222 -1448141 -1600662 -1500434 -1096399 -396972 428619 1131707 1565281 1766009
12834 1766009 1833926 1804853 1703613 1596834 1559554 1651863 1863664 2086787 2233989 2323136
12824 2323136 2375809 2322722 2109908 1809621 1560349 1469581 1544076 1740787 2029344 2332159
12814 2332159 2558641 2719747 2863166 2980070 3060700 3082718 2997187 2778287 2469163 2173406
12804 2173406 1937654 1739793 1572946 1419229 1241617 994237 622917 136834 -359246
12795 -359246 -748596 -962646 -929368 -646405 -254645 63741 173436 820 -412359 -880482
12785 -880482 -1246612 -1521892 -1712023 -1689985 -1375918 -905173 -564187 -574832 -951551 -1521456
$$ packed form
12853A852102l47334j89629o898J53116J58906q0136m77579p49789p63434o09547
12843a060222l87919j52521J00228M04035O99427Q25591P03088M33574K00728
12834A766009O7917k9073j01240j06779l7280R2309K11801K23123J47202Q9147
12824B323136N2673n3087k12814l00287k49272r0768P4495J96711K88557L02815
12814B332159K26482J61106J43419J16904Q0630K2018q5531k18900l09124k95757
12804B173406k35752j97861j66847j53717j77612k47380l71320m86083m96080
12795c59246l89350k14050L3278K82963L91760L18386J09695j72616m13179m68123
12785h80482l66130k75280j90131K2038L14067M70745L40986j0645l76719n69905
$$ plain form
12775 -1521456 -2023991 -2272999 -2273799 -2173014 -2129794 -2253422 -2543007 -2889210 -3149123 -3168993
12765 -3168993 -2886192 -2411580 -1883351 -1346128 -847305 -452610 -148425 143050 523023
12756 523023 1010768 1486388 1853387 2101493 2223634 2259595 2326107 2458633 2578652 2597364
12746 2597364 2463251 2218742 1957817 1780830 1769062 1917395 2146207 2375443 2547135 2569581
12736 2569581 2268270 1525328 545593 -233289 -562365 -523037 -326626 -117965 62844 178834
12726 178834 187229 95250 -76943 -337683 -618540 -757571 -680245 -466166 -227283 -721
12716 -721 212672 419903 641106 845249 972118 993423 909757 762910 633144 570087 551643
12705 551643 504925 408793 359481 482526 851908 1488261 2273981 2967633 3389376 3541718
$$ packed form
12775a521456n02535k49008q00J00785M3220j23628k89585l46203k59913j9870
12765c168993K82801M74612N28229N37223M98823L94695L04185K91475L79973
12756E23023M87745M75620L66999K48106J22141L5961O6512J32526J20019J8712
12746B597364j34113k44509k60925j76987j1768J48333K28812K29236J71692K2446
12736B569581l01311p42942r79735p78882l29076L9328J96411K08661J80809J15990
12726A78834Q395r1979j72193k60740k80857j39031P7326K14079K38883K26562
12716g21K13393K07231K21203K04143J26869K1305q3666j46847j29766o3057j8444
12705E51643m6718r6132m9312J23045L69382O36353P85720O93652M21743J52342
$$ plain form
12695 3541718 3571872 3605599 3553092 3266122 2805649 2327205 1957144 1776034 1744464 1743173
12685 1743173 1739725 1811900 2063504 2535379 3125431 3598081 3750486 3578680 3206574 2751253
12675 2751253 2247152 1712514 1270055 1016309 920032 928727 1034646 1228984 1459341 1640669
12665 1640669 1689779 1596137 1447010 1342139 1338869 1477427 1813984 2368026 2983689 3370863
12655 3370863 3352193 3018382 2580862 2159563 1771819 1389876 998060 623358 314917 145722
12645 145722 198842 468235 779584 924448 888231 829628 864019 950561 990699 942174 839713
12634 839713 776507 852161 1117792 1504500 1804493 1808744 1504691 1091674 781268 635611
12624 635611 602073 608508 590576 499711 326898 173548 146364 234738 375534 467674 433649
$$ packed form
12695C541718L0154L3727n2507k86970m60473m78444l70061j81110l1570j291
12685A743173l448P2175K51604M71875N90052M72650J52405j71806l72106m55321
12675B751253n04101n34638m42459k53746r6277Q695J05919J94338K30357J81328
12665A640669M9110r3642j49127j04871l270J38558L36557N54042O15663L87174
12655C370863j8670l33811m37520m21299l87744l81943l91816l74702l08441j69195
12645A45722N3120K69393L11349J44864l6217n8603L4391Q6542M0138m8525j02461
12634H39713o3206P5654K65631L86708K99993M251l04053m13017l10406j45657
12624F35611l3538O435j7932r0865j72813j53350k7184Q8374J40796R2140l4025
$$ plain form
12613 433649 313080 199536 119695 50512 62895 292044 711528 1075729 1197409 1130150
12603 1130150 1016352 901251 755193 595378 506399 500531 451693 214977 -250382 -849777
12593 -849777 -1413844 -1753505 -1773531 -1565174 -1308896 -1130110 -1036524 -980952 -930732 -810677
12583 -810677 -516379 -3138 659478 1355933 1997028 2482434 2704620 2592142 2172235 1570054
12573 1570054 970215 586638 542634 752722 1009308 1214866 1418377 1616675 1686477 1516218
12563 1516218 1130695 691355 336276 100069 -23740 -59485 -43382 -2400 70792 207514
12553 207514 423502 686945 923912 1097046 1216386 1288837 1364627 1549621 1873364 2201467
12543 2201467 2355599 2296300 2180550 2204524 2412321 2714120 3004818 3231028 3370106 3427564
$$ packed form
12613D33649j20569j13544p9841o9183J2383K29149M19484L64201J21680o7259
12603A130150j13798j15101j46058j59815q8979n868m8838k36716m65359n99395
12593h49777n64067l39661k0026K08357K56278J78786R3586N5572N0220J20055
12583h10677K94298N13241O62616O96455O41095M85406K22186j12478m19907o02181
12573A570054n99839l83577m4004K10088K56586K05558K03511J98298O9802j70259
12563A516218l85523m39340l55079k36207j23809l5745J6103M0982P3192J36722
12553B07514K15988K63443K36967J73134J19340P2451P5790J84994L23743L28103
12543B201467J54132n9299j15750K3974K07797L01799K90698K26210J39078N7458
$$ plain form
12533 3427564 3445804 3442065 3353482 3067990 2538596 1840742 1109744 496963 103811 -94483
12523 -94483 -225174 -426022 -726283 -987775 -985223 -593949 101284 896175 1603668 2046064
12513 2046064 2101058 1855997 1548698 1312996 1107275 855169 518674 145898 -134123 -236568
12503 -236568 -207416 -166165 -252990 -581699 -1082608 -1575585 -1959763 -2190923 -2252969 -2129675
12493 -2129675 -1805210 -1409223 -1161930 -1182955 -1452589 -1842206 -2162471 -2215341 -1891760 -1213466
12483 -1213466 -295618 671234 1476565 1965190 2114587 2052578 1885369 1589910 1139137 623334
12473 623334 169650 -185847 -505610 -852145 -1170001 -1354053 -1427142 -1556717 -1875761 -2382922
12463 -2382922 -2993032 -3558556 -3877150 -3819464 -3487119 -3101932 -2795848 -2593123 -2427639 -2210551
$$ packed form
12533C427564J8240l739q8583k85492n29394o97854p30998o12781l93152j98294
12523i4483j30691k00848l00261k61492K552L91274O95233P94891P07493M42396
12513B046064N4994k45061l07299k35702k05721k52106l36495l72776k80021j02445
12503b36568K9152M1251q6825l28709n00909m92977l84178k31160o2046J23294
12493b129675L24465L95987K47293k1025k69634l89617l20265n2870L23581O78294
12483a213466R17848R66852Q05331M88625J49397o2009j67209k95459m50773n15803
12473F23334m53684l55497l19763l46535l17856j84052p3089j29575l19044n07161
12463b382922o10110n65524l18594N7686L32345L85187L06084K02725J65484K17088
$$ plain form
12453 -2210551 -1932694 -1688858 -1557806 -1509875 -1495106 -1491939 -1506613 -1563180 -1673439 -1797687
12443 -1797687 -1811990 -1562648 -1018586 -359114 168289 446343 498052 421938 322031 250224
12433 250224 252677 375553 573396 687751 634765 540649 582641 796466 1117118 1512309
12423 1512309 2026614 2649555 3206643 3543208 3636660 3464336 3050919 2555675 2177287 2013042
12413 2013042 2052374 2263437 2563883 2846047 3035120 2995358 2574707 1850711 1097913 490571
12403 490571 16812 -353841 -637398 -894196 -1183049 -1518594 -1884870 -2173153 -2191221 -1855065
12393 -1855065 -1271575 -642148 -149765 157143 368361 567144 790202 1047125 1255499
12384 1255499 1270661 991229 419760 -286928 -829030 -955686 -712115 -364649 -110693 15979
$$ packed form
12453b210551K77857K43836J31052M7931J4769L167j4674n6567j10259j24248
12443a797687j4303K49342N44062O59472N27403K78054N1709p6114r9907p1807
12433B50224K453J22876J97843J14355n2986r4116M1992K13825L20652L95191
12423A512309N14305O22941N57088L36565R3452j72324m13417m95244l78388j64245
12413B013042L9332K11063L00446K82164J89073l9762m20651p23996p52798o07342
12403D90571m73759l70653k83557k56798k88853l35545l66276k88283j8068L36156
12393a855065N83490O29427M92383L06908K11218J98783K23058K56923K08374
12384A255499J5162k79432n71469p06688n42102j26656K43571L47466K53956J26672
$$ plain form
12374 15979 85221 185105 334278 433670 396738 290508 214494 186738 168484 133207 90404
12363 90404 42089 -8170 -31835 -33754 -50288 -42844 27878 117426 181002 196726 165659 137945
12351 137945 162866 296708 616034 1116776 1712128 2270794 2674419 2910951 3039098 3058116
12341 3058116 2868840 2366091 1598078 817592 265726 50177 192403 620231 1174331
12332 1174331 1699807 2089066 2245409 2143530 1884702 1668291 1643783 1761776 1864631 1908736
12322 1908736 1953806 2027277 2161057 2390546 2627447 2678503 2401999 1853901 1282445 910298
12312 910298 708729 478392 140858 -232031 -552264 -764880 -874449 -901455 -818508 -565822
12302 -565822 -106350 469378 1003312 1414103 1655959 1679873 1516521 1242510 877347 466720
$$ packed form
12374A5979O9242R9884J49173R9392l6932j06230p6014k7756j8254l5277m2803
12363I0404m8315n0259k3665j919j6534P444P0722Q9548O3576J5724l1067k7714
12351A37945K4921J33842L19326N00742N95352N58666M03625K36532J28147J9018
12341C058116j89276n02749p68013p80486n51866k15549J42226M27828N54100
12332A174331N25476L89259J56343j01879k58828k16411k4508J17993J02855M4105
12322A908736M5070P3471J33780K29489K36901N1056k76504n48098n71456l72147
12312I10298k01569k30337l37534l72889l20233k12616j09569k7006Q2947K52686
12302e65822M59472N75728N33934M10791K41856K3914j63352k74011l65163m10627
$$ plain form
12292 466720 153010 41194 84485 133413 37575 -324610 -1005341 -1806073 -2379895 -2607598
12282 -2607598 -2640365 -2675733 -2773537 -2818475 -2624374 -2090150 -1270485 -366997 344594 653422
12272 653422 482171 -86758 -822607 -1469295 -1866880 -1999926 -1958187 -1815110 -1566445 -1198678
12262 -1198678 -790377 -504074 -431244 -493863 -568375 -630747 -709890 -787374 -813792 -766505 -626043
12251 -626043 -333590 153022 790888 1445441 1909759 2022300 1860869 1719514 1826552 2240547
12241 2240547 2916620 3741434 4492931 4851626 4650755 4001399 3118610 2200551 1390128
12232 1390128 740964 282614 52823 16449 75535 153303 201394 187467 132799 119368 203798
12221 203798 320762 381799 446984 633484 920825 1170384 1303620 1343182 1276918 1064017
$$ packed form
12292D66720l13710j11816M3291M8928r5838l62185o80731q00732n73822k27703
12282b607598l2767l5368r7804m4938J94101N34224Q19665R03488P11591L08828
12272F53422j71251n68929p35849o46688l97585j33046M1739J43077K48665L67767
12262a198678M08301K86303P2830o2619p4512o2372p9143p7484k6418M7287J40462
12251f26043K92453M86612O37866O54553M64318J12541j61431j41355J07038M13995
12241B240547O76073Q24814P51497L58695k00871o49356q82789r18059q10423
12232A390128o49164m58350k29791l6374N9086P7768M8091j3927n4668j3431Q4430
12221B03798J16964O1037O5185J86500K87341K49559J33236L9562o6264k12901
$$ plain form
12211 1064017 755632 434077 158657 25103 84254 248566 407563 517941 548701 465617
12201 465617 274088 50352 -87643 -82646 2402 69492 107830 128390 74659 -104432 -393955
12190 -393955 -789548 -1317655 -1852386 -2134605 -2079541 -1838081 -1526394 -1081608 -426268 380810
12180 380810 1178841 1752747 1938541 1790223 1510128 1231798 1019275 930730 959526 1037537
12170 1037537 1077427 1012372 857840 704620 595460 448659 185110 -147020 -482000 -838328
12160 -838328 -1180033 -1398707 -1500782 -1607796 -1787215 -2033728 -2325784 -2630887 -2977278 -3454281
12150 -3454281 -4026685 -4468537 -4563314 -4262458 -3702994 -3070494 -2413594 -1712967 -1046151 -556854
12140 -556854 -329664 -352215 -566023 -822233 -916432 -771456 -513402 -319526 -261728 -354793
$$ packed form
12211A064017l08385l21555k75420j33554N9151J64312J58997J10378L0760q3084
12201D65617j91529k23736j37995M997Q5048O7090L8338K0560n3731j79091k89523
12190c93955l95593n28107n34731k82219N5064K41460L11687M44786O55340Q07078
12180C80810P98031N73906J85794j48318k80095k78330k12523q8545K8796P8011
12170A037537L9890o5055j54532j53220j09160j46801k63549l32130l34980l56328
12160h38328l41705k18674j02075j07014j79419k46513k92056l05103l46391m77003
12150c454281n72404m41852r4777L00856N59464O32500O56900P00627O66816M89297
12140e56854K27190k2551k13808k56210r4199J44976K58054J93876N7798r3065
$$ plain form
12130 -354793 -602286 -952027 -1323407 -1645609 -1937900 -2285772 -2663170 -2942455 -3055150 -3043353
12120 -3043353 -3009861 -3053321 -3211689 -3430754 -3617089 -3771241 -3948781 -4129689 -4235301 -4193634
12110 -4193634 -3935816 -3455620 -2884780 -2376330 -1949392 -1532919 -1079263 -601839 -166483
12101 -166483 201203 564560 936873 1241184 1464550 1684047 1939797 2160570 2245911 2188465
12091 2188465 2058042 1911666 1802698 1818891 1997339 2283516 2581666 2748079 2627713 2151738
12081 2151738 1432531 688803 53990 -446195 -840472 -1151458 -1300248 -1262453 -1233616 -1421147
12071 -1421147 -1764581 -1978162 -1837200 -1382845 -851370 -501026 -485564 -776727 -1198452 -1560409
12061 -1560409 -1736930 -1666382 -1346617 -845607 -335542 -40582 -115414 -576228 -1304926 -2139532
$$ packed form
12130c54793k47493l49741l71380l22202k92291l47872l77398k79285j12695J1797
12120c043353L3492m3460j58368k19065j86335j54152j77540j80908j05612M1667
12110d193634K57818M80196N70840N08450M26938M16473M53656M77424M35356
12101a66483L67686L63357L72313L04311K23366K19497K55750K20773Q5341n7446
12091B188465j30423j46376j08968J6193J78448K86177K98150J66413j20366m75975
12081B151738p19207p43728o34813n00185l94277l10986j48790L7795K8837j87531
12071a421147l43434k13581J40962M54355N31475L50344J5462k91163m21725l61957
12061a560409j76521P0548L19765N01010N10065K94960p4832m60814p28698q34606
$$ plain form
12051 -2139532 -2893356 -3374652 -3569185 -3588947 -3436014 -3088206 -2702131 -2512027 -2614981 -2884928
12041 -2884928 -3074256 -3035634 -2815162 -2508586 -2196617 -1937839 -1716618 -1515723 -1410942 -1455713
12031 -1455713 -1567152 -1632785 -1606701 -1527262 -1482267 -1489068 -1484438 -1415292 -1246763 -970865 -602650
12020 -602650 -131685 420963 913544 1153983 1095045 844501 524764 231981 22889 -123785
12010 -123785 -259200 -382528 -451464 -447490 -359635 -170773 113528 435423 644236 550067
12000 550067 119821 -468785 -1019275 -1469831 -1876740 -2294604 -2685365 -2951441 -3010980 -2884014
11990 -2884014 -2645602 -2324339 -1928786 -1510450 -1168015 -970229 -875569 -785530 -696468 -641509
11980 -641509 -603319 -552247 -480696 -412343 -373635 -369221 -339212 -184896 138549 569807 979670
$$ packed form
12051b139532p53824m81296j94533j9762J52933L47808L86075J90104j02954k69947
12041b884928j89328L8622K20472L06576L11969K58778K21221K00895J04781m4771
12031a455713j11439o5633K6084P9439M4995o801M630O9146J68529K75898L68215
12020f02650M70965N52648M92581K40439n8938k50544l19737k92783k09092j46674
12010a23785j35415j23328o8936L974Q7855J88862K84301L21895K08813r4169
12000E50067m30246n88606n50490m50556m06909m17864l90761k66076n9539J26966
11990b884014K38412L21263L95553M18336L42435J97786R4660R0039Q9062N4959
11980f41509L8190N1072P1551O8353L8708M414L0009J54316L23445M31258M09863
$$ plain form
11969 979670 1265663 1378166 1287153 1032417 734647 466395 209094 -81524 -451016 -895439
11959 -895439 -1334155 -1734838 -2124161 -2453117 -2630389 -2603475 -2343527 -1907177 -1464982 -1104386
11949 -1104386 -746634 -322309 103527 434988 728831 1159000 1789971 2488747 3107059
11940 3107059 3663687 4218311 4698346 4935816 4805665 4355291 3774908 3251341 2868099
11931 2868099 2615215 2433840 2247739 2017336 1757313 1478473 1180401 899909 652035
11922 652035 404737 180025 69613 115077 247740 404129 621854 920865 1186522 1296345
11912 1296345 1257259 1152917 1004256 738449 268025 -352901 -912435 -1204516 -1100753 -609967
11902 -609967 116637 872521 1449733 1682462 1559839 1257129 935459 626134 367840 278924
$$ packed form
11969I79670K85993J12503r1013k54736k97770k68252k57301k90618l69492m44423
11959h95439m38716m00683l89323l28956j77272K6914K59948M36350M42195L60596
11949a104386L57752M24325M25836L31461K93843M30169O30971O98776O18312
11940C107059N56628N54624M80035K37470j30151m50374n80383n23567l83242
11931B868099k52884j81375j86101k30403k60023k78840k98072k80492k47874
11922F52035k47298k24712j10412M5464J32663J56389K17725K99011K65657J09823
11912A296345l9086j04342j48661k65807m70424o20926n59534k92081J03763M90786
11902f09967P26604P55884N77212K32729j22623l02710l21670l09325k58294q8916
$$ plain form
11892 278924 443991 795589 1180091 1503542 1723819 1782315 1667195 1426148 1061488 508615
11882 508615 -224603 -960261 -1468375 -1656177 -1615700 -1452956 -1221479 -1041473 -1035968 -1103869
11872 -1103869 -985676 -565711 -12822 381846 468842 343023 158975 -16473 -109966 -1400
11862 -1400 330385 679599 784746 633946 417095 295793 356649 592465 911461 1215847
11852 1215847 1410550 1408508 1245881 1051947 939585 985464 1178770 1427721 1643917 1769338
11842 1769338 1772629 1662978 1472927 1219565 905265 536273 133450 -214187 -359751 -213034
11832 -213034 147614 536875 820445 953655 920615 698973 323368 -78456 -346144 -398803
11822 -398803 -283285 -89721 115734 267623 292729 154143 -112979 -380550 -479217 -309026
$$ packed form
11892B78924J65067L51598L84502L23451K20277N8496j15120k41047l64660n52873
11882E08615p33218p35658n08114j87802M0477J62744K31477J80006N505o7901
11872a103869J18193M19965N52889L94668Q6996j25819j84048j75448r3493J08566
11862a400L31785L49214J05147j50800k16851j21302O0856K35816L18996L04386
11852A215847J94703k042j62627j93934j12362M5879J93306K48951K16196J25421
11842A769338L291j09651j90051k53362l14300l68992m02823l47637j45564J46717
11832b13034L60648L89261K83570J33210l3040k21642l75605m01824k67688n2659
11822c98803J15518J93564K05455J51889K5106j38586k67122k67571r8667J70191
$$ plain form
11812 -309026 145619 812502 1463455 1806318 1753507 1479778 1200578 959010 666258 326484
11802 326484 50868 -98210 -124950 -11682 250528 583101 846233 937719 877159 742430
11792 742430 558780 300383 -49269 -486597 -1022864 -1655054 -2312173 -2883436 -3287487 -3511193
11782 -3511193 -3570847 -3511874 -3446592 -3367396 -3112388 -2604611 -1913748 -1187877 -604167 -208716
11772 -208716 122762 504112 931890 1300128 1511946 1574161 1558895 1487552 1344779 1201405
11762 1201405 1129451 1066764 890534 573068 234080 13273 -57350 -32302 249 -65801
11752 -65801 -306214 -732094 -1275324 -1827316 -2349017 -2827215 -3163366 -3250564 -3048858 -2551331
11742 -2551331 -1829661 -1043559 -332717 243257 708330 1088872 1283028 1164954 742544
$$ packed form
11812c09026M54645O66883O50953L42863n2811k73729k79200k41568k92752l39774
11802C26484k75616j49078k6740J13268K62210L32573K63132R1486o0560j34729
11792G42430j83650k58397l49652m37328n36267o32190o57119n71263m04051k23706
11782c511193n9654N8973O5282P9196K55008N07777O90863P25871N83710L95451
11772b08716L31478L81350M27778L68238K11818O2215j5266p1343j42773j43374
11762A201405p1954o2687j76230l17466l38988k20807p0623K5048L2551o6050
11752f5801k40413m25880n43230n51992n21701m78198l36151q7198K01706M97527
11742b551331P21670P86102P10842N75974M65073L80542J94156j18074m22410
$$ plain form
11733 742544 128407 -523756 -1060002 -1381581 -1505846 -1502308 -1386019 -1174625 -949537 -786425
11723 -786425 -711555 -683448 -628806 -515142 -325700 -45851 302684 706889 1160026 1542613
11713 1542613 1672929 1534527 1282055 1081317 1008278 1038972 1133810 1268762 1379843 1376047
11703 1376047 1196829 846106 393238 -102397 -576994 -920756 -1029548 -893035 -664341
11694 -664341 -511624 -493547 -617279 -811052 -909441 -809357 -553226 -275835 -81633 51664
11684 51664 198184 380326 559178 657691 639249 601831 691222 896477 1042520 1039597 1014562
11673 1014562 1082131 1143362 1055280 848201 664378 598793 611944 596632 545524 537026 623118
11662 623118 798126 967378 1018405 953652 812334 588296 298936 5352 -242577 -380767
$$ packed form
11733G42544o14137o52163n36246l21579j24265L538J16289K11394K25088J63112
11723g86425P4870K8107N4642J13664J89442K79849L48535M04205M53137L82587
11713A542613J30316j38402k52472k00738p3039L0694R4838J34952J11081l796
11703A376047j79218l50723m52868m95635m74597l43762j08792J36513K28694
11694f64341J52717J8077j23732j93773r8389J00084K56131K77391J94202J33297
11684E1664J46520J82142J78852R8513j8442l7418Q9391K05255J46043k923k5035
11673A014562O7569O1231q8082k07079j83823o5585J3151j5312n1108q498Q6092
11662F23118J75008J69252N1027o4753j41318k24038k89360k93584k47929j38190
$$ plain form
11652 -380767 -312221 -50008 262732 479572 514214 421305 416503 715804 1290556 1834554
11642 1834554 2021520 1745565 1172643 547310 18629 -284595 -255264 55773 417984 610642
11632 610642 602894 489097 345006 177099 -25518 -280855 -668042 -1272529 -2048488 -2816882
11622 -2816882 -3389897 -3672567 -3688655 -3458086 -2971907 -2331312 -1746026 -1431658 -1468580 -1687157
11612 -1687157 -1816103 -1720230 -1394318 -881572 -309671 228086 764468 1342724 1887137 2184096
11602 2184096 2117520 1818333 1484724 1224416 1092351 1111369 1199138 1237051 1149055 894770
11592 894770 533822 206505 -28212 -209031 -370974 -519168 -652086 -754484 -818255 -924546
11582 -924546 -1146676 -1367925 -1340746 -952542 -342003 194052 388453 189426 -251955 -691954
$$ packed form
11652c80767O8546K62213L12740K16840L4642r2909m802K99301N74752N43998
11642A834554J86966k75955n72922o25333n28681l03224K9331L11037L62211J92658
11632F10642p748j13797j44091j67907k02617k55337l87187o04487p75959p68394
11622b816882n73015k82670j6088K30569M86179O40595N85286L14368l6922k18577
11612a687157j28946R5873L25912N12746N71901N37757N36382N78256N44413K96959
11602B184096o6576k99187l33609k60308j32065J9018Q7769L7913q7996k54285
11592H94770l60948l27317k34717j80819j61943j48194j32918j02398o3771j06291
11582i24546k22130k21249K7179L88204O10539N36055J94401j99027m41381m39999
$$ plain form
11572 -691954 -927471 -925430 -791868 -632209 -478875 -315351 -134623 34234 157423 253647
11562 253647 385937 537425 580709 449793 308139 410398 786553 1176601 1323956 1186245
11552 1186245 898273 657798 552937 456931 179145 -327681 -929175 -1421634 -1676215 -1765113
11542 -1765113 -1854700 -1968960 -1992831 -1846945 -1610631 -1461381 -1488880 -1629514 -1776151 -1835526
11532 -1835526 -1689317 -1255964 -619393 16154 418146 456019 235814 -67655 -415552 -798418
11522 -798418 -1101002 -1235767 -1319616 -1481125 -1636910 -1651452 -1491389 -1141292 -556937 219063
11512 219063 1052718 1841367 2543694 3096409 3398969 3392020 3136808 2803198 2578370 2606053
11502 2606053 2945272 3484668 3977247 4335213 4664963 4970549 5169740 5279589 5362340 5409061
$$ packed form
11572f91954k35517K041J33562J59659J53334J63524J80728J68857J23189R6224
11562B53647J32290J51488M3284j30916j41654J02259L76155L90048J47355j37711
11552A186245k87972k40475j04861r6006k77786n06826o01494m92459k54581q8898
11542a765113q9587j14260k3871J45886K36314J49250k7499j40634j46637n9375
11532a835526J46209M33353O36571O35547M01992L7873k20205l03469l47897l82866
11522g98418l02584j34765q3849j61509j55785j4542J60063L50097N84355P76000
11512B19063Q33655P88649P02327N52715L02560o949k55212l33610k24828K7683
11502B606053L39219N39396M92579L57966L29750L05586J99191J09849Q2751M6721
$$ plain form
11492 5409061 5379567 5299833 5221765 5191312 5185204 5076028 4789355 4375335 3934992 3581610
11482 3581610 3395785 3399698 3544390 3694414 3731511 3683924 3644344 3596315 3402150 2972949
11472 2972949 2434821 2028827 1874164 1869360 1856029 1795755 1712958 1613973 1527588 1480563 1447680
11461 1447680 1385024 1272936 1109013 915754 760186 700603 723622 805933 917101 983177
11451 983177 970522 853886 592072 250912 31457 87023 403723 865470 1329320 1685615
11441 1685615 1861893 1800868 1534876 1151401 749500 485039 446055 543705 684772 907658
11431 907658 1195603 1377153 1300909 1009488 677216 353004 -28430 -462785 -844578 -1042526
11421 -1042526 -993522 -753581 -419418 -54406 275214 481165 561829 560549 417524 88279
$$ packed form
11492E409061k9494p9734p8068l0453o108j09176k86673m14020m40343l53382
11482C581610j85825L913J44692J50024L7097m7587l9580m8029j94165m29201
11472B972949n38128m05994j54663m804j3331o0274q2797r8985q6385m7025l2883
11461A447680o2656j12088j63923j93259j55568n9583K3019Q2311J11168O6076
11451I83177j2655j16636k61814l41160k19455N5566L16700M61747M63850L56295
11441A685615J76278o1025k65992l83475m01901k64461l8984R7650J41067K22886
11431I07658K87945J81550p6244k91421l32272l24212l81434m34355l81793j97948
11421a042526M9004K39941L34163L65012L29620K05951Q0664j280j43025l29245
$$ plain form
11411 88279 -299862 -586733 -803171 -1086547 -1457445 -1762149 -1826540 -1614845 -1184523 -599996
11401 -599996 34653 554018 840047 880055 744784 594316 579327 687027 786554 804246
11391 804246 751095 652768 519956 340949 109963 -145647 -349100 -437497 -459722 -481123
11381 -481123 -455520 -225771 309891 1045087 1746787 2210858 2337592 2176094 1883094 1549884
11371 1549884 1162036 720543 272494 -126367 -402147 -472012 -296569 73582 519437 902613
11361 902613 1131903 1175327 1033796 785533 571941 483781 538201 715459 915859 933182
11351 933182 629949 81365 -511077 -925012 -1060741 -967073 -683590 -220995 327859 786219
11341 786219 1031359 1085547 998426 749148 334668 -175547 -691278 -1123535 -1382281 -1431131
$$ packed form
11411H8279l88141k86871k16438k83376l70898l04704o4391K11695M30322N84527
11401e99996O34649N19365K86029M0008j35271j50468j4989J07700R9527J7692
11391H04246n3151r8327j32812j79007k30986k55610k03453q8397k2225k1401
11381d81123K5603K29749N35662P35196P01700M64071J26734j61498k93000l33210
11371A549884l87848m41493m48049l98861k75780o9865J75443L70151M45855L83176
11361I02613K29290M3424j41531k48263k13592q8160N4420J77258K00400J7323
11351I33182l03233n48584n92442m13935j35729R3668K83483M62595N48854M58360
11341G86219K45140N4188q7121k49278m14480n10215n15731m32257k58746m8850
$$ plain form
11331 -1431131 -1313642 -1075930 -758369 -462365 -305407 -323406 -457881 -593743 -633153 -582112
11321 -582112 -538854 -586846 -755184 -1033594 -1334449 -1545844 -1662735 -1795053 -2054928 -2394190
11311 -2394190 -2600384 -2550058 -2365517 -2273234 -2359898 -2508954 -2545967 -2447739 -2311818 -2185867
11301 -2185867 -2094344 -2100304 -2226671 -2401618 -2572915 -2741356 -2912433 -3076014 -3204838 -3285801
11291 -3285801 -3290262 -3171311 -2959113 -2775440 -2653795 -2544913 -2434860 -2260501 -1893571 -1235864
11281 -1235864 -318781 680361 1568631 2207066 2525327 2577430 2454440 2146786 1665896 1142688
11271 1142688 679930 317769 115402 128292 360569 761446 1188258 1480933 1620352 1660859
11261 1660859 1621821 1547749 1547915 1686397 1902908 2066650 2042762 1742081 1205415 625718
$$ packed form
11331a431131J17489K37712L17561K96004J56958j7999j34475j35862l9410N1041
11321e82112M3258m7992j68338k78410l00855k11395j16891j32318k59875l39262
11311b394190k06194N0326J84541R2283q6664j49056l7013R8228J35921J25951
11301b185867R1523n960j26367j74947j71297j68441j71077j63581j28824q0963
11291c285801m461J18951K12198J83673J21645J08882J10053J74359L66930O57707
11281a235864R17083R99142Q88270O38435L18261N2103j22990l07654m80890n23208
11271A142688m62758l62161k02367J2890K32277M00877M26812K92675J39419M0507
11261A660859l9038p4072J66J38482K16511J63742k3888l00681n36666n79697
$$ plain form
11251 625718 211056 71106 184314 419211 640889 782522 805374 696242 530076 410663
11241 410663 369254 383303 416256 413944 330662 230336 298371 684346 1376222 2231918 3059689
11230 3059689 3690598 4046578 4110140 3863689 3324263 2607308 1931129 1449288 1124018 871575
11220 871575 698697 610967 502663 236270 -234563 -797676 -1253469 -1487773 -1533940 -1500676
11210 -1500676 -1482090 -1530313 -1658382 -1758557 -1646414 -1261362 -728507 -245404 59142 194873
11200 194873 281933 387197 482931 570066 712543 943812 1194386 1324849 1251458 1034014
11190 1034014 780650 554616 383488 250367 87826 -149055 -433359 -724866 -1038286
11181 -1038286 -1374820 -1671218 -1848028 -1824827 -1601355 -1366472 -1375062 -1687532 -2125122 -2473929
$$ packed form
11251F25718m14662j39950J13208K34897K21678J41633K2852j09132j66166j19413
11241D10663m1409J4049L2953k312q3282j00326O8035L85975O91876Q55696Q27771
11230C059689O30909L55980O3562k46451n39426p16955o76179m81841l25270k52443
11220H71575j72878q7730j08304k66393m70833n63113m55793k34304m6167L3264
11210a500676J8586m8223j28069j00175J12143L85052N32855M83103L04546J35731
11200A94873Q7060J05264R5734Q7135J42477K31269K50574J30463p3391k17444
11190A034014k53364k26034j71128j33121j62541k36881k84304k91507l13420
11181a038286l36534k96398j76810K3201K23472K34883q590l12470m37590l48807
$$ plain form
11171 -2473929 -2633035 -2577887 -2295011 -1837841 -1341757 -915970 -606448 -434275 -434521 -604212
11161 -604212 -867607 -1176570 -1486163 -1684144 -1703670 -1643078 -1648161 -1702040 -1667345 -1499792 -1280226
11150 -1280226 -1108057 -1051060 -1129794 -1292754 -1423734 -1469282 -1451677 -1390401 -1299700 -1171729
11140 -1171729 -978624 -782887 -780110 -1069111 -1456090 -1649599 -1566360 -1316145 -1023202 -725833
11130 -725833 -374751 1016 224832 166683 -136705 -576888 -1078304 -1592161 -2071446 -2486335
11120 -2486335 -2784846 -2933975 -2954024 -2849311 -2577508 -2157570 -1772025 -1619160 -1743479 -2028819
11110 -2028819 -2293104 -2403040 -2333346 -2150166 -1944304 -1781211 -1692049 -1668766 -1642371 -1547970
11100 -1547970 -1384627 -1191724 -1043910 -982127 -926846 -747415 -408129 -47071 143501 85253
$$ packed form
11171b473929j59106N5148K82876M57170M96084M25787L09522J72173k46j69691
11161f04212k63395l08963l09593j97981j9526O0592n083n3879L4695J67553K19566
11150a280226J72169N6997p8734j62960j30980m5548J7605O1276R0701J27971
11140a171729J93105J95737K777k89001l86979j93509Q3239K50215K92943K97369
11130g25833L51082L75767K23816n8149l03388m40183n01416n13857m79285m14889
11120b486335k98511j49129k0049J04713K71803M19938L85545J52865j24319k85340
11110b028819k64285j09936O9694J83180K05862J63093Q9162K3283K6395R4401
11100a547970J63343J92903J47814O1783N5281J79431L39286L61058J90572n8248
$$ [...]
##END NTUPLES=NMR SPECTRUM
##END=
