##TITLE=31P ikalashn
CBPAd-2
19.7.2023
##JCAMPDX= 6.0         $$ Bruker NMR JCAMP-DX V2.0
##DATA TYPE= NMR SPECTRUM
##DATA CLASS= NTUPLES
##ORIGIN= UXNMR, Bruker Analytische Messtechnik GmbH
##OWNER= root
$$ TOPSPIN		Version 1.3
$$ 2023-07-19 15:16:26.296 +0400  Irina@DPX200
$$ Compression mode = diff/dup
##.OBSERVE FREQUENCY= 81.01967998063
##.OBSERVE NUCLEUS= ^31P
##.ACQUISITION MODE= SIMULTANEOUS
##.ACQUISITION SCHEME= undefined
##.AVERAGES= 64
##.DIGITISER RES= 17
##SPECTROMETER/DATA SYSTEM= spect
##.PULSE SEQUENCE= zgpg
##.SOLVENT NAME= D2O
##.SHIFT REFERENCE= INTERNAL, D2O, 1, 298.5841
##AUDIT TRAIL= $$ (NUMBER, WHEN, WHO, WHERE, WHAT)
$$ ##TITLE= Audit trail, TOPSPIN		Version 1.3
$$ ##JCAMPDX= 5.01
$$ ##ORIGIN= Bruker BioSpin GmbH
$$ ##OWNER= Irina
$$ $$ F:/spectra/data/iren/nmr/P31dec/1/pdata/1/auditp.txt
$$ ##AUDIT TRAIL=  $$ (NUMBER, WHEN, WHO, WHERE, VERSION, WHAT)
(   1,<2023-07-19 15:15:54.843 +0400>,<Irina>,<DPX200>,<TOPSPIN 1.3>,
      <created by zg
	started at 2023-07-19 15:14:11.562 +0400,
	POWCHK disabled, PULCHK disabled
       configuration hash MD5:
       BE 6D 3F 07 2A EA 11 49 91 17 2B D3 AF B3 58 0D
       data hash MD5: 32K
       7A 5E A1 8A F7 15 27 DB 2A F8 96 38 74 1F 05 C9>)
(   2,<2023-07-19 15:15:57.140 +0400>,<Irina>,<DPX200>,<TOPSPIN 1.3>,
      <Start of raw data processing
       efp BC_mod = 2 LB = 8 FT_mod = 6 PKNL = 1 PHC0 = -26.42566 PHC1 = 325.118 SI = 32K 
       data hash MD5: 32K
       32 FF B9 28 6C 75 25 2A B3 F7 EB A9 0F 08 E5 CE>)
(   3,<2023-07-19 15:15:59.703 +0400>,<Irina>,<DPX200>,<TOPSPIN 1.3>,
      <apk 
       data hash MD5: 32K
       ED F3 BC 44 E7 CF 34 AB B9 2E 71 93 7C 7A 6D 59>)
(   4,<2023-07-19 15:16:02.203 +0400>,<Irina>,<DPX200>,<TOPSPIN 1.3>,
      <abs n ABSG = 5 
       data hash MD5: 32K
       D4 67 01 EA 44 A4 EB D3 5A 0E 68 EB 4E D3 94 80>)
$$ ##END=
$$ 
$$ $$ hash MD5
$$ $$ A4 B8 4B 71 B2 EA 94 89 24 92 8D AE B1 C0 C8 16
##$RELAX= 
##$RELAX= 
##$RELAX= 
##$RELAX= 
##$RELAX= 
##$RELAX= 
##$RELAX= 
##$RELAX= 
##$RELAX= 
##$RELAX= 
$$ Bruker specific parameters
$$ --------------------------
##$DU= <F:/spectra>
##$EXPNO= 1
##$NAME= <P31dec>
##$PROCNO= 1
##$TYPE= <nmr>
##$USER= <iren>
##$AMP= (0..31)
100 100 100 100 100 100 100 100 100 100 100 100 100 100 100 100 100 100 
100 100 100 100 100 100 100 100 100 100 100 100 100 100 
##$ANAVPT= -1
##$AQSEQ= 0
##$AQ_mod= 1
##$AUNM= <au_zg>
##$AUTOPOS= <>
##$BF1= 81.014009
##$BF2= 200.13
##$BF3= 200.13
##$BF4= 200.13
##$BF5= 200.13
##$BF6= 200.13
##$BF7= 200.13
##$BF8= 200.13
##$BYTORDA= 1
##$CFDGTYP= 0
##$CFRGTYP= 5
##$CHEMSTR= <none>
##$CNST= (0..63)
1 1 145 1 1 1 1 1 1 1 1 1 1 1 1 1 1 1 1 1 1 1 1 1 1 1 1 1 1 1 1 1 1 1 
1 1 1 1 1 1 1 1 1 1 1 1 1 1 1 1 1 1 1 1 1 1 1 1 1 1 1 1 1 1 
##$CPDPRG= <waltz16>
##$CPDPRG1= <>
##$CPDPRG2= <waltz16>
##$CPDPRG3= <>
##$CPDPRG4= <mlev>
##$CPDPRG5= <mlev>
##$CPDPRG6= <mlev>
##$CPDPRG7= <mlev>
##$CPDPRG8= <mlev>
##$CPDPRGB= <>
##$CPDPRGT= <>
##$D= (0..63)
$$ [...]
##$SW_h= 37037.037037037
##$TD= 32768
##$TD0= 1
##$TE= 300
##$TE2= 300
##$TE3= 300
##$TEG= 300
##$TL= (0..7)
0 120 53 12 22 120 120 120 
##$TP= (0..7)
150 150 150 150 150 150 150 150 
##$TP07= 0
##$TPNAME0= <>
##$TPNAME1= <>
##$TPNAME2= <>
##$TPNAME3= <>
##$TPNAME4= <>
##$TPNAME5= <>
##$TPNAME6= <>
##$TPNAME7= <>
##$TPOAL= (0..7)
0.5 0.5 0.5 0.5 0.5 0.5 0.5 0.5 
##$TPOFFS= (0..7)
0 0 0 0 0 0 0 0 
##$TUNHIN= 0
##$TUNHOUT= 0
##$TUNXOUT= 0
##$USERA1= <user>
##$USERA2= <user>
##$USERA3= <user>
##$USERA4= <user>
##$USERA5= <user>
##$V9= 5
##$VALIST= <valist>
##$VCLIST= <CCCCCCCCCCCCCCC>
##$VD= 0
##$VDLIST= <DDDDDDDDDDDDDDD>
##$VPLIST= <PPPPPPPPPPPPPPP>
##$VTLIST= <TTTTTTTTTTTTTTT>
##$WBST= 1024
##$WBSW= 4
##$XGAIN= (0..3)
0 0 0 0 
##$XL= 0
##$YL= 0
##$YMAX_a= 12947
##$YMIN_a= -2075
##$ZGOPTNS= <>
##$ZL1= 120
##$ZL2= 120
##$ZL3= 120
##$ZL4= 120
##$ABSF1= 298.5841
##$ABSF2= -158.5842
##$ABSG= 5
##$ABSL= 5
##$ALPHA= 0
##$AQORDER= 0
##$ASSFAC= 0
##$ASSFACI= 0
##$ASSFACX= 0
##$ASSWID= 0
##$AUNMP= <proc_1d>
##$AXLEFT= 0
##$AXRIGHT= 0
##$AXTYPE= 0
##$AXUNIT= <>
##$AZFE= 0.1
##$AZFW= 0.5
##$BCFW= 0
##$BC_mod= 2
##$BYTORDP= 0
##$COROFFS= 0
##$CY= 12.5935478210449
##$DATMOD= 1
##$DC= 0
##$DFILT= <>
##$DTYPP= 0
##$F1P= 47.1127640792319
##$F2P= -24.0371245302204
##$FCOR= 0.5
##$FTSIZE= 32768
##$FT_mod= 6
##$GAMMA= 0
##$GB= 0
##$INTBC= 1
##$INTSCL= 7.269226e-011
##$ISEN= 30
##$LB= 8
##$LEV0= 0
##$LPBIN= 0
##$MAXI= 12.09355
##$MC2= 0
##$MEAN= 0
##$ME_mod= 0
##$MI= 0.7550151
##$NCOEF= 0
##$NC_proc= -11
##$NLEV= 6
##$NOISF1= 298.5841
##$NOISF2= 270.0111
##$NSP= 0
##$NTH_PI= 0
##$NZP= 0
##$OFFSET= 298.5841
##$PC= 1.4
##$PHC0= 36.91201
##$PHC1= 235.6548
##$PH_mod= 1
##$PKNL= yes
##$PPARMOD= 0
##$PPDIAG= 0
##$PPIPTYP= 0
##$PPMPNUM= 100
##$PPRESOL= 1
##$PSCAL= 0
##$PSIGN= 0
##$REVERSE= no
##$SF= 81.014009
##$SI= 32768
##$SIGF1= 270.0111
##$SIGF2= -158.5842
##$SINO= 77.54984
##$SIOLD= 32768
##$SREGLST= <31P.CDCl3>
##$SSB= 0
##$STSI= 32768
##$STSR= 0
##$SW_p= 37037.037037037
##$SYMM= 0
##$S_DEV= 0
##$TDeff= 32768
##$TDoff= 0
##$TI= <>
##$TILT= no
##$TM1= 0
##$TM2= 0
##$TOPLEV= 0
##$USERP1= <user>
##$USERP2= <user>
##$USERP3= <user>
##$USERP4= <user>
##$USERP5= <user>
##$WDW= 1
##$XDIM= 32768
##$YMAX_p= 485798042
##$YMIN_p= -23815721
$$ End of Bruker specific parameters
$$ ---------------------------------
##NTUPLES= NMR SPECTRUM
##VAR_NAME=  FREQUENCY,     SPECTRUM/REAL,   SPECTRUM/IMAG
##SYMBOL=    X,             R,               I
##VAR_TYPE=  INDEPENDENT,   DEPENDENT,       DEPENDENT
##VAR_FORM=  AFFN,          ASDF,            ASDF
##VAR_DIM=   32768,         32768,           32768
##UNITS=     HZ,            ARBITRARY UNITS, ARBITRARY UNITS
##FACTOR=    1.13031516577767, 1,            1
##FIRST=     37037.037037037, 681004,        12661613
##LAST=      0,             -5604734,        -12785440
##MIN=       0,             -23815721,       0
##MAX=       37037.037037037, 485798042,     0
$$ Real data points
##PAGE= N=1
##DATA TABLE= (X++(R..R)), XYDATA
$$ [...]
17758G21295o5450N7939J60833L84508P48919J081351J113221Q20977M37228R9829
17748E560650j56020k76891k76970l47585n79714p98560q55443q14775p62937
17739F91755o02805l41052k19209k54458k57861j43673N2780J67827O8609j64625
17729a002712m54525p04959p02724m71052k33838q1851J6790O5074R6370J97977
17719c275450L45544K89364m9166m64413o43454m45231r9157J96261M48735O37551
17709c059416P30760P91105P49020M39556K0802j76864q1836M3222l8053l24181
17699i05885n88130o15736m47221k27600j6181J56657L82244Q18011J225358J212936
17689I94453Q07580L44820P3378L9281J04171J44119K97183O17229Q40677P58745
$$ y = [721295, 655845, 713784, 874617, 1259125, 2008044, 3089395, 4202616, 5023593, 5460821, 5560650, 5404630, 5127739, 4850769, 4503184, 3923470, 3124910, 2269467, 1454692, 691755, 88950, -252102, -471311, -725769, -983630, -1127303, -1074523, -906696, -838087, -1002712, -1457237, -2162196, -2864920, -3335972, -3569810, -3651661, -3634871, -3569797, -3473427, -3275450, -2929906, -2640542, -2689708, -3154121, -3797575, -4242806, -4341963, -4145702, -3696967, -3059416, -2328656, -1537551, -788531, -348975, -328173, -505037, -586873, -543651, -581704, -905885, -1494015, -2109751, -2556972, -2784572, -2800753, -2644096, -2261852, -1443841, -218483, 994453, 1802033, 2146853, 2220231, 2259512, 2363683, 2507802, 2804985, 3422214, 4262891, 5021636]
17679E021636M51850J10929k02353m87960p00943q25823p68088l79896J61337
17670B380689M36612K17054k68699m66818l7314N92125P63271M09537l8029k33416
17660C755012l43942n83618q54798j022553j040935r00633o60613m93223m19927
17651b565230k23826J02046K20262n7486n29631p84129o50353l10678J31226O83418
17641c984381J089730J065368P80902M84225K61594J70104Q8400j80527m68962
17632f93547m01023o6970J56776K41654L73270N62024N78292L15513m3719k33612
17622G88658j45824Q8342K24367N6181l64038q12261j135114j162156p61168j13982
17612c336995L19697K25137j60007l57744k05374J50121N23816P30689P32686
$$ y = [5021636, 5473486, 5584415, 5382062, 4894102, 4193159, 3367336, 2599248, 2219352, 2380689, 2817301, 3034355, 2765656, 2298838, 2261524, 2853649, 3616920, 4026457, 3988428, 3755012, 3411070, 2827452, 1972654, 950101, -90834, -991467, -1652080, -2145303, -2565230, -2789056, -2687010, -2466748, -2524234, -3053865, -3837994, -4488347, -4799025, -4667799, -3984381, -2894651, -1829283, -1048381, -564156, -302562, -132458, -44058, -224585, -693547, -1094570, -1161540, -1004764, -763110, -389840, 172184, 750476, 1065989, 1022270, 788658, 642834, 731176, 955543, 1011724, 647686, -164575, -1299689, -2461845, -3223013, -3336995, -3017298, -2792161, -2952168, -3309912, -3515286, -3365165, -2841349, -2110660, -1377974]
17603a377974N80792K77992j04354l99867m23002j43970K23605M87373O16176
17594b63229N47219K67068q0325k64442k24214j98826l88711o90319q10555n24803
17584b631137l299L85253N06655M94046M88359N14470N72742O78268P43227N12782
17574B261366p5525o94966j013471r72091p38187n18358l29693r6327J36118K70388
17564a770746K77598J98629J15462O6113M3626K3087n5221j75204j38626J70599
17554a244683N84779Q63830Q80486O63896L32633j6861l47456n47959m82379k89173
17544C97113k84159m94056n92275l75090N2810M44581N36233K47727k72218o88386
17534a027720o57347j83106M15608Q44670R32309P30265N40588N15515N42616
$$ y = [-1377974, -797182, -519190, -623544, -1023411, -1446413, -1590383, -1366778, -879405, -263229, 283990, 551058, 470733, 206291, -17923, -216749, -605460, -1295779, -2106334, -2631137, -2634436, -2249183, -1742528, -1248482, -760123, -245653, 327089, 1005357, 1748584, 2261366, 2185841, 1490875, 477404, -494687, -1232874, -1751232, -2080925, -2177252, -2041134, -1770746, -1493148, -1294519, -1179057, -1112944, -1069318, -1046231, -1101452, -1276656, -1415282, -1244683, -659904, 203926, 1084412, 1748308, 2080941, 2064080, 1716624, 1168665, 686286, 397113, 112954, -381102, -973377, -1348467, -1295657, -851076, -314843, -67116, -339334, -1027720, -1685067, -1868173, -1452565, -607895, 324414, 1054679, 1595267, 2110782, 2653398]
17525B653398N04237K92565k85179j087885j567791j445898r07449k14922L93202
17516a665722P33740P29201M09285l8911m08143n64221m57202j75277J03574K69383
17506a064293M00870O13389Q43454P99526K62576o29103j432253j656397j253205
17497c115436n53832Q1712M41138N42459M33148K72681K42615L18016M59529O28670
17487b49300O41038M52292K40245R820k83866m77508l95336j63839k2226M7358
17477b01322K09917L67296J64100l61144o67222m90990j18159J09284J80951K39551
17467e67738K88921J67925k09980o82221r41071q13579m27987J8735L09273K97379
17457b560343J0017k92194k20893K40389O58477O84942M18246J83276J16290J32871
$$ y = [2653398, 3157635, 3450200, 3165021, 2077136, 509345, -936553, -1844002, -2058924, -1665722, -931982, -202781, 206504, 167593, -240550, -804771, -1261973, -1437250, -1333676, -1064293, -663423, -50034, 793420, 1592946, 1855522, 1226419, -205834, -1862231, -3115436, -3669268, -3587556, -3146418, -2603959, -2170811, -1898130, -1655515, -1337499, -877970, -249300, 391738, 844030, 1084275, 1094095, 810229, 332721, -62615, -226454, -248680, -201322, 8595, 375891, 539991, 178847, -488375, -979365, -1097524, -988240, -807289, -567738, -278817, -110892, -320872, -1003093, -1944164, -2757743, -3185730, -3166995, -2857722, -2560343, -2550326, -2842520, -3063413, -2823024, -2164547, -1479605, -1061359, -878083, -761793, -628922]
17447f28922J95233L43328N70617O78450M18235k61240j075597j545833j447159
17438b752888q79812r7300N68591Q58084P23308L54721M2015l9967J8725Q534
17428a195989k8189J06040L75157N44611M63484L36655L85397M68093M08372K33621
17418B097252K1838k49949n99656r44121j075467q50010m84633k30441n1617J27903
17408b238901K23074J04465j26854j72201o987R9912o8102m44412p72961q76176
17398d279143p61292n92985m55265k76048n0440J04060R9706J2253m0499q2764
17388f322417j84403l75154o24121p88309p21993m00378j5455K30729M00480O17656
17378h183365P48991O47019N40485O22431Q02461R61507R66933P33883L95952
$$ y = [-628922, -433689, -90361, 480256, 1158706, 1576941, 1315701, 240104, -1305729, -2752888, -3632700, -3730000, -3161409, -2303325, -1580017, -1225296, -1183281, -1223248, -1204523, -1195989, -1224178, -1118138, -742981, -198370, 265114, 601769, 987166, 1455259, 1863631, 2097252, 2119090, 1869141, 1269485, 325364, -750103, -1600113, -2084746, -2315187, -2366804, -2238901, -2015827, -1911362, -2038216, -2210417, -2217404, -2117492, -2185594, -2630006, -3402967, -4279143, -5040435, -5633420, -6088685, -6364733, -6415173, -6311113, -6211407, -6199154, -6239653, -6322417, -6506820, -6881974, -7506095, -8294404, -9016397, -9416775, -9432230, -9201501, -8801021, -8183365, -7434374, -6787355, -6246870, -5624439, -4821978, -3860471, -2893538, -2159655, -1763703]
17369a763703K23553M28600R51668J346217J230926O98095K7362o35586j130445
17360A376687j260868r85372m05666K59265Q16052J098655J041007P96688N24679
17351C261127K30698j48562o14197j016421j162562r72843o17959l53177k46111
17342a640007j16327J42383K85619R0210k37556l69818k33151P3883L10260K95192
17332a399312J23308m7001r977L11963O90117R70371J049714Q09845M32451J07888
17322C039367j72101l39285k74562k1909J11927p9949l24191l16008j55403L411
17312A471297J66203K37856R8002q3856Q319L56789O48736P04056N83141L95477
17302D586020J59476j03600k99166l20709j97379m5655J10432K03887O1350m34473
$$ y = [-1763703, -1540150, -1111550, -159882, 1186335, 2417261, 3115356, 3142718, 2507132, 1376687, 115819, -869553, -1275219, -1015954, -199902, 898753, 1939760, 2736448, 3261127, 3491825, 3343263, 2729066, 1712645, 550083, -422760, -1040719, -1393896, -1640007, -1756334, -1613951, -1328332, -1238122, -1475678, -1845496, -2078647, -2004764, -1694504, -1399312, -1276004, -1323005, -1332982, -1021019, -330902, 639469, 1689183, 2499028, 2931479, 3039367, 2867266, 2527981, 2253419, 2231510, 2343437, 2263488, 1939297, 1623289, 1467886, 1471297, 1637500, 1875356, 1973358, 1889502, 1897821, 2254610, 2903346, 3607402, 4190543, 4586020, 4745496, 4641896, 4342730, 4022021, 3824642, 3778987, 3889419, 4093306, 4154656, 3720183]
17292C720183j045410j267136r25063l34210O5443J1043l64332n02823r0851N73768
17282a59388J084999J195879Q37518K86097r8845k29486k65508m52337p00332
17273A498597p40524o10834m66819k89894o0681N9640J8606j323J13452K73001
17263b06779M41200O42199P78172P63625P14282P07692N99554L72126J77286O0617
17253E049974l2592j88303m37933p76928j034327r00122m02818J93822P28841
17244B199614J099223J202911R93245N24189j0892l67863m74758m44199l65072
17235D356398k29894r1061j40437m62163q49413j022188q02760l35400M8328J44062
17225F15472m3901k75313l39392k27334m7206L8645N5205J69862M12830O20283
$$ y = [3720183, 2674773, 1407637, 482574, 148364, 213807, 224850, -139482, -642305, -733156, -159388, 925611, 2121490, 2959008, 3245105, 3146260, 2916774, 2651266, 2198929, 1498597, 758073, 147239, -319580, -609474, -670155, -610515, -591909, -593232, -479780, -206779, 234421, 876620, 1654792, 2418417, 3132699, 3840391, 4439945, 4812071, 4989357, 5049974, 5017382, 4829079, 4391146, 3614218, 2579891, 1679769, 1276951, 1470773, 2199614, 3298837, 4501748, 5494993, 6019182, 6008290, 5640427, 5165669, 4721470, 4356398, 4126504, 4035443, 3895006, 3432843, 2583430, 1561242, 758482, 423082, 471410, 615472, 571571, 296258, -43134, -270468, -317674, -279029, -223824, -53962, 358868, 979151]
17215I79151M94357p4025o91912r05409o83249j52188N30108J097402J330427
17206A924662J194702Q21848L86847j6057l22257m32324k31071K16525N92992
17197D135867O13099L17537r0583m01340m53936l47593k75664l61722n72122o89415
17187A874128o32828n35485m66868m08792k96044o7965K41869M81505N28555L60977
17177A079052M7767j15997q696J23074J27347J72176L75958N63047N72817M08006
17167C344551O6275k58125k89819o9142K87925P18630J062564J192039J096543
17158G151441Q32352M96334M7437m59902p63303q43508q54370p38399m56051k03648
17148D208383j85847l35298n07999o33175m75008O4908O50191Q54379O00476J11837
$$ y = [979151, 1473508, 1399483, 707571, -197838, -881087, -1033275, -503167, 594235, 1924662, 3119364, 3941212, 4328059, 4312002, 3989745, 3557421, 3326350, 3542875, 4135867, 4748966, 5066503, 4975920, 4574580, 4120644, 3773051, 3497387, 3135665, 2563543, 1874128, 1241300, 705815, 238947, -169845, -465889, -533854, -291985, 189520, 718075, 1079052, 1126819, 1010822, 1002126, 1125200, 1252547, 1424723, 1800681, 2363728, 2936545, 3344551, 3410826, 3152701, 2862882, 2793740, 3081665, 3800295, 4862859, 6054898, 7151441, 7983793, 8480127, 8527564, 8067662, 7304359, 6460851, 5606481, 4868082, 4412031, 4208383, 4022536, 3687238, 3179239, 2546064, 2071056, 2135964, 2786155, 3640534, 4241010, 4352847]
17138D352847l07693m69218m11979k87462k29300l95338p31413r56291r53074
17129c88921p51683m69056l09867k98989l34208l98952n28109o31917n34888k89478
17119d936068M980L44582O02606P51599R50313J139062J106936R15605P88473
17110A668088P68138Q08434Q19275O87260L66604n5702k87984j26589K87398O41267
17100E576189O33782K57586r8315k60855n24258r15882j107861j089598j151068
17091A319720j374579j450729j137120n87093R334M94924O81596N93837K78611
17082a171499k35643o57393o61841k55696K75469P01305Q75181P25795L88384
17073a5938L0195k83574l50755m2418L51257N03502M09732K29966J82429L68886
$$ y = [4352847, 4045154, 3575936, 3163957, 2876495, 2647195, 2251857, 1520444, 564153, -388921, -1140604, -1609660, -1919527, -2218516, -2552724, -2951676, -3479785, -4111702, -4646590, -4936068, -4931088, -4586506, -3983900, -3232301, -2281988, -1142926, -35990, 879615, 1668088, 2436226, 3244660, 4063935, 4751195, 5117799, 5062097, 4774113, 4647524, 4934922, 5576189, 6209971, 6467557, 6369242, 6108387, 5584129, 4668247, 3560386, 2470788, 1319720, -54859, -1505588, -2642708, -3229801, -3220467, -2725543, -2043947, -1450110, -1171499, -1407142, -2064535, -2726376, -2982072, -2706603, -2005298, -1130117, -404322, -15938, 14257, -269317, -620072, -662490, -311233, 192269, 602001, 831967, 1014396, 1383282]
17063A383282N89920O56462O55841O42235N25812L77291L25295K76038K17187
17054E649363L41858M68948J01778o22561j009932q41843n12163l27618k00159
17045C047671l3282N7736L5764j0500j02713l24973n81299o79572n03550j39919
17035G65363J56249J70035j14629m95472o87246n98193l01490J21696N32981Q16163
17025C65457Q91032O47145M1681o29223q75674o46588l08150j40315j06750l0269
17015g91654P9001K4920k45914n71919p60473p36634n05556j73583N7431J20678
17005c503703K13336M60938O20142M20481j105k67209k92383j97910r4820k7081
16995b669314N9670J51774R0888j02221j52757M9642K82973K80086J3824l63312
$$ y = [1383282, 1973202, 2629664, 3285505, 3927740, 4453552, 4830843, 5156138, 5432176, 5649363, 5991221, 6460169, 6561947, 5939386, 4929454, 4087611, 3575448, 3247830, 3047671, 3014389, 3072125, 3107889, 3097389, 2994676, 2669703, 2088404, 1408832, 905282, 765363, 921612, 1091647, 977018, 481546, -205700, -803893, -1105383, -983687, -450706, 365457, 1256489, 1903634, 1945315, 1316092, 440418, -206170, -514320, -654635, -761385, -791654, -712653, -687733, -933647, -1505566, -2266039, -3002673, -3508229, -3681812, -3624381, -3503703, -3290367, -2829429, -2209287, -1788806, -1789911, -2057120, -2349503, -2547413, -2642233, -2669314, -2609644, -2457870, -2366982, -2469203, -2621960, -2572318, -2289345, -2009259, -1995435, -2358747]
16985b358747p42938q77917o05039j55409J13087J48448J94762M19353P26140
16976c138260Q30579P31665O65022O82181O75369M89981J26391j33729m5183K43887
16966A127903L87203K32905p0451l06026l79489k76758K590L09292L71220J52654
16956A551043p8950p8009M1739p1041m81521q38388q30002m60835J10630O40197
16946d95137R00290R59630J021990J020874P27698J27559m74231q08180q39760
16937B140733n80045j06773L12294M41207J97199l48348r20071j191095q44285
16928h99184J33458J070311J184686N55068j07725l96964l62362k23492m2575
16919I11221K44131M38035L69017K73695M47309P95207Q47780L68368l26194q22348
$$ y = [-2358747, -3101685, -3979602, -4584641, -4740050, -4626963, -4478515, -4283753, -3864400, -3138260, -2307681, -1576016, -910994, -228813, 446556, 936537, 1062928, 929199, 884016, 1127903, 1515106, 1748011, 1677560, 1371534, 992045, 715287, 717877, 1027169, 1398389, 1551043, 1472093, 1394084, 1435823, 1364782, 883261, 44873, -785129, -1245964, -1135334, -495137, 405153, 1364783, 2386773, 3407647, 4135345, 4262904, 3788673, 2980493, 2140733, 1560688, 1453915, 1766209, 2207416, 2404615, 2056267, 1136196, -54899, -899184, -765726, 304585, 1489271, 2044339, 1936614, 1539650, 1177288, 953796, 911221, 1155352, 1593387, 1962404, 2236099, 2683408, 3478615, 4326395, 4694763, 4368569, 3546221]
16909C546221r72379r75139j080228j115619p80242j75385J90356r5048p84450
16900b241913j159221q98251l55755O7217L48478N92312P49861P10636M52998
16891a733638O9152k95131m22601l20530k48700k94800k97960j82037q5213n1018
16881c862476O0172K55191M37051N10487L74315N679m87383q91124j067359j094210
16871e759657j031511p78010l26000J10478L06508K50582L9532j24261J8210N00179
16861f793950J003096J188984J050956Q28892O19344M15081M08141O51728Q16556
16852A88828O79833M06755J71330n8618l25404n30657n31304l53145j68347r6689
16842f17418j28899j62960j12407K5914J71585L34957M78572M13790J97688J13823
$$ y = [3546221, 2573842, 1598703, 518475, -597144, -1377386, -1552771, -1362415, -1457463, -2241913, -3401134, -4299385, -4655140, -4587923, -4239445, -3647133, -2897272, -2186636, -1733638, -1664486, -1959617, -2382218, -2702748, -2951448, -3246248, -3544208, -3726245, -3811458, -3862476, -3802304, -3547113, -3110062, -2599575, -2225260, -2219581, -2706964, -3598088, -4665447, -5759657, -6791168, -7569178, -7895178, -7784700, -7478192, -7227610, -7188078, -7312339, -7294129, -6793950, -5790854, -4601870, -3550914, -2722022, -2102678, -1687597, -1279456, -627728, 188828, 868661, 1275416, 1446746, 1388128, 1062724, 532067, 763, -352382, -520729, -617418, -746317, -909277, -1021684, -995770, -824185, -489228, -10656, 403134, 600822, 714645]
16832G14645K45323L76865K59314j62198o93663j002690r43747o89764m82576
16823b378491m16840l43866n4531L74618O53790P13359O94385P42730Q64923Q70761
16813A720838P11432O53578P71445P54120L40080l52241r88064j350855j342473
16804I17860j056667q19381p94739q22203p49532n22822j08661K86514K74331
16795c395300k44775r16972j340851j388434j115150n79580J00135N64944O07784
16786g708199L83802J15458j0955j4845l8330O5637M37113Q68935J090447J121771
16776c689166J171868J280917J233370R81481P00892L90477j3349n13315j044381
16767D98794j327977j129277n67671o4345K3290k46655n80786q21999q97632o77508
$$ y = [714645, 959968, 1336833, 1596147, 1433949, 740286, -262404, -1206151, -1895915, -2378491, -2795331, -3139197, -3193728, -2819110, -2165320, -1451961, -757576, -14846, 850077, 1720838, 2432270, 3085848, 3857293, 4611413, 4951493, 4599252, 3611188, 2260333, 917860, -138807, -958188, -1752927, -2575130, -3324662, -3847484, -3956145, -3669631, -3395300, -3640075, -4557047, -5897898, -7286332, -8401482, -8981062, -8880927, -8315983, -7708199, -7324397, -7208939, -7219894, -7234739, -7273069, -7207432, -6770319, -5901384, -4810937, -3689166, -2517298, -1236381, -3011, 978470, 1679362, 2069839, 2056490, 1543175, 498794, -829183, -1958460, -2526131, -2590476, -2567186, -2813841, -3394627, -4216626, -5114258, -5791766]
16757e791766j73347L64357P65441J007894J033078R06380P42971N70539L02602
16748b71851r6762n27045r36861j168377r47593l66822K05900N18317N84257O22829
16738b384008P48275Q46955P69950N34828K89197J62418J27180J18578J00666
16729A314039K4046j92054m78507o69599p50597o94810m83702k14398j1192N3312
16719b103462K9393P0102K91445O49174R35989R11372N97621J59222k41433m58839
16709H40584n37098o51361q67103j017455r10802n43501o5148L62360O74241Q08485
16699a906798P71863P02524O25990M28732J78695J38661K91911L66667K93704
16690A891949J75855k1636l36104o12723n81636k45529J57260M30810M14666M9264
$$ y = [-5791766, -5965113, -5600756, -4835315, -3827421, -2794343, -1887963, -1144992, -574453, -271851, -368613, -895658, -1832519, -3000896, -3948489, -4315311, -4109411, -3591094, -3006837, -2384008, -1635733, -788778, -18828, 516000, 805197, 967615, 1094795, 1213373, 1314039, 1338085, 1146031, 667524, -2075, -752672, -1447482, -1931184, -2145582, -2156774, -2103462, -2074069, -2003967, -1712522, -1063348, -127359, 784013, 1381634, 1540856, 1299423, 840584, 303486, -347875, -1214978, -2232433, -3143235, -3686736, -3751884, -3389524, -2715283, -1906798, -1134935, -432411, 193579, 622311, 801006, 939667, 1231578, 1598245, 1891949, 2067804, 2046168, 1710064, 1097341, 515705, 270176, 427436, 858246, 1272912, 1322176]
16680A322176n18983q80223p59596m00816j42184l7681j20598k49201q7523K98098
16670a576531N66776O35749N48041L08005J4859j45388q8014P3053J37222N9779
16660E33551J0349J61163M31330N01577K77694o5292l84362o05009o45045n40268
16650c24312n21719o71785p57395o04529k09875L00670O25321N84361L81863L01505
16640h95895L59073M60230N45912N99310N56005K84596j68939n34405o50624n68507
16630a3244l43545r6834j16102n16856q72825o48540J2397N40677P10296O81990
16620f62586O59887P24427O38581R6845p40317j373091j504510j232506p75893
16611d169163l03270J39450N45794Q03770Q48754O80458L57748j5540k91554l59331
$$ y = [1322176, 803193, -77030, -836626, -1237442, -1379626, -1417307, -1537905, -1787106, -1874629, -1576531, -1009755, -374006, 174035, 482040, 496899, 351511, 263497, 336550, 473772, 533551, 543900, 705063, 1136393, 1637970, 1915664, 1850372, 1466010, 861001, 215956, -324312, -846031, -1517816, -2275211, -2879740, -3089615, -2788945, -2163624, -1579263, -1197400, -895895, -536822, -76592, 469320, 1068630, 1624635, 1909231, 1740292, 1205887, 555263, -13244, -356789, -453623, -569725, -1086581, -1959406, -2607946, -2595549, -2054872, -1344576, -662586, -2699, 721728, 1360309, 1457154, 716837, -656254, -2160764, -3393270, -4169163, -4472433, -4332983, -3787189, -2983419, -2134665, -1454207, -1096459, -1111999, -1403553, -1762884]
16601a762884k68090j3789M55939R50352J202590J202859J154816J142699J088305
16592E152797R07960N48299O6510l95485p35101j009928j358867j610115j459845
16583A06225r52731l58968N8279J93468J16940N5002J44378K95095L44421R4898
16573I7007m26312p83632o83877k45764L34932Q63460J128894J047924Q00349
16564B132981O33114N10806K49718q6115k49394k33420j60189k7263J08418K2396
16554B901052m42302j076627j393219j128169n40911j29611p2877j78953l12971
16545b374588m59851n08052l13345O1316M48822P09253P23245M53804K27325K83814
16535g48257L98268M42628N67262P14787N84175J73463j63108k28442l8247L08337
$$ y = [-1762884, -2030974, -2044763, -1588824, -638472, 564118, 1766977, 2921793, 4064492, 5152797, 6060757, 6609056, 6675566, 6280081, 5544980, 4535052, 3176185, 1566070, 106225, -846506, -1205474, -1147195, -953727, -836787, -781785, -637407, -342312, 2109, 97007, -329305, -1112937, -1796814, -2042578, -1707646, -844186, 284708, 1332632, 2132981, 2766095, 3276901, 3526619, 3440504, 3191110, 2957690, 2797501, 2770238, 2878656, 2901052, 2458750, 1382123, -11096, -1139265, -1680176, -1809787, -1882664, -2061617, -2374588, -2834439, -3342491, -3655836, -3594520, -3145698, -2436445, -1713200, -1259396, -1032071, -748257, -349989, 92639, 659901, 1374688, 1958863, 2132326, 1969218, 1740776, 1702529, 2010866]
16525B010866O01087P13301N78414J89302k89010o21650p96642j019502j333881
16516C2285j486743j235526o06092J38785N95775N84240M65856O17412Q60011
16507c3997R13268Q49867Q82195J088562J225938J021434N36959l5705m85031
16498E963490o19895m58681k03148l8200J12092K99407L38222J05932l95952j030838
16488D072429j464687j457922j088999n91714o7351M34736O85574N56643K53639
16479A332348j7501k69717n14112n87423l58739J00128M64749M43000J94734N9015
16469H46482Q7629K98628P25721J041237Q46478K19719n16284j148909j496262
16460I04439j351375o51285J60356N46683N52652N11556N80716O46275O25310
$$ y = [2010866, 2611953, 3325254, 3903668, 4092970, 3803960, 3182310, 2385668, 1366166, 32285, -1454458, -2689984, -3296076, -3157291, -2561516, -1977276, -1511420, -894008, -33997, 879271, 1729138, 2611333, 3699895, 4925833, 5947267, 6484226, 6448521, 5963490, 5343595, 4884914, 4681766, 4643566, 4755658, 5055065, 5393287, 5499219, 5103267, 4072429, 2607742, 1149820, 60821, -530893, -598244, -163508, 522066, 1078709, 1332348, 1314847, 1045130, 531018, -56405, -415144, -315016, 149733, 592733, 787467, 846482, 934111, 1232739, 1958460, 2999697, 3846175, 4065894, 3549610, 2400701, 904439, -446936, -1098221, -937865, -391182, 161470, 673026, 1253742, 1900017, 2525327]
16451B525327O23739O12462L14128k94910q18427j034569j032508q51352n10925
16442d67035j95812j45658l85174o40789n42677J1243N86422O71926K40482l93972
16432a261044q54584j012304r01201n13743j202M10385O42679Q35577J114766
16423a540671J305750J206726R07305N84315K62866j42783o24366r94419j057690
16414i2967q11475m01332o8885j8106j61873k73410j11596M53573J173646J560427
16404A248002J352869P42590J04786l31126n95918q22027j016792j050561p38160
16395a106337p6441N68801Q35490O54246K72251L6652q8567l79486p60787j156288
16385a200466j622717j795349j333039n41060N9686J66664j51289m27790k85178
$$ y = [2525327, 3149066, 3761528, 4075656, 3780746, 2962319, 1927750, 895242, 43890, -467035, -662847, -808505, -1193679, -1834468, -2377145, -2365902, -1779480, -1107554, -867072, -1261044, -2115628, -3127932, -4029133, -4542876, -4544078, -4133693, -3491014, -2655437, -1540671, -234921, 971805, 1879110, 2463425, 2726291, 2583508, 1959142, 964723, -92967, -904442, -1305774, -1374659, -1392765, -1554638, -1828048, -1939644, -1486071, -312425, 1248002, 2600871, 3343461, 3448247, 3117121, 2521203, 1699176, 682384, -368177, -1106337, -1182778, -613977, 221513, 875759, 1148010, 1184662, 1096095, 716609, -44178, -1200466, -2823183, -4618532, -5951571, -6492631, -6432945, -6266281, -6417570, -6845360, -7130538]
16376g130538K21705Q84394J426891J570005J347895R55709M33097j49392n27226
16367i67460m95697j41260L61357R17392J289306J275256R37599M25008j45495
16358C456006o10270p69137n73725k06921P884l5847K7588M72474J071279J451485
16348D290816J333419O58345k25079q12884r28717o99787l45104L5127M04120
16339C710256M94575J17134m49741q19725q14479n55770l24165k32149k79143
16330H46793n73808j134101j680384j856985j546876j002627m77408Q110M34264
16321f983022P13642R23800R96951O66968q8561r57339j598410k040855k501603
16312a0868429l008096l533708l761732k643756L43108L345979M428334M083423
$$ y = [-7130538, -6908833, -6024439, -4597548, -3027543, -1679648, -723939, -290842, -440234, -967460, -1463157, -1604417, -1243060, -325668, 963638, 2238894, 3176493, 3601501, 3456006, 2845736, 2076599, 1502874, 1295953, 1303837, 1267990, 1295578, 1768052, 2839331, 4290816, 5624235, 6282580, 6057501, 5244617, 4315900, 3616113, 3271009, 3306136, 3710256, 4204831, 4321965, 3872224, 3052499, 2238020, 1682250, 1358085, 1125936, 846793, 272985, -861116, -2541500, -4398485, -5945361, -6947988, -7425396, -7417286, -6983022, -6269380, -5345580, -4348629, -3681661, -3770222, -4727561, -6325971, -8366826, -10868429, -13876525, -17410233, -21171965, -23815721, -23472613, -20126634, -15698300, -11614877]
16304a1614877L357513K569614J799724J061022L81776n0340j17372L0779Q9823
16295b492338n9962l11490n42873o53360p39602q71152q34861n62216k89492j47649
16285g504995j4186J96243M09704N22234N55473O59875R13958J152818J186714
16276a922162J044059Q75896O57453K65321k01041m79741m48804k51933j00144
16267e61096k4720l099j12228j91352p096K81689M55617O18894Q89492J130523
16257B476624J069835N73486r6874n21756o16324o33195q16076j023261r37652
16248e25193o24869l17204j43044j48561k42233k35923k0877L35035N97781N85678
16238g39410K96959j34730m75131o55655p41402o58436l19181O2200K19421R1583
$$ y = [-11614877, -8257364, -5687750, -3888026, -2827004, -2445228, -2495568, -2612940, -2582161, -2492338, -2552300, -2863790, -3406663, -4060023, -4799625, -5670777, -6505638, -7067854, -7357346, -7504995, -7519181, -7322938, -6913234, -6391000, -5835527, -5175652, -4261694, -3108876, -1922162, -878103, -2207, 655246, 920567, 719526, 239785, -209019, -460952, -561096, -585816, -588915, -701143, -892495, -899591, -617902, -162285, 456609, 1346101, 2476624, 3546459, 4119945, 4023071, 3501315, 2884991, 2251796, 1435720, 412459, -525193, -1150062, -1467266, -1610310, -1758871, -2001104, -2237027, -2257904, -1922869, -1325088, -739410, -442451, -577181, -1052312, -1707967, -2449369, -3107805, -3426986, -3364786, -3145365, -3053782]
16228c053782k22678m26108l57313j15149J95387M97369P30174Q38041Q13200
16219a100859P71498P84854Q03768P39495O78035P10734O79826M63361J08106
16210D638818l20993p36238r75115j031274j051447j016574q46233n20418k1834
16201a881308N48755R62525J065125Q50465L50338k05562m88063m70191l23779
16192D08305j56526l3917l7379n8099L0679J04143P1628j601N006O867j66161
16181A72945m48520o48170p11790o55221m35412p7521K83749N08451N14317K56174
16171a240998j86043n93214p39438n71048k14734J41936K60161Q8690j09447j82201
16161c346336j99018j71837n3770P5375J41375K30890L65434M37361L69006J95538
$$ y = [-3053782, -3276460, -3702568, -4059881, -4175030, -3979643, -3482274, -2752100, -1914059, -1100859, -329361, 455493, 1259261, 1998756, 2676791, 3387525, 4067351, 4530712, 4638818, 4317825, 3581587, 2606472, 1575198, 523751, -492823, -1339056, -1859474, -1881308, -1332553, -370028, 695097, 1545562, 1895900, 1690338, 1202275, 732084, 408305, 251779, 217862, 180483, 122384, 153063, 257206, 328834, 327233, 332239, 339106, 172945, -275575, -923745, -1635535, -2290756, -2726168, -2803689, -2519940, -2011489, -1497172, -1240998, -1427041, -2020255, -2759693, -3330741, -3545475, -3403539, -3143378, -3054688, -3164135, -3346336, -3545354, -3717191, -3770961, -3695586, -3554211, -3323321, -2957887, -2520526, -2151520, -1955982]
16151a955982L1807q8610k41099l41022l22584k23294m1419J98326M99947Q48900
16141a635030J145197J297814J209679Q80008M86917K19778J39222O6424k21098
16132C588911o15587q84971r57646q58021o76305n80526n70685m48120j74307
16123b177257K04956N92500Q13465Q00757O16977L36703J345l25137o55498j067301
16113h58490j400165j444387j266951j063868q72827n61883k15875q0216o5657
16104g830319J11958M33900P77597J141816J436543J542575J445048J243152J175026
16095A477296J338727J495377J368933P82180o3552o61562q13070o32010l52444
16086C939875k70524m18166o08619p73486p62788n72819m74264n83646p91688
$$ y = [-1955982, -1924175, -2012785, -2253884, -2594906, -2917490, -3140784, -3182203, -2983877, -2483930, -1635030, -489833, 807981, 2017660, 2897668, 3384585, 3604363, 3743585, 3810009, 3588911, 2973324, 2088353, 1130707, 272686, -403619, -984145, -1554830, -2002950, -2177257, -1972301, -1379801, -566336, 234421, 851398, 1188101, 1189446, 864309, 208811, -858490, -2258655, -3703042, -4969993, -6033861, -6906688, -7468571, -7684446, -7764662, -7830319, -7718361, -7284461, -6506864, -5365048, -3928505, -2385930, -940882, 302270, 1477296, 2816023, 4311400, 5680333, 6462513, 6398961, 5737399, 4924329, 4292319, 3939875, 3669351, 3251185, 2642566, 1869080, 1106292, 533473, 59209, -524437, -1316125]
16077a316125q85071p01815l49666k7820K72563N15029N50896M52488L59226K57208
16067h73087K07838L19754N40180O41532N00285K18642p2910l97068p18677q00239
16057d33750n54764j20897L38008O11796N93493M70360L49841J37315q5718j01822
16047A203862P9925K31728J46194k06351o31429r22095j021938r59390p40005
16038b819499l61735J7021K15243K55892K27235J31108n5880k20129k23851q303
16028b842898L31493M97514M20829L23338K36740O9849r7248j30037q2734q7546
16018a360700j55956j89383r1506J64664M67215N42877K72312j38567m63266o41100
16008a593410n55494j27414K64699K06049j49709m76143o03221n39490m69883
$$ y = [-1316125, -2201196, -2903011, -3252677, -3280497, -3007934, -2492905, -1942009, -1489521, -1130295, -873087, -665249, -345495, 194685, 836217, 1336502, 1555144, 1482234, 1085166, 366489, -433750, -988514, -1109411, -771403, -159607, 433886, 904246, 1254087, 1391402, 1305684, 1203862, 1283787, 1515515, 1661709, 1455358, 823929, -98166, -1120104, -2079494, -2819499, -3181234, -3164213, -2948970, -2693078, -2465843, -2334735, -2390615, -2610744, -2834595, -2842898, -2511405, -2013891, -1593062, -1269724, -1032984, -963135, -1060383, -1190420, -1273154, -1360700, -1516656, -1706039, -1797545, -1632881, -1165666, -622789, -350477, -489044, -952310, -1593410, -2148904, -2276318, -2011619, -1805570, -1955279, -2431422, -3034643, -3574133, -4044016]
15999d044016m50618j89582L68241P81332Q36840P70384P24590O18376M47117
15990a37336K26824l0457k69968n49772p91675p36018m77919k95447j91679p8369
15980c331816N9632K42472L61133K37898j02410m21714n73572n90651m02987L7861
15970d484154M40210N19196L95540L15181K56560Q1156j36448k42938k09064j02171
15960c166932o4137o5490R3039L95542O87600R01627R29520P42236M31100J04548
15950I88653q9112j29986n2913M3693k675k10652m70534n67941m56337l54138
15940a301942l57587l37453j66739P1626J42744J2371j59604k80551k55835l3973
15930b666943K65639N58328Q58448J106042J192596R66917M75786J9315j73341
$$ y = [-4044016, -4494634, -4684216, -4315975, -3534643, -2697803, -1927419, -1202829, -584453, -137336, 89488, 59031, -210937, -760709, -1552384, -2288402, -2766321, -3061768, -3253447, -3331816, -3272184, -3029712, -2668579, -2430681, -2533091, -2954805, -3528377, -4119028, -4522015, -4484154, -4043944, -3524748, -3129208, -2814027, -2557467, -2476311, -2612759, -2855697, -3064761, -3166932, -3231069, -3296559, -3203520, -2807978, -2120378, -1218751, -289231, 453005, 884105, 988653, 899541, 769555, 716642, 760335, 757660, 547008, 76474, -491467, -947804, -1301942, -1659529, -1996982, -2163721, -2092095, -1949351, -1936980, -2096584, -2377135, -2632970, -2666943, -2401304, -1842976, -984528, 121514, 1314110, 2281027, 2756813, 2776128, 2602787]
15921B602787k20491l04999k84919j23639r7253k92501m29021l97469n03837r00544
15911i51886j159638r51472m97754k7265L91230O65984P61288O41456K74060j53841
15901a007838m06997l98511j05692L69904P84405J063248J331886J554226J520813
15892D705444J175403O39514Q8942k89154m49793n14946m78111k09841J26215
15883D793673L59717N35006N26453K76882l9376j78087L5472M24118N47176J72411
15873G453445m47737q93692j042565j001094q28152o15832n16193n46963n61036
15864A000181l43532R7529L85879K85304m7627l93659o08137n41840j40378M03048
15854I6768P30899Q02343Q30295Q27262O67618J67569p27572j606465j909092
$$ y = [2602787, 2382296, 2077297, 1792378, 1668739, 1571486, 1278985, 849964, 452495, -51342, -951886, -2111524, -3062996, -3560750, -3588015, -3196785, -2530801, -1769513, -1128057, -853997, -1007838, -1414835, -1813346, -1919038, -1549134, -764729, 298519, 1630405, 3184631, 4705444, 5880847, 6520361, 6609303, 6320149, 5870356, 5355410, 4877299, 4667458, 4793673, 5153390, 5688396, 6214849, 6491731, 6452355, 6274268, 6309740, 6733858, 7281034, 7453445, 7005708, 6112016, 5069451, 4068357, 3240205, 2624373, 2108180, 1561217, 1000181, 656649, 754178, 1140057, 1425361, 1377734, 984075, 375938, -165902, -306280, 96768, 827667, 1630010, 2460305, 3287567, 3955185, 4122754, 3395182, 1788717, -120375]
15845a20375j598679j052338n04734L7610M98791O78841O03328M61219K57285
15836g39052l4170k71141l17362k08089p534J94172K64098J91789R2899J114j54279
15825i87555k94194j79204J60216K96261N2443l65979p25050q75967q44242o62136
15815d425407k50160L08398P22802R79684J231442J385152J236428P33201J62765
15806B084305k06064m83442p28193p87281o47892l77107J4485L57224L98336K07816
15796a67813Q0608R4850J44057K36093N01057P96531P77936L63359j64594m58543
15786B203541m91335n21992n90990o10508n86632n85545p76917j148333j323464
15777d432175j029930n41757j96695K2260Q6321j25482l90609l14964J7910J96584
$$ y = [-120375, -1719054, -2771392, -3276126, -3238516, -2739725, -2060884, -1457556, -996337, -739052, -773222, -1044363, -1361725, -1569814, -1577348, -1383176, -1119078, -927289, -834390, -833276, -987555, -1281749, -1460953, -1300737, -1004476, -952033, -1318012, -2043062, -2919029, -3763271, -4425407, -4675567, -4367169, -3644367, -2664683, -1433241, -48089, 1188339, 1921540, 2084305, 1878241, 1394799, 666606, -120675, -768567, -1145674, -1131189, -773965, -375629, -167813, -87205, 7645, 151702, 387795, 888852, 1685383, 2463319, 2826678, 2662084, 2203541, 1712206, 1190214, 599224, -11284, -597916, -1183461, -1960378, -3108711, -4432175, -5462105, -6003862, -6200557, -6178297, -6091976, -6217458, -6608067, -6923031, -6905121, -6708537]
15767f708537K28809L48275N73111Q52081R67563O59318Q8350k70729k45336l2214
15757c539309K37502N52386P72712P94549P48984P36709P28685N79104K54088
15748A865410J5453j7222m7539j58367j78958Q76K58518L90714L86266L47849
15738B863000K78319J26050k31599p91993j246907j185536o32394n6061L07091
15729e70030N61526P00835N84882K20043j22102j99521m182K76770M17453K84322
15719B149996m5842k58750k04070m4776M8311Q4076O1550q1777j79508M5571M88215
15708B062996P55531O65880L14538q3746l42045l88938l04322k46661l06208m57405
15698A669620o12892p28702q60748r77516q40955l67208J02313K83813L72559
$$ y = [-6708537, -6479728, -6131453, -5558342, -4706261, -3738698, -3079380, -2991030, -3261759, -3507095, -3539309, -3301807, -2749421, -1976709, -1182160, -433176, 303533, 1032218, 1611322, 1865410, 1880863, 1863641, 1816102, 1657735, 1478777, 1479653, 1738171, 2128885, 2515151, 2863000, 3141319, 3267369, 3035770, 2243777, 996870, -188666, -821060, -877121, -570030, -8504, 692331, 1277213, 1497256, 1375154, 1175633, 1171451, 1448221, 1865674, 2149996, 2104154, 1845404, 1641334, 1596558, 1644869, 1728945, 1790495, 1708718, 1529210, 1574781, 2062996, 2818527, 3484407, 3798945, 3715199, 3373154, 2984216, 2679894, 2433233, 2127025, 1669620, 1056728, 328026, -532722, -1510238, -2351193, -2718401, -2616088, -2332275, -1959716]
15689a959716N46498P14545Q27118R20530J045440J067735P28313N6147o06972
15680C339638r51157q63888m25820R5085M11584M18779K16057m8730j29073J02669
15670B165144L95795M81250L96812K69539J48237P6829J5462j77655m63061m88683
15660B819669j19777J72251J06915j25140m24737o41316n16629j20700J86055
15651A336591J79220o0529l67789o05845o12734l99477j64743O5799L62008N95828
15641C28329P41603Q82315R81902R00523N96761J46640m38295j097526j534368
15632A507884j490487j053343n29042k24903j88750k13530j55080o6177q7303
15623b500731k84952n74907p23578m39282K01818P45743R45735R23926Q89520
$$ y = [-1959716, -1413218, -698673, 128445, 1048975, 2094415, 3162150, 3890463, 3946610, 3339638, 2388481, 1524593, 1098773, 1193858, 1605442, 2024221, 2240278, 2191548, 2062475, 2165144, 2560939, 3042189, 3439001, 3708540, 3856777, 3933606, 3949068, 3771413, 3308352, 2819669, 2699892, 2872143, 2979058, 2853918, 2429181, 1787865, 1271236, 1150536, 1336591, 1515811, 1455282, 1087493, 481648, -131086, -530563, -695306, -629507, -267499, 328329, 1069932, 1952247, 2934149, 3834672, 4431433, 4578073, 4139778, 3042252, 1507884, 17397, -1035946, -1564988, -1789891, -1978641, -2192171, -2347251, -2413428, -2500731, -2785683, -3360590, -4084168, -4523450, -4321632, -3575889, -2630154, -1706228, -816708]
15614h16708R07333Q46772O08218K55357k2570j16432j48696j35666O782K86726
15604A671116N72757O48506M19625j22120p74200j208955j250434q93911l97099
15595a334715p5929J363q6569j91555k12157j86483j19603P140J65029L90414
15585a643065O92797Q79254P36010K53301l92748q70920q63162m39718Q9838M63884
15575a094529N33413L62714J44526K8872q3502l34380n88420o31538m24770j33139
15565b220753O3618J60425L07106M89350M83875L14565K52969L54789L93878K47424
15555H47246O5552M382K1046l1700j95714m15337n99945p12453p19023n23664
15545b259610j59777J85095K50159l1455l70597n19136m49263j97107J44285L75023
$$ y = [-816708, 90625, 937397, 1545615, 1800972, 1778402, 1661970, 1513274, 1377608, 1384390, 1671116, 2243873, 2892379, 3312004, 3189884, 2415684, 1206729, -43705, -937616, -1334715, -1410644, -1409281, -1495850, -1687405, -1899562, -2086045, -2205648, -2198508, -2033479, -1643065, -950268, -71014, 664996, 918297, 525549, -345371, -1208533, -1648251, -1558413, -1094529, -561116, -198402, -53876, -25004, -108506, -442886, -1031306, -1662844, -2087614, -2220753, -2157135, -1996710, -1689604, -1200254, -716379, -401814, -148845, 205944, 599822, 847246, 912798, 917180, 938226, 906526, 710812, 295475, -304470, -1016923, -1735946, -2259610, -2419387, -2234292, -1984133, -2015588, -2386185, -2905321, -3354584, -3551691, -3407406, -3032383]
15535c032383L87986K88278J09929j69133m05607m24222k93135j43616N2932M02620
15525c226351P50208O80477J67197l40275m04809j18499k4354l42498p14821p23864
15515d297589l22701K31010N29177M20939J70683o1897k80674m09642k97653N0203
15505d268144M20802P12861Q77508Q13789N69247K72014o0942m31755o26070m19008
15495b139698J1689L53594O86602J079673J295964J278642J163308R82131N87403
15486E299308k5863o35325j162850j562892j703767j600652j359235j025324n59296
15477d335896n1008L27660M92903M89600M21169K35925r0679k81841j22162J54521
15467b759808K51347J70833J42759L17161N47699O20682N68659M91497L64130
$$ y = [-3032383, -2644397, -2356119, -2246190, -2415323, -2820930, -3245152, -3538287, -3681903, -3628971, -3226351, -2476143, -1795666, -1628469, -1968744, -2373553, -2492052, -2516406, -2858904, -3573725, -4297589, -4620290, -4389280, -3860103, -3439164, -3268481, -3330378, -3611052, -4020694, -4318347, -4268144, -3847342, -3134481, -2256973, -1443184, -873937, -601923, -662865, -1094620, -1720690, -2139698, -2128009, -1774415, -1087813, -8140, 1287824, 2566466, 3729774, 4711905, 5299308, 5273445, 4638120, 3475270, 1912378, 208611, -1392041, -2751276, -3776600, -4335896, -4386904, -4059244, -3566341, -3076741, -2655572, -2419647, -2510326, -2792167, -2914329, -2759808, -2508461, -2337628, -2194869, -1877708, -1330009, -709327, -140668, 350829, 714959]
15458G14959J80823p680k37279m45526l45195N3571L98940M41635J48568l82587
15448E20229q55753r04461n00902J8239K42712J00936n4229M1341K87968M45027
15438f58893L90404L031n75984r26223q42992m05414K25509Q47200J159630J000422
15428B16690M85647k6543j72379J3074J92231J98719J46449J01363j56273p60397
15418B38581j438601j750476j493283q69199k14020K76798M86838M49494M14882
15409c898986N55095Q10341Q86175N72560J0326n67023q86927q27631o06415l08053
15399d260538J70184O74038J009828J190374J239939J206683J127707R17849O07143
15390C883207L47674J12283k74596p79433j094142j055293q94850q54652p61702
$$ y = [714959, 895782, 888102, 650823, 205297, -139898, -86327, 312613, 754248, 902816, 520229, -335524, -1239985, -1740887, -1722648, -1479936, -1379000, -1433229, -1391888, -1103920, -658893, -268489, -265458, -841442, -1767665, -2610657, -3016071, -2790562, -1943362, -783732, 216690, 702337, 675794, 503415, 516489, 708720, 907439, 1053888, 1155251, 998978, 238581, -1200020, -2950496, -4443779, -5312978, -5526998, -5250200, -4763362, -4313868, -3898986, -3343891, -2533550, -1647375, -1074815, -1064489, -1631512, -2518439, -3346070, -3952485, -4260538, -4090354, -3416316, -2406488, -1216114, 23825, 1230508, 2358215, 3276064, 3883207, 4230881, 4343164, 4068568, 3289135, 2194993, 1139700, 244850, -609802, -1371504]
15381a371504m26692k0761K80328N19775P60272R50836J014384R21197N79420
15372C207255o2510p50894j093158r49964n55092j64367J81522M86293O32740
15363I31825N58216L86872K62167J73227P8709Q8748J18740r2855m75686p76352
15353A253611r57264j023718p92005k18730K87345M29928M87732P12941Q92055
15344A071895Q19735N52702K64008J10282J22901J26550k9842j99851j68362J8082
15334B688100J11782l873k55388n11650o68147p33782o76807m83520k67336M1369
15324g59252M39438O66839O49080M85969K47994J00479J05468P1354p6738j56340
15314A774291j96240m23873o87376n75239n9912N12339P78401M96261n3584k21244
$$ y = [-1371504, -1798196, -1818957, -1538629, -1018854, -258582, 692254, 1706638, 2627835, 3207255, 3144745, 2393851, 1300693, 350729, -204363, -368730, -187208, 299085, 931825, 1490041, 1876913, 2139080, 2312307, 2391016, 2479764, 2598504, 2505649, 2029963, 1253611, 296347, -727371, -1519376, -1738106, -1450761, -1020833, -533101, 179840, 1071895, 1891630, 2444332, 2708340, 2818622, 2941523, 3068073, 3038231, 2838380, 2670018, 2688100, 2799882, 2796009, 2540621, 2028971, 1360824, 627042, -49765, -533285, -800621, -759252, -319814, 347025, 996105, 1482074, 1730068, 1830547, 1936015, 2007369, 1930631, 1774291, 1578051, 1154178, 466802, -108437, -168349, 343990, 1122391, 1618652, 1565068, 1343824]
15304A343824J28911N88331Q21738P20710L13048j54487l89074k95564n4991R0895
15294C113341Q8358M2479N0536J11235K55573M45671N41396M70851K74170K4811
15284E418421k33683m31483m32087k80322k27196l50359m78578m69158k95985
15275B219570K161K35464K93606L40553N59926Q60862R70685R46461J021939J039811
15265H491038O63132k9148o02975q78363q74979o13441l48709l62730n89520q24508
15255D029797r44660q24542m07381J35574N10707N57347L87465K46014K19601
15246C909922K33918K96477M15410M15080K41949J21730J27202P8095j24427l83702
15236E331654n17998m91978m43974m69052n12827m56390l34670k82655k14944
$$ y = [1343824, 1472735, 2061066, 2882804, 3603514, 3916562, 3762075, 3373001, 3077437, 3022446, 3113341, 3201699, 3244178, 3294714, 3405949, 3661522, 4107193, 4648589, 5119440, 5393610, 5418421, 5184738, 4753255, 4321168, 4040846, 3813650, 3463291, 2984713, 2515555, 2219570, 2221731, 2457195, 2750801, 3091354, 3651280, 4512142, 5482827, 6429288, 7451227, 8491038, 9154170, 9125022, 8522047, 7643684, 6768705, 6155264, 5806555, 5443825, 4854305, 4029797, 3085137, 2260595, 1853214, 1988788, 2499495, 3056842, 3444307, 3690321, 3909922, 4143840, 4440317, 4855727, 5270807, 5512756, 5634486, 5761688, 5839783, 5715356, 5331654, 4813656, 4321678, 3877704, 3408652, 2895825, 2439435, 2104765, 1822110, 1607166]
15227A607166O3558N10421Q01595P73634N61911L92591L95429N48445P04688N76543
15217F935981O7891n72270j001329j044575p07045j97373J90445L17141K28344
15208D217210J19139J28018J88857J95659J86738J95952J49601M2128j18981m42124
15198D862197q51842j045530r13425o42837l77954k2485L57536M59886K22211
15189B047757q1171j83335k0481L56951P17031Q00325N62289J65888j08167p9586
15179D177501K34381O46181R06957R56681Q23797O04638M86944M20400K10196
15170I467676j72006m82447n12855l51353j70480O663J67427K56306L50200L83454
15160H942585K50775R1820P2801K38890L50455J41517l23985p97064r64253o52258
$$ y = [1607166, 1670724, 2181145, 2982740, 3756374, 4318285, 4710876, 5106305, 5654750, 6359438, 6935981, 7003872, 6431602, 5430273, 4385698, 3678653, 3481280, 3671725, 3988866, 4217210, 4336349, 4464367, 4653224, 4848883, 5035621, 5231573, 5381174, 5423302, 5304321, 4862197, 4010355, 2964825, 2051400, 1408563, 1030609, 1008124, 1365660, 1825546, 2047757, 1966586, 1783251, 1762770, 2119721, 2836752, 3637077, 4199366, 4365254, 4257087, 4177501, 4411882, 5058063, 5965020, 6921701, 7745498, 8350136, 8837080, 9257480, 9467676, 9295670, 8813223, 8300368, 7949015, 7778535, 7785198, 7952625, 8208931, 8559131, 8942585, 9193360, 9285180, 9357981, 9596871, 9947326, 10088843, 9764858, 8967794, 8003541, 7351283]
15150G351283o577P28451J329170J551626J365055J074166Q46659N03309J1873
15141A4755015m54317o68995m89910j04776J53556J45373j1105j16684o5575J53826
15131A3296408L92534M73628N09961O57922Q45587R72739J070055J112578J009810
15122B0341222P23854K52121k80346o05519o04319m22263l79222n64386p30622
15113A7730520p33328o08540l25086J76384O87930R14606R71118J070661J119295
15104B1003560J016798Q41601O84019N75484N45506O52353R55914J360512J609000
15095B9244747J518027J221632J102209J355370J873150K371950K632563K742757
15087D4062405K889106L151122L584591M323683N396560O697383Q183076R659473
$$ y = [7351283, 7344706, 8073157, 9402327, 10953953, 12319008, 13393174, 14239833, 14743142, 14755015, 14300698, 13631703, 13141793, 13037017, 13190573, 13335946, 13324841, 13208157, 13142582, 13296408, 13688942, 14162570, 14672531, 15330453, 16176040, 17148779, 18218834, 19331412, 20341222, 21065076, 21317197, 21036851, 20431332, 19827013, 19404750, 19025528, 18461142, 17730520, 16997192, 16388652, 16063566, 16239950, 16927880, 17842486, 18813604, 19884265, 21003560, 22020358, 22861959, 23545978, 24121462, 24666968, 25319321, 26275235, 27635747, 29244747, 30762774, 31984406, 33086615, 34441985, 36315135, 38687085, 41319648, 44062405, 46951511, 50102633, 53687224, 58010907, 63407467, 70104850, 78287926, 87947399]
15079H7947399J0708777J0972975J0247424Q486667N920563L168050R24383m15231
15071A37961007r30677j121319j408300j740571j791578j270305j85909J200298
15063A30712646K696229M252883N826447P303715Q603391R613496J0183904J0284480
15055A89477191J0192867J0435432J1168520J1771417J1416874R625755O147715
15048B60235771J407170l249565o522586p953520p845242o549302m096178n28747
15040B24897801L830082Q502150J3101760J7073325J9708790K0643549J9926017
15033C27683474J7811076J4962325J2286296J0469089R773043R826740R619364
15026D12431407P918681M190197o15348m644211o700045p023544o286159m348564
$$ y = [87947399, 98656176, 109629151, 119876575, 128363242, 134283805, 137451855, 138376238, 137961007, 137030330, 135909011, 134500711, 132760140, 130968562, 129698257, 129512348, 130712646, 133408875, 137661758, 143488205, 150791920, 159395311, 169008807, 179192711, 189477191, 199670058, 210105490, 221274010, 233045427, 244462301, 254088056, 260235771, 261642941, 258393376, 251870790, 243917270, 236072028, 229522726, 225426548, 224897801, 228727883, 237230033, 250331793, 267405118, 287113908, 307757457, 327683474, 345494550, 360456875, 372743171, 383212260, 392985303, 402812043, 412431407, 420350088, 424540285, 423924937, 419280726, 412580681, 405557137, 399270978, 394922414]
15018C94922414n09028N344820J2417224J9111933K2817521K0654469J1038689
15011D85798042n022191k3003183l6806695m3188659m3043430l9136763l3776605
15004B61820516k8128351k2687908j7828549j3956183j1373099j0011672r394536
14997A48440218r001778q515205p909825p260693o637290o315889o289482o067771
14989I0442285n306964m176132l106685k270648j661744j331992j160792q70391
14981G0556937l43331J88681M93372O32836O92725O44731M10053m9051o69979
14972G2556974j351812j878143j966544j602330j086870o40292k81336k61409
14964F3488238q95782j932552k775791l090545l006710k725472k256422j764658
$$ y = [394922414, 394413386, 399758206, 412175430, 431287363, 454104884, 474759353, 485798042, 480775851, 457772668, 420965973, 377777314, 334733884, 295597121, 261820516, 233692165, 211004257, 193175708, 179219525, 167846426, 157834754, 148440218, 139438440, 130923235, 123013410, 115752717, 109115427, 102799538, 96510056, 90442285, 85135321, 80959189, 77852504, 75581856, 73920112, 72588120, 71427328, 70556937, 70213606, 70402287, 70895659, 71528495, 72221220, 72865951, 73276004, 73226953, 72556974, 71205162, 69327019, 67360475, 65758145, 64671275, 64030983, 63749647, 63488238, 62592456, 60659904, 57884113, 54793568, 51786858, 49061386, 46804964, 45040306]
14956D5040306j487019j450555j590900j807227j793942j298416m71440K52645
14948C5393452M61958R4121n49770j130005j519247j762558j903368j964089j997436
14939B5123058j840607j277493n07308K11421P19933Q71386O90844L98065J30532
14930B4519831k81445q97753j470595j820648j906671j632372j057897m49609
14922A5002841k2794L0708l57334r72039j491255j642498j337973p83416k71378
14913H154862J65022O07890Q58982Q31762P09829O80190Q43625J060381J099411
14904A5011954Q96024N09135R1498l03657p42335j140472j419087j514069j378408
14895A0010583j112059q38894m41203J69022O83225Q44304P74035N76522K73346
$$ y = [45040306, 43553287, 42102732, 40511832, 38704605, 36910663, 35612247, 35140807, 35393452, 35855410, 35949531, 35399761, 34269756, 32750509, 30987951, 29084583, 27120494, 25123058, 23282451, 22004958, 21497650, 21709071, 22429004, 23300390, 23991234, 24389299, 24519831, 24238386, 23340633, 21870038, 20049390, 18142719, 16510347, 15452450, 15002841, 14980047, 15010755, 14653421, 13681382, 12190127, 10547629, 9209656, 8426240, 8154862, 8319884, 8927774, 9786756, 10618518, 11328347, 12008537, 12852162, 13912543, 15011954, 15907978, 16417113, 16508611, 16204954, 15462619, 14322147, 12903060, 11388991, 10010583, 8898524, 8059630, 7618427, 7787449, 8470674, 9314978, 10089013, 10665535, 10938881]
14886A0938881j44673o81328j011496q00025k92358j7835j08066l35368m59924
14877G087808l95439l41041m73224p26082r12537q54540n79345l02326j50690
14868B352584p4143j0743R6799J99813J11035j25886k82421k38558p88K63080
14858B290772L06245J80779J89985M54680Q94751J244538J150785O17237O1852
14849G391624j35566J9935K82935M71960N56087N51038M32626J42592j76869l71581
14839I164781m48331m56248n15433o10144n12581j58401J78737K39826J19281
14830G001487O4152J69092L19858L12433Q7794j92571l14631k95035k89193l68481
14820F494905m09387m12547n27988o69506o93668n76730l81063k25037j23620
$$ y = [10938881, 10794208, 10112880, 9101384, 8301359, 8009001, 7991166, 7883100, 7547732, 7087808, 6692369, 6351328, 5878104, 5152022, 4239485, 3384945, 2805600, 2503274, 2352584, 2278441, 2267698, 2364497, 2564310, 2675345, 2549459, 2267038, 2028480, 2027692, 2290772, 2597017, 2777796, 2967781, 3422461, 4317212, 5561750, 6712535, 7329772, 7391624, 7256058, 7275993, 7558928, 8030888, 8586975, 9138013, 9570639, 9713231, 9536362, 9164781, 8716450, 8260202, 7744769, 7134625, 6622044, 6463643, 6642380, 6882206, 7001487, 7065639, 7234731, 7554589, 7867022, 7954816, 7762245, 7447614, 7152579, 6863386, 6494905, 6085518, 5672971, 5144983, 4475477, 3781809, 3205079, 2824016, 2598979, 2475359]
14811B475359J1385J85414L05967K74377r62n62051j081644j205514r64327m80188
14801a042184L3441K51022J32820R588J04756L28691N67291P05524N17522P2654
14791A681125k87909m02210l81690l69334k45858K1717K07612K96380M27941O28468
14781A576242P87132O76510K86069o9639j45955J293R0971o1406l54292o63911
14771B123014q62747p85913n37714l70333k37812J23620O63717J021043R81994
14762B118869N70568j03190o72808o97389j71142N28023R64443Q20112K04183
14753C561669l25320l75567k16606k30781k80250k2421N38436Q86735O06960q77
14743D141978l06149k20023j45750k27593k86926l64106o10573q51085p84858
$$ y = [2475359, 2486744, 2672158, 2978125, 3252502, 3251540, 2689489, 1607845, 402331, -561996, -1042184, -1008743, -757721, -624901, -615313, -510557, -181866, 385425, 1090949, 1608471, 1681125, 1393216, 991006, 609316, 239982, -5876, 15841, 223453, 519833, 947774, 1576242, 2363374, 3039884, 3325953, 3256314, 3110359, 3111652, 3202623, 3141217, 2786925, 2123014, 1260267, 474354, -63360, -433693, -671505, -547885, 115832, 1136875, 2118869, 2689437, 2586247, 1913439, 1216050, 1044908, 1572931, 2537374, 3357486, 3561669, 3236349, 2860782, 2644176, 2413395, 2133145, 2110724, 2649160, 3535895, 4142855, 4141978, 3835829, 3615806, 3470056, 3242463, 2955537, 2591431, 1980858, 1129773, 344915]
14734C44915l94762J5097J23221j11399m52089n77816m42114l47679m64007o19002
14724b925635o17108m54999k19983l4503O6680J33867J13590r1387l70596m05939
14714d806013n2757M64347P88287P92615N97399M12724L76265M32791N46497O64978
14704B17133O64531N41879L38474R4209r218J71316M12809K90842k09296o22489
14694A890190p67540p28346n38645l20143j23321J75068O83929J237950J508259
14685C017401J384484R68150M00007j10130m54932p08632r39439j149040j263053
14676A144816j142954p49111k80188L6180J35035P0257j01450l83348p16519r02401
14666b889683p15182j50150M61335Q79284J123156J055422O80327L76616L20054
$$ y = [344915, -49847, -34750, 88471, -22928, -475017, -1052833, -1494947, -1842626, -2306633, -2925635, -3542743, -3997742, -4217725, -4252228, -4185548, -4051681, -3938091, -4029478, -4400074, -4806013, -4858770, -4394423, -3606136, -2813521, -2216122, -1803398, -1427133, -994342, -447845, 217133, 881664, 1423543, 1762017, 1856226, 1847008, 2018324, 2431133, 2721975, 2512679, 1890190, 1122650, 394304, -144341, -464484, -587805, -412737, 271192, 1509142, 3017401, 4401885, 5370035, 5770042, 5659912, 5204980, 4496348, 3556909, 2407869, 1144816, 1862, -747249, -1027437, -991257, -856222, -785965, -887415, -1270763, -1987282, -2889683, -3604865, -3755015, -3293680, -2414396, -1291240, -235818, 444509, 821125, 1141179]
14657A141179L92150L88538J96776j06231l97585n05157l87193l18019m97090
14648i2632o79515n66391j91943J42016K22646K42518M57132P97745R22044O44702
14638A898322K21903m6458j46377j54641q7627l2975j24759l89863o78334q41220
14628c82029q23340o16768m38015m83859m79734q2004O35730J301338J579969
14619B11288J359557Q79768M65092K06209L9933j45375l47211n34176o77162o42831
14609H15092n23145n62008o39832n91872n94897o98007o37533l34651J07027N11516
14599c148310O15305M08262J41583p1019l25267o58829r34003j024054q79341
14590e875673n94467l45878j06128J95779L86086K92644l0945l58580l52032K6561
$$ y = [1141179, 1533329, 1921867, 2118643, 2012412, 1614827, 1109670, 722477, 404458, -92632, -772147, -1338538, -1530481, -1388465, -1165819, -923301, -466169, 331576, 1253620, 1898322, 2120225, 2073767, 1927390, 1772749, 1685122, 1652147, 1527388, 1137525, 459191, -382029, -1205369, -1822137, -2260152, -2744011, -3223745, -3305749, -2670019, -1368681, 211288, 1570845, 2450613, 2915705, 3121914, 3161847, 3016472, 2669261, 2135085, 1457923, 815092, 291947, -270061, -909893, -1501765, -2096662, -2794669, -3432202, -3766853, -3659826, -3148310, -2533005, -2124743, -1983160, -2054179, -2379446, -3038275, -3972278, -4996332, -5875673, -6470140, -6816018, -6922146, -6726367, -6340281, -6047637, -6078582, -6437162, -6789194, -6762633]
14580f762633K75022R0568k15530l20346j89917J18856N64777J002879J341069
14571d095255J570475J531136J093138M49392j09173o07046j167978j542122j510468
14562d387901j258699r79278o76262k86959J65307N03835O23041O45714P06912
14553d944290P71993Q37699R16358P74083K42701m56344r80356j158430r86651
14544d983237n56243KN81715J088947J340524J221589Q36151M60856K94158L05789
14534E90251L29207K41746R6791M6554J17513J18126j04178k88343j43658P4043
14524A078052J0589l06289o86584r12718p74194l93521o0872K41145N46055O65749
14514e92588M95295R3287k93342m05372l27579k96441l29150l73345m57646m82303
$$ y = [-6762633, -6487611, -6397043, -6612573, -6932919, -7122836, -7003980, -6439203, -5436324, -4095255, -2524780, -993644, 99494, 548886, 439713, -167333, -1335311, -2877433, -4387901, -5646600, -6625878, -7302140, -7589099, -7423792, -6919957, -6296916, -5651202, -4944290, -4172297, -3334598, -2418240, -1644157, -1401456, -1857800, -2838156, -3996586, -4983237, -5539480, -5539478, -4957763, -3868816, -2528292, -1306703, -470552, -9696, 284462, 590251, 919458, 1161204, 1257995, 1304549, 1422062, 1540188, 1436010, 1147667, 1004009, 1078052, 1088641, 782352, 95768, -816950, -1591144, -1984665, -2045537, -1804392, -1258337, -592588, -97293, -4006, -297348, -702720, -1030299, -1326740, -1655890, -2029235, -2486881, -2969184]
14504b969184l19764o1473K54592N87459P00537N34172M03265N20667O74928N66527
14494H91726J71691k84735n97060o75597m96996j28740J90468K83567K98291M39778
14484I2393N64839M49526Q0965m10781p84518q08119n25853j86190J0960J2449
14474a504329j17473k62582m05303o23587q67784q49679l84257J82706M13975
14465d418313L35594K39175L05414M93765O89276O84974L30036j59173m74729
14456a973981n83429o12430n59339l71095o8299L39797O56375O30412K63029k79639
14446b558599p01774o95539k60485K60542N39938N49363M19764L11344L71694
14437a763752N79074P02534N56772K53936M2884P8212K25268J93401M5462k0596
$$ y = [-2969184, -3288948, -3350421, -3095829, -2508370, -1807833, -1273661, -870396, -349729, 325199, 891726, 1063417, 778682, 181622, -493975, -990971, -1119711, -929243, -645676, -347385, 92393, 657232, 1106758, 1187723, 776942, -7576, -815695, -1341548, -1527738, -1516778, -1504329, -1621802, -1884384, -2289687, -2913274, -3781058, -4630737, -5014994, -4832288, -4418313, -4082719, -3843544, -3538130, -3044365, -2355089, -1670115, -1340079, -1499252, -1973981, -2557410, -3169840, -3729179, -4100274, -4168573, -3828776, -3172401, -2541989, -2278960, -2558599, -3260373, -3955912, -4216397, -3955855, -3415917, -2866554, -2446790, -2135446, -1763752, -1184678, -482144, 74628, 328564, 371448, 449660, 674928, 868329, 913791, 893195]
14427H93195k9799m6478n6290n2154k08015n61829p55208o67942n54843n15554
14417b554917l63591m8859K19341M73368Q71073J239353J299323J093995Q86950
14408C116036R17635J190218J449804J492255J305802R75010O70427L96328P7652
14399A1591167k53767m98016l66479J58398N76559N05131P429o04054j025073
14390A0091295j186918j151437r22515n94864l07672j16023m4729p4862k8083
14381E664192J49880K56063J30235j76534l09644K8547P89830J635564K047851
14372A0215984J721282R83547M97594L95174M24315L74430J71438O6065J68213
14363A5018042J91567o8149m15701n71009n42740m66385k59422J06411L89470
$$ y = [893195, 863396, 816918, 760628, 708474, 500459, -61370, -816578, -1484520, -2039363, -2554917, -2918508, -2967367, -2748026, -2274658, -1403585, -164232, 1135091, 2229086, 3116036, 4033671, 5223889, 6673693, 8165948, 9471750, 10446760, 11117187, 11513515, 11591167, 11337400, 10839384, 10472905, 10631303, 11207862, 11712993, 11720422, 11116368, 10091295, 8904377, 7752940, 6830425, 6235561, 5927889, 5811866, 5767137, 5692275, 5664192, 5814072, 6070135, 6200370, 6023836, 5714192, 5742739, 6532569, 8168133, 10215984, 11937266, 12920813, 13418407, 13813581, 14237896, 14612326, 14783764, 14849829, 15018042, 15209609, 15141460, 14725759, 14154750, 13612010, 13145625, 12886203, 12992614, 13382084]
14354A3382084M00958K30850O3475m8662j32490k09569k60804k54605r8461L39511
14344A3412287Q86816J116331Q78989M08721J92230M28821O65673N39529K59426
14335A8788823J37138K26256L92487M63211M57655M77511M37976L40990M01693
14326B2123740P14545J057821J133937P97248J76072l48324m99603l42704o7437
14317B4745295J73600J71280j15633m22289o67421r00891r22106o26091k52695
14308B1183049o2731j13050l78343p65610j098946j280773j357814j337300j000114
14299A3788368l86282R3796L24418L40263J14193k46703n46686p35719q95421
14290A1850227r71589r00726q43638q16935o59419l22806J28653M76359N15287
$$ y = [13382084, 13783042, 14013892, 14077367, 14028705, 13896215, 13686646, 13425842, 13171237, 13072776, 13412287, 14299103, 15415434, 16294423, 16703144, 16895374, 17324195, 17989868, 18529397, 18788823, 18925961, 19152217, 19544704, 20007915, 20465570, 20943081, 21381057, 21722047, 22123740, 22838285, 23896106, 25030043, 25827291, 26003363, 25655039, 25155436, 24812732, 24745295, 24918895, 25090175, 24974542, 24552253, 23884832, 22983941, 22061835, 21435744, 21183049, 21120318, 21007268, 20628925, 19863315, 18764369, 17483596, 16125782, 14788482, 13788368, 13402086, 13495882, 13820300, 14160563, 14274756, 14028053, 13481367, 12745648, 11850227, 10878638, 9977912, 9134274, 8317339, 7657920, 7335114, 7463767, 7940126, 8455413]
14281H455413K37728j76539m88893n57657l24377J50658O06545P78159O65879
14272I346916M81658L58991K17368p4335m58000p18881q09376q07955o63845m08489
14262F464052k06649j37820r0637P6105J85564K3359k82401m84828n01675m27074
14252D617996l64906k69803j725M27764Q30325J165416J393723J396148J305477
14243A0500415J239681J117299Q76969M10173k94125r98272j483403j690995j710319
14234G967423j619752j442624j231519r95513o40415k15979L5607P3170J41560
14225B071958M43700P93664Q34973N92704M03083M26647N71314O30694M20715
14216G189452N0807q9673J22016M86667P00760M68227m8051m05132l93587j80153
$$ y = [8455413, 8693141, 8516602, 8027709, 7470052, 7145675, 7296333, 7902878, 8681037, 9346916, 9828574, 10187565, 10404933, 10330598, 9872598, 9153717, 8344341, 7536386, 6872541, 6464052, 6257403, 6119583, 6028946, 6105051, 6290615, 6313974, 6031573, 5546745, 5045070, 4617996, 4253090, 3983287, 3981562, 4409326, 5239651, 6405067, 7798790, 9194938, 10500415, 11740096, 12857395, 13734364, 14144537, 13850412, 12852140, 11368737, 9677742, 7967423, 6347671, 4905047, 3673528, 2678015, 2037600, 1821621, 1857228, 1930398, 2071958, 2515658, 3309322, 4144295, 4736999, 5140082, 5566729, 6138043, 6768737, 7189452, 7240259, 7150586, 7272602, 7759269, 8460029, 8928256, 8880205, 8475073, 8081486, 7901333]
14206G901333o5031j28775l28801o09569q96185j082622j088959r80502q14088
14197A906801o02446l50467J8232O04505J279419J610945J344225P82192K94965
14188F888371N3641Q5416N8147l19752q83931j349404j523772j247100n55722
14179A205894J71175O11808O76833L93146o1902m71386n83365l00186J04236K76333
14169B022586K00963P8467o9439j81534j00730P5964J66740J82825J89486K01430
14159B766758L03016N79856Q32575Q01025N42401K95099K96904N03905O46453
14150G567992N71049K62238o5295j48607j11434k51794n96162q46410p63038n02051
14140E116488m03309n90782r29560j182178j250910j279521j311722j173245q61340
$$ y = [7901333, 7836302, 7707527, 7378726, 6769157, 5872972, 4790350, 3701391, 2720889, 1906801, 1304355, 953888, 972120, 1576625, 2856044, 4466989, 5811214, 6593406, 6888371, 6942012, 7027428, 7085575, 6765823, 5881892, 4532488, 3008716, 1761616, 1205894, 1377069, 1988877, 2665710, 3058856, 2996954, 2525568, 1942203, 1642017, 1746253, 2022586, 2223549, 2302016, 2232577, 2051043, 1950313, 2026277, 2193017, 2375842, 2565328, 2766758, 3069774, 3649630, 4482205, 5283230, 5825631, 6120730, 6417634, 6921539, 7567992, 8139041, 8401279, 8335984, 8187377, 8075943, 7824149, 7227987, 6381577, 5618539, 5116488, 4713179, 4122397, 3192837, 2010659, 759749, -519772, -1831494, -3004739, -3866079]
14131c866079n19509k35309q4238r6431k77354m53634m09834j62166J09621L01511
14121e693422M49866N97431O89016N65316K90526J17755J55131K52012J85934
14112b390435j6255p4252K29176P84330J205745J154400P00949J04531m13901
14103A284288p15369o84209l36457J02518N63755J047339J261826R13299K21385
14094C658375k87489m01998l30358j29879L16397Q04921R86315P73200K45467
14085E634951l64691o87806n59959l24853n41342j198407j735558j702989j046149
14076b526803k10434K18007J42225l4777n3092j00702m11658q59180j030582p02218
14066e569214O859P34580J109278J080987Q71907O55431M54747L14257K32579
$$ y = [-3866079, -4385588, -4620897, -4705135, -4801566, -5078920, -5532554, -5942388, -6104554, -5994933, -5693422, -5243556, -4646125, -3957109, -3391793, -3101267, -2983512, -2828381, -2576369, -2390435, -2406690, -2480942, -2251766, -1467436, -261691, 892709, 1593658, 1698189, 1284288, 568919, -115290, -451747, -349229, 214526, 1261865, 2523691, 3436990, 3658375, 3370886, 2968888, 2638530, 2508651, 2825048, 3629969, 4616284, 5389484, 5634951, 5270260, 4582454, 4022495, 3697642, 3156300, 1957893, 222335, -1480654, -2526803, -2737237, -2519230, -2377005, -2411782, -2464874, -2565576, -2977234, -3836414, -4866996, -5569214, -5562355, -4827775, -3718497, -2637510, -1765603, -1110172, -655425, -341168, -108589]
14057a08589J56346M5191p1278o7692J10822L89550N63859N14911L26907J71799
14047B031826M8171j84884l89244l82187k58224j07696J8304l5276k38459k72208
14037B30123R9344P43912J240426J385714J344263J208952R42551N68280K78338
14028H041903K90332N34974P62052Q12447O36666K18058k99142o56473p60931
14019I579886o54500m37161j66183J22327L72440N68108O55654O22231N03863
14010A1166665M63710P69231J289488J631156J641741J383960R26583L11086m05561
14001A9178059j027870j277027j143380r02157p17613n42706k56304R0160L71556
13992A3772718O98490J189595J689357K084012K613070L423142M222163M738926
$$ y = [-108589, 47757, 92948, 21670, -46022, 64800, 454350, 1018209, 1533120, 1860027, 2031826, 2079997, 1895113, 1505869, 1123682, 865458, 757762, 776066, 740790, 502331, 230123, 329467, 1073379, 2313805, 3699519, 5043782, 6252734, 7195285, 7763565, 8041903, 8332235, 8867209, 9629261, 10441708, 11078374, 11296432, 10997290, 10340817, 9579886, 8925386, 8488225, 8322042, 8444369, 8816809, 9384917, 10040571, 10662802, 11166665, 11630375, 12399606, 13689094, 15320250, 16961991, 18345951, 19272534, 19583620, 19178059, 18150189, 16873162, 15729782, 14827625, 14110012, 13567306, 13311002, 13401162, 13772718, 14471208, 15660803, 17350160, 19434172, 22047242, 25470384, 29692547, 34431473]
13984C4431473N038775N345793N715080N755672M991707L286300Q59547j659330
13976F3765017l421328l946548l418510k412221j326337k12593R98769K288976
13968E2315225L372131L958540L920627L066486J354089q03841k748924l989802
13960F0444531m530874m712475m779785m724204m376300l722664k966664k302916
13952B8328649j813419j396384q61971l66347k86775o45128j100963j367218j526134
13943A8964310j794046k085733k059365j637485j073871n99659l31186l00177
13935I082788m21767m79969l67097j27263J89791N22266O55537L16559l70581
13926I000264r65716j176319r27005l69934J74887M86648N56336N19123N26138
$$ y = [34431473, 39470248, 44816041, 50531121, 56286793, 61278500, 64564800, 65424347, 63765017, 60343689, 56397141, 52978631, 50566410, 49240073, 49027480, 50026249, 52315225, 55687356, 59645896, 63566523, 66633009, 67987098, 67183257, 64434333, 60444531, 55913657, 51201182, 46421397, 41697193, 37320893, 33598229, 30631565, 28328649, 26515230, 25118846, 24256875, 23890528, 23603753, 22958625, 21857662, 20490444, 18964310, 17170264, 15084531, 13025166, 11387681, 10313810, 9714151, 9382965, 9082788, 8661021, 8181052, 7813955, 7686692, 7876483, 8398749, 9054286, 9370845, 9000264, 8034548, 6858229, 5931224, 5561290, 5736177, 6222825, 6779161, 7298284, 7824422]
13917G824422O36557P43092P14283M94816O7226l65677m94165l24780k51971m61896
13907H581907n90765m34358l07067m38329p14938r89685j255791j439660j396028
13898A015286j068792m94469J18457M84380N37411M80278N17238O11235O69494
13889B870518P01557P11223O15994L79249P9917k16336m23223m49453l00114j40734
13879C828598j28179j33690R3543N00050O95401M17346j72537o50417q13238p37183
13869B899694n20752k95310k25349l09600m95270q24202j086040r79210n86377
13860b422416j00244L75846O60148O79500N79189N01521L97520J42383j32559
13851F80888k49084k13123q8634M8295O7112o2486j06903J24392M74725O33773
$$ y = [7824422, 8460979, 9204071, 9918354, 10413170, 10480396, 10114719, 9620554, 9295774, 9043803, 8581907, 7991142, 7556784, 7249717, 6811388, 6096450, 5106765, 3850974, 2411314, 1015286, -53506, -547975, -429518, 54862, 592273, 1072551, 1589789, 2201024, 2870518, 3572075, 4283298, 4899292, 5278541, 5358458, 5142122, 4718899, 4269446, 3969332, 3828598, 3700419, 3566729, 3660272, 4160322, 4855723, 5273069, 5100532, 4450115, 3636877, 2899694, 2378942, 2083632, 1858283, 1548683, 1053413, 229211, -856829, -1836039, -2422416, -2522660, -2146814, -1486666, -807166, -227977, 273544, 671064, 813447, 680888, 431804, 218681, 130047, 178342, 245454, 182968, 76065, 200457, 675182, 1308955]
13841A308955M09379n9696l41482k91281k16176k99386l30098q9719K84468M70965
13831H45929L74920Q2940k70264m85679l79848L2991M46985M68629P7881m01992
13821G92492o38317m81677j26813R7886J29517J62108K78531L03482R8829j81721
13811D34317l34933l43527k24713k5189J15473J36513J8666k55710o07655r67430
13801b054188j229001j227207r20105n12539j36486K69812O58520R33889J028999
13792c188306Q37646M70249K28183J25883R0057J38677K00913J75357P6235N4732
13782g90374J66795K99706L12491P9778l19185n50845m60969k78660k21614k64070
13772b026947m38994p17837p57952m72543k26861k16188k53696k04105k02294
$$ y = [1308955, 1718334, 1658638, 1317156, 1025875, 809699, 510313, 180215, 90496, 374964, 845929, 1220849, 1303789, 1033525, 547846, 167998, 200989, 647974, 1116603, 1194484, 792492, 154175, -327502, -454315, -356429, -226912, -64804, 213727, 517209, 616038, 434317, 99384, -244143, -468856, -494045, -378572, -242059, -223393, -479103, -1086758, -2054188, -3283189, -4510396, -5430501, -5943040, -6079526, -5809714, -5151194, -4217305, -3188306, -2350660, -1880411, -1652228, -1526345, -1436288, -1297611, -1096698, -921341, -845106, -790374, -623579, -323873, -11382, 68396, -250789, -801634, -1262603, -1541263, -1762877, -2026947, -2465941, -3183778, -3941730, -4414273, -4641134, -4857322, -5111018, -5315123, -5517417]
13763e517417l44063m83663l66011J18779Q08653J294552J261621Q76413M84052
13754a867084K03982J20604K84731N35277N77049K11237l24710o34790o59940
13745a553644n99644n43831l85224q5716K99487P02195J059417J243109J125589
13736A261738O79722O2024n14914q29712o84710k54217J47313M34231O50393Q11532
13726A763400P17194J46725o94818j331032j477738j122995m79628J06984L44478
13717b027430J95585j671Q8880L10986L28934J79423J10477J79657K90585M07932
13707F3358M81989L62123N3969k80089m17139k48706K674Q2462o1320m44017r35808
13696a340504j203899j129273r04932o31006l40134j72499o0310K82781P87302
$$ y = [-5517417, -5861480, -6345143, -6711154, -6592375, -5783722, -4489170, -3227549, -2351136, -1867084, -1663102, -1542498, -1257767, -722490, -145441, 65796, -258914, -893704, -1553644, -2153288, -2697119, -3082343, -3168059, -2868572, -2166377, -1106960, 136149, 1261738, 1941460, 2003484, 1488570, 658858, -25852, -280069, -132756, 301475, 951868, 1763400, 2480594, 2627319, 1932501, 601469, -876269, -1999264, -2478892, -2371908, -2027430, -1831845, -1833516, -1744636, -1433650, -1104716, -925293, -814816, -635159, -344574, 63358, 545347, 907470, 961439, 681350, 264211, 15505, 18179, 100641, 39321, -404696, -1340504, -2544403, -3673676, -4578608, -5209614, -5549748, -5722247, -5782557, -5499776, -4712474]
13687d712474J072171J069877R19068O92174M04595J69721J46528K55762L11516
13678C28938K94636K80401K51109J36414o8280l11463m89312n12062m53231m39515
13668i82365m40272l73652k48836j13120P9489L18614N42218P44509Q94539Q67951
13658A289075N37423m8601o31583q52174o88488n02909m23517l01763j24667l6625
13648a783829j46720m35419p48726q29744n43483J8222N65424Q25878Q17758O91744
13638a568895N27424L89644L56630L14153J74243J4296p4066m4445K6895K28247
13628C44126O57143R64556P73722K35316k27554m10209m02118m56436o61023p64794
13618E2729n74070j80456K08565M69840O53892P71527P07655M18220Q3825n1493
$$ y = [-4712474, -3640303, -2570426, -1651358, -959184, -554589, -384868, -238340, 17422, 328938, 623574, 903975, 1155084, 1291498, 1223218, 911755, 422443, -89619, -542850, -982365, -1422637, -1796289, -2045125, -2158245, -2078756, -1760142, -1217924, -473415, 421124, 1289075, 1826498, 1777897, 1146314, 294140, -394348, -897257, -1320774, -1622537, -1747204, -1783829, -1930549, -2365968, -3114694, -3944438, -4487921, -4469699, -3904275, -3078397, -2260639, -1568895, -1041471, -651827, -295197, 18956, 193199, 207495, 133429, 88984, 115879, 344126, 1001269, 1965825, 2739547, 2974863, 2747309, 2337100, 1934982, 1478546, 817523, 52729, -521341, -701797, -493232, -23392, 630500, 1402027, 2109682, 2527902, 2611727, 2560234]
13608B560234J00538K82177K01524J0405j079J62049K91783L30970L53605L55377
13598D647583K54337j319l90837q20910j222813j475418j493519j452050j552808
13589c507754j797616j912178j552847p08278J94427Q00998J060788R34989M85790
13580f001681j1595k49027j9413N39342J155791J554587J398704Q16781L19069
13571d97442N3120j65855l48033l87899l52476k91984k00323j29688p7267R741
13561b388106J16569K71324M50739M88858L64708J21770j82664l84456m02027
13552a543285l38939l06865k88786j40141J58814L56536K23766j74953n72197
13543b626050p73985p60595o64144o12160n75159m16509q4196K87148N09511N42673
$$ y = [2560234, 2660772, 2942949, 3144473, 3154878, 3153799, 3315848, 3607631, 3938601, 4292206, 4647583, 4901920, 4900601, 4509764, 3688854, 2466041, 990623, -502896, -1954946, -3507754, -5305370, -7217548, -8770395, -9478673, -9284246, -8483248, -7422460, -6487471, -6001681, -6013276, -6262303, -6281716, -5742374, -4586583, -3031996, -1633292, -816511, -497442, -444322, -610177, -958210, -1346109, -1698585, -1990569, -2190892, -2320580, -2397847, -2388106, -2271537, -2000213, -1549474, -1060616, -695908, -574138, -756802, -1141258, -1543285, -1882224, -2189089, -2477875, -2618016, -2459202, -2102666, -1878900, -2053853, -2626050, -3400035, -4160630, -4824774, -5436934, -6012093, -6428602, -6512798, -6225650, -5716139, -5173466]
13533e173466N85917P26606P86749O84079N38050L99207K93731K51230J52639
13524g55258k9857k12644m17752p06775j006694j097749p79637j36451N50603
13515d592214J040193J203024J050167O39051J67303j97211n07143p80320q11641
13506b788791n11395q6294K06563K27335K9605k67781o41875r90658j074903q91209
13496f789403o83105n27770k83377M0474K00586J72387J61423J04110m3277K5443
13486g622509M49143R35060J155436J108629J040864J081997J150744J196965
13478D96329J228314J260919J270292J190738R74330O18553K16627q8391l79082
13469F788629q35361j234336j115797n50054j87948l45632o63065p00092l39042
$$ y = [-5173466, -4587549, -3860943, -3074194, -2390115, -1852065, -1452858, -1159127, -907897, -755258, -785115, -997759, -1415511, -2122286, -3128980, -4226729, -5006366, -5142817, -4592214, -3552021, -2348997, -1298830, -659779, -492476, -689687, -1196830, -1977150, -2788791, -3300186, -3386480, -3179917, -2952582, -2922977, -3190758, -3832633, -4823291, -5898194, -6789403, -7472508, -8000278, -8283655, -8243181, -8042595, -7870208, -7708785, -7604675, -7647952, -7622509, -7173366, -6238306, -5082870, -3974241, -2933377, -1851380, -700636, 496329, 1724643, 2985562, 4255854, 5446592, 6420922, 7039475, 7256102, 7167711, 6788629, 5953268, 4718932, 3603135, 3053081, 2865133, 2519501, 1856436, 1156344, 817302]
13460H17302K39301P48373Q61123N18811O0264k50515m59211o07339o61320o80901
13450E85888o33077l56062J23545N23840N64959L08511M5484j32924l08330m75061
13440B46773m77006k68573K1635L14988O09463Q96147J093300J077753P48081
13431D262561J55315n05599r83386j089416q51675m33028j16682j22952l73189
13422e8051o90739r41602r18262n02730J41785N98693N29630N9772l91054n61270
13412b733828o07464o49502m87444m8195M10850N55929L17541K8314k777K02586
13402c013990M59471O87848R04048J041352J009149O98896O4217o75959j135711
13393C9321j226675j172800j187636j336102j408727j115563m46955L20697Q52935
$$ y = [817302, 1056603, 1804976, 2666099, 3184910, 3245174, 2994659, 2535448, 1928109, 1266789, 585888, -47189, -403251, -279706, 244134, 809093, 1117604, 1163088, 1030164, 721834, 246773, -230233, -498806, -477171, -162183, 447280, 1343427, 2436727, 3514480, 4262561, 4417876, 3912277, 2928891, 1839475, 987800, 554772, 438090, 315138, -58051, -748790, -1690392, -2608654, -3111384, -2969599, -2370906, -1841276, -1781504, -2172558, -2733828, -3341292, -3990794, -4478238, -4526433, -4115583, -3559654, -3242113, -3213799, -3216576, -3013990, -2554519, -1866671, -962623, 78729, 1087878, 1786774, 1850991, 1175032, 39321, -1187354, -2360154, -3547790, -4883892, -6292619, -7408182, -7855137, -7534440, -6681505]
13384f681505R96437Q34295N29479L10977L50836N29317N15195J34770l62470
13375b842669o52024o26984k31089M24004J009105J234118R47127L10560j91285
13366f19137l03527j52461Q6985K14448J35110l8142k32032m65400o27343o03305
13356b604804m39232k97077j85540M8384N02811J073462J382174J227786Q62657
13347A570621O13140M93565J78669m71325j087824j274668j039638o23718j90877
13338a832055K27339N91428Q59350J019174J032055Q79159N68143Q4810m58087
13329B971316p42988o22503k71126J86734N12906M16117R7218r6912k03750m16015
13319A830997o62840p40888o29621l41872J87053Q09399J212971J340691J242207
$$ y = [-6681505, -5685068, -4850773, -4321294, -4010317, -3659481, -3130164, -2614969, -2480199, -2842669, -3494693, -4121677, -4352766, -3928762, -2919657, -1685539, -738412, -427852, -619137, -922664, -1075125, -988140, -773692, -638582, -676724, -908756, -1374156, -2001499, -2604804, -3044036, -3341113, -3526653, -3478269, -2975458, -1901996, -519822, 707964, 1570621, 2183761, 2677326, 2855995, 2384670, 1296846, 22178, -1017460, -1641178, -1832055, -1604716, -1013288, -153938, 865236, 1897291, 2776450, 3344593, 3429403, 2971316, 2228328, 1605825, 1334699, 1521433, 2034339, 2450456, 2547674, 2450762, 2247012, 1830997, 1168157, 427269, -202352, -544224, -357171, 452228, 1665199, 3005890, 4248097]
13310D248097Q20555P3743o64821r63282o27071J24613P92435J112443J065695
13301E982407O47963L3705m35385p11064r59210j121182j002917n89497r1045
13292A753775K75099M32406L40834O3610j46139j13020J31102M37441N81120M34520
13282D190748J12254k56439o02733p45884n27305o3627L60299N60461O05907O61421
13272D295102P14770N81890L50155L35209M65325L55612r6351n80399p90969o64209
13262D966135l59558o1964R1212K3236j84039m16378m60833N861R27765J909856
13252F441293K772130L511400M083390M448888M598456M360721L522269K211168
13244C5949715P63280n90793j666095k338217k637499k719693k755735k892996
$$ y = [4248097, 5068652, 5142395, 4477574, 3514292, 2887221, 3011834, 3804269, 4916712, 5982407, 6630370, 6664075, 6228690, 5517626, 4558416, 3437234, 2434317, 1844820, 1753775, 2028874, 2461280, 2802114, 2865724, 2719585, 2606565, 2737667, 3175108, 3756228, 4190748, 4303002, 4046563, 3443830, 2697946, 2170641, 2107014, 2467313, 3027774, 3633681, 4295102, 5009872, 5591762, 5941917, 6277126, 6742451, 7098063, 7001712, 6421313, 5630344, 4966135, 4606577, 4544613, 4635825, 4659061, 4475022, 4058644, 3597811, 3603672, 4531437, 6441293, 9213423, 12724823, 16808213, 21257101, 25855557, 30216278, 33738547, 35949715, 36712995, 36122202, 34456107, 32117890, 29480391, 26760698, 24004963, 21111967]
13236B1111967l041337k858559k231394j555497j217608j197195j278156j322337
13228F409884j255976q73263p9728O42497P02981K78089n7960j76706k99673m31579
13218D858566m30750l26834l23333m39354m99014m60382m09984m02369m16343
13209A150203n02223o80006p79980o97556n21098l81292k91778j64845k3343R3558
13199b798360K16795K35815J07406K0148K5691p7004k96413l20234J5000M35550
13189b435606N74516M81724N42037Q02071R20051P39135L41743m1632j86548j78391
13179A559100j73896r8067Q7574K10448K62736L21902L31625L40321M12983M19375
13169C674101J94961k43753o22391o45881l35383K4083K04135K30588K70108K91439
$$ y = [21111967, 18070630, 15212071, 12980677, 11425180, 10207572, 9010377, 7732221, 6409884, 5153908, 4280645, 4200917, 4843414, 5546395, 5824484, 5766524, 5589818, 5290145, 4858566, 4427816, 4100982, 3777649, 3338295, 2839281, 2378899, 1968915, 1566546, 1150203, 647980, -32026, -812006, -1509562, -2030660, -2411952, -2703730, -2868575, -2891918, -2798360, -2581565, -2345750, -2238344, -2218196, -2192505, -2269509, -2565922, -2886156, -2871156, -2435606, -1861090, -1379366, -837329, -35258, 884793, 1623928, 1965671, 1924039, 1737491, 1559100, 1385204, 1287137, 1374711, 1585159, 1847895, 2169797, 2501422, 2841743, 3254726, 3674101, 3869062, 3625309, 3002918, 2357037, 2021654, 2045737, 2249872, 2480460, 2750568, 3042007]
13159C042007J07457k79237o60808q72227q44663n50402j57776L729j66762m81917
13149h60599o75434n82919k30802J61538L83162M28533M19107M20591N08040O70674
13139F41891P08317N76084L34826j1885m20150p88895r69033q42494m70392j24162
13129a365893k5603r3022j78635l10379m64013m39304k37038j25295j30122J0012
13119c359292L70485P25872Q31379P12188O32660N94634L87891J5704l58664o03693
13109e0836o85086n98636l80612k11360k62715m17848m98178n07384l60441J3663
13099c959433N13991R77205J176217R46350M64054O3879m4019J35799L15685K30768
13089H20496j10875n68067q72299p75959l10988K59714N64606M25626j870m03124
$$ y = [3042007, 3149464, 2870227, 2209419, 1337192, 492529, -57873, -215649, -211920, -378682, -860599, -1536033, -2118952, -2349754, -2188216, -1805054, -1376521, -957414, -536823, -28783, 641891, 1350208, 1926292, 2261118, 2249233, 1829083, 1040188, 71155, -771339, -1241731, -1365893, -1391496, -1484518, -1663153, -1973532, -2437545, -2876849, -3113887, -3239182, -3369304, -3359292, -2988807, -2262935, -1431556, -719368, -86708, 507926, 895817, 911521, 552857, -50836, -735922, -1334558, -1715170, -1926530, -2189245, -2607093, -3105271, -3612655, -3973096, -3959433, -3445442, -2468237, -1292020, -345670, 118384, 182263, 138244, 274043, 589728, 820496, 709621, 141554, -730745, -1506704, -1817692, -1557978, -993372, -567746, -569616, -972740]
13079i72740n62642n50030m91986l20748J38347P69012J113411J058749Q70501
13070A051874O70494M06912K3988l93520o37156n87029k33576K94787P76783J089085
13060B462642J244404J117056O51684O9462m24103o08381m19542j96825k04975
13051C691422l74785n97065p81744p58970n50283l60736k90685k89607j83495
13042d95948N8362K42751J42066k80668q96401j550582k052306k156487j704298
13033h693511q61634L4267O64070R04075R56487J036542J091645R62665O36407
13024c268987K60673q7073k63236n2763M01090P45534P37305M67315L39566N40210
13014a80366P49985N15214j02445n78601o86095o03381l66413N7036L56426K03659
$$ y = [-972740, -1535382, -2085412, -2577398, -2898146, -2759799, -1990787, -877376, 181373, 1051874, 1722368, 2129280, 2153268, 1759748, 1122592, 535563, 301987, 596774, 1373557, 2462642, 3707046, 4824102, 5475786, 5545248, 5121145, 4512764, 4093222, 3896397, 3691422, 3316637, 2719572, 1937828, 1178858, 628575, 267839, -22846, -312453, -495948, -437586, -194835, -52769, -333437, -1229838, -2780420, -4832726, -6989213, -8693511, -9555145, -9520878, -8856808, -7952733, -6996246, -5959704, -4868059, -3905394, -3268987, -3008314, -3095387, -3358623, -3411386, -3010296, -2264762, -1527457, -1060142, -720576, -180366, 569619, 1084833, 982388, 403787, -282308, -885689, -1252102, -1195066, -838640, -634981]
13004f34981k67761p10091r60111r92526p92333m76341k09978q4918r4601p5101
12994e298742J59855N11876O57125N07720K54966J2162j66814k00009j01873Q4282
12984c579452L12265M04006J88827j90521m89934o43116o19785m71445l06751
12975e395906r6656J48265L31513M43511M74461L68316K36206K73778M38741N65083
12965b212688N16860J70214l73220p81279p97608l86531K17497O70554Q39965
12956b136236P96049O86374N46101L64451J18716k92575p21739q63682p04020
12947b206561m54615k89590k00150l4711K36499L97282L01257J50653J11375L8715
12937a949846j86252m17632m23535j57979K19829N64136P05548N30218J50952
$$ y = [-634981, -902742, -1612833, -2572944, -3565470, -4357803, -4834144, -5044122, -5129040, -5223641, -5298742, -5138887, -4627011, -3969886, -3462166, -3207200, -3195038, -3361852, -3561861, -3663734, -3579452, -3267187, -2863181, -2674354, -2864875, -3354809, -3997925, -4617710, -5089155, -5395906, -5492562, -5344297, -5012784, -4569273, -4094812, -3726496, -3490290, -3216512, -2777771, -2212688, -1695828, -1525614, -1898834, -2680113, -3477721, -3864252, -3646755, -2976201, -2136236, -1340187, -653813, -107712, 256739, 375455, 82880, -638859, -1502541, -2206561, -2661176, -2950766, -3150916, -3185627, -2949128, -2551846, -2250589, -2099936, -1988561, -1949846, -2136098, -2553730, -2977265, -3135244, -2915415, -2351279, -1645731, -1115513, -964561]
12928i64561l01935o96749q62864p29434l76775Q2303M65126N75181M68217K84489
12918b057002Q1654q316K06983P60413J301766J395500J144080R50439Q40159
12909D615676O05854J74077m83845j155466j371674j066768n99851j96806L4038
12900E55235j7604k74221n38357o71266o39997n42898l55667P248L83067M90556
12890a603904K96132O5148R8012M81353R34772J098701J029195J009620J032970
12881D441999Q71598N36949L62765M03569K45375k93893q00451r00156p94269
12872D073486p39385o41309m21750j11579K16720L98244K70999k6982j47199j8097
12862B853148J33152J86243K67787M62577N94728M45945K6087m91923q82457r54623
$$ y = [-964561, -1266496, -1963245, -2826109, -3555543, -3932318, -3850015, -3384889, -2809708, -2341491, -2057002, -1975348, -1983664, -1776681, -1016268, 285498, 1680998, 2825078, 3775517, 4615676, 5221530, 5395607, 4911762, 3756296, 2384622, 1317854, 718003, 521197, 555235, 537631, 263410, -274947, -946213, -1586210, -2129108, -2484775, -2477527, -2094460, -1603904, -1307772, -1242624, -1144612, -663259, 271513, 1370214, 2399409, 3409029, 4441999, 5313597, 5850546, 6213311, 6616880, 6862255, 6568362, 5767911, 4867755, 4073486, 3334101, 2692792, 2271042, 2159463, 2376183, 2774427, 3045426, 3018444, 2871245, 2853148, 2986300, 3172543, 3440330, 3902907, 4497635, 4943580, 4969667, 4477744, 3595287, 2640664]
12852B640664o21857j9637N54324J004546J422189J721479J707632J213436L94811
12843A0017587k62318n33615n31830m61189m98631o41158p45329p76549p67561
12834D799407o92958n51440l36670p9903P5346O8103J2233q502K6625J95070N33029
12823D040340Q11760P38018L12571j50085l32891l01659k53628j84899K5764L22456
12813E027747N38595O59244O67432N55818L99225L5833o49896j374642j865750
12804C993606j950512j607038r59243j88888L96125O01007M26698J20569O1951
12795H94275K84073N39087O78422O31221L56507j04302n98642q87524p45953k98849
12785G48315l5135j102J71948M58445M99584K31256k406N4676K55061K79902P4887
$$ y = [2640664, 2018807, 1999170, 2553494, 3558040, 4980229, 6701708, 8409340, 9622776, 10017587, 9755269, 9221654, 8689824, 8228635, 7730004, 7088846, 6343517, 5566968, 4799407, 4106449, 3555009, 3218339, 3138436, 3213782, 3281885, 3294118, 3285616, 3312241, 3507311, 4040340, 4852100, 5590118, 5902689, 5752604, 5419713, 5118054, 4864426, 4679527, 4705291, 5027747, 5566342, 6225586, 6893018, 7448836, 7848061, 7883894, 7233998, 5859356, 3993606, 2043094, 436056, -523187, -712075, -315950, 285057, 711755, 832324, 894275, 1178348, 1717435, 2395857, 3027078, 3383585, 3279283, 2680641, 1793117, 1047164, 748315, 713180, 712078, 884026, 1342471, 1842055, 2073311, 2070905, 2125581, 2380642, 2660544, 2735431]
12774B735431j85771l00855j99537j0520J20075R3803o9385k38807k91176p4155
12764A579103L69097O75386O15684L50428J75909J12239o19k16220n22614p64419
12754B373974p90306o07336k68358L4150M9117j41631k08479r6706n295J5105
12744C54235O5090J76663K98788K86059J48501N3790n6622j85408j40431M2041
12734A042706J43137P7852j54042l74900l12263K9786M48485Q21578J082088J190962
12724C995389J053201N27895k50516r44768j243913j049301o08467l01416k61209
12715I16895l62386m82660n08358l45307l2634L26068M83410K68880m1141o4431
12705A58336K79232O73130O64740J72213m83007r45537r04748k61880N68826J012143
$$ y = [2735431, 2549660, 2248805, 2049268, 2038748, 2158823, 2252626, 2183241, 1944434, 1653258, 1579103, 1948200, 2623586, 3239270, 3589698, 3765607, 3877846, 3877227, 3661007, 3138393, 2373974, 1583668, 976332, 707974, 742124, 791241, 649610, 441131, 344425, 339130, 354235, 419325, 595988, 894776, 1180835, 1329336, 1383126, 1326504, 1141096, 1000665, 1042706, 1185843, 1263695, 1109653, 734753, 422490, 452276, 900761, 1722339, 2804427, 3995389, 5048590, 5576485, 5325969, 4381201, 3137288, 2087987, 1479520, 1178104, 916895, 554509, 71849, -436509, -781816, -814450, -488382, -4972, 263908, 222767, 158336, 437568, 1110698, 1775438, 1947651, 1464644, 519107, -385641, -647521, -78695, 933448]
12695I33448Q82734M66976J61075J05174J46805L2922k75644n74652o77563n94550
12685F06725m50113l05801j72283j04001j44076k35226k88587k34266j8951K54707
12675a091872L77570K28962M1475J87491N13529N97243M05055J29315j05435k55321
12665A028012l18882l10863k45642j50913j28526k20848k84039k12850o7977J43334
12655g69194L82504M47705K38264o9955k46873k87659k67172j63334n1871j02520
12645h90105m08242p85457j006064j019699q28465m22551J54682O29716P89602
12636c786583P19452O83437Q20372R91033R70800O87050L46112K59530M23264
12627B114467L75733j92221r32149j308915j197335p86515l46325o8573J24793
$$ y = [933448, 1816182, 2283158, 2444233, 2549407, 2696212, 2729134, 2453490, 1878838, 1201275, 606725, 156612, -149189, -321472, -425473, -569549, -804775, -1093362, -1327628, -1346579, -1091872, -714302, -485340, -443865, -256374, 257155, 854398, 1259453, 1388768, 1283333, 1028012, 709130, 398267, 152625, 1712, -126814, -347662, -631701, -844551, -912528, -769194, -386690, 61015, 299279, 229324, -17549, -305208, -572380, -735714, -787585, -890105, -1298347, -2083804, -3089868, -4109567, -4938032, -5360583, -5205901, -4576185, -3786583, -3067131, -2383694, -1563322, -572289, 398511, 1085561, 1431673, 1691203, 2114467, 2490200, 2297979, 1365830, 56915, -1140420, -1926935, -2273260, -2341833, -2217040]
12618b217040K56919J44796j70813l81662l81662l65318l67790j27725M21754
12609c188541J054989J444942J337622Q23471K32508j60720k21040n0614M3844
12600A316461o1870k34973k78724j76715j26465k88011o14910q11184o75150l94473
12590b346014j54578K0864J80704L15760K26110L1881J37636M84973P72272R49150
12580F18758R34806O26934J90556j78311m74033p63997j012225j117024r51522
12571b126058m39661L17415J049650J288783P88180k7875o97390j054329j015111
12562a916396o83139l46192j22189L5655J97858M86606Q23677R82481Q56699N13375
12552H28435J11188k27755m34066l91406j39712N4091R519j73372j70240K02415
$$ y = [-2217040, -1960121, -1815325, -1986138, -2367800, -2749462, -3114780, -3482570, -3610295, -3188541, -2133552, -688610, 649012, 1472483, 1704991, 1544271, 1323231, 1272617, 1316461, 1254591, 1019618, 740894, 564179, 437714, 149703, -465207, -1276391, -1951541, -2346014, -2500592, -2479728, -2299024, -1983264, -1757154, -1725273, -1587637, -1102664, -330392, 618758, 1553564, 2180498, 2371054, 2192743, 1718710, 954713, -57512, -1174536, -2126058, -2565719, -2248304, -1198654, 90129, 878309, 850434, 153044, -901285, -1916396, -2599535, -2945727, -3067916, -3032261, -2834403, -2347797, -1524120, -541639, 315060, 828435, 939623, 711868, 277802, -113604, -253316, -199225, -189706, -363078, -533318, -330903]
12542c30903P61315J222732J513569J575337J340105R59898O69891M66363J34905
12533H313212l35706o10678n91641l83577P497M92556P83558N80395n2082p28530
12523G475004j014253p96127l64796p4097k6656j17254j47348j03689j07338j04637
12513D618809j9719O7946R6435P4239o4456l56392o92349p90346m74701m6891
12503B412575J33949P4886j58226n68491j012670j201935r86192n18393o3868
12494a888365J20904N9493J31490M38726O74091N94114K37672j05979l24406n33274
12484e95534n77774k07975N25581J292276J728220J673004J283672Q24802L56877
12475F303149J4142j71681m98014r72485j185508q24170j00034M40757N00107
$$ y = [-330903, 430412, 1653144, 3166713, 4742050, 6082155, 7042053, 7711944, 8178307, 8313212, 7977506, 7366828, 6775187, 6391610, 6399107, 6891663, 7675221, 8255616, 8203534, 7475004, 6460751, 5664624, 5299828, 5225731, 5199075, 5081821, 4934473, 4830784, 4723446, 4618809, 4599090, 4667036, 4763471, 4837710, 4773254, 4416862, 3724513, 2934167, 2459466, 2412575, 2546524, 2621410, 2463184, 1894693, 882023, -319912, -1306104, -1824497, -1888365, -1767461, -1707968, -1576478, -1137752, -463661, 130453, 368125, 262146, -62260, -595534, -1173308, -1381283, -855702, 436574, 2164794, 3837798, 5121470, 5946272, 6303149, 6317291, 6145610, 5647596, 4675111, 3489603, 2665433, 2565399, 3006156, 3506263]
12466C506263K13060j51332l83847m87492o80846r64227j016678p28239l30157
12457a023495j1414J03309m143j78998l06213l88560m09934l20933j87358j15030
12447b842769j00017j1137K30889M62756M73310L46990K62392J81701O8798l4770
12437i61857j02689r1779L8621J52923P8309j82709n13061p06857n18954P0504
12427b737549P10715J023639Q54111L60578q7483l95584o79485q73150p92214
12418b616422k39292P21155J600123J840272J344101N33013q1236k35707l6822
12409B829185J67596J21744j50603m53318n98994n26786l19400k31736l49798
12400D87890m34636k91967m0894M8651N5786K38653N82812Q08059O06035R9309
$$ y = [3506263, 3719323, 3567991, 3184144, 2696652, 2015806, 1051579, 34901, -693338, -1023495, -1034909, -931600, -935743, -1114741, -1420954, -1809514, -2219448, -2540381, -2727739, -2842769, -2942786, -2953923, -2723034, -2260278, -1786968, -1439978, -1177586, -995885, -927087, -961857, -1064546, -1156325, -1117704, -964781, -886472, -1069181, -1582242, -2289099, -2808053, -2737549, -2026834, -1003195, -149084, 211494, 124011, -271573, -951058, -1824208, -2616422, -2855714, -2134559, -534436, 1305836, 2649937, 3182950, 3101714, 2866007, 2829185, 2996781, 3118525, 2967922, 2514604, 1915610, 1388824, 1069424, 837688, 487890, 53254, -238713, -279607, -230956, -175170, 63483, 646295, 1454354, 2060389, 2159698]
12390B159698l24252m87270l93305k34868k38813l59055m02671k57190N6580L25225
12380a55921L81792L21367K29883J23527M2404m7654j64569j83679q5360m1716
12370D20074j02031j77383k57364l20051j82998K89633P95703R15715O65952L36641
12360B383891P3166k10767n44759q35720j061956j269636j491825j716136j770985
12351f444727j408335o91026L9166N91805R23721J000056Q13828M00626n3829
12342d828715l09677k86405r5276J43834L91088O56892R15771J181604J389921
12333h40963J237126P08108J17980k32297k41152p1678k4005k22017m56355n14492
12323e39745l80010k57888l69948n12936k70037K59260O37423O32352L79818J64285
$$ y = [2159698, 1835446, 1348176, 954871, 720003, 481190, 122135, -280536, -537726, -481146, -155921, 225871, 547238, 777121, 900648, 943052, 895398, 730829, 547150, 461790, 420074, 318043, 140660, -116704, -436755, -619753, -330120, 465583, 1381298, 2047250, 2383891, 2457057, 2246290, 1701531, 865811, -196145, -1465781, -2957606, -4673742, -6444727, -7853062, -8544088, -8504922, -7913117, -6989396, -5989340, -5175512, -4774886, -4828715, -5138392, -5424797, -5520073, -5376239, -4985151, -4328259, -3412488, -2230884, -840963, 396163, 1104271, 1222251, 989954, 748802, 677124, 653119, 431102, -25253, -539745, -919755, -1177643, -1547591, -2060527, -2330564, -2071304, -1433881, -801529, -421711, -257426]
12313b57426M2119r4028l08846o08868r30186j100460r98627o09372q3631L47342
12303d601983O12023O61307M54505J75699k367r3422j55387j24622P5869L49387
12293b648991M92141L79945J44040J16646M45369Q77312J073253R31567P21987
12284B533269Q04112J121648J224341Q18331J33739l54479m78130m25601m37354
$$ y = [-257426, -215307, -309335, -618181, -1227049, -2157235, -3257695, -4256322, -4865694, -4949325, -4601983, -3989960, -3328653, -2874148, -2698449, -2700816, -2794238, -2949625, -3074247, -2998378, -2648991, -2156850, -1776905, -1632865, -1516219, -1070850, -193538, 879715, 1811282, 2533269, 3337381, 4459029, 5683370, 6501701, 6635440, 6280961, 5802831, 5377230, 4939876]
$$ [...]
##END NTUPLES=NMR SPECTRUM
##END=
