##TITLE=31P ikalashn
11P153_mk
26.7.2023
##JCAMPDX= 6.0         $$ Bruker NMR JCAMP-DX V2.0
##DATA TYPE= NMR SPECTRUM
##DATA CLASS= NTUPLES
##ORIGIN= UXNMR, Bruker Analytische Messtechnik GmbH
##OWNER= root
$$ TOPSPIN		Version 1.3
$$ 2023-07-26 13:40:09.671 +0400  Irina@DPX200
$$ Compression mode = diff/dup
##.OBSERVE FREQUENCY= 81.01967998063
##.OBSERVE NUCLEUS= ^31P
##.ACQUISITION MODE= SIMULTANEOUS
##.ACQUISITION SCHEME= undefined
##.AVERAGES= 64
##.DIGITISER RES= 17
##SPECTROMETER/DATA SYSTEM= spect
##.PULSE SEQUENCE= zgpg
##.SOLVENT NAME= CDCl3
##.SHIFT REFERENCE= INTERNAL, CDCl3, 1, 298.5841
##AUDIT TRAIL= $$ (NUMBER, WHEN, WHO, WHERE, WHAT)
$$ ##TITLE= Audit trail, TOPSPIN		Version 1.3
$$ ##JCAMPDX= 5.01
$$ ##ORIGIN= Bruker BioSpin GmbH
$$ ##OWNER= Irina
$$ $$ F:/spectra/data/iren/nmr/P31dec/1/pdata/1/auditp.txt
$$ ##AUDIT TRAIL=  $$ (NUMBER, WHEN, WHO, WHERE, VERSION, WHAT)
(   1,<2023-07-26 13:38:11.015 +0400>,<Irina>,<DPX200>,<TOPSPIN 1.3>,
      <acquisition in progress>)
(   2,<2023-07-26 13:39:52.859 +0400>,<Irina>,<DPX200>,<TOPSPIN 1.3>,
      <Start of raw data processing
       efp BC_mod = 2 LB = 12 FT_mod = 6 PKNL = 1 PHC0 = 0.004493713 PHC1 = 273.9166 SI = 32K 
       data hash MD5: 32K
       64 97 11 29 CC DE E0 B7 9B B6 ED F3 6A C2 4F A8>)
(   3,<2023-07-26 13:39:55.031 +0400>,<Irina>,<DPX200>,<TOPSPIN 1.3>,
      <apk 
       data hash MD5: 32K
       9B B5 39 60 2F 45 70 69 95 E6 23 D6 FA 80 0E 06>)
(   4,<2023-07-26 13:39:57.218 +0400>,<Irina>,<DPX200>,<TOPSPIN 1.3>,
      <abs n ABSG = 5 
       data hash MD5: 32K
       EB 15 83 AC E2 67 95 BE 6E AB 34 8E 86 A8 E0 75>)
$$ ##END=
$$ 
$$ $$ hash MD5
$$ $$ DF D0 9B D1 70 9C 69 38 DC 97 CB 28 0D 6B 61 97
##$RELAX= 
##$RELAX= 
##$RELAX= 
##$RELAX= 
##$RELAX= 
##$RELAX= 
##$RELAX= 
##$RELAX= 
##$RELAX= 
##$RELAX= 
$$ Bruker specific parameters
$$ --------------------------
##$DU= <F:/spectra>
##$EXPNO= 1
##$NAME= <P31dec>
##$PROCNO= 1
##$TYPE= <nmr>
##$USER= <iren>
##$AMP= (0..31)
100 100 100 100 100 100 100 100 100 100 100 100 100 100 100 100 100 100 
100 100 100 100 100 100 100 100 100 100 100 100 100 100 
##$ANAVPT= -1
##$AQSEQ= 0
##$AQ_mod= 1
##$AUNM= <au_zg>
##$AUTOPOS= <>
##$BF1= 81.014009
##$BF2= 200.13
##$BF3= 200.13
##$BF4= 200.13
##$BF5= 200.13
##$BF6= 200.13
##$BF7= 200.13
##$BF8= 200.13
##$BYTORDA= 1
##$CFDGTYP= 0
##$CFRGTYP= 5
##$CHEMSTR= <none>
##$CNST= (0..63)
1 1 145 1 1 1 1 1 1 1 1 1 1 1 1 1 1 1 1 1 1 1 1 1 1 1 1 1 1 1 1 1 1 1 
1 1 1 1 1 1 1 1 1 1 1 1 1 1 1 1 1 1 1 1 1 1 1 1 1 1 1 1 1 1 
##$CPDPRG= <waltz16>
##$CPDPRG1= <>
##$CPDPRG2= <waltz16>
##$CPDPRG3= <>
##$CPDPRG4= <mlev>
##$CPDPRG5= <mlev>
##$CPDPRG6= <mlev>
##$CPDPRG7= <mlev>
##$CPDPRG8= <mlev>
##$CPDPRGB= <>
##$CPDPRGT= <>
##$D= (0..63)
0 1 0 0 0 0 0 0 0 0.06 0 0.03 2e-005 3e-006 0 0 0.0002 0 0 0 0 0 0 0 0 
0 0 0 0 0 0 0 0 0 0 0 0 0 0 0 0 0 0 0 0 0 0 0 0 0 0 0 0 0 0 0 0 0 0 0 
0 0 0 0 
##$DATE= 1690364390
##$DBL= (0..7)
120 120 120 11 120 120 24 19 
##$DBP= (0..7)
150 150 150 150 150 150 150 150 
$$ [...]
##$SW_h= 37037.037037037
##$TD= 32768
##$TD0= 1
##$TE= 300
##$TE2= 300
##$TE3= 300
##$TEG= 300
##$TL= (0..7)
0 120 53 12 22 120 120 120 
##$TP= (0..7)
150 150 150 150 150 150 150 150 
##$TP07= 0
##$TPNAME0= <>
##$TPNAME1= <>
##$TPNAME2= <>
##$TPNAME3= <>
##$TPNAME4= <>
##$TPNAME5= <>
##$TPNAME6= <>
##$TPNAME7= <>
##$TPOAL= (0..7)
0.5 0.5 0.5 0.5 0.5 0.5 0.5 0.5 
##$TPOFFS= (0..7)
0 0 0 0 0 0 0 0 
##$TUNHIN= 0
##$TUNHOUT= 0
##$TUNXOUT= 0
##$USERA1= <user>
##$USERA2= <user>
##$USERA3= <user>
##$USERA4= <user>
##$USERA5= <user>
##$V9= 5
##$VALIST= <valist>
##$VCLIST= <CCCCCCCCCCCCCCC>
##$VD= 0
##$VDLIST= <DDDDDDDDDDDDDDD>
##$VPLIST= <PPPPPPPPPPPPPPP>
##$VTLIST= <TTTTTTTTTTTTTTT>
##$WBST= 1024
##$WBSW= 4
##$XGAIN= (0..3)
0 0 0 0 
##$XL= 0
##$YL= 0
##$YMAX_a= 9017
##$YMIN_a= -1938
##$ZGOPTNS= <>
##$ZL1= 120
##$ZL2= 120
##$ZL3= 120
##$ZL4= 120
##$ABSF1= 298.5841
##$ABSF2= -158.5842
##$ABSG= 5
##$ABSL= 5
##$ALPHA= 0
##$AQORDER= 0
##$ASSFAC= 0
##$ASSFACI= 0
##$ASSFACX= 0
##$ASSWID= 0
##$AUNMP= <proc_1d>
##$AXLEFT= 0
##$AXRIGHT= 0
##$AXTYPE= 0
##$AXUNIT= <>
##$AZFE= 0.1
##$AZFW= 0.5
##$BCFW= 0
##$BC_mod= 2
##$BYTORDP= 0
##$COROFFS= 0
##$CY= 12.5935478210449
##$DATMOD= 1
##$DC= 0
##$DFILT= <>
##$DTYPP= 0
##$F1P= 47.1127640792319
##$F2P= -24.0371245302204
##$FCOR= 0.5
##$FTSIZE= 32768
##$FT_mod= 6
##$GAMMA= 0
##$GB= 0
##$INTBC= 1
##$INTSCL= 7.269226e-011
##$ISEN= 30
##$LB= 12
##$LEV0= 0
##$LPBIN= 0
##$MAXI= 12.09355
##$MC2= 0
##$MEAN= 0
##$ME_mod= 0
##$MI= 0.7550151
##$NCOEF= 0
##$NC_proc= -13
##$NLEV= 6
##$NOISF1= 298.5841
##$NOISF2= 270.0111
##$NSP= 0
##$NTH_PI= 0
##$NZP= 0
##$OFFSET= 298.5841
##$PC= 1.4
##$PHC0= -11.94385
##$PHC1= 344.1545
##$PH_mod= 1
##$PKNL= yes
##$PPARMOD= 0
##$PPDIAG= 0
##$PPIPTYP= 0
##$PPMPNUM= 100
##$PPRESOL= 1
##$PSCAL= 0
##$PSIGN= 0
##$REVERSE= no
##$SF= 81.014009
##$SI= 32768
##$SIGF1= 270.0111
##$SIGF2= -158.5842
##$SINO= 77.54984
##$SIOLD= 32768
##$SREGLST= <31P.CDCl3>
##$SSB= 0
##$STSI= 32768
##$STSR= 0
##$SW_p= 37037.037037037
##$SYMM= 0
##$S_DEV= 0
##$TDeff= 32768
##$TDoff= 0
##$TI= <>
##$TILT= no
##$TM1= 0
##$TM2= 0
##$TOPLEV= 0
##$USERP1= <user>
##$USERP2= <user>
##$USERP3= <user>
##$USERP4= <user>
##$USERP5= <user>
##$WDW= 1
##$XDIM= 32768
##$YMAX_p= 305658098
##$YMIN_p= -37469596
$$ End of Bruker specific parameters
$$ ---------------------------------
##NTUPLES= NMR SPECTRUM
##VAR_NAME=  FREQUENCY,     SPECTRUM/REAL,   SPECTRUM/IMAG
##SYMBOL=    X,             R,               I
##VAR_TYPE=  INDEPENDENT,   DEPENDENT,       DEPENDENT
##VAR_FORM=  AFFN,          ASDF,            ASDF
##VAR_DIM=   32768,         32768,           32768
##UNITS=     HZ,            ARBITRARY UNITS, ARBITRARY UNITS
##FACTOR=    1.13031516577767, 1,            1
##FIRST=     37037.037037037, 10741563,      41357295
##LAST=      0,             174687,          -32187414
##MIN=       0,             -37469596,       0
##MAX=       37037.037037037, 305658098,     0
$$ Real data points
##PAGE= N=1
##DATA TABLE= (X++(R..R)), XYDATA
$$ [...]
17612a8964884K38404K41795J94242K38247M85456R45789J524258K080935K494808
17603a0520950K653462K458481J930904J258254O57672K26861k5647r7828J046
17594a457745K29226N14480P60557Q72121P90072N20995J58457j68355m04454
17585A815354n90560p39682p52691n52341k14091J53719N33443R14754J230016
17576A797921J409223J400877J184270Q42643N58037M76342O07376Q60462J114604
17567A0251755J236693J143244R11540P53412P96597R12002Q31150M14314k44948
17558A7005759r26243j417163j587585j455672j170388q41470m33365J22650P85445
17549A0081968J425148J922276K155789J963682J281951L11947n51213r91568
$$ y = [-18964884, -18726480, -18484685, -18290443, -18052196, -17566740, -16620951, -15096693, -13015758, -10520950, -7867488, -5409007, -3478103, -2219849, -1562177, -1335316, -1360963, -1458791, -1457745, -1228519, -714039, 46518, 918639, 1708711, 2229706, 2388163, 2219808, 1815354, 1224794, 485112, -267579, -819920, -1034011, -880292, -346849, 567905, 1797921, 3207144, 4608021, 5792291, 6634934, 7192971, 7669313, 8276689, 9137151, 10251755, 11488448, 12631692, 13543232, 14296644, 15093241, 16005243, 16836393, 17250707, 17005759, 16079516, 14662353, 13074768, 11619096, 10448708, 9607238, 9173873, 9296523, 10081968, 11507116, 13429392, 15585181, 17548863, 18830814, 19142761, 18591548, 17599980]
17541A7599980j005882q66630q50833j031779j292535j488621j599025j715522
17533G749153j913105k170858k366434k320391j925360j295128p40323n29371
17525e511817o93484j064267j440771j716247j863533j844806j642852j357834
17517a7135611j132738r98027q74356o90455m46910j72992J36379M97003Q61010
17508a9956697J094516J058717P60490M02923K13498K22163K58762J53280j26098
17499a5918446n06736q90760j186593j308706j194214q68704m74342j56163P0857
17490b2433807L19820P17925J288751J939213K527934K900842K908524K483074
17482g347724J725001R05203L59872L00290O75202J232934J703281J922375J845326
$$ y = [17599980, 16594098, 15727468, 14876635, 13844856, 12552321, 11063700, 9464675, 7749153, 5836048, 3665190, 1298756, -1021635, -2946995, -4242123, -4982446, -5511817, -6205301, -7269568, -8710339, -10426586, -12290119, -14134925, -15777777, -17135611, -18268349, -19266376, -20140732, -20831187, -21278097, -21451089, -21314710, -20817707, -19956697, -18862181, -17803464, -17042974, -16640051, -16426553, -16204390, -15945628, -15792348, -15918446, -16425182, -17315942, -18502535, -19811241, -21005455, -21874159, -22348501, -22504664, -22433807, -22113987, -21396062, -20107311, -18168098, -15640164, -12739322, -9830798, -7347724, -5622723, -4717520, -4357648, -4057358, -3382156, -2149222, -445941, 1476434, 3321760]
17473C321760J496361R28549K14607n59304j285750j839191k160926k322007k418952
17464d624853k452723k395664k302549k250953k216350k067717j662479r29240
17456b0902528N7239J009159J516851J324694N63875k86794p26406n78566m1192
17447a8063668N62648J042722J389264J642255J775267J732615J538388J304119
17439g076390J124191J003294Q90544P59526O46216O08862O45227O75216O15553
17430a07761M31322J37854j84495l86543l26678J3464M94340R01416J076746R98802
17420C048467P76814N73790M92376N33997O48224P35287O17465J33186p04548
17411F855058j647044k301018k369063j886098j212571p65722p39357j030087
$$ y = [3321760, 4818121, 5746670, 5961277, 5401973, 4116223, 2277032, 116106, -2205901, -4624853, -7077576, -9473240, -11775789, -14026742, -16243092, -18310809, -19973288, -20902528, -20845289, -19836130, -18319279, -16994585, -16430710, -16717504, -17443910, -18022476, -18063668, -17501020, -16458298, -15069034, -13426779, -11651512, -9918897, -8380509, -7076390, -5952199, -4948905, -4058361, -3298835, -2652619, -2043757, -1398530, -723314, -107761, 323561, 461415, 276920, -109623, -436301, -422837, 71503, 972919, 2049665, 3048467, 3825281, 4399071, 4891447, 5425444, 6073668, 6808955, 7426420, 7559606, 6855058, 5208014, 2906996, 537933, -1348165, -2560736, -3326458, -4065815, -5095902]
17403e095902j368391j519392j380475r44091k56688N71416J339466J803230J837557
17394e013270J547082J146186P69033M42991J43012k06051o97526j326831j936835
17385e132209k322334k370254k061861j408548m90027M85798J275856J770071
17377a0253508K021355K102981J994216J648683J125497N90271J77379r7382k48385
17368i38893k15080P2164N17116Q28375P64852L73170j12399n59852j016332j522520
17358a809399j986180k262561k243678j854234j087220r6259Q19027J398839J598348
17349g523317J558287J444717J343150J245367J081771P95100M08968P691l09763
17340E1971m37606l38706j20361N2736N3718k05291p17386j281403j586477j470173
$$ y = [-5095902, -6464293, -7983685, -9364160, -10308251, -10564939, -9993523, -8654057, -6850827, -5013270, -3466188, -2320002, -1550969, -1107978, -964966, -1171017, -1868543, -3195374, -5132209, -7454543, -9824797, -11886658, -13295206, -13785233, -13299435, -12023579, -10253508, -8232153, -6129172, -4134956, -2486273, -1360776, -770505, -593126, -690508, -938893, -1153973, -1081809, -564693, 263682, 1028534, 1401704, 1289305, 729453, -286879, -1809399, -3795579, -6058140, -8301818, -10156052, -11243272, -11339531, -10520504, -9121665, -7523317, -5965030, -4520313, -3177163, -1931796, -850025, -54925, 354043, 361734, 51971, -385635, -724341, -844702, -791966, -738248, -943539, -1660925, -2942328, -4528805, -5998978]
17330e998978j033892n21293j25390J10207K10155J33496k10900q05764j423882
17321i666241j762666j680669j255668o74622j28255K66250N36040Q03618J126802
17312a2435411J446120J680783J792537J739700J459791R59587L79616p0187k47571
17303c295035j79924k6412O0932J6026j49441l57046m94098n02177m15433k91042
17293e633650j51696o665J24492K13143K33857J78601O1040q1590k23650m10158
17283e696276p33471j204825j643077j755555j398396p37422j01783L15178N48055
17274a2407572O69975O47632M44257J57343m0951n1169J14843L89995P01526R98998
17264h375123J292580J674824K241875K932979L487269L627432L268754K506298
$$ y = [-5998978, -7032870, -7554163, -7679553, -7569346, -7359191, -7225695, -7436595, -8242359, -9666241, -11428907, -13109576, -14365244, -15039866, -15168121, -14901871, -14365831, -13562213, -12435411, -10989291, -9308508, -7515971, -5776271, -4316480, -3356893, -2977277, -3047464, -3295035, -3474959, -3501371, -3440439, -3424413, -3573854, -3930900, -4424998, -4927175, -5342608, -5633650, -5785346, -5792011, -5667519, -5454376, -5220519, -5041918, -4980878, -5062468, -5286118, -5696276, -6429747, -7634572, -9277649, -11033204, -12431600, -13169022, -13270805, -12955627, -12407572, -11737597, -11089965, -10645708, -10488365, -10529316, -10580485, -10465642, -10075647, -9374121, -8375123, -7082543, -5407719, -3165844, -232865, 3254404, 6881836, 10150590, 12656888]
17256A2656888J471061L00721q08822j623807j968783j834163j421823j044750
17248E726522r22806j063990j354118j720360k160332k666087l175506l551478
17240a0888155l613663l295529k737662k152498j640775j165250o71290j89221
17232b6354043J97876M53994O19188P65026R38842J130549J312858J502662J725612
17223a7707436J940744K075942K137025K211087K364103K583792K807632K970411
17215A383300L028282K959646K740993K321808J645202P13874l45906j296446
17207A3150753j911354k112467j983701j693648j417997j261026j229497j254332
17199B86731j204879r62395n33876p2419K58681M36817N58315O97083Q22043Q32367
$$ y = [12656888, 14127949, 14428670, 13619848, 11996041, 10027258, 8193095, 6771272, 5726522, 4803716, 3739726, 2385608, 665248, -1495084, -4161171, -7336677, -10888155, -14501818, -17797347, -20535009, -22687507, -24328282, -25493532, -26164822, -26354043, -26156167, -25702173, -25082985, -24317959, -23379117, -22248568, -20935710, -19433048, -17707436, -15766692, -13690750, -11553725, -9342638, -6978535, -4394743, -1587111, 1383300, 4411582, 7371228, 10112221, 12434029, 14079231, 14793105, 14447199, 13150753, 11239399, 9126932, 7143231, 5449583, 4031586, 2770560, 1541063, 286731, -918148, -1880543, -2414419, -2486838, -2228157, -1791340, -1233025, -535942, 286101, 1118468]
17189A118468O34814K04126l67529q89779j200184j267431j182011j092831j110707
17180e153064j201495j207072j013723o58803k49458J54118N08371P28897P74398
17171g317831P07720O08825N09848M03782K58796O6114j09139j99869k55182m02729
17161e729665p02888j089985j452460j705366j785946j661687j364045r68970
17153a6461012n28292l8608N08952J082532J642367K161296K587282K834237K817941
17144c393305K493622J895760J163389M83138r519k74886l65427l77287l61515
17135A253970k78822q2348J68824L52706M10947L60199K04007o8206l58744m62525
17125A500008k71139J07496M57040O14824N17952J87236k48556n75538o35793
$$ y = [1118468, 1753282, 1957408, 1589879, 700100, -500084, -1767515, -2949526, -4042357, -5153064, -6354559, -7561631, -8575354, -9234157, -9483615, -9329497, -8821126, -8092229, -7317831, -6610111, -6001286, -5491438, -5087656, -4828860, -4762746, -4871885, -5071754, -5326936, -5729665, -6432553, -7522538, -8974998, -10680364, -12466310, -14127997, -15492042, -16461012, -16989304, -17027912, -16518960, -15436428, -13794061, -11632765, -9045483, -6211246, -3393305, -899683, 996077, 2159466, 2642604, 2633085, 2358199, 1992772, 1615485, 1253970, 975148, 892800, 1061624, 1414330, 1825277, 2185476, 2389483, 2321277, 1962533, 1500008, 1228869, 1336365, 1793405, 2408229, 2926181, 3113417, 2864861, 2289323, 1653530]
17116A653530m32215p7361L07956O52201R40596J145656J163307Q85398L27827
17107F566895l35043q54487j094363j153877j204773j241592j085215n80726K24068
17098g59113J040270J536152J626326J507046J406961J380042J344346J218636
17090A0300666R57734N32695l8752o54192j143093j326488j108132n67566N8032
17081G010904N12206O40319M32326J9003l73471n45771m60719k55265j03531n5293
17071F820708j8219J08310L18879N10183N62449M19384J17934k51866o05462q76800
17061G105500r93282q84763n29719L9693P35838J391964J825615J996096K046505
17052A2733447K140821K297688K391664K277017J901602J329662P01907J93013
$$ y = [1653530, 1221315, 1143954, 1451910, 2104111, 3044707, 4190363, 5353670, 6239068, 6566895, 6231852, 5377365, 4283002, 3129125, 1924352, 682760, -402455, -983181, -759113, 281157, 1817309, 3443635, 4950681, 6357642, 7737684, 9082030, 10300666, 11258400, 11791095, 11752343, 11098151, 9955058, 8628570, 7520438, 6952872, 7010904, 7523110, 8163429, 8595755, 8614758, 8241287, 7695516, 7234797, 6979532, 6876001, 6820708, 6802489, 6910799, 7229678, 7739861, 8302310, 8721694, 8839628, 8587762, 7982300, 7105500, 6112218, 5227455, 4697736, 4737429, 5473267, 6865231, 8690846, 10686942, 12733447, 14874268, 17171956, 19563620, 21840637, 23742239, 25071901, 25773808, 25966821]
17044B5966821p9844j57135j81373k49672l68068n26226p66992j133559j574081
17035B0929871j948258k120064k047661j794190j461471j154415r73965r40498
17027H489349r59888r38248q71916q01582p45436o76602n36053k93205L0064M23041
17017C119524Q86084J336333J603589J551907J168770N53664j17613o46321r27009
17008H528928j002527r45472p42621l66301J15698N64536Q48749Q80880O31186
16999H513056J38093m90939j067925j358169j233405q04125l62986j84590l33378
16990B815632o53920r71741j250097j519267j741007j805246j626310j212322
16982g964278o72111j72737J63119L25398L58925K84925Q3195k51331n90964o84331
$$ y = [25966821, 25886977, 25729842, 25548469, 25298797, 24930729, 24404503, 23637511, 22503952, 20929871, 18981613, 16861549, 14813888, 13019698, 11558227, 10403812, 9429847, 8489349, 7529461, 6591213, 5719297, 4917715, 4172279, 3495677, 2959624, 2666419, 2696483, 3119524, 4005608, 5341941, 6945530, 8497437, 9666207, 10219871, 10102258, 9455937, 8528928, 7526401, 6580929, 5838308, 5472007, 5587705, 6152241, 7000990, 7881870, 8513056, 8651149, 8160210, 7092285, 5734116, 4500711, 3696586, 3333600, 3149010, 2815632, 2161712, 1189971, -60126, -1579393, -3320400, -5125646, -6751956, -7964278, -8636389, -8809126, -8646007, -8320609, -7961684, -7676759, -7593564, -7844895, -8435859, -9120190]
16972i120190l94948J19804N69390Q13397R00911R04166Q29230O67390M27351
16963d283499J05854k92114p05358j045803j244813j249660j035304o42681j94844
16954a0588222J23933J70985l4482l34078n60173o21175n05168k50973N5231K85646
16944a2258476L36170J97373n9425l59008o61320r47357j197717j383048j485153
16935a7817961j514876j471518j336845j162850j063498j056206j019315q43138
16927b7286207n36282j52362L12645R00815J618347K359748K884356K966098K598457
16918a4334385K008569J470058J119765R51460R54770J180331J616790K091187
16910b941455K364573K305071J954907J459906R58915N16494J38930j82616m73064
$$ y = [-9120190, -9515138, -9395334, -8825944, -8012547, -7111636, -6207470, -5378240, -4710850, -4283499, -4177645, -4469759, -5175117, -6220920, -7465733, -8715393, -9750697, -10393378, -10588222, -10464289, -10293304, -10327786, -10661864, -11222037, -11843212, -12348380, -12599353, -12544122, -12258476, -11922306, -11724933, -11784358, -12143366, -12804686, -13752043, -14949760, -16332808, -17817961, -19332837, -20804355, -22141200, -23304050, -24367548, -25423754, -26443069, -27286207, -27822489, -27974851, -27662206, -26761391, -25143044, -22783296, -19898940, -16932842, -14334385, -12325816, -10855758, -9735993, -8784533, -7829763, -6649432, -5032642, -2941455, -576882, 1728189, 3683096, 5143002, 6101917, 6618411, 6757341, 6574725, 6101661]
16901F101661p68555j071718j326579j446975j396276j254283j163849j215715
16893c542289j403647j644324j804542j742226j379436p51298o67O72238J107012
16884a0489179J260566J182787R43392O37661M23769M54066P69659J303359J939943
16875a573977K513668K794786K588940J915710J064719M15055J99842M31159R44089
16866A1293991J488983J866392J988871J838730J452002R49256N19616K87673
16858B1685514J80923K6020k41317n68372r37174j397419j937746k408356k621108
16849A1780965k497829k105022j577953r98177l57945L13341Q70531J192246J331642
16840G951799J441316J575098J645804J587552J454906J314814J138391Q56218
$$ y = [6101661, 5333106, 4261388, 2934809, 1487834, 91558, -1162725, -2326574, -3542289, -4945936, -6590260, -8394802, -10137028, -11516464, -12267762, -12268429, -11596191, -10489179, -9228613, -8045826, -7102434, -6464773, -6041004, -5586938, -4817279, -3513920, -1573977, 939691, 3734477, 6323417, 8239127, 9303846, 9718901, 9918743, 10349902, 11293991, 12782974, 14649366, 16638237, 18476967, 19928969, 20878225, 21397841, 21685514, 21866437, 21892457, 21651140, 21082768, 20145594, 18748175, 16810429, 14402073, 11780965, 9283136, 7178114, 5600161, 4601984, 4244039, 4557380, 5427911, 6620157, 7951799, 9393115, 10968213, 12614017, 14201569, 15656475, 16971289, 18109680, 18965898]
16832A8965898M89398J89316J12979K58050M36723M11598M7617o38534j519151
16823A8753894k401216l031066l167247k783749k160040j637716j327839j139559
16815A105462r86588q40966o28927k06788M86369J273811J802714J814374J361674
16806E181135P38553K12147j21296k66328k42251j00122N4889J27564R7192L332
16796E684815j20347k99536n92949j001693j436680j765976j839496j530416q74945
16787c777223j44236L12721L20058k8712m79897p89405q39738o47328k85657J65138
16777f194279N96738Q57496Q48120O37839M07305K73038K07811J22241K840m4887
16767b285738J18215N19961J001668J343020J454565J411118J354426J404476
$$ y = [18965898, 19455296, 19644612, 19757591, 20015641, 20452364, 20863962, 20911579, 20273045, 18753894, 16352678, 13321612, 10154365, 7370616, 5210576, 3572860, 2245021, 1105462, 118874, -722092, -1351019, -1557807, -1071438, 202373, 2005087, 3819461, 5181135, 5919688, 6131835, 6010539, 5744211, 5501960, 5401838, 5456727, 5584291, 5681483, 5684815, 5564468, 5264932, 4671983, 3670290, 2233610, 467634, -1371862, -2902278, -3777223, -3921459, -3608738, -3288680, -3317392, -3797289, -4586694, -5426432, -6073760, -6359417, -6194279, -5597541, -4740045, -3891925, -3254086, -2846781, -2573743, -2365932, -2243691, -2240851, -2285738, -2167523, -1647562, -645894, 697126, 2151691, 3562809, 4917235, 6321711]
16759F321711J605643J888808K062106J891398J301244M90481k31811o92675r12273
16750A3724632r91060r79786q48699n96942l65910l68799p01051j272001j898275
16741E702109k411164k703823k730196k506329k122063j684195j230679p54308
16733a0440648k95947N2022K47958L51152M41283N40165O16613O22437N30379
16724g334586L78177K84022L72521O59224J035087J376331J622039J736950J667783
16715A797548J380800R22335M11928m1218m06268o91204q62165q64967p39361
16706I07428o30789o35362p11434p84054q26327q04287o61390l90226m0014L35446
16696d241009O69026Q45556P34317K80204m29469j188651j765092k000395j859761
$$ y = [6321711, 7927354, 9816162, 11878268, 13769666, 15070910, 15561391, 15329580, 14636905, 13724632, 12733572, 11753786, 10905087, 10308145, 9942235, 9573436, 8872385, 7600384, 5702109, 3290945, 587122, -2143074, -4649403, -6771466, -8455661, -9686340, -10440648, -10736595, -10684573, -10436615, -10085463, -9644180, -9104015, -8487402, -7864965, -7334586, -6956409, -6672387, -6299866, -5640642, -4605555, -3229224, -1607185, 129765, 1797548, 3178348, 4100683, 4512611, 4471393, 4065125, 3373921, 2511756, 1646789, 907428, 276639, -358723, -1070157, -1854211, -2680538, -3484825, -4146215, -4536441, -4576455, -4241009, -3571983, -2726427, -1992110, -1711906, -2141375, -3330026, -5095118, -7095513, -8955274]
16687h955274j397522o75097K46430J185899J809593J845040J302314M48546l86801
16678d576872r87766j321918j474506j535906j546678j472640j240590q44231
16670a5001107l86060l5471L8964k35471p50865j258288j552359j623067j603829
16661b2407553j593376j565827j433911j172496q72323o56416n71918n91311o66349
16652c1531480p37142p10797m84731k4190O07332J307906J985723K535778K827238
16643b4224363K760462K348458J750606J199921Q62486P65891Q67482J122703
16635a2546354J413619J529074J342526R22088M45029Q2736p8444p3733j7116
16626f980575J3759N6579K13083N15054Q42961R85348P80053K19279n57861j362798
$$ y = [-8955274, -10352796, -11027893, -10781463, -9595564, -7785971, -5940931, -4638617, -4190071, -4576872, -5564638, -6886556, -8361062, -9896968, -11443646, -12916286, -14156876, -15001107, -15387167, -15422638, -15383674, -15619145, -16370010, -17628298, -19180657, -20803724, -22407553, -24000929, -25566756, -27000667, -28173163, -29045486, -29701902, -30273820, -30865131, -31531480, -32268622, -32979419, -33464150, -33488340, -32881008, -31573102, -29587379, -27051601, -24224363, -21463901, -19115443, -17364837, -16164916, -15302430, -14536539, -13669057, -12546354, -11132735, -9603661, -8261135, -7339047, -6894018, -6811282, -6889726, -6963459, -6980575, -6966816, -6910237, -6697154, -6182100, -5339139, -4353791, -3573738, -3354459, -3912320, -5275118]
16616e275118k035144k444528k471133k052013j285413m34620K36111O18098P38954
16607a4404806O68788N14091M29806N23251P08158P26740L93799k12598q07146
16598a1459917j110709j026342o40244j00794M67393R59358J282932J422918J476615
16589h728790J546807J624834J640034J524670J174951M83674n39619j706145
16581b979584k681266l120391k889414k187594j382405p15648k10186K26508P16853
16572a5223127J348790K075387K691263K942527K693721K049575J326850Q89237
16564G94223R51458J445451K039661K336645K132230J526801P96247J69017l00987
16555A1890746o78645j009437j282601j474577j561723j502937j229590o96558
$$ y = [-5275118, -7310262, -9754790, -12225923, -14277936, -15563349, -15997969, -15761858, -15143760, -14404806, -13736018, -13221927, -12792121, -12268870, -11560712, -10833972, -10440173, -10652771, -11459917, -12570626, -13596968, -14237212, -14338006, -13870613, -12911255, -11628323, -10205405, -8728790, -7181983, -5557149, -3917115, -2392445, -1217494, -733820, -1273439, -2979584, -5660850, -8781241, -11670655, -13858249, -15240654, -15956302, -16166488, -15939980, -15223127, -13874337, -11798950, -9107687, -6165160, -3471439, -1421864, -95014, 794223, 1745681, 3191132, 5230793, 7567438, 9699668, 11226469, 12022716, 12191733, 11890746, 11212101, 10202664, 8920063, 7445486, 5883763, 4380826, 3151236, 2454678]
16547B454678L197O19993R13624Q34488N23470J86813M769M9489K33753M13040
16537F237314N03930M65087K60956j14625o28794j215265j765976k159576k339852
16528g56801k343759k236888k056553j795987j400018q31441j91295K78474L91969
16519a0942299K34318J31672L65054R07094J467444J782034J775865J475795R09256
16510a893767J59945n41762r17239r03066p45882p16143p95410p52979m55437
16501g561740l707M24489P97404J252949J909888K663896L203795L257442K807091
16492H751507K074964J324465O78545J01244m95834j165587j888083k540436k940480
16483C900305k957956k548724j720828n72179O63396J704320K360084K590787
$$ y = [2454678, 2457875, 3077868, 3991492, 4825980, 5349450, 5536263, 5541032, 5590521, 5824274, 6237314, 6741244, 7206331, 7467287, 7352662, 6723868, 5508603, 3742627, 1583051, -756801, -3100560, -5337448, -7394001, -9189988, -10590006, -11421447, -11612742, -11334268, -10942299, -10707981, -10576309, -10211255, -9304161, -7836717, -6054683, -4278818, -2803023, -1893767, -1733822, -2275584, -3192823, -4095889, -4841771, -5557914, -6353324, -7106303, -7561740, -7565447, -7140958, -6343554, -5090605, -3180717, -516821, 2686974, 5944416, 8751507, 10826471, 12150936, 12829481, 12930725, 12434891, 11269304, 9381221, 6840785, 3900305, 942349, -1606375, -3327203, -3899382, -3235986, -1531666, 828418, 3419205]
16475C419205K481313K174660J822820J576961J543002J687588J814078J673329
16467A8192956J129007K65430o44146j322233j672796j759648j631296j252438
16459A1304836o18343J30555P58594J067304R84343O06606J67686j13966j99909
16450A4087706k16873k65854l11924k82573j91533j18925j05839j06089p5036
16441A2413060q4273k69247o73275j201372j709959k051106k050742j613867q86205
16432A873014j70189L39384O10541O28484M00445N8957k47075n06050p48840r20441
16422A318230r35574p60063m12765K3434L94502N65146N45753M98289N90017Q56947
16412B683916J235177J669894K109400K419390K437739K160918J755616J352362
$$ y = [3419205, 5900518, 8075178, 9897998, 11474959, 13017961, 14705549, 16519627, 18192956, 19321963, 19587393, 18943247, 17621014, 15948218, 14188570, 12557274, 11304836, 10686493, 10817048, 11575642, 12642946, 13627289, 14233895, 14401581, 14287615, 14087706, 13870833, 13604979, 13293055, 13010482, 12818949, 12700024, 12594185, 12488096, 12413060, 12328787, 12059540, 11386265, 10184893, 8474934, 6423828, 4373086, 2759219, 1873014, 1702825, 2042209, 2652750, 3281234, 3681679, 3740636, 3493561, 2987511, 2238671, 1318230, 382656, -377407, -790172, -766738, -372236, 192910, 738663, 1236952, 1826969, 2683916, 3919093, 5588987, 7698387, 10117777, 12555516, 14716434, 16472050, 17824412]
16404A7824412R25181L94314k30009q59838j423536j864470k077383j929348j370423
16395I388900n05455M67734J404387K254724K924506L195754K905856K146947
16387B4183353J199539K96643n20382j343925k206902k952298l336197l250453
16379A2069378k795934k160357j496181r17608n05031k41857k5331K01872L96794
16370D525745N23130O43119Q32798J023688J030491P65198L46314m2449l31177
16361I316857n35190o22129n15423k31158P0236K29128K29428J31415q5577m96843
16351G490744j068249j638707k057533k279150k344332k313975k233932k125270
16343h570404j959623j686504j336794j028076q26427o32072k20857N55633J581156
$$ y = [17824412, 18749593, 19143907, 18913898, 18054060, 16630524, 14766054, 12688671, 10759323, 9388900, 8883445, 9351179, 10755566, 13010290, 15934796, 19130550, 22036406, 24183353, 25382892, 25679535, 25159153, 23815228, 21608326, 18656028, 15319831, 12069378, 9273444, 7113087, 5616906, 4699298, 4194267, 3952410, 3927079, 4128951, 4525745, 5048875, 5691994, 6524792, 7548480, 8578971, 9344169, 9690483, 9648034, 9316857, 8781667, 8159538, 7644115, 7412957, 7483193, 7712321, 7941749, 8073164, 7987587, 7490744, 6422495, 4783788, 2726255, 447105, -1897227, -4211202, -6445134, -8570404, -10530027, -12216531, -13553325, -14581401, -15407828, -16039900, -16260757, -15705124, -14123968]
16334a4123968K517730L064425L163198K955252K579080K087299J548309J094626
16326D885951Q21434P08213O73340O75543P30342Q28327Q72260P59161N29655
16317A1484226L80178N13846J012993J856956K968627M177610N178194N593515
16309C3166145N113320L590174J105730j908161m663258o430356p026728o760274
16301A6186592o040068n168936m303913l425555k434251j342965l12281N22890
16293f318487J202940J859473K532396L142875L583454L757465L599795L147642
16285A6507553K534789J883250J252495O78282J84971k47948o50507j003997j268299
16276A9870589j396416j296883q97769k94225K75279O25903P12851N48689J71946
$$ y = [-14123968, -11606238, -8541813, -5378615, -2423363, 155717, 2243016, 3791325, 4885951, 5707385, 6415598, 7088938, 7764481, 8494823, 9323150, 10195410, 10954571, 11484226, 11864404, 12378250, 13391243, 15248199, 18216826, 22394436, 27572630, 33166145, 38279465, 41869639, 42975369, 41067208, 36403950, 29973594, 22946866, 16186592, 10146524, 4977588, 673675, -2751880, -5186131, -6529096, -6841377, -6318487, -5115547, -3256074, -723678, 2419197, 6002651, 9760116, 13359911, 16507553, 19042342, 20925592, 22178087, 22856369, 23041340, 22793392, 22142885, 21138888, 19870589, 18474173, 17177290, 16279521, 15985296, 16260575, 16886478, 17599329, 18148018, 18319964]
16267A8319964k88267o43084p80092p28434n95254m76502m23762m38799m91824
16258A3453946n73271o99042q66064j035681j157971j220605j263721j290395
16250E347196j180600q04935k41188K18961K99457l9228n68411r81341j121804
16241I28107j029789q21477n63050k56701Q9627M40511P67345J032933J161339
16232A748845J082280Q04220M25239N1113k67248m86031n26917l36746L1488M59781
16222B986024R03114J415049K001512K497311K640548K292046J591435Q68965
16214A7196004L76992J30392n846j45581k95370l79712l60914l25077l94368n85855
16204A5210665p94429q99150q72973p83087p24197p53047q58110j001606j141796
$$ y = [18319964, 18031697, 17388613, 16608521, 15880087, 15284833, 14808331, 14384569, 13945770, 13453946, 12880675, 12181633, 11315569, 10279888, 9121917, 7901312, 6637591, 5347196, 4166596, 3361661, 3120473, 3339434, 3638891, 3599663, 3031252, 2049911, 928107, -101682, -923159, -1486209, -1742910, -1653283, -1212772, -445427, 587506, 1748845, 2831125, 3635345, 4060584, 4111697, 3844449, 3358418, 2831501, 2494755, 2526243, 2986024, 3889138, 5304187, 7305699, 9803010, 12443558, 14735604, 16327039, 17196004, 17572996, 17703388, 17697542, 17551961, 17256591, 16876879, 16515965, 16190888, 15796520, 15210665, 14416236, 13517086, 12644113, 11861026, 11136829, 10383782, 9525672, 8524066, 7382270]
16195G382270j211770j172268j076622j005049r33808p25851k87689K86367P49430
16186B005010Q44674M50214l30210j223518j937376k262450k104845j523928p51541
16177f833970j08980J65450J02252j7657N4183L37266O89613R48054J034621R79427
16167b649741Q52285P26528O58768O55334P06357Q06994Q98541Q68948O71171
16158D195185M23355L56921O28946J176226J770492K182200K256400J925363J257631
16149A6172719M73701j42576m04411l38769j20184J07431L19756N47249P67781
16140A7382697R02366R01045P94470O70005O00615N78406N32519M14162K55157
16131B3031442J33857O2679o9330l98297r53088j630166k230782k560115k568740
$$ y = [7382270, 6170500, 4998232, 3921610, 2916561, 1982753, 1256902, 969213, 1255580, 2005010, 2849684, 3299898, 2969688, 1746170, -191206, -2453656, -4558501, -6082429, -6833970, -6942950, -6777500, -6675248, -6692905, -6638722, -6301456, -5611843, -4663789, -3629168, -2649741, -1797456, -1070928, -412160, 243174, 949531, 1756525, 2655066, 3524014, 4195185, 4618540, 4975461, 5604407, 6780633, 8551125, 10733325, 12989725, 14915088, 16172719, 16646420, 16503844, 16099433, 15760664, 15640480, 15747911, 16067667, 16614916, 17382697, 18285063, 19186108, 19980578, 20650583, 21251198, 21829604, 22362123, 22776285, 23031442, 23165299, 23227978, 23158648, 22760351, 21807263, 20177097, 17946315, 15386200, 12817460]
16122A2817460k347199k000501j618193j324413j273202j568039k153608k786918
16114b254613l175285l143798k678286j895215r94774j91356L70703O77661Q16780
16105a2468183Q59844Q24202P50137O98409O80293O58167N74687L68856K3255
16096g030333l63494n80887m58716l0580N02789R64672J322402J635054J924554
16087b114539K137007K214194K163135K061418K000332K018587K075125K044316
16079A4599575J776765J246179N95893K3922l18420l94297l19727k62836k85582
16070A6661472l29745l40993l39772l60381l71494l13686k04058j35212j61651
16061A4104480k15799j58193P3076L93643O38215O24560K29141m82566j239999
$$ y = [12817460, 10470261, 8469760, 6851567, 5527154, 4253952, 2685913, 532305, -2254613, -5429898, -8573696, -11251982, -13147197, -14141971, -14333327, -13962624, -13284963, -12468183, -11608339, -10784137, -10034000, -9335591, -8655298, -7997131, -7422444, -7053588, -7030333, -7393827, -7974714, -8433430, -8464010, -7961221, -6996549, -5674147, -4039093, -2114539, 22468, 2236662, 4399797, 6461215, 8461547, 10480134, 12555259, 14599575, 16376340, 17622519, 18218412, 18242334, 17923914, 17529617, 17209890, 16947054, 16661472, 16331727, 15990734, 15650962, 15290581, 14919087, 14605401, 14401343, 14266131, 14104480, 13888681, 13730488, 13803564, 14197207, 14835422, 15459982, 15689123, 15206557, 13966558]
16052A3966558j754766j911615j796727j616187j560340j664187j805095j839448
16044A8193j677585j281132p28483k48596p3755k60669o80517j135189j421706
16035g489439j357899q99528k39134L06317N28920M66199L53254M11840O33894
16026g285576Q05540P55668M93673P6743n27954j322942k089345k473471k292783
16017a3860447j695525j031674n88678l99094k71297O87M75436J051911J555793
16008a4762888J873194K015086K027603J879757J504140R28782L20049j12967
16000d327244k58509j41562J49690N19942Q77613J161594J353775J463166J521999
15991B320464J583818J686293J794390J812841J684366J435898J133816Q64925
$$ y = [13966558, 12211792, 10300177, 8503450, 6887263, 5326923, 3662736, 1857641, 18193, -1659392, -2940524, -3669007, -3917603, -3991358, -4252027, -4932544, -6067733, -7489439, -8847338, -9746866, -9986000, -9679683, -9150763, -8684564, -8331310, -7919470, -7285576, -6480036, -5724368, -5230695, -5153952, -5681906, -7004848, -9094193, -11567664, -13860447, -15555972, -16587646, -17176324, -17575418, -17846715, -17846028, -17370592, -16318681, -14762888, -12889694, -10874608, -8847005, -6967248, -5463108, -4534326, -4214277, -4327244, -4585753, -4727315, -4577625, -4057683, -3180070, -2018476, -664701, 798465, 2320464, 3904282, 5590575, 7384965, 9197806, 10882172, 12318070, 13451886, 14316811]
15983A4316811P35577Q02922R82460J076158R35962N63119M3852n28060j057406
15974A7871395j476180j771953j954136k042784k049786j904129j509000r27893
15966D235534l67136N7845M22621Q32426J260314J596344J757815J706068J444328
15957A2946159J025398N53907K10431J61506L70674O27429P80610Q48767R38717
15948A8463598J129561J405776J664459J786504J714729J504165J277003J070175
15940C0015970P87840L73332l0527j73204M2700M36425P00366O54671L47027m9406
15930C3105194l70346n22541n05916l96488k85684k48630l33670n15127o92866
15921B9233926p88434p98100p29951n52818k50902J40919O17663J217213J895865
$$ y = [14316811, 15052388, 15855310, 16837770, 17913928, 18849890, 19413009, 19456861, 18928801, 17871395, 16395215, 14623262, 12669126, 10626342, 8576556, 6672427, 5163427, 4235534, 3868398, 3926243, 4348864, 5181290, 6441604, 8037948, 9795763, 11501831, 12946159, 13971557, 14525464, 14735895, 14897401, 15268075, 15895504, 16676114, 17524881, 18463598, 19593159, 20998935, 22663394, 24449898, 26164627, 27668792, 28945795, 30015970, 30803810, 31177142, 31146615, 30973411, 31016111, 31452536, 32152902, 32807573, 33154600, 33105194, 32734848, 32212307, 31706391, 31309903, 31024219, 30775589, 30441919, 29926792, 29233926, 28445492, 27647392, 26917441, 26364623, 26113721, 26254640, 26872303, 28089516, 29985381]
15912B9985381K488556K813493K767515K327337J527213M88993n81171j490248
15904D0327069k146135k536314k653496k490678k084004j539536j025833o82205
15896B5168868n26531n01292n65795p00748q96368j171810j530211j894870k147913
15887A5233330k173341j856957j177014k93934N18047R81623R06135L04506n70437
15878A1871958j355092j775038j763544j404213p77655Q0997J058853J866658
15870G802924K151478J756038Q50947k13918j134216j709180j818076j468376
15862F217621q36552j77118L22886N92934O42416N17883K85375K7506j54083j30879
15852G307989K07990Q59710J662060K367286K790309K884523K714562K415709
$$ y = [29985381, 32473937, 35287430, 38054945, 40382282, 41909495, 42398488, 41817317, 40327069, 38180934, 35644620, 32991124, 30500446, 28416442, 26876906, 25851073, 25168868, 24642337, 24141045, 23575250, 22874502, 21978134, 20806324, 19276113, 17381243, 15233330, 13059989, 11203032, 10026018, 9732084, 10250131, 11231754, 12137889, 12442395, 11871958, 10516866, 8741828, 6978284, 5574071, 4796416, 4877413, 5936266, 7802924, 9954402, 11710440, 12561387, 12347469, 11213253, 9504073, 7685997, 6217621, 5381069, 5203951, 5526837, 6119771, 6762187, 7280070, 7565445, 7592951, 7438868, 7307989, 7515979, 8375689, 10037749, 12405035, 15195344, 18079867, 20794429, 23210138]
15844B3210138K123197J871030J576751J142349N91483J26144n606K41256O11131
15835C1487873P40761M41715j96902r23275j495300j795267j862165j833808j828985
15826B2734647j844710j766961j484167r80118l70179J24638L07479J58902j56128
15817A6723403m21063m89924l74622k64153l81463q04033j446771k152435k735820
15808G653119l002558k829680k261807j496703p63655k13954J02617K16863K27304
15799b368454K39913K82113K99181K42948J61917J69488K98083M36379M55399
15790B16967L48938K31225K28828L48154M46015L64667P3636l12722o11976o73201
15780F60531m33561Q4861P77629J464666J972800K213030K151495J769509J116794
$$ y = [23210138, 25333335, 27204365, 28781116, 29923465, 30514948, 30641092, 30635486, 30876742, 31487873, 32228634, 32670349, 32473447, 31550172, 30054872, 28259605, 26397440, 24563632, 22734647, 20889937, 19122976, 17638809, 16658691, 16288512, 16413150, 16720629, 16879531, 16723403, 16302340, 15812416, 15437794, 15173641, 14792178, 13988145, 12541374, 10388939, 7653119, 4650561, 1820881, -440926, -1937629, -2701284, -2915238, -2812621, -2595758, -2368454, -2128541, -1846428, -1547247, -1304299, -1142382, -972894, -674811, -238432, 216967, 565905, 797130, 1025958, 1374112, 1820127, 2184794, 2258430, 1945708, 1333732, 660531, 226970, 311831, 1089460, 2554126, 4526926, 6739956, 8891451, 10660960, 11777754]
15771A1777754L72982k22239n24793n81440n79146o77117q89700j114865j232596
15762F328840j187861j027219q77950q38633q57054p66145m51471L2768M93595
15753H48870P59663Q14566P44134O09972M39356K96445L03489N60804J038836
15744F416135J570355J949877K055811J904382J601996J263971R60373P06078
15736A8428978M84112K66346M7400j37260k71001l99309n79913q36846j168523
15727A5833984j546436j901411k150179k210723j967322j315343l05448P97405
15719E234527J657023K101276K208311K180445K141306K026278J679385J071505
15711B0300056L96071p0055j44642K18701R22515J716040K319368K613526K670526
$$ y = [11777754, 12150736, 11928497, 11403704, 10822264, 10243118, 9566001, 8676301, 7561436, 6328840, 5140979, 4113760, 3235810, 2397177, 1540123, 773978, 322507, 355275, 848870, 1608533, 2423099, 3167233, 3777205, 4216561, 4513006, 4816495, 5377299, 6416135, 7986490, 9936367, 11992178, 13896560, 15498556, 16762527, 17722900, 18428978, 18913090, 19179436, 19226836, 19089576, 18818575, 18419266, 17839353, 17002507, 15833984, 14287548, 12386137, 10235958, 8025235, 6057913, 4742570, 4437122, 5234527, 6891550, 8992826, 11201137, 13381582, 15522888, 17549166, 19228551, 20300056, 20696127, 20626072, 20481430, 20700131, 21622646, 23338686, 25658054, 28271580, 30942106]
15702C0942106K621165K504156K210716J624457Q07126l4946p06539j098684j209326
15693C7660231j148615j085698j151520j366515j636501j819708j819638j632593
15685B5999443j340718j047505p75305m72034j18505K46289N78262Q33182R40376
15676B4843485Q40479N50628J47561k76788o01272p00323n59597l31950k05568
15667B3706655k27489k86637k13340J02783O10971J096492J272189Q96340p0519
15658B6887445j356759k507156l181327l298664k919334k126304j065566K5934
15650A0458269R15498J480649J717769J686812J486864J266448J194001J377162
15642B1583472J772782K174401K337597K135851J609564R11106K28362k87310
$$ y = [30942106, 33563271, 36067427, 38278143, 39902600, 40709726, 40674780, 39968241, 38869557, 37660231, 36511616, 35425918, 34274398, 32907883, 31271382, 29451674, 27632036, 25999443, 24658725, 23611220, 22835915, 22363881, 22245376, 22491665, 23069927, 23903109, 24843485, 25683964, 26234592, 26382153, 26105365, 25504093, 24803770, 24244173, 23912223, 23706655, 23479166, 23192529, 22979189, 23081972, 23692943, 24789435, 26061624, 26957964, 26887445, 25530686, 23023530, 19842203, 16543539, 13624205, 11497901, 10432335, 10458269, 11373767, 12854416, 14572185, 16258997, 17745861, 19012309, 20206310, 21583472, 23356254, 25530655, 27868252, 30004103, 31613667, 32524773, 32753135, 32465825]
15634C2465825n86236p21835p97627r07833j069751j219157j290298j246925j041405
15625B3584758o20712J9544P88262J482503J897594K007876J966208J931016J962964
15616C5020013K046199K135172K186389K165111K016160J668080J101880L85052
15608D8724056l52393r36937j196491j062675o36548j40089J81906J58927k35801
15599D4503955q90958j595082k077186k108931j654121r08533j71937L13811M67137
15590C5878155L81870K20774P0152j09613l99574p82036j113449j251754j155216
15581C1739309q43394l34202L25491J015377J593884J994207K236125K319756
15573D0046553K165046J734643J169223O84729L46516M0570l53252q48014j358416
$$ y = [32465825, 31879589, 31157754, 30360127, 29452294, 28382543, 27163386, 25873088, 24626163, 23584758, 22964046, 22983590, 23771852, 25254355, 27151949, 29159825, 31126033, 33057049, 35020013, 37066212, 39201384, 41387773, 43552884, 45569044, 47237124, 48339004, 48724056, 48371663, 47434726, 46238235, 45175560, 44539012, 44398923, 44580829, 44739756, 44503955, 43612997, 42017915, 39940729, 37831798, 36177677, 35269144, 35097207, 35411018, 35878155, 36260025, 36480799, 36550951, 36441338, 36041764, 35259728, 34146279, 32894525, 31739309, 30895915, 30561713, 30887204, 31902581, 33496465, 35490672, 37726797, 40046553, 42211599, 43946242, 45115465, 45800194, 46146710, 46187280, 45834028, 44986014, 43627598]
15564D3627598j741356j899640j888564j835800j760412j564658j192666p24204
15556C1020298l02098N432K34886M33572O24084Q53400J172909J556731J889520
15547C7488734K074052K108113K017973J816208J556568J354575J310669J404626
15539E1131518J506677J518630J454539J366897J234282R53131M68730p7831l90022
15530E9166551k65640K16203P68650J117801J184167J062406Q54679O27730M84769
15521F5217316N37227P74219J005351R58187M67007l81485j283071j893477k021429
15512F3379845j738337j297844r41859p81614p88635q38973p77501m97094O502
15503E5724490O52471J306853J778234J892690J659716J303785J087162J115987
$$ y = [43627598, 41886242, 39986602, 38098038, 36262238, 34501826, 32937168, 31744502, 31020298, 30718200, 30723632, 30958518, 31392090, 32016174, 32869574, 34042483, 35599214, 37488734, 39562786, 41670899, 43688872, 45505080, 47061648, 48416223, 49726892, 51131518, 52638195, 54156825, 55611364, 56978261, 58212543, 59165674, 59634404, 59556573, 59166551, 58900911, 59117114, 59885764, 61003565, 62187732, 63250138, 64104817, 64732547, 65217316, 65754543, 66528762, 67534113, 68492300, 68959307, 68577822, 67294751, 65401274, 63379845, 61641508, 60343664, 59401805, 58620191, 57831556, 56992583, 56215082, 55717988, 55724490, 56376961, 57683814, 59462048, 61354738, 63014454, 64318239, 65405401, 66521388]
15495F6521388J318576J558498J694493J603092J249873P01686M7574o33552j222086
15486G2839542j572585j622374j449136j208792j018207r05582q58668q80638
15478F3323560j001894j243074j552266j798777j836650j565630r79152j80095
15470E3166022O69854J422521J989243K355600K539114K496894K131114J434801
15462F8205163N83301j45939n24718m79962j12027L77865P92073J016481J053378
15453G0765615R87043Q98266P98917O47037M40748K87016L19447N72755R80397
15444G6697241J437152J832221K083131K196909K276755K416839K582072K617390
15436I4139710K394933J931083J340852P30690J88231j78066k68163o0568L32008
$$ y = [66521388, 67839964, 69398462, 71092955, 72696047, 73945920, 74647606, 74695180, 74061628, 72839542, 71266957, 69644583, 68195447, 66986655, 65968448, 65062866, 64204198, 63323560, 62321666, 61078592, 59526326, 57727549, 55890899, 54325269, 53346117, 53166022, 53835876, 55258397, 57247640, 59603240, 62142354, 64639248, 66770362, 68205163, 68788464, 68642525, 68117807, 67637845, 67525818, 67903683, 68695756, 69712237, 70765615, 71752658, 72650924, 73449841, 74096878, 74537626, 74824642, 75144089, 75716844, 76697241, 78134393, 79966614, 82049745, 84246654, 86523409, 88940248, 91522320, 94139710, 96534643, 98465726, 99806578, 100537268, 100725499, 100547433, 100279270, 100218702, 100550710]
15427A00550710O98264Q93838R60280J037991J198932J386539J448323J210238
15419A09385115O10589k22569j074078j822163k510608l218379l906461m440566
15411I2800880m668413m489273l954882l264549k622992k125695j748678j386096
15403F8540302r09683k72481M16267R66456J265639J348435J342269J365139J466789
15394G5529132J646807J897258K199226K501266K737910K862339K848636K685748
15386I4908322K385354J995241J600662J266596R67217O45337L59962K80773N24588
15377A04934052J072600J817604K607937L274288L675171L718515L360906K624415
15369A27085488J616042M90026o22609j614530k356322k713640k610587k076497
$$ y = [100550710, 101248974, 102142812, 103103092, 104141083, 105340015, 106726554, 108174877, 109385115, 109995704, 109773135, 108699057, 106876894, 104366286, 101147907, 97241446, 92800880, 88132467, 83643194, 79688312, 76423763, 73800771, 71675076, 69926398, 68540302, 67630619, 67358138, 67774405, 68740861, 70006500, 71354935, 72697204, 74062343, 75529132, 77175939, 79073197, 81272423, 83773689, 86511599, 89373938, 92222574, 94908322, 97293676, 99288917, 100889579, 102156175, 103123392, 103768729, 104128691, 104409464, 104934052, 106006652, 107824256, 110432193, 113706481, 117381652, 121100167, 124461073, 127085488, 128701530, 129191556, 128568947, 126954417, 124598095, 121884455, 119273868, 117197371]
15361A17197371j255316l37068N28530J243173J748906K045264K182435K204196
15353A25557491K120657J935575J668347J357672J041513P42364M97751L69282
15345A35290652L76958M55743N06073M49471K22983k16864q41776j509607j975897
15336A32757736j990798j468238n59737M98443J561046K540239L296969L670248
15328A40305908L594503L122748K343916J358099L42813m45092p90198o53951
15320A49178746j82402M41305J134678J881533K607366L177277L514735L615928
15312A65369166L432635K860586J905794P86660k13742r69820j539738j997941
15304A69633600k302201k338314k048640j533292j032204p22091n39846k78093
$$ y = [117197371, 115942055, 115604987, 116133517, 117376690, 119125596, 121170860, 123353295, 125557491, 127678148, 129613723, 131282070, 132639742, 133681255, 134423619, 134921370, 135290652, 135667610, 136123353, 136629426, 137078897, 137301880, 137085016, 136243240, 134733633, 132757736, 130766938, 129298700, 128738963, 129237406, 130798452, 133338691, 136635660, 140305908, 143900411, 147023159, 149367075, 150725174, 151067987, 150622895, 149832697, 149178746, 148996344, 149437649, 150572327, 152453860, 155061226, 158238503, 161753238, 165369166, 168801801, 171662387, 173568181, 174354841, 174141099, 173171279, 171631541, 169633600, 167331399, 164993085, 162944445, 161411153, 160378949, 159656858, 159117012, 158838919]
15296A58838919J68892O74189R80260R28781N71714P8348l98494p67325j009257
15287A60066027j155179j195571j058086p02971j95824L14192O84967Q57442Q27175
15278A58442172N91661J84148l07395p83248j147762j348650j446892j569701
15270A52614333j771646j988417k133901k194174k185942k071622j789454j348500
15262A37130677q39735l71408J2848L81347Q50769J468093K169804K831722L310923
15253A46945040L458146L180443K535034J724214R67898L83254l1827l18564m55406
15244A58388232l56710J3709N90801J278491J997482K673125L213723L512400
15236A71311253L495221L173292K653735K110310J725976J643323J959546K715361
$$ y = [158838919, 159007811, 159682000, 160662260, 161591041, 162162755, 162241103, 161842609, 161075284, 160066027, 158910848, 157715277, 156657191, 155954220, 155758396, 156072588, 156757555, 157614997, 158442172, 159033833, 159217981, 158910586, 158127338, 156979576, 155630926, 154184034, 152614333, 150842687, 148854270, 146720369, 144526195, 142340253, 140268631, 138479177, 137130677, 136290942, 135919534, 135932382, 136313729, 137164498, 138632591, 140802395, 143634117, 146945040, 150403186, 153583629, 156118663, 157842877, 158810775, 159194029, 159162202, 158843638, 158388232, 158031522, 158045231, 158636032, 159914523, 161912005, 164585130, 167798853, 171311253, 174806474, 177979766, 180633501, 182743811, 184469787, 186113110, 188072656, 190788017]
15228A90788017L818354M982578N807039N967413N363350M114574K450801O13345
15220B23905471j159890k620612l555651l850034l474681k465944r75430P00449
15212B06503678K186107L157996L459593L139819K439979J715195J264270J173785
15204B25040422J299766J392814J269515Q99915L68972k19602q16113j428709
15196B27806980k081209k756463l342079l659407l607658l270659k841659k484896
15188B03762950k294834k296767k421647k555270k695111k976961l445734l890620
15180A81186006m023404l747345l180111k501895j848757j323738j026845r91813
15172A62542098j119188j236234j225230j102555r93564j000055j077429j093244
$$ y = [190788017, 194606371, 199588949, 205395988, 211363401, 216726751, 220841325, 223292126, 223905471, 222745581, 220124969, 216569318, 212719284, 209244603, 206778659, 205803229, 206503678, 208689785, 211847781, 215307374, 218447193, 220887172, 222602367, 223866637, 225040422, 226340188, 227733002, 229002517, 229902432, 230271404, 230051802, 229235689, 227806980, 225725771, 222969308, 219627229, 215967822, 212360164, 209089505, 206247846, 203762950, 201468116, 199171349, 196749702, 194194432, 191499321, 188522360, 185076626, 181186006, 177162602, 173415257, 170235146, 167733251, 165884494, 164560756, 163533911, 162542098, 161422910, 160186676, 158961446, 157858891, 156865327, 155865272, 154787843, 153694599]
15164A53694599j014007r46227r62310j013559j044303j061256j069788j006550
15156A45576599p90723m37473m0862L38355O74501R24654J094343J294991J629403
15147A50263788K061657K467454K772713K982781L127666L264651L499733L931072
15139A74371515M556424N212665N623246N577424N115797M544662M212748M275363
15131B13489844M684198N288593N908796O402667O694859O760369O638074O411447
15123B62278847O086700N540633M646814L406264J943160M11946j081468k475659
15115B80757237l689861m572776m949809m752508m074964l094247j972944q35976
15107B52814152K36677J211273K043550K652556K973352L005569K855426K770150
$$ y = [153694599, 152680592, 151734365, 150772055, 149758496, 148714193, 147652937, 146583149, 145576599, 144785876, 144348403, 144307541, 144645896, 145320397, 146245051, 147339394, 148634385, 150263788, 152325445, 154792899, 157565612, 160548393, 163676059, 166940710, 170440443, 174371515, 178927939, 184140604, 189763850, 195341274, 200457071, 205001733, 209214481, 213489844, 218174042, 223462635, 229371431, 235774098, 242468957, 249229326, 255867400, 262278847, 268365547, 273906180, 278552994, 281959258, 283902418, 284314364, 283232896, 280757237, 277067376, 272494600, 267544791, 262792283, 258717319, 255623072, 253650128, 252814152, 253050829, 254262102, 256305652, 258958208, 261931560, 264937129, 267792555, 270562705]
15099B70562705L037158L749370M681230N416449N593581N069367L946692K510925
15091C04567477J090621j08958j090315k022223l114764m470137n993775p442415
15083B81415511q601121r413155r924200j0161028j0084342r641957q884423p998596
15075B06706689p158989o380044n584189m769425m049484l542232l246200l022707
15067A68953419k653923j955124r60248K3923O26408O52819J62851o19629j490563
15058A62739933k375894l292510m241923n105686n676820n858156n762532n568137
15050A24858275n336914m991772m429185l654433k824103k151788j776120j708055
15042I7985905j839292j975629j943161j719266j426069j178366r63937o75274
$$ y = [270562705, 273599863, 277349233, 282030463, 287446912, 293040493, 298109860, 302056552, 304567477, 305658098, 305549140, 304458825, 302436602, 299321838, 294851701, 288857926, 281415511, 272814390, 263401235, 253477035, 243316007, 233231665, 223589708, 214705285, 206706689, 199547700, 193167656, 187583467, 182814042, 178764558, 175222326, 171976126, 168953419, 166299496, 164344372, 163384124, 163408047, 164034455, 164687274, 164850125, 164230496, 162739933, 160364039, 157071529, 152829606, 147723920, 142047100, 136188944, 130426412, 124858275, 119521361, 114529589, 110100404, 106445971, 103621868, 101470080, 99693960, 97985905, 96146613, 94170984, 92227823, 90508557, 89082488, 87904122, 86940185, 86264911]
15034H6264911k41398K81703P49607J040797J103622R33437N78110J84123k7339
15025I0867573P8325M07675P23207Q42552P25157M44222J25658j10094k16208
15016I3888067k44877k65066k96906l60016n12527p85567j135499j495463j827097
15007H6965049k120541k383146k622265k794113k804135k586903k124462j419249
14999F8110235n41807L43261J056964J491580J658741J674536J672178J719094
14991G7184782J797491J849005J824989J730779J682243J853724K297699K884993
14983I3105705L422699L752251L791182L570301L234026K974753K921122L052690
14975A19824729L233060L328026L288224L152434K997127K873087K771628K650887
$$ y = [86264911, 86023513, 86305216, 87054823, 88095620, 89199242, 90132679, 90710789, 90894912, 90867573, 90945898, 91353573, 92076780, 92919332, 93644489, 94088711, 94214369, 94104275, 93888067, 93643190, 93378124, 93081218, 92721202, 92208675, 91423108, 90287609, 88792146, 86965049, 84844508, 82461362, 79839097, 77044984, 74240849, 71653946, 69529484, 68110235, 67568428, 67911689, 68968653, 70460233, 72118974, 73793510, 75465688, 77184782, 78982273, 80831278, 82656267, 84387046, 86069289, 87923013, 90220712, 93105705, 96528404, 100280655, 104071837, 107642138, 110876164, 113850917, 116772039, 119824729, 123057789, 126385815, 129674039, 132826473, 135823600, 138696687, 141468315, 144119202]
14967A44119202K471602K208469J878952J558758J332937J243246J282492J394798
14959A57490456J473236J425166J268526J092180R02934O02599J37629l94846
14951A63997880q15845j048291j212724j470621j803052k032317k010980j724651
14943A51879399j251824o80418q5967M29539P44059Q00107O56322M44717K80578
14934A53216512J96128J21038q9956n24859j085112j553448j769143j731257j593178
14925A45186725j574951j813586k255930k722785l038330l094314k919440k723053
14917A25044336k764800l148156l793942m556291n255463n635445n427029m558998
14909H9904212l306363k165132j539816j471831j625277j632356j461596j386784
$$ y = [144119202, 146590804, 148799273, 150678225, 152236983, 153569920, 154813166, 156095658, 157490456, 158963692, 160388858, 161657384, 162749564, 163652498, 164255097, 164392726, 163997880, 163182035, 162133744, 160921020, 159450399, 157647347, 155615030, 153604050, 151879399, 150627575, 149947157, 149861190, 150290729, 151034788, 151834895, 152491217, 152935934, 153216512, 153412640, 153533678, 153443722, 152918863, 151833751, 150280303, 148511160, 146779903, 145186725, 143611774, 141798188, 139542258, 136819473, 133781143, 130686829, 127767389, 125044336, 122279536, 119131380, 115337438, 110781147, 105525684, 99890239, 94463210, 89904212, 86597849, 84432717, 82892901, 81421070, 79795793, 78163437, 76701841, 75315057]
14901G5315057j658648k282910l043255l617148l718529l258932k407081j485534
14893E3843020q05925n57487p70126j314782j945139k386993k461360k219325
14885D1381883j917238j750309j670604j526467j262568r16126n19977r7204L16302
14876C2037692P10844J104437J474887J757544J927234J986779J860217J395283
14868D4254917M89279q04379k242724l459798m129798m109712l461206k400533
14860B4136046j216886j64800N97365J029619J212515J278159J282896J140965
14852B9295879P38766J21502m98968r50420j251072j512631j778455k001408k088538
14843B0074655j952671j603270j169744p95520n67363n27383o41169p62316p30385
$$ y = [75315057, 73656409, 71373499, 68330244, 64713096, 60994567, 57735635, 55328554, 53843020, 53037095, 52479608, 51709482, 50394700, 48449561, 46062568, 43601208, 41381883, 39464645, 37714336, 36043732, 34517265, 33254697, 32338571, 31818594, 31721390, 32037692, 32748536, 33852973, 35327860, 37085404, 39012638, 40999417, 42859634, 44254917, 44744196, 43939817, 41697093, 38237295, 34107497, 29997785, 26536579, 24136046, 22919160, 22754360, 23351725, 24381344, 25593859, 26872018, 28154914, 29295879, 30034645, 30156147, 29657179, 28706759, 27455687, 25943056, 24164601, 22163193, 20074655, 18121984, 16518714, 15348970, 14553450, 13986087, 13458704, 12817535, 12055219, 11324834]
14834A1324834n09318j89353R9078K90306M58926P33069J133299J571553J953695
14825A6866089K200515K208127J880595J255183N30841r9027n88478r87111j327684
14816B1939050j584662j679966j557814j280694r78640p13627m60584k00240K6924
14807A3509747J83418K99993M12322M87020M71703L58067J72840l0306j63736
14798A5701068j44745K0441K01857K23525m427m05421q41635j312352j901849
14789A1536462k539953k979625l003801k576404j822164r16248J968Q26933J445830
14780b7002J766458J789885J637126J499494J516370J663960J808024J869545
14772A3523860J904833K027968K269954K546077K732448K745375K568369K213790
$$ y = [11324834, 10815516, 10626163, 10725241, 11015547, 11474473, 12207542, 13340841, 14912394, 16866089, 19066604, 21274731, 23155326, 24410509, 24941350, 24842323, 24253845, 23266734, 21939050, 20354388, 18674422, 17116608, 15835914, 14857274, 14143647, 13683063, 13482823, 13509747, 13693165, 13993158, 14405480, 14892500, 15364203, 15722270, 15895110, 15864804, 15701068, 15556323, 15576764, 15778621, 16002146, 15997719, 15592298, 14750663, 13438311, 11536462, 8996509, 6016884, 3013083, 436679, -1385485, -2301733, -2299765, -1472832, -27002, 1739456, 3529341, 5166467, 6665961, 8182331, 9846291, 11654315, 13523860, 15428693, 17456661, 19726615, 22272692, 25005140, 27750515, 30318884, 32532674]
14764C2532674J706129J118919N66139J19156k29102m90164o31311o33868n47818
14755C3510754m66238m75695o25980q87062j132625j222773j093916p60073l01006
14746B6545386J30568L67432L45896J73463O9907J94322M83752P24235Q00714
14737B9835675P96079Q66939J074193J297223J304740R43812K66026n18739j169744
14728C4696204j551521j733070j907875k156475k328850k199943j711132j031142
14720B0076196m26094r4691r1900l80850q84716j482785k057081k550189k931007
14711I176883l133612l094224k850185k540554k289207k109018j895961j507235
14703a0243113r03003k40344K24031L73469L28619K90363L54671N03554P12763
$$ y = [32532674, 34238803, 35357722, 35923861, 36043017, 35813915, 35323751, 34692440, 34058572, 33510754, 33044516, 32568821, 31942841, 31055779, 29923154, 28700381, 27606465, 26846392, 26545386, 26675954, 27043386, 27389282, 27562745, 27632652, 27826974, 28310726, 29034961, 29835675, 30631754, 31498693, 32572886, 33870109, 35174849, 36118661, 36384687, 35865948, 34696204, 33144683, 31411613, 29503738, 27347263, 25018413, 22818470, 21107338, 20076196, 19650102, 19555411, 19463511, 19082661, 18197945, 16715160, 14658079, 12107890, 9176883, 6043271, 2949047, 98862, -2441692, -4730899, -6839917, -8735878, -10243113, -11146116, -11386460, -11162429, -10788960, -10460341, -10169978, -9815307, -9311753, -8598990]
14694h598990J012189J433645J869776K067952J869302J373386P92530K48959
14686B068749k03097m86714n51978m32269j94997J05188M20209O88728Q53476
14677B267295R32021J035763J249708J514957J663921J537535J094371M70084
14669A1765655q3166l69274l74931k16468k5771P7788K9993r9636j91308k72342
14659A0240540n10233r70037j460445j678804j496000j032387m58771J49146P56778
14650C539787J320978J799017K127198K218491K032359J641474J195417P98912
14642A6673633M43106N1510m23804r36661j345419j487572j320900j005965p87014
14633I860914p71466q77243r70850r75731q81191p14618m96364k27483Q2006M06094
$$ y = [-8598990, -7586801, -6153156, -4283380, -2215428, -346126, 1027260, 1819790, 2068749, 1865652, 1378938, 826960, 394691, 199694, 304882, 725091, 1413819, 2267295, 3199316, 4235079, 5484787, 6999744, 8663665, 10201200, 11295571, 11765655, 11682489, 11313215, 10938284, 10721816, 10696045, 10773833, 10803826, 10704190, 10512882, 10240540, 9730307, 8760270, 7299825, 5621021, 4125021, 3092634, 2633863, 2783009, 3539787, 4860765, 6659782, 8786980, 11005471, 13037830, 14679304, 15874721, 16673633, 17116739, 17168249, 16744445, 15807784, 14462365, 12974793, 11653893, 10647928, 9860914, 9089448, 8212205, 7241355, 6265624, 5384433, 4669815, 4173451, 3945968, 4027974, 4434068]
14623D434068O99234Q82270Q60895N72989L2847o61134j352542j861840k055251
14614A551536j917033j493983p99431J17257J061302J750397J990843J800457
14606D061345J347222P84394K14615k34247m32295l35866p696L95863O74757P28781
14596G196873O64630O70100P83645Q76454Q27421O27560L47702P7405j05399j60916
14586A1805475j39318j73939l48781n93356p65808q25421q71103j016180j264194
14577E807375j507810j647169j704910j791958j946128k034889j855059j338539
14569h019087o68685j63381p708j35557l70234o35979r98435j480489j911264
14560a4390819k048775j822344j396570j015481p84086n80359j82692N09789J363505
$$ y = [4434068, 5133302, 6015572, 6876467, 7449456, 7482303, 6821169, 5468627, 3606787, 1551536, -365497, -1859480, -2658911, -2541654, -1480352, 270045, 2260888, 4061345, 5408567, 6192961, 6407576, 6173329, 5741034, 5405168, 5397472, 5793335, 6468092, 7196873, 7861503, 8531603, 9315248, 10191702, 11019123, 11646683, 11994385, 12071790, 11966391, 11805475, 11666157, 11492218, 11143437, 10550081, 9784273, 8958852, 8087749, 7071569, 5807375, 4299565, 2652396, 947486, -844472, -2790600, -4825489, -6680548, -8019087, -8687772, -8851153, -8858861, -8994418, -9364652, -10000631, -10999066, -12479555, -14390819, -16439594, -18261938, -19658508, -20673989, -21458075, -22038434, -22221126, -21711337, -20347832]
14551b0347832K111410K566292K731640K733864K665136K504869K182972J689453
14543a162196J130998O86971N04796O28979R96328J463235J822911J854860J460199
14534I387081P42651o3333p27403j133306j304032j336485j320626j302562j258731
14525A683254j068205n86693J64118R46949J519824J806307J826412J600048J199249
14516I091263P89815N12224L50944J68136j69173o92712j276447j669790j668377
14507E435883j276932o98567k15163n3942k36886n44598o95992n49127j34263
14498A030413M21418R81418J464410J824640K017294K058410K042750K041012
14490A3881765K043474J998365J840977J511481J007087M06561j93365p44488
$$ y = [-20347832, -18236422, -15670130, -12938490, -10204626, -7539490, -5034621, -2851649, -1162196, -31198, 655773, 1160569, 1789548, 2785876, 4249111, 6072022, 7926882, 9387081, 10129732, 10066399, 9338996, 8205690, 6901658, 5565173, 4244547, 2941985, 1683254, 615049, 28356, 192474, 1139423, 2659247, 4465554, 6291966, 7892014, 9091263, 9881078, 10393302, 10744246, 10912382, 10743209, 10050497, 8774050, 7104260, 5435883, 4158951, 3460384, 3245221, 3191279, 2954393, 2409795, 1713803, 1164676, 1030413, 1451831, 2433249, 3897659, 5722299, 7739593, 9798003, 11840753, 13881765, 15925239, 17923604, 19764581, 21276062, 22283149, 22689710, 22496345, 21751857]
14482B1751857j228972j616251j863502j925556j756042j351954q31405m06215
14474A0771960k28275l05359n43427p90806q80640p25500l69753P1096M71124
14465G470420P03661O90654M76602K20180R5319J54102K67259K40212k82l27924
14455I990203n18817m55187k31953l6310O6141J90784N00691J034748J667600
14446A2207900K212555K512928K467119K014046J135737n8888j295521k267563
14438A8928313k799249k874791k588023k101038j585515j138957p62902m40229
14430D637609k07339j31899k23151l85937m94519m89468m08369l46742l46144
14421A604041l21603j54479J42474L96548M17186J08766n20469j345051k133347
$$ y = [21751857, 20522885, 18906634, 17043132, 15117576, 13361534, 12009580, 11178175, 10771960, 10543685, 10238326, 9694899, 8904093, 8023453, 7297953, 6928200, 6999296, 7470420, 8174081, 8864735, 9341337, 9561517, 9656836, 9810938, 10078197, 10318409, 10318127, 9990203, 9471386, 9016199, 8784246, 8747936, 8814077, 9004861, 9505552, 10540300, 12207900, 14420455, 16933383, 19400502, 21414548, 22550285, 22491397, 21195876, 18928313, 16129064, 13254273, 10666250, 8565212, 6979697, 5840740, 5077838, 4637609, 4430270, 4298371, 4075220, 3689283, 3194764, 2705296, 2296927, 1950185, 1604041, 1282438, 1127959, 1270433, 1666981, 2084167, 2192933, 1672464, 327413, -1805934]
14412a805934k609770k533263j835303p19026M40936J314117J734737J683072
14404d330434J283951Q15262N47229N26013N67869M77122K49740L1980n6589k658
14394A09485J16517J82370Q9779k24239p44306j331695j769404j881402j606657
14385g059552j023621l16783L48698R18844J391136J705202J746850J457098R10268
14376G8140K92363j74834l06246l2822N54796J310080K146962K965565L550298
14367A0384302L668185L248246K427650J475668O69061J59717o7949j02308L160
14358B1865732K12934M04831L40885j75821j095886k120549k921073l340265l390835
14349I779953l132946k612174j897702j103088l48895K85978Q07577J275010J686923
$$ y = [-1805934, -4415704, -6948967, -8784270, -9503296, -9062360, -7748243, -6013506, -4330434, -3046483, -2231221, -1683992, -1157979, -590110, -112988, 136752, 168732, 112143, 109485, 226002, 408372, 498151, 273912, -470394, -1802089, -3571493, -5452895, -7059552, -8083173, -8399956, -8051258, -7132414, -5741278, -4036076, -2289226, -832128, 78140, 370503, 195669, -110577, -143399, 411397, 1721477, 3868439, 6834004, 10384302, 14052487, 17300733, 19728383, 21204051, 21873112, 22032829, 21964880, 21862572, 21865732, 22078666, 22483497, 22824382, 22648561, 21552675, 19432126, 16511053, 13170788, 9779953, 6647007, 4034833, 2137131, 1034043, 685148, 971126, 1778703, 3053713, 4740636]
14340D740636J952708J992182J810145J490393J156079R14259P95060P21394N57467
14331A6130323K02986l70335j138644k050817l024081l905278m476610m535445
14323c167901m009776l030030j861073p44281J84224Q69990J302386J505097J558422
14314g392942J586943J677252J844440K076557K321150K430972K225103J636562
14306H406037P71722j53584r27328j442225j700994j757176j674173j492912j209942
14297a180575p78272j54971N92612J241656J565613J562210J470356J511437J653700
14288G483766J676879J415026Q65534J27848o57942j323752j701799j703315j388490
14279D793755r41654n63256l97273n13095q77092j363909j833247k161797k217170
$$ y = [4740636, 6693344, 8685526, 10495671, 11986064, 13142143, 14056402, 14851462, 15572856, 16130323, 16333309, 15962974, 14824330, 12773513, 9749432, 5844154, 1367544, -3167901, -7177677, -10207707, -12068780, -12813061, -12628837, -11758847, -10456461, -8951364, -7392942, -5805999, -4128747, -2284307, -207750, 2113400, 4544372, 6769475, 8406037, 9177759, 9024175, 8096847, 6654622, 4953628, 3196452, 1522279, 29367, -1180575, -1958847, -2113818, -1521206, -279550, 1286063, 2848273, 4318629, 5830066, 7483766, 9160645, 10575671, 11441205, 11569053, 10911111, 9587359, 7885560, 6182245, 4793755, 3852101, 3288845, 2891572, 2378477, 1501385, 137476, -1695771, -3857568, -6074738]
14270f074738j890406j205739l89289K10062L15526j15049q71466j584320j882392
14261a3487811j600949q81949n2256N85482Q80350Q34285N41342J39452k16897
14252a3258951l91496l19944o7696J57911J25149k18256o52750q60996p05863
14243a6192892k66071L37609J000750J589839J996417K191465K165491J899624
14235e277768J437526R10815M43059N9713k77099n63046p25996p10846n24607
14226e228249j79676L06624Q43334J276903J463368J297419P42466r1832r49037
14217e18680j535532j657203j309580o51727R0088P07089J052893J044673O80532
14208b097447Q8106n03434q96033j011623q91432o62740m63679l80448m48187
$$ y = [-6074738, -7965144, -9170883, -9560172, -9350110, -9034584, -9149633, -10021099, -11605419, -13487811, -15088760, -15970709, -16022965, -15437483, -14557133, -13722848, -13181506, -13042054, -13258951, -13650447, -13970391, -14038087, -13880176, -13755027, -13973283, -14626033, -15487029, -16192892, -16458963, -16121354, -15120604, -13530765, -11534348, -9342883, -7177392, -5277768, -3840242, -2929427, -2486368, -2426655, -2703754, -3266800, -3992796, -4703642, -5228249, -5407925, -5101301, -4257967, -2981064, -1517696, -220277, 522189, 430357, -518680, -2054212, -3711415, -5020995, -5672722, -5582634, -4875545, -3822652, -2777979, -2097447, -2009341, -2512775, -3408808, -4420431, -5311863, -5974603, -6438282, -6818730, -7266917]
14199g266917o63979j005216j454126j955536k357244k488258k303320j893271
14191b1387867j348850o67313J40589R17861J440211J589603J412761J057711
14183a6845294O87519M26089L18211L25661L84104M72052O40225R54266J393191
14174a1243976J827604K079262K002588J549608P89304q6694q24441j278038j487735
14165f672518j543493j439271j111864n85019k9514L24103L23159k9139n66548
14156a1330104j022367j181604j011964o43514k66142l5953R724k9653J478K21831
14146a5288268O54163J195828J690051K079270K437962K813190L094395L086993
14138A763584K666203J851443Q00381k50727j086196j615590j924330k202027
$$ y = [-7266917, -7930896, -8936112, -10390238, -12345774, -14703018, -17191276, -19494596, -21387867, -22736717, -23404030, -23263441, -22345580, -20905369, -19315766, -17903005, -16845294, -16157775, -15731686, -15413475, -15087814, -14703710, -14231658, -13591433, -12637167, -11243976, -9416372, -7337110, -5334522, -3784914, -2995610, -3082304, -3906745, -5184783, -6672518, -8216011, -9655282, -10767146, -11352165, -11381679, -11057576, -10734417, -10763556, -11330104, -12352471, -13534075, -14546039, -15189553, -15455695, -15491648, -15481924, -15511577, -15510099, -15288268, -14634105, -13438277, -11748226, -9668956, -7230994, -4417804, -1323409, 1763584, 4429787, 6281230, 7081611, 6830884, 5744688, 4129098, 2204768, 2741]
14130B741k577689l011699l332505l343210k922015k094114j031126M5910R54570
14121a7309137J546452J721224J526494J176217Q91734P52533P08405O55467M92722
14112g837889J82530k05671n08242n63968l33698Q2559N28241Q63173R83421Q23237
14102e986307M04590r3500m15427m57701l65683l56075m77601n91083n70233m34808
14092i343828k96723k65708m00700o81588r87336j137619j017875o58118j97392
14083a4986887J91111L62104K65736P910j65347O726O18969J492231K256927K600270
14073g350250K474478K103862J795068J692408J693841J578891J199930O22635
14065E810863J22624l7141J40349L85325L97269Q1106m19844q97849j247735j469181
$$ y = [2741, -2574948, -5586647, -8919152, -12262362, -15184377, -17278491, -18309617, -18263707, -17309137, -15762685, -14041461, -12514967, -11338750, -10447016, -9694483, -8986078, -8330611, -7837889, -7655359, -7861030, -8369272, -8933240, -9266938, -9184379, -8656138, -7792965, -6809544, -5986307, -5581717, -5675217, -6090644, -6548345, -6914028, -7270103, -7747704, -8338787, -8909020, -9343828, -9640551, -9906259, -10306959, -10988547, -11975883, -13113502, -14131377, -14789495, -14986887, -14795776, -14433672, -14167936, -14160026, -14325373, -14318647, -13699678, -12207447, -9950520, -7350250, -4875772, -2771910, -976842, 715566, 2409407, 3988298, 5188228, 5810863, 5933487, 5896346, 6036695, 6422020, 6819289, 6900395, 6480551, 5582702, 4334967, 2865786]
14055B865786j578460j564801j431078j245872j117931j093515j093598r72614
14047g232083o14251M34P40192J353951J630105J536740J182061P00939K39488
14038d62424o4672j96584k93223m63117o12712n47225k02974L15176Q62379J311079
14028c54297J548840J524918J299619J025419Q55294Q38411Q85444Q31494N62833
14019I017975J29213k44104k90152R2804P50061J374190J696316J623879J237013
14010A5387195O86472Q8498n24421j149508j715764k081171k149105j962992j669919
14001D909285j419542j309363j399534j720417k207521k618869k585990j877710
13993a0229661o62625N44569J240013J254162P94837K67420K8304K06490O90088
$$ y = [2865786, 1287326, -277475, -1708553, -2954425, -4072356, -5165871, -6259469, -7232083, -7846334, -7845900, -7105708, -5751757, -4121652, -2584912, -1402851, -701912, -462424, -527096, -723680, -1016903, -1480020, -2092732, -2639957, -2842931, -2527755, -1665376, -354297, 1194543, 2719461, 4019080, 5044499, 5899793, 6738204, 7623648, 8455142, 9017975, 9147188, 8903084, 8612932, 8705736, 9455797, 10829987, 12526303, 14150182, 15387195, 16073667, 16162165, 15637744, 14488236, 12772472, 10691301, 8542196, 6579204, 4909285, 3489743, 2180380, 780846, -939571, -3147092, -5765961, -8351951, -10229661, -10892286, -10347717, -9107704, -7853542, -7058705, -6791285, -6762981, -6556491, -5866403]
13984e866403J228688J577663J628891J416146J044849O72402M57894M30377M74180
13975C064687M79239M03318K07980r9526l94901n26667m42042k23325k7244O4799
13965B506318J17522K26128L99421N91055P70761R22953J023284J053740J018627
13956H629809R24066P81561O41344N63415N52004N63279N65079N69860O21420
13947A4411837P30319Q28544Q05860N50887j0201q07988j596789k116278k269721
13938A0526470k161083j977255j814127j667461j564574j583299j760643k051658
13930d053630k332985k433955k234961j757058j118039m01145L59848J077772
13922a2894153J596476J793348J646344J179036M20765n05927j341495j814646
$$ y = [-5866403, -4637715, -3060052, -1431161, -15015, 1029834, 1702236, 2160130, 2590507, 3064687, 3543926, 3947244, 4155224, 4055698, 3660797, 3134130, 2692088, 2468763, 2441519, 2506318, 2623840, 2849968, 3249389, 3840444, 4611205, 5534158, 6557442, 7611182, 8629809, 9553875, 10335436, 10976780, 11540195, 12092199, 12655478, 13220557, 13790417, 14411837, 15142156, 15970700, 16776560, 17327447, 17317246, 16509258, 14912469, 12796191, 10526470, 8365387, 6388132, 4574005, 2906544, 1341970, -241329, -2001972, -4053630, -6386615, -8820570, -11055531, -12812589, -13930628, -14331773, -13971925, -12894153, -11297677, -9504329, -7857985, -6678949, -6258184, -6764111, -8105606, -9920252]
13914i920252j790207j302821n02956M09135J237178J844012K165660K171484
13906e688767J852705J275523O38120K22581K21874N99948J107660J437267J411908
13897C078819J081746O68678L75901K18960P4663j12050k36739j90817m5141K1539
13887D935559n2841j45929r8649J33648N05566J003039J637901K303251K723398
13878A2944943K608080J887447Q28539j01059n46035m84824j73674R7996K03374
13869A7264787J87443J31953N6205m0837j34257k43239m48434p46293r76727r72651
13859A4077950p47162m96363l99664m48774n20855n57318n73635n50523m51746
13850I331910l24263k67827k90091k51298k7321L09322N87725P50647Q43693Q85360
$$ y = [-9920252, -11710459, -13013280, -13516236, -13107101, -11869923, -10025911, -7860251, -5688767, -3836062, -2560539, -1922419, -1699838, -1477964, -878016, 229644, 1666911, 3078819, 4160565, 4829243, 5205144, 5424104, 5498767, 5386717, 5149978, 4959161, 4914020, 4935559, 4882718, 4736789, 4638140, 4771788, 5277354, 6280393, 7918294, 10221545, 12944943, 15553023, 17440470, 18269009, 18167950, 17621915, 17137091, 16963417, 17061413, 17264787, 17452230, 17584183, 17640388, 17599551, 17465294, 17222055, 16773621, 16027328, 15050601, 14077950, 13330788, 12834425, 12434761, 11985987, 11465132, 10907814, 10334179, 9783656, 9331910, 9007647, 8739820, 8449729, 8198431, 8171110, 8480432, 9068157, 9818804, 10662497, 11547857]
13840A1547857Q75254Q50496Q32289P91941P23841O69149O24523N01593K34201
13831A7651144r7617l13510l24986k06254n8636N4770M8448j49049n01379q89580
13821A5213351j227219j536048j899596k310957k622576k695791k538288k278857
13813a895981k027106j756543j352454p76008j48238L21241M79965L34824M0297
13804f780003k01116k41954n7590K29880M52669N43447N22236L90879J38093j71172
13794e174631m27643o23526q45572j101207j247546j094351n47955L40813J405576
13785i316042K367343K894848K824549K319127J712636J255281J068624J189735
13777F316101J527941J888970K117223K139419J912091J421475P15664p8756p94404
$$ y = [11547857, 12423111, 13273607, 14105896, 14897837, 15621678, 16290827, 16915350, 17416943, 17651144, 17553527, 17240017, 16915031, 16708777, 16650141, 16704911, 16753359, 16604310, 16102931, 15213351, 13986132, 12450084, 10550488, 8239531, 5616955, 2921164, 382876, -1895981, -3923087, -5679630, -7032084, -7808092, -7956330, -7635089, -7155124, -6820300, -6780003, -6981119, -7223073, -7280663, -7050783, -6598114, -6054667, -5532431, -5141552, -5003459, -5174631, -5602274, -6225800, -7071372, -8172579, -9420125, -10514476, -11062431, -10721618, -9316042, -6948699, -4053851, -1229302, 1089825, 2802461, 4057742, 5126366, 6316101, 7844042, 9733012, 11850235, 13989654, 15901745, 17323220, 18038884, 17960128, 17165724]
13768A7165724j317659j651395j872985k027283k073908j922811j520030r22465
13760C857188k65887L35089Q19959J166297J413627J665795J986025K321829K562223
13751A5862145K614651K431021K018620J445602Q11495K23042k10023m35441n42116
13742B4218996o97978r66841j282821j600339j938689k278258k518591k546085
13734A0389394k307627j852144j311704q34042n33809m40900m46711l87162k08877
13725B066418K8404K88961O02790R79069J366569J680314J818483J735040J525778
13716A2091826J367763J369846J506888J674644J793817J853722J856701J769183
13708B5284390J575188J344775J198981J184397J165724R22681M10415j74630
$$ y = [17165724, 15848065, 14196670, 12323685, 10296402, 8222494, 6299683, 4779653, 3857188, 3591301, 3926390, 4746349, 5912646, 7326273, 8992068, 10978093, 13299922, 15862145, 18476796, 20907817, 22926437, 24372039, 25183534, 25406576, 25196553, 24761112, 24218996, 23521018, 22554177, 21271356, 19671017, 17732328, 15454070, 12935479, 10389394, 8081767, 6229623, 4917919, 4083877, 3550068, 3109168, 2662457, 2275295, 2066418, 2094822, 2383783, 2986573, 3965642, 5332211, 7012525, 8831008, 10566048, 12091826, 13459589, 14829435, 16336323, 18010967, 19804784, 21658506, 23515207, 25284390, 26859578, 28204353, 29403334, 30587731, 31753455, 32676136, 33086551, 32911921]
13700C2911921n87719p17234o17352m27192k80807k77810m80664q84654j396591
13691B7241898j895925k320135k688656l058545l450267l819288m084181m154043
13683A770858l916690l271888k260912j109520q1468O72676J092786J126921Q19917
13674e157320M44859L69183P57678J449872K094658K381977K185951J580058P78953
13665F885869K1341n18666p24405n67481j81839J94769L69756K76860K797k63367
13655E495634l84786l48493k03011m1525M677j13669l02601m49163n43292o27025
13645B486746o79760o15219l58773R8344O94863J307895J747653J826459J514801
13636H023009J007677N97341M48988N01998N84401N63092L94599J15191k04257
$$ y = [32911921, 32324202, 31606968, 30989616, 30562424, 30281617, 30003807, 29523143, 28638489, 27241898, 25345973, 23025838, 20337182, 17278637, 13828370, 10009082, 5924901, 1770858, -2145832, -5417720, -7678632, -8788152, -8869620, -8196944, -7104158, -5977237, -5157320, -4712461, -4343278, -3585600, -2135728, -41070, 2340907, 4526858, 6106916, 6885869, 6907210, 6388544, 5664139, 5096658, 4914819, 5109588, 5479344, 5756204, 5759001, 5495634, 5110848, 4762355, 4559344, 4517819, 4522496, 4408827, 4106226, 3657063, 3113771, 2486746, 1806986, 1191767, 832994, 931338, 1626201, 2934096, 4681749, 6508208, 8023009, 9030686, 9628027, 10077015, 10579013, 11163414, 11726506, 12121105, 12236296, 12032039]
13627A2032039n32799q78650j206131j416168j418181j192505p88679k70156L31556
13618D660326R75567J544302J883522J916096J687601J330473R97987P70671N84296
13609A6350841K82320k14994q18736j365849j737098j863881j713450j315000
13601G604153p73848k64670K3894O260k51194o24091j038329j478450j927689
13592A276036k297567k427727k224571j780072j290548r01683o48438m68263k25376
13583a0988209K45105J063937K205955L419414M315938M628484M389424L835957
13575A3116005L182144K556862K050602J654238J245595P65324L33845J07875
13567B5012490O5415N958k42837o61275j040604j122699q11485k74155J74466
$$ y = [12032039, 11499240, 10620590, 9414459, 7998291, 6580110, 5387605, 4598926, 4328770, 4660326, 5635893, 7180195, 9063717, 10979813, 12667414, 13997887, 14995874, 15766545, 16350841, 16633161, 16418167, 15599431, 14233582, 12496484, 10632603, 8919153, 7604153, 6830305, 6565635, 6589529, 6595789, 6344595, 5720504, 4682175, 3203725, 1276036, -1021531, -3449258, -5673829, -7453901, -8744449, -9646132, -10294570, -10762833, -10988209, -10743104, -9679167, -7473212, -4053798, 262140, 4890624, 9280048, 13116005, 16298149, 18855011, 20905613, 22559851, 23805446, 24570770, 24904615, 25012490, 25077905, 25083863, 24841026, 24179751, 23139147, 22016448, 21204963, 20930808, 21105274]
13558B1105274K95004P6854l06464p08671j150408j686323k175906k328340k012103
13549A1108917j429947r37036p39494p91904r14088r59087q92016p44301n30211
13540C170833k27079J95787P64446J468798K200154K789346L126685L171770K874690
13531A9535430K179912J159524J21169n50916p28692o26686n48277o43995q89048
13522A9008421j160762j301964j180607p79267k56953J27640J86201q9249n40454
13513A4013006r47142j149640j118250r09270n39787M8535Q48078J657799K172558
13504A4075887K205523J844538J400989J131000J008207Q16272L95449k41870
13496B2635995r47928j538235j901426k005109j816717j323107o10826J29961
$$ y = [21105274, 21400278, 21477132, 21170668, 20461997, 19311589, 17625266, 15449360, 13121020, 11108917, 9678970, 8741934, 8002440, 7210536, 6296448, 5337361, 4445345, 3701044, 3170833, 2943754, 3139541, 3903987, 5372785, 7572939, 10362285, 13488970, 16660740, 19535430, 21715342, 22874866, 22996035, 22445119, 21716427, 21089741, 20541464, 19897469, 19008421, 17847659, 16545695, 15365088, 14585821, 14328868, 14456508, 14642709, 14553460, 14013006, 13065864, 11916224, 10797974, 9888704, 9348917, 9397452, 10245530, 11903329, 14075887, 16281410, 18125948, 19526937, 20657937, 21666144, 22482416, 22877865, 22635995, 21688067, 20149832, 18248406, 16243297, 14426580, 13103473, 12492647, 12622608]
13488A2622608O72678Q74714P85549O14145N52975O25617P09127O61130L80784
13479A8499327j98850j088070k167884l152527l681793l502551k625968j374797
13471G06887k16909N19196P65437O37207L25362L3406o1467J37973N84677J097182
13461D528951J470746J589410J458923J161713P89187L97766J3573l09841m56926
13452A0643502l23284Q1461O13870J066973J310925J382875J400530J415371J370188
13443A8962411J185635Q91117O41852N65780O50300Q17619R97376J110167J103878
13434B6926135J006657Q64216O29096J79560n21907j331352j999760k338236k328858
13425B1085551k105853j849210j651454j452876j156109p94115n00777l72896
$$ y = [12622608, 13295286, 14170000, 14955549, 15569694, 16122669, 16748286, 17457413, 18118543, 18499327, 18300477, 17212407, 15044523, 11891996, 8210203, 4707652, 2081684, 706887, 489978, 1009174, 1774611, 2411818, 2737180, 2770586, 2709119, 2847092, 3431769, 4528951, 5999697, 7589107, 9048030, 10209743, 10998930, 11396696, 11410269, 11100428, 10643502, 10320218, 10401679, 11015549, 12082522, 13393447, 14776322, 16176852, 17592223, 18962411, 20148046, 21039163, 21681015, 22246795, 22897095, 23714714, 24712090, 25822257, 26926135, 27932792, 28797008, 29426104, 29605664, 29083757, 27752405, 25752645, 23414409, 21085551, 18979698, 17130488, 15479034, 14026158, 12870049, 12075934, 11575157, 11202261]
13417A1202261m40322o96416j108047j611676k102659k457174k613149k637372
13409b464554k658635k701317k621727k245693j568503p85881j48401J70357J35634
13400a4888720j28667m13860n69200n68551m74163m15054n43695q82732j255329
13391b0139971j445898j376830j106544p07414j69698N60165J470753K410449
13383b0504988L087571L245303K877802K178495J325060M18014m38877j085991
13375h897611j349176j181167p51733k96108R7771M60701Q08023J131370J429880
13366h548050J696403J908204K037047K076231K067994K077418K115604K099728
13358G530579J893289J400628O79152n5461n80202q10854q23950p79404q14949
$$ y = [11202261, 10761939, 10065523, 8957476, 7345800, 5243141, 2785967, 172818, -2464554, -5123189, -7824506, -10446233, -12691926, -14260429, -15046310, -15194711, -15024354, -14888720, -15017387, -15431247, -16000447, -16568998, -17043161, -17458215, -18001910, -18884642, -20139971, -21585869, -22962699, -24069243, -24776657, -24946355, -24386190, -22915437, -20504988, -17417417, -14172114, -11294312, -9115817, -7790757, -7372743, -7811620, -8897611, -10246787, -11427954, -12179687, -12475795, -12378024, -11917323, -11109300, -9977930, -8548050, -6851647, -4943443, -2906396, -830165, 1237829, 3315247, 5430851, 7530579, 9423868, 10824496, 11503648, 11448187, 10867985, 10057131, 9233181, 8453777, 7638828]
13349G638828r68472j169162j278803j153627p54511k19539K41306N27592O84377
13340C547989P77989Q01465P18779N36799K98306L3801k51098n36215p45587p73360
13330D408868n75022k05676K38164O72886J021749J185881J069490O85641J99818
13321H701799k08567m88979o86776q58242j049099j280829j507443j601996j429769
13312d09901r66747l69871Q1187J71321p3234m29431o89247p63338o48104l81056
13302d478421o904M11285P45335Q35668O09272J41062m07482q77221j129606j040650
13292e197662n63274J95456J018412J716157K186124K369806K249233J900405
13284E874657J486639J132390Q12633M22876p6313o07563r93015j041633p21289
$$ y = [7638828, 6670356, 5501194, 4222391, 3068764, 2314253, 2094714, 2336020, 2863612, 3547989, 4325978, 5127443, 5846222, 6383021, 6681327, 6715128, 6464030, 5927815, 5182228, 4408868, 3833846, 3628170, 3866334, 4539220, 5560969, 6746850, 7816340, 8501981, 8701799, 8493232, 8004253, 7317477, 6459235, 5410136, 4129307, 2621864, 1019868, -409901, -1376648, -1746519, -1665332, -1494011, -1567245, -1996676, -2685923, -3449261, -4097365, -4478421, -4485325, -4074040, -3328705, -2493037, -1883765, -1742703, -2150185, -3027406, -4157012, -5197662, -5760936, -5565480, -4547068, -2830911, -644787, 1725019, 3974252, 5874657, 7361296, 8493686, 9306319, 9729195, 9652882, 9045319, 8052304, 7010671, 6289382]
13275F289382k46485M6774l7232l92328p24928q00172n72712j26503M21632R03900
13265D761328J132527J041803P04730K15790l45214q70890j224530j287080j015592
13256C112872m78188J56783P08015J077352J239459J181560Q96982M32713p4349
13247H253199m50534o01643n73630m99945m76134m63958l36546l9585L21285N69934
13237E702443N86117L50321m1548m01411n48743m09823m9720L66937O79791Q40517
13227G074881R17016R77412R91198Q67502N68682J65258k20643n14043p25175
13218A0102088q94863j012322j004780p95598l62001K23872P92387J178922J354596
13209I582301J379398J250890R11391L86647j62949n33845n91818l06128K38343
$$ y = [6289382, 6042897, 6089671, 6052439, 5660111, 4935183, 4135011, 3562299, 3435796, 3857428, 4761328, 5893855, 6935658, 7640388, 7856178, 7510964, 6640074, 5415544, 4128464, 3112872, 2634684, 2791467, 3499482, 4576834, 5816293, 6997853, 7894835, 8327548, 8253199, 7802665, 7201022, 6627392, 6127447, 5651313, 5187355, 4850809, 4811224, 5132509, 5702443, 6288560, 6638881, 6597333, 6195922, 5647179, 5237356, 5187636, 5554573, 6234364, 7074881, 7991897, 8969309, 9960507, 10828009, 11396691, 11561949, 11341306, 10827263, 10102088, 9207225, 8194903, 7190123, 6394525, 6032524, 6256396, 7048783, 8227705, 9582301, 10961699, 12212589, 13123980, 13510627, 13347678, 12813833, 12222015, 11915887, 12154230]
13200A2154230Q01409J065538Q56070K76337l67553p71395q13128n89028l01827
13191A2310653j21826j37998l63240p31682j138523j524155j896040k209989k276629
13182A910571j925143j260125o46910m17542o34736j104715j563508j863354j959927
13173i465389j776243j216823k91913Q56569J997869K861677L248131L131116
13165f55006K660729K059387J455801Q29103J56181m36293p42115o89819m26921
13156D211047k12369k79589p27959j449251k173227k624892k681024k400262j928576
13147a0266102j428809j037577p96179o53205n26331l28946k0344L42981O67086
13138a4047426R24691J149650J337819J426123J379654J236306J041242P99196
$$ y = [12154230, 12955639, 14021177, 14877247, 15153584, 14786031, 14014636, 13201508, 12612480, 12310653, 12188827, 12050829, 11687589, 10955907, 9817384, 8293229, 6397189, 4187200, 1910571, -14572, -1274697, -1921607, -2339149, -2973885, -4078600, -5642108, -7505462, -9465389, -11241632, -12458455, -12750368, -11893799, -9895930, -7034253, -3786122, -655006, 2005723, 4065110, 5520911, 6350014, 6506195, 6069902, 5327787, 4637968, 4211047, 3998678, 3719089, 2991130, 1541879, -631348, -3256240, -5937264, -8337526, -10266102, -11694911, -12732488, -13528667, -14181872, -14708203, -15037149, -15057493, -14714512, -14047426, -13122735, -11973085, -10635266, -9209143, -7829489, -6593183, -5551941, -4752745]
13130d752745N04042J54729k52413o97030j107378j396758j521023j473601j215817
13121a1757994o85461M0177O72513R26862P61771L44592j24347m94468o71859
13112a0988214o33127m31453j69508M7664J65438K42054M29970Q08626J278216
13103i250334J682767J948246K050760J947020J603587J054109L80544l33092
13095A083607j005959j558613j922809k040676j892040j544247j112731o69742
13087a0663210k41364J58307N63701J073360J726302K388900K857962L059568
13079I23526L063900K934376K658266K215597J662949J152381Q49358P95713Q69112
13070A7125178R04091Q29521O42777L22905j24854o15789j060577j430489j721942
$$ y = [-4752745, -4248703, -4093974, -4346387, -5043417, -6150795, -7547553, -9068576, -10542177, -11757994, -12443455, -12403278, -11730765, -10803903, -10042132, -9697540, -9821887, -10316355, -10988214, -11621341, -12052794, -12222302, -12174638, -12009200, -11767146, -11337176, -10528550, -9250334, -7567567, -5619321, -3568561, -1621541, -17954, 1036155, 1416699, 1083607, 77648, -1480965, -3403774, -5444450, -7336490, -8880737, -9993468, -10663210, -10904574, -10746267, -10182566, -9109206, -7382904, -4994004, -2136042, 923526, 3987426, 6921802, 9580068, 11795665, 13458614, 14610995, 15460353, 16256066, 17125178, 18029269, 18858790, 19501567, 19824472, 19699618, 19083829, 18023252, 16592763, 14870821]
13061A4870821j895107j853619j497416q54507j64605K49256K11259k45216r72926
13052G847940j758207k342141k531916k324337j867985j300538o85221p2271M88664
13043d546012R84572J403197J674490J702903J467083J065261O58178L72274K27622
13034E009568J54146J08062J46231L38132O29617Q63491R23126P93481M96311
13025I462165L3885n69712j195890j665196j879470j899357j856694j805823j684143
13016c060235j426033j103154r02362r46642j186509j469169j665991j732196
13008a3492291j689745j590277j467719j305726j089758q62603o64261m73397
13000b2635777k66708p5944M1202O4785N8062J32828L29763N51986O40481M69476
$$ y = [14870821, 12975714, 11122095, 9624679, 8770172, 8605567, 8854823, 9066082, 8820866, 7847940, 6089733, 3747592, 1215676, -1108661, -2976646, -4277184, -4962405, -5034676, -4546012, -3561440, -2158243, -483753, 1219150, 2686233, 3751494, 4409672, 4781946, 5009568, 5163714, 5271776, 5418007, 5756139, 6385756, 7249247, 8172373, 8965854, 9462165, 9496050, 8926338, 7730448, 6065252, 4185782, 2286425, 429731, -1376092, -3060235, -4486268, -5589422, -6491784, -7438426, -8624935, -10094104, -11760095, -13492291, -15182036, -16772313, -18240032, -19545758, -20635516, -21498119, -22162380, -22635777, -22902485, -22978429, -22937227, -22872442, -22814380, -22681552, -22351789, -21799803, -21159322, -20689846]
12990b0689846l1028q21440j671525k255080k407429k226267j898923j542978
12982c3544516j215647r42237p12345n16509l59313j79029J80471Q52711J812873
12973c4623541K833137L560708L722279L319574K597749J808709J061421L72803
12965a5347161k35384p23701j085989j338220j456433j393003j139854p21412
12957b3441157j63486M65914J024425J374230J460099J292797R45749N83164M18353
12948a6039912O13647J184588J952785K618184K934287K839521K458339K000028
12940E61467J614741J297292R01080K82830m87256j103455j294016j080471p40846
12931d8634n49271n77273o98264p30529o04331l95883j99174j1182K41993N74347
$$ y = [-20689846, -20720874, -21542314, -23213839, -25468919, -27876348, -30102615, -32001538, -33544516, -34760163, -35702400, -36414745, -36931254, -37290567, -37469596, -37289125, -36436414, -34623541, -31790404, -28229696, -24507417, -21187843, -18590094, -16781385, -15719964, -15347161, -15582545, -16306246, -17392235, -18730455, -20186888, -21579891, -22719745, -23441157, -23604643, -23138729, -22114304, -20740074, -19279975, -17987178, -17041429, -16458265, -16039912, -15426265, -14241677, -12288892, -9670708, -6736421, -3896900, -1438561, 561467, 2176208, 3473500, 4374580, 4657410, 4170154, 3066699, 1772683, 692212, -48634, -597905, -1175178, -1873442, -2603971, -3208302, -3604185, -3803359, -3814541, -3572548, -2998201]
12921b998201Q50322Q51278M60977k01751q43797j184602j088960n98589Q4845
12912d668478O61552Q83497P10734K80404k50506p76615j216213j480820j497075
12903g353520j267742r14807o28047n37975o38953q06151q56060o58794k61222
12894a3923271J54279M46521O07070P17152Q59830J056876J262543J378892J282010
12885f158098Q95514K64039m55156j047507j292669j033056k59591Q25129J880261
12876f381134K643157L053329L194057L188740L130192L056810K952304K755177
12868A7592632K405525J901788J297954O35904j08227r65919j856679k603842
12860A8299136l065517l162070k849350k186312j357618n71493K0062L38629L73192
$$ y = [-2998201, -2147879, -1296601, -835624, -1037375, -1881172, -3065774, -4154734, -4753323, -4668478, -4006926, -3123429, -2412695, -2132291, -2382797, -3159412, -4375625, -5856445, -7353520, -8621262, -9536069, -10164116, -10702091, -11341044, -12147195, -13003255, -13662049, -13923271, -13768992, -13322471, -12715401, -11998249, -11138419, -10081543, -8819000, -7440108, -6158098, -5262584, -4998545, -5453701, -6501208, -7793877, -8826933, -9086524, -8261395, -6381134, -3737977, -684648, 2509409, 5698149, 8828341, 11885151, 14837455, 17592632, 19998157, 21899945, 23197899, 23833803, 23725576, 22759657, 20902978, 18299136, 15233619, 12071549, 9222199, 7035887, 5678269, 5106776, 5126838, 5465467, 5838659]
12851E838659J54148k54696p46979j183667j431810j426258j196277q32979m44654
12842a524513j19210R4790J70140J09249M159L4160L30208Q23361J264552J398594
12832B585490J120179N58006K9449j78600j0752L70007P49644R91146J014449
12823G229018P13967J1381r78459j921807k448713k374853j797582r89054j79983
12814b736085N41735J142647J544382J661203J503376J211415R80303R31219J037872
12805G818067J171482J189650R90457N71384J01534j52321n4697K99683O92009
12796A2627248Q85526O85410L5428r02122j801493k354397k434223k137338j684351
12787B919688j253144r29794p93784r31209j341682j888190k349104k532176k393254
$$ y = [5838659, 5992807, 5738111, 4991132, 3807465, 2375655, 949397, -246880, -1079859, -1524513, -1643723, -1548933, -1378793, -1269544, -1265385, -1231225, -901017, -77656, 1186896, 2585490, 3705669, 4263675, 4293124, 4114524, 4103772, 4473779, 5223423, 6214569, 7229018, 7942985, 7954366, 6975907, 5054100, 2605387, 230534, -1567048, -2556102, -2736085, -2194350, -1051703, 492679, 2153882, 3657258, 4868673, 5848976, 6780195, 7818067, 8989549, 10179199, 11169656, 11741040, 11842574, 11690253, 11635556, 11935239, 12627248, 13512774, 14198184, 14233612, 13331490, 11529997, 9175600, 6741377, 4604039, 2919688, 1666544, 736750, -57034, -988243, -2329925, -4218115, -6567219, -9099395, -11492649]
12778a1492649k079218j825071j748639j735594j543951r89812m8451J092030
12770b0371355K060835K520004K399571J912669J378434J029484R30501J035717
12762g104140J279844J581530J804068J769482J343606N67616k88424q81910j025123
12753i53451p61418l06789O6185J90553R3632q1413k23891l26592m18905m69073
12743c191162l99285j85325J12551M34240P69416J108044J429007J743387K052931
12734C873804K253023K153247J647297Q46409J6247o01214r03064r26707p78986
12725G580056n49091k73294L3575L24506N19192N57109M19044J23798k45101n50296
12715G939498o83716o50069n95724p11841j054481j506911j920894k202755k271466
$$ y = [-11492649, -13571867, -15396938, -17145577, -18881171, -20425122, -21414934, -21463385, -20371355, -18310520, -15790516, -13390945, -11478276, -10099842, -9070358, -8139857, -7104140, -5824296, -4242766, -2438698, -669216, 674390, 1242006, 953582, 71672, -953451, -1714869, -2021658, -1955473, -1764920, -1671288, -1752701, -1976592, -2303184, -2722089, -3191162, -3590447, -3775772, -3663221, -3228981, -2459565, -1351521, 77486, 1820873, 3873804, 6126827, 8280074, 9927371, 10773780, 10790027, 10188813, 9285749, 8359042, 7580056, 7030965, 6757671, 6791246, 7115752, 7634944, 8192053, 8611097, 8734895, 8489794, 7939498, 7255782, 6605713, 6009989, 5298148, 4243667, 2736756, 815862, -1386893, -3658359]
12706c658359k032214j439304n73424L79989J199299J665654J635501J130855
12698a692003L54348m05534r31701j165591j146103r00765m48107J14921O13398
12689e607137R01303R50917Q57851P43523O57825O06495N92512N79312M94542
12680G77143K78533p7168m80301p64973q10015n92759j49679M38685J002041J295131
12670I16638J154104O34318m4252o55958j064367j221023j144436r39435p69926
12661c134337p22553o91588m36471K03684J133119K036106K584723K629830K227717
12652E830230J535717P19757p8146p42208j181479j340994j215215q85261n47742
12643B094659m11210n39467q20089j066525j138184r76622n91134o9242M23015
$$ y = [-3658359, -5690573, -7129877, -7703301, -7323312, -6124013, -4458359, -2822858, -1692003, -1337655, -1743189, -2674890, -3840481, -4986584, -5887349, -6335456, -6220535, -5607137, -4705834, -3754917, -2897066, -2153543, -1495718, -889223, -296711, 282601, 777143, 1055676, 978508, 498207, -266766, -1076781, -1669540, -1819219, -1380534, -378493, 916638, 2070742, 2705060, 2660808, 2004850, 940483, -280540, -1424976, -2364411, -3134337, -3856890, -4548478, -4984949, -4781265, -3648146, -1612040, 972683, 3602513, 5830230, 7365947, 8085704, 8007558, 7265350, 6083871, 4742877, 3527662, 2642401, 2094659, 1683449, 1143982, 323893, -742632, -1880816, -2857438, -3448572, -3517814, -3094799]
12634c094799P32672Q20646P28458M90618J08882m43845j160150j883665k338601
12625f039784k323614j850175j093853k40723N99103J351008J909251K159048
12617e529739K066539J739279J359453J035391P86583O54852P14424R58379J244563
12608E029724J384978J276573R62069N83743K35668j15463n14788r01444j164244
12599F776816j282329j372106j573834j880443k081197j906296j248950k47880
12591d816219Q12711J644328K043826J954818J495919R09941M53983K89860M11692
12582E200859O52214P89393O85418L62116q259k10214j47434J12144M19187N96990
12572H452414N01061J30001l47384p02787p95315o28126k76318J95440P32246
$$ y = [-3094799, -2362127, -1541481, -813023, -322405, -213523, -657368, -1817518, -3701183, -6039784, -8363398, -10213573, -11307426, -11548149, -10949046, -9598038, -7688787, -5529739, -3463200, -1723921, -364468, 670923, 1457506, 2112358, 2826782, 3785161, 5029724, 6414702, 7691275, 8653344, 9237087, 9472755, 9357292, 8842504, 7941060, 6776816, 5494487, 4122381, 2548547, 668104, -1413093, -3319389, -4568339, -4816219, -4003508, -2359180, -315354, 1639464, 3135383, 4045324, 4499307, 4789167, 5200859, 5853073, 6642466, 7327884, 7690000, 7681741, 7471527, 7324093, 7436237, 7855424, 8452414, 8953475, 9083476, 8736092, 8033305, 7237990, 6609864, 6333546, 6528986, 7261232]
12563G261232J259979J666347J829046J707784J407594J125710J001792J024880
12555A8284364J094195J114918R99946O66708J54945l18602n74526p03236r68428
12546A9750284j523184k281897k999204l430416l440319l014951k247993j325586
$$ y = [7261232, 8521211, 10187558, 12016604, 13724388, 15131982, 16257692, 17259484, 18284364, 19378559, 20493477, 21493423, 22160131, 22315076, 21996474, 21421948, 20718712, 19750284, 18227100, 15945203, 12945999, 9515583, 6075264, 3060313, 812320, -513266]
$$ [...]
##END NTUPLES=NMR SPECTRUM
##END=
