##TITLE=31P ikalashn
11P153_mk-TFA
26.7.2023
##JCAMPDX= 6.0         $$ Bruker NMR JCAMP-DX V2.0
##DATA TYPE= NMR SPECTRUM
##DATA CLASS= NTUPLES
##ORIGIN= UXNMR, Bruker Analytische Messtechnik GmbH
##OWNER= root
$$ TOPSPIN		Version 1.3
$$ 2023-07-26 15:36:29.453 +0400  Irina@DPX200
$$ Compression mode = diff/dup
##.OBSERVE FREQUENCY= 81.01967998063
##.OBSERVE NUCLEUS= ^31P
##.ACQUISITION MODE= SIMULTANEOUS
##.ACQUISITION SCHEME= undefined
##.AVERAGES= 64
##.DIGITISER RES= 17
##SPECTROMETER/DATA SYSTEM= spect
##.PULSE SEQUENCE= zgpg
##.SOLVENT NAME= CDCl3
##.SHIFT REFERENCE= INTERNAL, CDCl3, 1, 298.5841
##AUDIT TRAIL= $$ (NUMBER, WHEN, WHO, WHERE, WHAT)
$$ ##TITLE= Audit trail, TOPSPIN		Version 1.3
$$ ##JCAMPDX= 5.01
$$ ##ORIGIN= Bruker BioSpin GmbH
$$ ##OWNER= Irina
$$ $$ F:/spectra/data/iren/nmr/P31dec/1/pdata/1/auditp.txt
$$ ##AUDIT TRAIL=  $$ (NUMBER, WHEN, WHO, WHERE, VERSION, WHAT)
(   1,<2023-07-26 15:35:55.703 +0400>,<Irina>,<DPX200>,<TOPSPIN 1.3>,
      <created by zg
	started at 2023-07-26 15:34:12.453 +0400,
	POWCHK disabled, PULCHK disabled
       configuration hash MD5:
       BE 6D 3F 07 2A EA 11 49 91 17 2B D3 AF B3 58 0D
       data hash MD5: 32K
       D8 5E 98 BB B0 A6 F4 0D 2B F1 84 C8 E4 45 7B 04>)
(   2,<2023-07-26 15:36:16.000 +0400>,<Irina>,<DPX200>,<TOPSPIN 1.3>,
      <Start of raw data processing
       efp BC_mod = 2 LB = 15 FT_mod = 6 PKNL = 1 PHC0 = -11.31022 PHC1 = 349.2841 SI = 32K 
       data hash MD5: 32K
       1D 25 0F AA ED 5A 24 7A 0D C1 64 49 D1 10 65 62>)
(   3,<2023-07-26 15:36:18.218 +0400>,<Irina>,<DPX200>,<TOPSPIN 1.3>,
      <abs n ABSG = 5 
       data hash MD5: 32K
       90 3D 8F B8 77 11 E8 4D E7 49 76 9D C3 DE E9 32>)
$$ ##END=
$$ 
$$ $$ hash MD5
$$ $$ 05 7F C9 D0 0C 55 41 A5 BF 09 49 45 8E 34 26 59
##$RELAX= 
##$RELAX= 
##$RELAX= 
##$RELAX= 
##$RELAX= 
##$RELAX= 
##$RELAX= 
##$RELAX= 
##$RELAX= 
##$RELAX= 
$$ Bruker specific parameters
$$ --------------------------
##$DU= <F:/spectra>
##$EXPNO= 1
##$NAME= <P31dec>
##$PROCNO= 1
##$TYPE= <nmr>
##$USER= <iren>
##$AMP= (0..31)
100 100 100 100 100 100 100 100 100 100 100 100 100 100 100 100 100 100 
100 100 100 100 100 100 100 100 100 100 100 100 100 100 
##$ANAVPT= -1
##$AQSEQ= 0
##$AQ_mod= 1
##$AUNM= <au_zg>
##$AUTOPOS= <>
##$BF1= 81.014009
##$BF2= 200.13
##$BF3= 200.13
##$BF4= 200.13
##$BF5= 200.13
##$BF6= 200.13
##$BF7= 200.13
##$BF8= 200.13
##$BYTORDA= 1
##$CFDGTYP= 0
##$CFRGTYP= 5
##$CHEMSTR= <none>
##$CNST= (0..63)
1 1 145 1 1 1 1 1 1 1 1 1 1 1 1 1 1 1 1 1 1 1 1 1 1 1 1 1 1 1 1 1 1 1 
1 1 1 1 1 1 1 1 1 1 1 1 1 1 1 1 1 1 1 1 1 1 1 1 1 1 1 1 1 1 
##$CPDPRG= <waltz16>
##$CPDPRG1= <>
##$CPDPRG2= <waltz16>
##$CPDPRG3= <>
##$CPDPRG4= <mlev>
##$CPDPRG5= <mlev>
##$CPDPRG6= <mlev>
##$CPDPRG7= <mlev>
##$CPDPRG8= <mlev>
##$CPDPRGB= <>
##$CPDPRGT= <>
##$D= (0..63)
0 1 0 0 0 0 0 0 0 0.06 0 0.03 2e-005 3e-006 0 0 0.0002 0 0 0 0 0 0 0 0 
0 0 0 0 0 0 0 0 0 0 0 0 0 0 0 0 0 0 0 0 0 0 0 0 0 0 0 0 0 0 0 0 0 0 0 
0 0 0 0 
##$DATE= 1690371351
##$DBL= (0..7)
$$ [...]
##$SW_h= 37037.037037037
##$TD= 32768
##$TD0= 1
##$TE= 300
##$TE2= 300
##$TE3= 300
##$TEG= 300
##$TL= (0..7)
0 120 53 12 22 120 120 120 
##$TP= (0..7)
150 150 150 150 150 150 150 150 
##$TP07= 0
##$TPNAME0= <>
##$TPNAME1= <>
##$TPNAME2= <>
##$TPNAME3= <>
##$TPNAME4= <>
##$TPNAME5= <>
##$TPNAME6= <>
##$TPNAME7= <>
##$TPOAL= (0..7)
0.5 0.5 0.5 0.5 0.5 0.5 0.5 0.5 
##$TPOFFS= (0..7)
0 0 0 0 0 0 0 0 
##$TUNHIN= 0
##$TUNHOUT= 0
##$TUNXOUT= 0
##$USERA1= <user>
##$USERA2= <user>
##$USERA3= <user>
##$USERA4= <user>
##$USERA5= <user>
##$V9= 5
##$VALIST= <valist>
##$VCLIST= <CCCCCCCCCCCCCCC>
##$VD= 0
##$VDLIST= <DDDDDDDDDDDDDDD>
##$VPLIST= <PPPPPPPPPPPPPPP>
##$VTLIST= <TTTTTTTTTTTTTTT>
##$WBST= 1024
##$WBSW= 4
##$XGAIN= (0..3)
0 0 0 0 
##$XL= 0
##$YL= 0
##$YMAX_a= 7326
##$YMIN_a= -1597
##$ZGOPTNS= <>
##$ZL1= 120
##$ZL2= 120
##$ZL3= 120
##$ZL4= 120
##$ABSF1= 298.5841
##$ABSF2= -158.5842
##$ABSG= 5
##$ABSL= 5
##$ALPHA= 0
##$AQORDER= 0
##$ASSFAC= 0
##$ASSFACI= 0
##$ASSFACX= 0
##$ASSWID= 0
##$AUNMP= <proc_1d>
##$AXLEFT= 0
##$AXRIGHT= 0
##$AXTYPE= 0
##$AXUNIT= <>
##$AZFE= 0.1
##$AZFW= 0.5
##$BCFW= 0
##$BC_mod= 2
##$BYTORDP= 0
##$COROFFS= 0
##$CY= 12.5935478210449
##$DATMOD= 1
##$DC= 0
##$DFILT= <>
##$DTYPP= 0
##$F1P= 47.1127640792319
##$F2P= -24.0371245302204
##$FCOR= 0.5
##$FTSIZE= 32768
##$FT_mod= 6
##$GAMMA= 0
##$GB= 0
##$INTBC= 1
##$INTSCL= 7.269226e-011
##$ISEN= 30
##$LB= 15
##$LEV0= 0
##$LPBIN= 0
##$MAXI= 12.09355
##$MC2= 0
##$MEAN= 0
##$ME_mod= 0
##$MI= 0.7550151
##$NCOEF= 0
##$NC_proc= -14
##$NLEV= 6
##$NOISF1= 298.5841
##$NOISF2= 270.0111
##$NSP= 0
##$NTH_PI= 0
##$NZP= 0
##$OFFSET= 298.5841
##$PC= 1.4
##$PHC0= -11.31022
##$PHC1= 349.2841
##$PH_mod= 1
##$PKNL= yes
##$PPARMOD= 0
##$PPDIAG= 0
##$PPIPTYP= 0
##$PPMPNUM= 100
##$PPRESOL= 1
##$PSCAL= 0
##$PSIGN= 0
##$REVERSE= no
##$SF= 81.014009
##$SI= 32768
##$SIGF1= 270.0111
##$SIGF2= -158.5842
##$SINO= 77.54984
##$SIOLD= 32768
##$SREGLST= <31P.CDCl3>
##$SSB= 0
##$STSI= 32768
##$STSR= 0
##$SW_p= 37037.037037037
##$SYMM= 0
##$S_DEV= 0
##$TDeff= 32768
##$TDoff= 0
##$TI= <>
##$TILT= no
##$TM1= 0
##$TM2= 0
##$TOPLEV= 0
##$USERP1= <user>
##$USERP2= <user>
##$USERP3= <user>
##$USERP4= <user>
##$USERP5= <user>
##$WDW= 1
##$XDIM= 32768
##$YMAX_p= 374400514
##$YMIN_p= -89832267
$$ End of Bruker specific parameters
$$ ---------------------------------
##NTUPLES= NMR SPECTRUM
##VAR_NAME=  FREQUENCY,     SPECTRUM/REAL,   SPECTRUM/IMAG
##SYMBOL=    X,             R,               I
##VAR_TYPE=  INDEPENDENT,   DEPENDENT,       DEPENDENT
##VAR_FORM=  AFFN,          ASDF,            ASDF
##VAR_DIM=   32768,         32768,           32768
##UNITS=     HZ,            ARBITRARY UNITS, ARBITRARY UNITS
##FACTOR=    1.13031516577767, 1,            1
##FIRST=     37037.037037037, -10204989,     60110293
##LAST=      0,             712581,          -66369901
##MIN=       0,             -89832267,       0
##MAX=       37037.037037037, 374400514,     0
$$ Real data points
##PAGE= N=1
##DATA TABLE= (X++(R..R)), XYDATA
$$ [...]
17821b1604475k773719j878589o63415O88901J935359K849236L298516L266105
$$ -21604475 -24378194 -26256783 -26920198 -26231297 -24295938 -21446702 -18148186 -14882081
17813a4882081K803695J987204R19621k57709j394899k375443l109458l493796
$$ -14882081 -12078386 -10091182 -9171561 -9429270 -10824169 -13199612 -16309070 -19802866
17805a9802866l418071k848641j916774q98974p6400M05379N62818N02603L41921
$$ -19802866 -23220937 -26069578 -27986352 -28885326 -28961726 -28556347 -27993529 -27490926 -27149005
17796b7149005J80620J11550K09929M86447Q61388J203348J400460J405061J235510
$$ -27149005 -26968385 -26856835 -26646906 -26160459 -25299071 -24095723 -22695263 -21290202 -20054692
17787b0054692R52004O18888K68947j00644m86022q31555j053517j123915j108639
$$ -20054692 -19102688 -18483800 -18214853 -18315497 -18801519 -19633074 -20686591 -21810506 -22919145
17778b2919145j096111j097064j045181q93644o76052m72871l52299l42254m24184
$$ -22919145 -24015256 -25112320 -26157501 -27051145 -27727197 -28200068 -28552367 -28894621 -29318805
17769b9318805n44077o43494o81993o30451m62932j78667J71859N10769P94179
$$ -29318805 -29862882 -30506376 -31188369 -31818820 -32281752 -32460419 -32288560 -31777791 -30983612
17760c0983612J041670J301648J584502J819530J873424J625552J047380K21327
$$ -30983612 -29941942 -28640294 -27055792 -25236262 -23362838 -21737286 -20689906 -20468579
17752b0468579p08778j592966k291907k691816k748996k513546k086780j556732
$$ -20468579 -21177357 -22770323 -25062230 -27754046 -30503042 -33016588 -35103368 -36660100
17744c6660100r74381l66133K54213Q82666J520011K161098K791038L400537M001626
$$ -36660100 -37634481 -38000614 -37746401 -36863735 -35343724 -33182626 -30391588 -26991051 -22989425
17735b2989425M608926N191289N648297N850479N717296N264349M569924L693730
$$ -22989425 -18380499 -13189210 -7540913 -1690434 4026862 9291211 13861135 17554865
17727A7554865K644478J433350J39276j093299k114864k827297l203502l283584
$$ 17554865 20199343 21632693 21771969 20678670 18563806 15736509 12533007 9249423
17719I249423l154985k904453k563846k100766j458910o08297M16508J500391
$$ 9249423 6094438 3189985 626139 -1474627 -2933537 -3541834 -3125326 -1624935
17711a624935K466904L124913L325555L017182K277854J303224L36287m38793
$$ -1624935 841969 3966882 7292437 10309619 12587473 13890697 14226984 13788191
17703A3788191r68410j321192j621030j963162k356946k732721k992453l046131
$$ 13788191 12819781 11498589 9877559 7914397 5557451 2824730 -167723 -3213854
17695c213854k821520k274999j413325l08781R15642K122085L176872L956329
$$ -3213854 -6035374 -8310373 -9723698 -10032479 -9116837 -6994752 -3817880 138449
17687A38449M373782M412432M123001L582985K852969J967484R61490r9725j114833
$$ 138449 4512231 8924663 13047664 16630649 19483618 21451102 22412592 22312867 21198034
17678B1198034j959208k500989k628276k295930j576392o70109J65379P36095
$$ 21198034 19238826 16737837 14109561 11813631 10237239 9567130 9732509 10468604
17670A0468604R88043R85338Q26114N69717K23571k13856o99584j134078j409475
$$ 10468604 11456647 12441985 13268099 13837816 14061387 13847531 13147947 12013869 10604394
17661A0604394j474725j352464j102973p80190m11126j1528L76089O67338P69823
$$ 10604394 9129669 7777205 6674232 5894042 5482916 5471388 5847477 6514815 7284638
17652G284638O49788L83904J33996M7901J79427M91734R06539J331216J666335
$$ 7284638 7934426 8318330 8452326 8500227 8679654 9171388 10077927 11409143 13075478
17643A3075478J842511J870081J839121J864169K013783K262425K496689K589490
$$ 13075478 14917989 16788070 18627191 20491360 22505143 24767568 27264257 29853747
17635B9853747K506529K347469K252197K248936K199640J894744J207502J84186
$$ 29853747 32360276 34707745 36959942 39208878 41408518 43303262 44510764 44694950
17627D4694950r83142k056552k842062l229162l200419k844030k353417j964339
$$ 44694950 43711808 41655256 38813194 35584032 32383613 29539583 27186166 25221827
17619B5221827j840587j999118k335935k712755l018884l173046l109189k794567
$$ 25221827 23381240 21382122 19046187 16333432 13314548 10141502 7032313 4237746
17611D237746k264079j625934j023482n75679l35278k91147l98171n92872p87880
$$ 4237746 1973667 347733 -675749 -1251428 -1586706 -1877853 -2276024 -2868896 -3656776
17602c656776q84405q23512o34266m23539l02338l02229l59027l80640l23607
$$ -3656776 -4541181 -5364693 -5998959 -6422498 -6724836 -7027065 -7386092 -7766732 -8090339
17593h090339k01776l6236J77328M38237O99837Q91615R84630J018078J050048
$$ -8090339 -8292115 -8328351 -8151023 -7712786 -7012949 -6121334 -5136704 -4118626 -3068578
17584c068578J082811J042066Q30700M00432k26830r83706j770504k459694k943874
$$ -3068578 -1985767 -943701 -113001 287431 60601 -923105 -2693609 -5153303 -8097177
17575h097177l198499l273290l215553l019925k659938k154034j586235j064005
$$ -8097177 -11295676 -14568966 -17784519 -20804444 -23464382 -25618416 -27204651 -28268656
17567b8268656o57527l64593j21051J49979M90021Q92934J316507J694582J956012
$$ -28268656 -28926183 -29290776 -29411827 -29261848 -28771827 -27878893 -26562386 -24867804 -22911792
17558b2911792K057119K007601J866445J708502J587636J523283J510067J529532
$$ -22911792 -20854673 -18847072 -16980627 -15272125 -13684489 -12161206 -10651139 -9121607
17550i121607J552822J542489J465660J318401J147894J044068J075423J208912
$$ -9121607 -7568785 -6026296 -4560636 -3242235 -2094341 -1050273 25150 1234062
17542A234062J308329J232236R30612M51320j15512o82498j176552j539036j733072
$$ 1234062 2542391 3774627 4705239 5156559 5041047 4358549 3181997 1642961 -90111
17533i0111j747490j589563j288812r16899n81371l76314l42538m72694p23081
$$ -90111 -1837601 -3427164 -4715976 -5632875 -6214246 -6590560 -6933098 -7405792 -8128873
17524h128873j007775j226111j347629j462762j705098k109074k563830k902132
$$ -8128873 -9136648 -10362759 -11710388 -13173150 -14878248 -16987322 -19551152 -22453284
17516b2453284l002879k816280k347642j653091q41078o0445N24491P70528O05811
$$ -22453284 -25456163 -28272443 -30620085 -32273176 -33114254 -33174699 -32650208 -31879680 -31273869
17507c1273869Q1028o19425j244012j585376j550845j160223n11970K50468R75798
$$ -31273869 -31192841 -31812266 -33056278 -34641654 -36192499 -37352722 -37864692 -37614224 -36638426
17498c6638426J544314J903118K089471K212750K380809K622602K878497L055653
$$ -36638426 -35094112 -33190994 -31101523 -28888773 -26507964 -23885362 -21006865 -17951212
17490a7951212L072456K857140K354573J581184O76385j27118o17801p22913n35699
$$ -17951212 -14878756 -12021616 -9667043 -8085859 -7409474 -7536592 -8154393 -8877306 -9413005
17481i413005k33166M1927K44440M19002O58946J034946J499327J864599J921657
$$ -9413005 -9646171 -9604244 -9359804 -8940802 -8281856 -7246910 -5747583 -3882984 -1961327
17472a961327J590038R58215K08523m85445j021927j382193j605711j743397j803403
$$ -1961327 -371289 586926 795449 310004 -711923 -2094116 -3699827 -5443224 -7246627
17463g246627j724708j414225q37161r1122O09522J040729J100382Q81488O26890
$$ -7246627 -8971335 -10385560 -11222721 -11313843 -10704321 -9663592 -8563210 -7681722 -7054832
17454g054832N77037Q13323J215315J552302J612431J275828N38473m71043j505166
$$ -7054832 -6477795 -5664472 -4449157 -2896855 -1284424 -8596 529877 58834 -1446332
17445a446332k291903k677128k700876k536178k346953k186642j997771j682365
$$ -1446332 -3738235 -6415363 -9116239 -11652417 -13999370 -16186012 -18183783 -19866148
17437a9866148j180879n17891J96863Q13895J218831J383139J349118J176334
$$ -19866148 -21047027 -21564918 -21368055 -20554160 -19335329 -17952190 -16603072 -15426738
17429a5426738R10896N97949L08647J40462J71038L99176P38778J086131J402693
$$ -15426738 -14515842 -13917893 -13609246 -13468784 -13297746 -12898570 -12159792 -11073661 -9670968
17420i670968J731257K129320K589719L022052L299262L321881L052582K507263
$$ -9670968 -7939711 -5810391 -3220672 -198620 3100642 6422523 9475105 11982368
17412A1982368J728986P78556k53890j232833j983282k347287k274431j863125
$$ 11982368 13711354 14489910 14236020 13003187 11019905 8672618 6398187 4535062
17404D535062j298417p49212l17120m4411N6052k7814l09559p68565j312833j796764
$$ 4535062 3236645 2487433 2170313 2125902 2181954 2154140 1844581 1076016 -236817 -2033581
17394b033581k102933k218347k228102k232897k265252k270609k157155j855351
$$ -2033581 -4136514 -6354861 -8582963 -10815860 -13081112 -15351721 -17508876 -19364227
17386a9364227j346769o86959j8062M87300P35137P65281P05199O85743P82926
$$ -19364227 -20710996 -21397955 -21416017 -20928717 -20193580 -19428299 -18723100 -18037357 -17254431
17377a7254431J000696J294468J608728J885975K058418K070421J922582J679913
$$ -17254431 -16253735 -14959267 -13350539 -11464564 -9406146 -7335725 -5413143 -3733230
17369c733230J436244J280674J282960J479930J852877K300493K638337K667527
$$ -3733230 -2296986 -1016312 266648 1746578 3599455 5899948 8538285 11205812
17361A1205812K289628J573330P14054p3491o46656r64645j068284j043599r84500
$$ 11205812 13495440 15068770 15782824 15709333 15062677 14098032 13029748 11986149 11001649
17352A1001649r58401r95292j110786j328977j666476k087480k473508k646317
$$ 11001649 10043248 9047956 7937170 6608193 4941717 2854237 380729 -2265588
17344b265588k453613j873595j056056k60397K64962L89598J47820k92473p15863
$$ -2265588 -4719201 -6592796 -7648852 -7909249 -7644287 -7254689 -7106869 -7399342 -8115205
17335h115205r49134r18073o56694k72192J13192M16996O20672P48825Q30612
$$ -8115205 -9064339 -9982412 -10639106 -10911298 -10798106 -10381110 -9760438 -9011613 -8181001
17326h181001Q86615R37933R95714J026133R45757O78469K28419k94660p26357
$$ -8181001 -7294386 -6356453 -5360739 -4334606 -3388849 -2710380 -2481961 -2776621 -3502978
17317c502978r42355r17678p14405m30121j43802J12720L33295M91846N46048
$$ -3502978 -4445333 -5363011 -6077416 -6507537 -6651339 -6538619 -6205324 -5713478 -5167430
17308e167430M98327M14253L46921K67198J05171j42036l75292m88230m79746
$$ -5167430 -4669103 -4254850 -3907929 -3640731 -3535560 -3677596 -4052888 -4541118 -5020864
17299e020864m44091m62948n38154o24837o90864p16459o58463m57144q6368M10821
$$ -5020864 -5464955 -5927903 -6466057 -7090894 -7781758 -8498217 -9156680 -9613824 -9700192 -9289371
17289i289371R33014J373912J685820J899510K085592K303074K568330K842466
$$ -9289371 -8356357 -6982445 -5296625 -3397115 -1311523 991551 3559881 6402347
17281F402347L047737L116970L043922K896497K777571K757622K827086K900142
$$ 6402347 9450084 12567054 15610976 18507473 21285044 24042666 26869752 29769894
17273B9769894K872913K697856K406050K054227J657236J178127N75117j51761
$$ 29769894 32642807 35340663 37746713 39800940 41458176 42636303 43211420 43059659
17265D3059659r52885j755944k494956l108946l528114l697256l629482l422972
$$ 43059659 42106774 40350830 37855874 34746928 31218814 27521558 23892076 20469104
17257B0469104l205694l047356k905298k649755k171865j503245q33721m01511
$$ 20469104 17263410 14216054 11310756 8661001 6489136 4985891 4152170 3750659
17249C750659l56527p01122j317949k029966k651754l034402l107681k902360
$$ 3750659 3394132 2693010 1375061 -654905 -3306659 -6341061 -9448742 -12351102
17241a2351102k539332k181154j953805j873178j831765j682211j367092r70792
$$ -12351102 -14890434 -17071588 -19025393 -20898571 -22730336 -24412547 -25779639 -26750431
17233b6750431o36775m40757l44308k42410k9390L61285R30858J603366K255234
$$ -26750431 -27387206 -27827963 -28172271 -28414681 -28444071 -28082786 -27151928 -25548562 -23293328
17224b3293328K775271L101059L213678L125839K880095K534446K137997J733167
$$ -23293328 -20518057 -17416998 -14203320 -11077481 -8197386 -5662940 -3524943 -1791776
17216a791776J375676J116901R48208P85596N35453J69510k70209p14062j093839
$$ -1791776 -416100 700801 1649009 2434605 2970058 3139568 2869359 2155297 1061458
17207A061458j348523j430577j323165j055648o85492k47173K61134Q15009J299249
$$ 1061458 -287065 -1717642 -3040807 -4096455 -4781947 -5029120 -4767986 -3952977 -2653728
17198b653728J535584J400467R23839K63254m20482j054846j638591k166343k580338
$$ -2653728 -1118144 282323 1206162 1469416 1048934 -5912 -1644503 -3810846 -6391184
17189f391184k780304k671300k219639j491000o44575J21623O41705Q29936O93795
$$ -6391184 -9171488 -11842788 -14062427 -15553427 -16198002 -16076379 -15434674 -14604738 -13910943
17180a3910943L19104j69861o61434j080553j374102j497242j436548j251754
$$ -13910943 -13591839 -13761700 -14423134 -15503687 -16877789 -18375031 -19811579 -21063333
17172b1063333j070591j001605j033889j029070q16730l07647M53390J306984
$$ -21063333 -22133924 -23135529 -24169418 -25198488 -26015218 -26322865 -25869475 -24562491
17164b4562491K048040K513016K638483K459238K065677J561489J040052N69590
$$ -24562491 -22514451 -20001435 -17362952 -14903714 -12838037 -11276548 -10236496 -9666906
17156i666906J69371k14209o88413j325788k060244k672497k902487k609290j864448
$$ -9666906 -9497535 -9711744 -10400157 -11725945 -13786189 -16458686 -19361173 -21970463 -23834911
17147b3834911r20764q2884M36715N97947N16323L66520K78261K97133M05500
$$ -23834911 -24755675 -24838559 -24401844 -23803897 -23287574 -22921054 -22642793 -22345660 -21940160
17138b1940160N52425O75347P32018P36822P60838Q87411J162656J573075K055024
$$ -21940160 -21387735 -20712388 -19980370 -19243548 -18482710 -17595299 -16432643 -14859568 -12804544
17129a2804544K524099K906103L153471L237320L132102K832665K397995J958382
$$ -12804544 -10280445 -7374342 -4220871 -983551 2148551 4981216 7379211 9337593
17121I337593J657283J577037J701475J921405K075026K018242J695479J159423
$$ 9337593 10994876 12571913 14273388 16194793 18269819 20288061 21983540 23142963
17113B3142963N24237r6185o17660r94471j225081j347867j428733j551599j798608
$$ 23142963 23667200 23571015 22953355 21958884 20733803 19385936 17957203 16405604 14606996
17104A4606996k204644k723446l251956l690992l980772m086687l970709l600933
$$ 14606996 12402352 9678906 6426950 2735958 -1244814 -5331501 -9302210 -12903143
17096a2903143k996303k253434j528726r81706o95049o25470o45188o44352n96869
$$ -12903143 -15899446 -18152880 -19681606 -20663312 -21358361 -21983831 -22629019 -23273371 -23870240
17087b3870240n40596n05778m64357l52224j39574J29576L70782N27610O07545
$$ -23870240 -24410836 -24916614 -25380971 -25733195 -25872769 -25743193 -25372411 -24844801 -24237256
17078b4237256O69370P97041J074392J555383K246653L105100M024405M825602
$$ -24237256 -23567886 -22770845 -21696453 -20141070 -17894417 -14789317 -10764912 -5939310
17070e939310N303678N328183M929132M299641L701272L323105L178025L100356
$$ -5939310 -635632 4692551 9621683 13921324 17622596 20945701 24123726 27224082
17062B7224082K850301K267165J378501L88067m53527r98262j254534j312778
$$ 27224082 30074383 32341548 33720049 34108116 33654589 32656327 31401793 30089015
17054C0089015j239535j059763q08736n41310k86632m4186J56267K22984N5843
$$ 30089015 28849480 27789717 26980981 26439671 26153039 26108853 26265120 26488104 26543947
17045B6543947l65872r45333j514445j929790k151002k249360k333173k444442
$$ 26543947 26178075 25232742 23718297 21788507 19637505 17388145 15054972 12610530
17037A2610530k530649k523638k420145k258460k037648j700110j202653n98031
$$ 12610530 10079881 7556243 5136098 2877638 839990 -860120 -2062773 -2660804
17029b660804m4034K88213L48318K67527K88080O11038J260119K046357K659330
$$ -2660804 -2704838 -2416625 -2068307 -1800780 -1512700 -901662 358457 2404814 5064144
17020E064144K832541K487937J766915R23829J72112m00094q21419j179290j544743
$$ 5064144 7896685 10384622 12151537 13075366 13247478 12847384 12025965 10846675 9301932
17011I301932j911203k191272k282217k146396j835842j450580j075032p26695
$$ 9301932 7390729 5199457 2917240 770844 -1064998 -2515578 -3590610 -4317305
17003d317305l46621J36736P05410J213575J470550J384823J043449O57659M25769
$$ -4317305 -4663926 -4527190 -3821780 -2608205 -1137655 247168 1290617 1948276 2374045
16994B374045M27021O14283Q78962J114165J237212J192354R59323N61720O1328
$$ 2374045 2801066 3415349 4294311 5408476 6645688 7838042 8797365 9359085 9420413
16985I420413m65436r63589j425433j876410k325646k724450k968138k949620
$$ 9420413 8954977 7991388 6565955 4689545 2363899 -360551 -3328689 -6278309
16977f278309k638064k113775j521133r87923n75048k77152o7242N1667M4111
$$ -6278309 -8916373 -11030148 -12551281 -13539204 -14114252 -14391404 -14458646 -14406979 -14362868
16968a4362868j06230l56182o21919q24339r05004q22497n76751k43017M3791
$$ -14362868 -14469098 -14825280 -15447199 -16271538 -17176542 -17999039 -18575790 -18818807 -18775016
16959a8775016J51465J8663k98981o42457q37411p94442n42579j84842J75746
$$ -18775016 -18623551 -18604888 -18903869 -19546326 -20383737 -21178179 -21720758 -21905600 -21729854
16950b1729854M85908P44385R74303J196246J410886J589635J678655J615429
$$ -21729854 -21243946 -20499561 -19525258 -18329012 -16918126 -15328491 -13649836 -12034407
16942a2034407J345524Q37672J12302p25153j495536k020560k203618k049936
$$ -12034407 -10688883 -9851211 -9738909 -10464062 -11959598 -13980158 -16183776 -18233712
16934a8233712j623999j006747l02208L43509P77585R16264P86787N03070K05829
$$ -18233712 -19857711 -20864458 -21166666 -20823157 -20045572 -19129308 -18342521 -17839451 -17633622
16925a7633622Q966k3410J31750M72879R72124J555468K094130K437747K485590
$$ -17633622 -17624656 -17648066 -17516316 -17043437 -16071313 -14515845 -12421715 -9983968 -7498378
16916g498378K256279J891201J557296J322914J128796Q76854N35028J57277j74636
$$ -7498378 -5242099 -3350898 -1793602 -470688 658108 1534962 2069990 2227267 2052631
16907B052631m07854n24213n13622l63826q2040K97397P41978J225424J680390
$$ 2052631 1644777 1120564 606942 243116 161076 458473 1200451 2425875 4106265
16898D106265J982229K022452J794303J390167R29766N00612J46034j17047k84893
$$ 4106265 6088494 8110946 9905249 11295416 12225182 12725794 12871828 12754781 12469888
16889A2469888l68663l96213m03168m02541l36989p0225N27048J447645K500414
$$ 12469888 12101225 11705012 11301844 10899303 10562314 10492089 11019137 12466782 14967196
16880A4967196L387774L827203L642604K826482J572303K36252p96332j289351
$$ 14967196 18354970 22182173 25824777 28651259 30223562 30459814 29663482 28374131
16872B8374131j261921r39906n95443m00259l84349m85300o11911o82062o46902
$$ 28374131 27112210 26172304 25576861 25176602 24792253 24306953 23695042 23012980 22366078
16863B2366078n16241l70261l21339m32010o69023r53524j252630j607345k080613
$$ 22366078 21849837 21479576 21158237 20726227 20057204 19103680 17851050 16243705 14163092
16854A4163092k691701l367554l923529m118504l766947k813279j331738M97573
$$ 14163092 11471391 8103837 4180308 61804 -3705143 -6518422 -7850160 -7352587
16846g352587K406629M083653N259821N793164N699326N124219M281443L381198
$$ -7352587 -4945958 -862305 4397516 10190680 15890006 21014225 25295668 28676866
16838B8676866K584288J999310J693895J677269J861609K055002K013349J531083
$$ 28676866 31261154 33260464 34954359 36631628 38493237 40548239 42561588 44092671
16830D4092671N35331q60893k389976l739096m672714n100006n062207m673141
$$ 44092671 44628002 43767109 41377133 37638037 32965323 27865317 22803110 18129969
16822A8129969m065863l357978k625093j893044j165142m65712J52081O47121
$$ 18129969 14064106 10706128 8081035 6187991 5022849 4557137 4709218 5356339
16814E356339J016143J259540J340300J205659Q56485L89666l0752k44728j54694
$$ 5356339 6372482 7632022 8972322 10177981 11034466 11424132 11393380 11148652 10993958
16805A0993958K48490Q88792J639153K369498K968425L336559L403906L177774
$$ 10993958 11242448 12131240 13770393 16139891 19108316 22444875 25848781 29026555
16797B9026555K748544K223169J662882J097983N79421J80900o0332k01488l81153
$$ 29026555 31775099 33998268 35661150 36759133 37338554 37519454 37459122 37257634 36876481
16788C6876481p28132j275954j961564k680504l327376l802830m008569l859788
$$ 36876481 36148349 34872395 32910831 30230327 26902951 23100121 19091552 15231764
16780A5231764l335721k531513j629997p90997o7201N77309J194102J805658K405301
$$ 15231764 11896043 9364530 7734533 6943536 6876335 7453644 8647746 10453404 12858705
16771A2858705K974152L494706L947146M286833M432088M286035L777385K901789
$$ 12858705 15832857 19327563 23274709 27561542 31993630 36279665 40057050 42958839
16763D2958839J756521N43136m88165j137399j345835j226573j009063r19002
$$ 42958839 44715360 45258496 44770331 43632932 42287097 41060524 40051461 39132459
16755C9132459j064196j401653j793958k097670k232037k206268k099298k006172
$$ 39132459 38068263 36666610 34872652 32774982 30542945 28336677 26237379 24231207
16747B4231207j982815k016906k029574j900956j525227q82543o8105P61927J476446
$$ 24231207 22248392 20231486 18201912 16300956 14775729 13893186 13825081 14587008 16063454
16738A6063454K003241K303425K344735K105771J599181Q93588J07905o36909
$$ 16063454 18066695 20370120 22714855 24820626 26419807 27313395 27421300 26784391
16730B6784391j275071j810299k280739k715098l113385l453293l709286l867057
$$ 26784391 25509320 23699021 21418282 18703184 15589799 12136506 8427220 4560163
16722D560163l917267l836707l589321l155985k556136j831723j016354j29126
$$ 4560163 642896 -3193811 -6783132 -9939117 -12495253 -14326976 -15343330 -15472456
16714a5472456Q02063J708717K465873K916552K933930K481830J644821O21103
$$ -15472456 -14670393 -12961676 -10495803 -7579251 -4645321 -2163491 -518670 102433
16706A02433l35121j015360j342554j372362j213437r42762n78123j13621M14028
$$ 102433 -232688 -1248048 -2590602 -3962964 -5176401 -6119163 -6697286 -6810907 -6396879
16697f396879Q92643J185416J222772J036399P09782L12916j20858n78165j040237
$$ -6396879 -5504236 -4318820 -3096048 -2059649 -1349867 -1036951 -1157809 -1735974 -2776211
16688b776211j473625j841538k122549k319838k453876k531299k494390k204584
$$ -2776211 -4249836 -6091374 -8213923 -10533761 -12987637 -15518936 -18013326 -20217910
16680b0217910j517587m14776R27912K214787L195784L780793M022460M013583
$$ -20217910 -21735497 -22150273 -21222361 -19007574 -15811790 -12030997 -8008537 -3994954
16672c994954L794857L340519K626323J710632P57649m057l64957k30175L27662
$$ -3994954 -200097 3140422 5766745 7477377 8235026 8230969 7866012 7635837 7963499
16663G963499J102348J849196K369709K544539K334489J788493J050010L19405
$$ 7963499 9065847 10915043 13284752 15829291 18163780 19952273 21002283 21321688
16655B1321688k18602m48756l38755P1181O82920J350493J897488K171183K131923
$$ 21321688 21103086 20654330 20315575 20386756 21069676 22420169 24317657 26488840 28620763
16646B8620763J903495J705888J708929J940539K318406K732674L077141L232882
$$ 28620763 30524258 32230146 33939075 35879614 38198020 40930694 44007835 47240717
16638D7240717L077593K534202J603866L55970j090083k569772l902331m950869
$$ 47240717 50318310 52852512 54456378 54812348 53722265 51152493 47250162 42299293
16630D2299293n651980n998533o024497n798261n394403m861036m226654l536319
$$ 42299293 36647313 30648780 24624283 18826022 13431619 8570583 4343929 807610
16622H07610k851206k193191j519548p81060J0129P75974J415269J859122K120624
$$ 807610 -2043596 -4236787 -5756335 -6537395 -6527266 -5751292 -4336023 -2476901 -356277
16613c56277K306314K562172K971291L467303L845642L891319L519045K803528
$$ -356277 1950037 4512209 7483500 10950803 14796445 18687764 22206809 25010337
16605B5010337J908552J010596K63370k16034l68836k23336J01112M27869N68736
$$ 25010337 26918889 27929485 28192855 27976821 27607985 27384649 27485761 27913630 28482366
16596B8482366L68836k32308j142641k129753k921225l318521l255261k801950
$$ 28482366 28851202 28618894 27476253 25346500 22425275 19106754 15851493 13049543
16588A3049543k128441j421355p97892k81120J53496N15400P75181Q86990Q33144
$$ 13049543 10921102 9499747 8701855 8420735 8574231 9089631 9864812 10751802 11584946
16579A1584946O56109M43034K66348J34649M849j56515l23389m15998l52912r9668
$$ 11584946 12241055 12684089 12950437 13085086 13089935 12933420 12610031 12194033 11841121 11741453
16569A1741453L17100Q15806J276731J580713J657598J510187J200809Q23958
$$ 11741453 12058553 12874359 14151090 15731803 17389401 18899588 20100397 20924355
16561B0924355M94011L32929M24378P60738J241044J720267K063767K180460K039304
$$ 20924355 21418366 21751295 22175673 22936411 24177455 25897722 27961489 30141949 32181253
16552C2181253J677662J192804O97355K54534j44995n36482r16578j230615j421183
$$ 32181253 33858915 35051719 35749074 36003608 35858613 35322131 34405553 33174938 31753755
16543C1753755j475851j419036j271923j035973p06803k90617J87191O72878J075664
$$ 31753755 30277904 28858868 27586945 26550972 25844169 25553552 25740743 26413621 27489285
16534B7489285J277794J177499P50577Q1086o84466j425268k076008k573503k814728
$$ 27489285 28767079 29944578 30695155 30776241 30091775 28666507 26590499 24016996 21202268
16525B1202268k690455k155988j279594k39379P33362J436351J761977J716400
$$ 21202268 18511813 16355825 15076231 14836852 15570214 17006565 18768542 20484942
16517B0484942J388020Q91465L16285k97540r30993j519349j921445j974654j597341
$$ 20484942 21872962 22764427 23080712 22783172 21852179 20332830 18411385 16436731 14839390
16508A4839390q46624J21620J144279K104980K920549L509217L796939L757109
$$ 14839390 13992766 14114386 15258665 17363645 20284194 23793411 27590350 31347459
16500C1347459L434310K917590K282205J564467Q04385R9498m15170o56888o61273
$$ 31347459 34781769 37699359 39981564 41546031 42350416 42449914 42034744 41377856 40716583
16491D0716583n59164m89454n26186o72855q95721j143244j355429j485997j525721
$$ 40716583 40157419 39667965 39141779 38468924 37573203 36429959 35074530 33588533 32062812
16482C2062812j509943j507185j588498j792243k112351k515034k954370l370414
$$ 32062812 30552869 29045684 27457186 25664943 23552592 21037558 18083188 14712774
16474A4712774l688521l828889l722849l345079k744390k032278j336266p57839
$$ 14712774 11024253 7195364 3472515 127436 -2616954 -4649232 -5985498 -6743337
16466f743337l50925j16852r798N0657J51867L45285O29063R78644J368560J744980
$$ -6743337 -7094262 -7211114 -7220912 -7170255 -7018388 -6673103 -6044040 -5065396 -3696836 -1951856
16456a951856K001784K012780J701964J097942L30741m20632r85270j234467j099492
$$ -1951856 49928 2062708 3764672 4862614 5193355 4772723 3787453 2552986 1453494
16447A453494n94670J53749R17130J450690J609198J396007R23266L43896k03849
$$ 1453494 858824 1012573 1929703 3380393 4989591 6385598 7308864 7652760 7448911
16438G448911o34374r17158j038787r66138o54006r6156O23257J328682J816901
$$ 7448911 6814537 5897379 4858592 3892454 3238448 3142292 3765549 5094231 6911132
16429F911132J950923J727528J268942P36672K35785k20324o76293j168882j679517
$$ 6911132 8862055 10589583 11858525 12595197 12830982 12610658 11934365 10765483 9085966
16420I085966k132429k426860k481318k268827j824668j220767n27114J94446
$$ 9085966 6953537 4526677 2045359 -223468 -2048136 -3268903 -3796017 -3601571
16412c601571Q49680J288610J367555J052551M48949k68695r39213j445151j713363
$$ -3601571 -2751891 -1463281 -95726 956825 1405774 1137079 197866 -1247285 -2960648
16403b960648j726814j539348j256333r68730o74509k61609M01035J326426K347425
$$ -2960648 -4687462 -6226810 -7483143 -8451873 -9126382 -9387991 -8986956 -7660530 -5313105
16394e313105L182840L576006L406040K716115J672287M90854o38694j606956
$$ -5313105 -2130265 1445741 4851781 7567896 9240183 9731037 9092343 7485387
16386G485387k379917k933291l189986l048985k489131j618727o19761L33130
$$ 7485387 5105470 2172179 -1017807 -4066792 -6555923 -8174650 -8794411 -8461281
16378h461281J120917J698532K079078K284569K305232K122482J779411J398793
$$ -8461281 -7340364 -5641832 -3562754 -1278185 1027047 3149529 4928940 6327733
16370F327733J099595Q99560P23618N09197K66649K2846k34480n00539o79699
$$ 6327733 7427328 8326888 9050506 9559703 9826352 9849198 9614718 9114179 8434480
16361H434480o41097l55095O3443M50902P04672P95528P12279M36312k2166n78171
$$ 8434480 7793383 7438288 7501731 7952633 8657305 9452833 10165112 10601424 10579258 10001087
16351A0001087j078604j370504j383498j170964q82375o77146o28472o86042p37223
$$ 10001087 8922483 7551979 6168481 4997517 4115142 3437996 2809524 2123482 1386259
16342A386259p17850o66696o72597p72149r03919r58398q58312n95703k26316
$$ 1386259 668409 1713 -670884 -1443033 -2346952 -3305350 -4163662 -4759365 -4985681
16333d985681J51695M38923N94198O64550P42458Q83562J061893J190962J176160
$$ -4985681 -4833986 -4395063 -3800865 -3136315 -2393857 -1510295 -448402 742560 1918720
16324A918720R52969M90130k18368j137026k170118l190362m103064m884789n572579
$$ 1918720 2871689 3361819 3143451 2006425 -163693 -3354055 -7457119 -12341908 -17914487
16315a7914487o229168o905114p607029q284639q832192r083181q800277p712508
$$ -17914487 -24143655 -31048769 -38655798 -46940437 -55772629 -64855810 -73656087 -81368595
16307h1368595n661120k802552L46804L167600N280082O631051P332792P519155
$$ -81368595 -87029715 -89832267 -89485463 -86317863 -81037781 -74406730 -67073938 -59554783
16299e9554783P334583O960144O578333O294465O094192N877559N537319N024426
$$ -59554783 -52220200 -45260056 -38681723 -32387258 -26293066 -20415507 -14878188 -9853762
16291i853762M372123L675521L034910K496558K041162J627658J236374Q66321
$$ -9853762 -5481639 -1806118 1228792 3725350 5766512 7394170 8630544 9496865
16283I496865N07093J23399l33985q92840j529953k183488k780672l231243l411287
$$ 9496865 10003958 10127357 9793372 8900532 7370579 5187091 2406419 -824824 -4236111
16274d236111l200571k562582j588787m61607O38508J615893K470188L231630
$$ -4236111 -7436682 -9999264 -11588051 -12049658 -11411150 -9795257 -7325069 -4093439
16266d093439L885840M351520M515768M292090L670825K745550J696604P25317
$$ -4093439 -207599 4143921 8659689 12951779 16622604 19368154 21064758 21790075
16258B1790075k0302m73005o26062n16319k32636R6983L66618N36013O10775O11170
$$ 21790075 21769773 21296768 20670706 20154387 19921751 20018734 20385352 20921365 21532140 22143310
16248B2143310N63761M88918L83658K37167P6609j6738M7390L01614O83511J050169
$$ 22143310 22707071 23195989 23579647 23816814 23893423 23876685 23924075 24225689 24909200 25959369
16238B5959369J242963J167422Q36570L56398j31699n25519q13442j057400j314347
$$ 25959369 27202332 28369754 29206324 29562722 29431023 28905504 28092062 27034662 25720315
16229B5720315j572673j767545j846543j803360j655949j420296j116871p90921
$$ 25720315 24147642 22380097 20533554 18730194 17074245 15653949 14537078 13746157
16221A3746157n14646l58021l36531l78966l62586j98819J10231M96819Q89659
$$ 13746157 13231511 12873490 12536959 12157993 11795407 11596588 11706819 12203638 13093297
16212A3093297J237023J490132J602884J563011J406919J189120R50883P36708
$$ 13093297 14330320 15820452 17423336 18986347 20393266 21582386 22533269 23269977
16204B3269977O26869P22929J086389J681154K362594K929552L215044L155450
$$ 23269977 23896846 24619775 25706164 27387318 29749912 32679464 35894508 39049958
16196C9049958K795889K242035J601205R48945L25442k57139q04297j320137j795528
$$ 39049958 41845847 44087882 45689087 46638032 46963474 46706335 45902038 44581901 42786373
16187D2786373k227539k642509l062332l429857l594299l400570k805659j926357
$$ 42786373 40558834 37916325 34853993 31424136 27829837 24429267 21623608 19697251
16179A9697251r89432k23604K26553L10110L5704n36068j275972k009006k587818
$$ 19697251 18707819 18484215 18710768 19020878 19056582 18520514 17244542 15235536 12647718
16170A2647718k950868l121756l167566l137205l000062k647580j995421j098014
$$ 12647718 9696850 6575094 3407528 270323 -2729739 -5377319 -7372740 -8470754
16162h470754j49902O18868J041845J052459O88019Q2748n79291j158310j630367
$$ -8470754 -8620656 -8001788 -6959943 -5907484 -5219465 -5136717 -5716008 -6874318 -8504685
16153h504685k054363k455102k748754k797985k535090k023656j405676p90041
$$ -8504685 -10559048 -13014150 -15762904 -18560889 -21095979 -23119635 -24525311 -25315352
16145b5315352j88799M33996J054759J557736J831408J883170J832777J798604
$$ -25315352 -25504151 -25070155 -24015396 -22457660 -20626252 -18743082 -16910305 -15111701
16137a5111701J809347J812329J735383J536813J213020P76864K56004k71069
$$ -15111701 -13302354 -11490025 -9754642 -8217829 -7004809 -6227945 -5971941 -6243010
16129f243010o60677p71024n66849j48974L20684P02521Q98043Q48090N57817
$$ -6243010 -6903687 -7674711 -8241560 -8390534 -8069850 -7367329 -6469286 -5621196 -5063379
16120e063379J15960l22562n86205n60013k40731K74879Q44598J320828J567631
$$ -5063379 -4947419 -5269981 -5856186 -6416199 -6656930 -6382051 -5537453 -4216625 -2648994
16111b648994J488232J072282M11972l50617j093766j736113k217297k489648
$$ -2648994 -1160762 -88480 323492 -27125 -1120891 -2857004 -5074301 -7563949
16103g563949k528858k341515j964187j457112q89959l21901K17288P34185J253861
$$ -7563949 -10092807 -12434322 -14398509 -15855621 -16745580 -17067481 -16850193 -16116008 -14862147
16094a4862147J788467K327261K852363L344933L765892M031951M018441L606996
$$ -14862147 -13073680 -10746419 -7894056 -4549123 -783231 3248720 7267161 10874157
16086A0874157K760730J578741K80950q83701j746953k271925k524652k608906
$$ 10874157 13634887 15213628 15494578 14610877 12863924 10591999 8067347 5458441
16078E458441k604822k531679k354250k023902j515404q40194m6209P94298J610271
$$ 5458441 2853619 321940 -2032310 -4056212 -5571616 -6411810 -6458019 -5663721 -4053450
16069d053450K343691K935416L325508L487589L445533L237384K873816K341907
$$ -4053450 -1709759 1225657 4551165 8038754 11484287 14721671 17595487 19937394
16061A9937394J639750Q07471o0107q30782j383780j654366j638428j376391r50807
$$ 19937394 21577144 22384615 22324508 21493726 20109946 18455580 16817152 15440761 14489954
16052A4489954m85453j15593O2759K6978j71891m34452o54528p62098p44756o33977
$$ 14489954 14004501 13888908 13951667 13978645 13806754 13372302 12717774 11955676 11210920 10576943
16042A0576943m69641k76537o3455J74501M59825Q28339J296448J809156K225071
$$ 10576943 10107302 9830765 9767310 9941811 10401636 11229975 12526423 14335579 16560650
16033A6560650K378476K174474J635114Q69593J5735p86285j389149j659412j542039
$$ 16560650 18939126 21113600 22748714 23618307 23634042 22847757 21458608 19799196 18257157
16024A8257157j104895n02209J16742O70849J139352J513034J760850J855620
$$ 18257157 17152262 16650053 16766795 17437644 18576996 20090030 21850880 23706500
16016B3706500J841713J843415J954561K118957K160867J951426J526453J036320
$$ 23706500 25548213 27391628 29346189 31465146 33626013 35577439 37103892 38140212
16008C8140212O08334K71929m689k33272l66239l17764j1935N63029J319877K095249
$$ 38140212 38748546 39020475 39015786 38782514 38416275 38098511 38086576 38649605 39969482 42064731
15998D2064731K721998L089631L145887K855882K183353J137305j53220j428486
$$ 42064731 44786729 47876360 51022247 53878129 56061482 57198787 57045567 55617081
15990E5617081k396721k876555k875187k553366k108851j665592j250320q51077
$$ 55617081 53220360 50343805 47468618 44915252 42806401 41140809 39890489 39039412
15982C9039412m73150j38176J42045L74740N82775Q01218J068335J405629J789573
$$ 39039412 38566262 38428086 38570131 38944871 39527646 40328864 41397199 42802828 44592401
15973D4592401K132121K298055K157248J638524P63963l49639j531123k606989
$$ 44592401 46724522 49022577 51179825 52818349 53582312 53232673 51701550 49094561
15965D9094561l418717l819243l705323l080049k067419q42048M62331J783082
$$ 49094561 45675844 41856601 38151278 35071229 33003810 32161762 32624093 34407175
15957C4407175L086726M311067N352536O111240O552499O727483O726964O606816
$$ 34407175 37493901 41804968 47157504 53268744 59821243 66548726 73275690 79882506
15949G9882506O367730O015825N618619N268304M983841M655298M098194L202139
$$ 79882506 86250236 92266061 97884680 103152984 108136825 112792123 116890317 120092456
15941A20092456K053392Q98838k3049o26214r90161j264616j555253j868951k139255
$$ 120092456 122145848 123044686 123021637 122395423 121405262 120140646 118585393 116716442 114577187
15932A14577187k289625k280280k121348j866150j600641j421145j388146j495344
$$ 114577187 112287562 110007282 107885934 106019784 104419143 102997998 101609852 100114508
15924A00114508j708226k027996k476883l016968l522206l848213l925326l786265
$$ 100114508 98406282 96378286 93901403 90884435 87362229 83514016 79588690 75802425
15916G5802425l510475l155875k755682k354897k005607j721468j469834j228057
$$ 75802425 72291950 69136075 66380393 64025496 62019889 60298421 58828587 57600530
15908E7600530j032562r56235j034676j211736j361716j377774j248293j049150
$$ 57600530 56567968 55611733 54577057 53365321 52003605 50625831 49377538 48328388
15900D8328388q61747p06362n56683l91202k07443j1878J75669L22298M06266
$$ 48328388 47466641 46760279 46203596 45812394 45604951 45593073 45768742 46091040 46497306
15891D6497306M36975M45735M66288N27005O39713P73209Q48154P86295N71684
$$ 46497306 46934281 47380016 47846304 48373309 49013022 49786231 50634385 51420680 51992364
15882E1992364K56815q6371m12438p02449r32187j059372j054748r38405p71256
$$ 51992364 52249179 52162808 51750370 51047921 50115734 49056362 48001614 47063209 46291953
15873D6291953o13078m94436m15701l51871k58970r6428J39548L95610N72430
$$ 46291953 45678875 45184439 44768738 44416867 44157897 44061469 44201017 44596627 45169057
15864D5169057N67185L27499j11864o30420j066447j292049j277169j090124q26410
$$ 45169057 45736242 46063741 45951877 45321457 44255010 42962961 41685792 40595668 39769258
15855C9769258n29586j90792J77604N05192P27625Q73584J062454J403379J887059
$$ 39769258 39239672 39048880 39226484 39731676 40459301 41332885 42395339 43798718 45685777
15846D5685777K361525K604714K441430J841775R42981l0758q90949j552419k010678
$$ 45685777 48047302 50652016 53093446 54935221 55878202 55847444 54956495 53404076 51393398
15837E1393398k269817k299027k067260j606503j023274m62199n8318J17177Q7089
$$ 51393398 49123581 46824554 44757294 43150791 42127517 41665318 41607000 41724177 41811266
15828D1811266o1405k32170l52953l86490l34933k41684j92070k97336o41232
$$ 41811266 41749861 41517691 41164738 40778248 40443315 40201631 40009561 39712225 39070993
15819C9070993j220438j947668k713783l427694m004953m350796m369467l998095
$$ 39070993 37850555 35902887 33189104 29761410 25756457 21405661 17036194 13038099
15811A3038099l247693k221932j094384n4873P46063J235726J433634J436159
$$ 13038099 9790406 7568474 6474090 6419217 7165280 8401006 9834640 11270799
15803A1270799J371463J343137J396124J524022J705847J937147K226929K567979
$$ 11270799 12642262 13985399 15381523 16905545 18611392 20548539 22775468 25343447
15795B5343447K906007L135651L146822K892516K415996J824332J244953P93451
$$ 25343447 28249454 31385105 34531927 37424443 39840439 41664771 42909724 43703175
15787D3703175N47593N17771O31980P65055Q08026P20338N13182J96077k33930
$$ 43703175 44250768 44768539 45400519 46165574 46973600 47693938 48207120 48403197 48169267
15778D8169267p44061j225277j524906j540175j286968q77732m41992o4640K24239
$$ 48169267 47425206 46199929 44675023 43134848 41847880 40970148 40528156 40463516 40687755
15769D0687755M17151M97895M51432K96718R9839l6915O023L32989R77245J849394
$$ 40687755 41104906 41602801 42054233 42350951 42450790 42413875 42419898 42752887 43730132 45579526
15759D5579526K747304L444316L794393L781446L507306L153806K912319K870095
$$ 45579526 48326830 51771146 55565539 59346985 62854291 66008097 68920416 71790511
15751G1790511K945080K964065K812693K503014K118879J731838J372862J058302
$$ 71790511 74735591 77699656 80512349 83015363 85134242 86866080 88238942 89297244
15743H9297244Q25372P33517Q12182R96579J129652J046930O65763Q914q16141
$$ 89297244 90122616 90856133 91668315 92664894 93794546 94841476 95507239 95516153 94700012
15734I4700012j637628k251213k485523k271273j665884q29066K7051P00732J067166
$$ 94700012 93062384 90811171 88325648 86054375 84388491 83559425 83586476 84287208 85354374
15725H5354374J127245J005887Q82824Q92050J054901J283321J443485J438981
$$ 85354374 86481619 87487506 88370330 89262380 90317281 91600602 93044087 94483068
15717I4483068J269467J032919Q61201Q29729R19471J060838J204329J348811
$$ 94483068 95752535 96785454 97646655 98476384 99395855 100456693 101661022 103009833
15709A03009833J510560J671721J762786J698126J439346J039791O29465L52156
$$ 103009833 104520393 106192114 107954900 109653026 111092372 112132163 112761628 113113784
15701A13113784L16894N81672J129631J846001K547683L060041L284529L217211
$$ 113113784 113430678 114012350 115141981 116987982 119535665 122595706 125880235 129097446
15693A29097446K914800K442436J853798J216910O37408K26147L0243Q366Q8575
$$ 129097446 132012246 134454682 136308480 137525390 138162798 138388945 138419188 138427554 138516129
15684A38516129K42431M89520Q41279J263355J691950K066034K337353K463819
$$ 138516129 138758560 139248080 140089359 141352714 143044664 145110698 147448051 149911870
15676A49911870K410666K166026J747786J197485N91953O1415k35542j73706K92338
$$ 149911870 152322536 154488562 156236348 157433833 158025786 158087201 157851659 157677953 157970291
15667A57970291J114043K160692L260402M247402M980736N349498N299112M870107
$$ 157970291 159084334 161245026 164505428 168752830 173733566 179083064 184382176 189252283
15659A89252283M211680L536071L009511K642338K280710J726410Q82841j91437
$$ 189252283 193463963 197000034 200009545 202651883 204932593 206659003 207541844 207350407
15651B07350407j335683k376590l188071l698455l869712l688245l171312k370293
$$ 207350407 206014724 203638134 200450063 196751608 192881896 189193651 186022339 183652046
15643A83652046j363822k40916R15805K029807L018736L797529M309026M549361
$$ 183652046 182288224 182047308 182963113 184992920 188011656 191809185 196118211 200667572
15635B00667572M545229M315335L878007L273978K540077J669738O34174n56848
$$ 200667572 205212801 209528136 213406143 216680121 219220198 220889936 221524110 220967262
15627B20967262j830495l077119m186920n078245n712073o064401o070832n627582
$$ 220967262 219136767 216059648 211872728 206794483 201082410 195018009 188947177 183319595
15619A83319595m671054l246337j514722K67589J805919K875219L413061L522606
$$ 183319595 178648541 175402204 173887482 174155071 175960990 178836209 182249270 185771876
15611A85771876L397588L239511L208937L385555L719992M032330M100906L786220
$$ 185771876 189169464 192408975 195617912 199003467 202723459 206755789 210856695 214642915
15603B14642915L093724K142253J087224O1303q49867j603147k173826k535333
$$ 214642915 217736639 219878892 220966116 221027419 220177552 218574405 216400579 213865246
15595B13865246k661774k547565k220465j730529j122082m17005L58134J119391
$$ 213865246 211203472 208655907 206435442 204704913 203582831 203165826 203523960 204643351
15587B04643351J728399K075399K148600K012734J744868J415010J108334R11002
$$ 204643351 206371750 208447149 210595749 212608483 214353351 215768361 216876695 217787697
15579B17787697Q46752Q51073Q28069P23150N41946L21896J05412n3262p3675
$$ 217787697 218634449 219485522 220313591 221036741 221578687 221900583 222005995 221952733 221879058
15570B21879058J23608N54614J134745J709432K131935K330881K333027K244063
$$ 221879058 222002666 222557280 223692025 225401457 227533392 229864273 232197300 234441363
15562B34441363K193340K257689K411591K538883K497323K211467J742954J266789
$$ 234441363 236634703 238892392 241303983 243842866 246340189 248551656 250294610 251561399
15554B51561399R62765R16316J078151J281789J335035J146888P70433L20183
$$ 251561399 252524164 253440480 254518631 255800420 257135455 258282343 259052776 259372959
15546B59372959j35694o04063j113615j643626k095177k325494k217711j736039
$$ 259372959 259237265 258633202 257519587 255875961 253780784 251455290 249237579 247501540
15538B47501540r41325J9990R47639J658704K083407K310492K519172K829860
$$ 247501540 246560215 246580205 247527844 249186548 251269955 253580447 256099619 258929479
15530B58929479L189495L390857L211583K559699J531082L63658o73578j383844
$$ 258929479 262118974 265509831 268721414 271281113 272812195 273175853 272502275 271118431
15522B71118431j680700j584650j216195p59550l84339j79985j48814k45103m22137
$$ 271118431 269437731 267853081 266636886 265877336 265492997 265313012 265164198 264919095 264496958
15513B64496958o53554r07021j098592j097448p88696j28004Q41977J991534L118842
$$ 264496958 263843404 262936383 261837791 260740343 259951647 259823643 260665620 262657154 265775996
15504B65775996L999145M458581M428784L953581L164183K239817J349483N91661
$$ 265775996 269775141 274233722 278662506 282616087 285780270 288020087 289369570 289961231
15496B89961231k1486n13246q78293j086613j140701j093972j009727r23756q46305
$$ 289961231 289939745 289426499 288548206 287461593 286320892 285226920 284217193 283293437 282447132
15487B82447132p77162p06601o11286m67961k84730j19603o4315k07697n95632
$$ 282447132 281669970 280963369 280352083 279884122 279599392 279479789 279415474 279207777 278612145
15478B78612145j187393j833543k323867k495367k323151j929311j503561j182102
$$ 278612145 277424752 275591209 273267342 270771975 268448824 266519513 265015952 263833850
15470B63833850r63552p27734l49921J73690O90054R86610R56268O81785L52016
$$ 263833850 262870298 262142564 261792643 261966333 262656387 263642997 264599265 265281050 265633066
15461B65633066R9970p5737k61964n32945q85234j234065j455106j442060j159879
$$ 265633066 265733036 265657299 265395335 264862390 263977156 262743091 261287985 259845925 258686046
15452B58686046o76368j45776K66029M72118N04759M85131N53974Q00438J213369
$$ 258686046 258009678 257863902 258129931 258602049 259106808 259591939 260145913 260946351 262159720
15443B62159720J678434K037038K178700K093678J852534J560458J327948J242162
$$ 262159720 263838154 265875192 268053892 270147570 272000104 273560562 274888510 276130672
15435B76130672J324389J502973J645025J640540J474501J231018J031842R58962
$$ 276130672 277455061 278958034 280603059 282243599 283718100 284949118 285980960 286939922
15427B86939922J013957J130156J222487J250502J246182J260875J275093J178885
$$ 286939922 287953879 289084035 290306522 291557024 292803206 294064081 295339174 296518059
15419B96518059Q62616L37211k32239o05916n83792p8844Q57732K037236L167540
$$ 296518059 297380675 297717886 297485647 296879731 296295939 296217095 297074827 299112063 302279603
15410C02279603L944532M176623L866601L199784K453305J875558J586183J548979
$$ 302279603 306224135 310400758 314267359 317467143 319920448 321796006 323382189 324931168
15402C24931168J635897J725237J762553J768497J802210J894003J992023J968846
$$ 324931168 326567065 328292302 330054855 331823352 333625562 335519565 337511588 339480434
15394C39480434J688270J092013K50109o60294j424219j855012j843107j397584
$$ 339480434 341168704 342260717 342510826 341850532 340426313 338571301 336728194 335330610
15386C35330610o61988J36752P94304J201610J335968J230233R70124O76946M45471
$$ 335330610 334668622 334805374 335599678 336801288 338137256 339367489 340337613 341014559 341460030
15377C41460030L01771K39256K77103M54621P85553J254029J844414K530497L221730
$$ 341460030 341761801 342001057 342278160 342732781 343518334 344772363 346616777 349147274 352369004
15368C52369004L754000L971471L826017L392389K797477K140013J450431O99712
$$ 352369004 356123004 360094475 363920492 367312881 370110358 372250371 373700802 374400514
15360C74400514j43276j035367j837245k395267k658469k701241k640380k561754
$$ 374400514 374257238 373221871 371384626 368989359 366330890 363629649 360989269 358427515
15352C58427515k512909k506527k501000k398391k095045j559982q80381k35326
$$ 358427515 355914606 353408079 350907079 348508688 346413643 344853661 343973280 343737954
15344C43737954J88358K89257R8790k47403n88677q14937r10900r56532j068489
$$ 343737954 343926312 344215569 344314359 344066956 343478279 342663342 341752442 340795910 339727421
15335C39727421j313811j669612k045610k326561k423609k334081k155472k012405
$$ 339727421 338413610 336743998 334698388 332371827 329948218 327614137 325458665 323446260
15327C23446260j958329j951789j912117j779907j545682j262757j043090j020034
$$ 323446260 321487931 319536142 317624025 315844118 314298436 313035679 311992589 310972555
15319C10972555j298377j921751k853790l969903n082419o007011o628639o911419
$$ 310972555 309674178 307752427 304898637 300928734 295846315 289839304 283210665 276299246
15311B76299246o857592o478158n803083m896709l859851k832111j978664j435743
$$ 276299246 269441654 262963496 257160413 252263704 248403853 245571742 243593078 242157335
15303B42157335j238795j290425j406669j427356j318597j183164j163681j318364
$$ 242157335 240918540 239628115 238221446 236794090 235475493 234292329 233128648 231810284
15295B31810284j562893j712159j593557j152810m72905K90755R83904J486050
$$ 231810284 230247391 228535232 226941675 225788865 225315960 225606715 226590619 228076669
15287B28076669J717416J647450J298027P29253K2126p28280j417744j958084
$$ 228076669 229794085 231441535 232739562 233468815 233490941 232762661 231344917 229386833
15279B29386833k321839k556582k736985k899421l019800l043438k934478k706164
$$ 229386833 227064994 224508412 221771427 218872006 215852206 212808768 209874290 207168126
15271B07168126k405655k065544j675000j203415o48934n8731M95279R50298J270666
$$ 207168126 204762471 202696927 201021927 199818512 199169578 199110847 199606126 200556424 201827090
15262B01827090J458805J558097J634319J737346J859686J924760J837280J566591
$$ 201827090 203285895 204843992 206478311 208215657 210075343 212000103 213837383 215403974
15254B15403974J178852P92525N20109M38997N73851Q81640J255095J551505J637985
$$ 215403974 216582826 217375351 217895460 218334457 218908308 219789948 221045043 222596548 224234533
15245B24234533J433324R26239J67428p50808j709234k565346l167394l395462
$$ 224234533 225667857 226594096 226761524 226010716 224301482 221736136 218568742 215173280
15237B15173280l203416k630728j792231q62393m0346N23778Q05264R02517R41642
$$ 215173280 211969864 209339136 207546905 206684512 206644166 207167944 207973208 208875725 209817367
15228B09817367R82770J013381J009089R85448R92963J067987J188827J268691
$$ 209817367 210800137 211813518 212822607 213808055 214801018 215869005 217057832 218326523
15220B18326523J184047Q33159J99416o32127j510922k269343k775203k992571
$$ 218326523 219510570 220343729 220543145 219911018 218400096 216130753 213355550 210362979
15212B10362979l005315k958017k947991k956177k877586k628585k227265j767252
$$ 210362979 207357664 204399647 201451656 198495479 195617893 192989308 190762043 188994791
15204A88994791j331121r47085o15109l44944j55902m7304K4670J37871L48279
$$ 188994791 187663670 186716585 186101476 185756532 185600630 185553326 185577996 185715867 186064146
15195A86064146O14670P83538O74607J96422o06597j586613k552132l329653l824516
$$ 186064146 186678816 187462354 188136961 188333383 187726786 186140173 183588041 180258388 176433872
15186A76433872m048144m072470l937095l607361l045231k317109j615808j181033
$$ 176433872 172385728 168313258 164376163 160768802 157723571 155406462 153790654 152609621
15178A52609621j194766j707315k610236l672570m625796n232841n320868m835183
$$ 152609621 151414855 149707540 147097304 143424734 138798938 133566097 128245229 123410046
15170A23410046l913322k871363k060769j703841j809655k181686k512600k540870
$$ 123410046 119496724 116625361 114564592 112860751 111051096 108869410 106356810 103815940
15162A03815940k173809j494481o80184Q2721O49476R37973R18986N91686j0519
$$ 103815940 101642131 100147650 99467466 99550187 100199663 101137636 102056622 102648308 102637789
15153A02637789p85660j569181k206636k622302k818585k832512k707932k495291
$$ 102637789 101852129 100282948 98076312 95454010 92635425 89802913 87094981 84599690
15145H4599690k253488k032148j848730j699392j599311j599248j744182k005212
$$ 84599690 82346202 80314054 78465324 76765932 75166621 73567373 71823191 69817979
15137F9817979k256143k322182k065426j463754o39204K02707Q92817J375896
$$ 69817979 67561836 65239654 63174228 61710474 61071270 61273977 62166794 63542690
15129F3542690J680230J825481J773232J467829R20229K56597l13533o05017n74666
$$ 63542690 65222920 67048401 68821633 70289462 71209691 71466288 71152755 70547738 69973072
15120F9973072l48292j15195K9128J42659L40169O47018R45870J047547Q11257
$$ 69973072 69624780 69509585 69538713 69681372 70021541 70668559 71614429 72661976 73473233
15111G3473233K21447o22935j582252k542060l412440m081268m407367m286590
$$ 73473233 73694680 73071745 71489493 68947433 65534993 61453725 57046358 52759768
15103E2759768l724294k854227j902831j103840n91624l59848l24712m04637n30805
$$ 52759768 49035474 46181247 44278416 43174576 42582952 42223104 41898392 41493755 40962950
15094D0962950o31964o64212o52737o72297p74589r33344j053851j040296q71914
$$ 40962950 40330986 39666774 39014037 38341740 37567151 36633807 35579956 34539660 33667746
15085C3667746o24333m18696l52057m63890p42127j145074j612249k056043k367609
$$ 33667746 33043413 32624717 32272660 31808770 31066643 29921569 28309320 26253277 23885668
15076B3885668k464800k352175k137091j972792j956284k062283k170508k149335
$$ 23885668 21420868 19068693 16931602 14958810 13002526 10940243 8769735 6620400
15068F620400j916519j451453p89182j6187P44148J361674J724386J751324J417492
$$ 6620400 4703881 3252428 2463246 2447059 3191207 4552881 6277267 8028591 9446083
15059I446083P86613J649p78787j435008j891532k112219k113816j966562j759253
$$ 9446083 10232696 10234345 9455558 8020550 6129018 4016799 1902983 -63579 -1822832
15050a822832j553766j366274j181440r78258p48340m96643k21367J13365N79071
$$ -1822832 -3376598 -4742872 -5924312 -6902570 -7650910 -8147553 -8368920 -8255555 -7676484
15041g676484J239005K084685L007348L838182M431821M720465M701020M400921
$$ -7676484 -6437479 -4352794 -1345446 2492736 6924557 11645022 16346042 20746963
15033B0746963L879375L254104K696953K360131K271239K304057K276812K083383
$$ 20746963 24626338 27880442 30577395 32937526 35208765 37512822 39789634 41873017
15025D1873017J732192J290198Q18077L52388p7524m37976p02563q64911r31017
$$ 41873017 43605209 44895407 45713484 46065872 45988348 45550372 44847809 43982898 43051881
15016D3051881r11370q31806p42252p04532p55482q52673q58936o25033j19670
$$ 43051881 42140511 41308705 40566453 39861921 39106439 38253766 37394830 36769797 36650127
15007C6650127N21022J074045J363741J344505J080059O44424M7209p26572j607958
$$ 36650127 37171149 38245194 39608935 40953440 42033499 42677923 42725132 41998560 40390602
14998D0390602k409048k917420l023968k770769k306604j814964j464471j366809
$$ 40390602 37981554 35064134 32040166 29269397 26962793 25147829 23683358 22316549
14990B2316549j523600j805611k010724j975417j657071j121888m68879K12682
$$ 22316549 20792949 18987338 16976614 15001197 13344126 12222238 11753359 11966041
14982A1966041Q19582J219402J309370J103592P46766M27663K68615K75907L75945
$$ 11966041 12785623 14005025 15314395 16417987 17164753 17592416 17861031 18136938 18512883
14973A8512883M96794O12822P09829P27216N60446J28062n59927j386380k176419
$$ 18512883 19009677 19622499 20332328 21059544 21619990 21748052 21188125 19801745 17625326
14964A7625326k773185l078106l051076k718945k198954j682549j343378j222925
$$ 17625326 14852141 11774035 8722959 6004014 3805060 2122511 779133 -443792
14956d43792j206162j121004q61721m38785M2939M38441O23477N40423K21610
$$ -443792 -1649954 -2770958 -3632679 -4071464 -4028525 -3590084 -2966607 -2426184 -2204574
14947b204574k09622n79942p44515o46173l21424J31522O02320J013530J334471
$$ -2204574 -2414196 -2994138 -3738653 -4384826 -4706250 -4574728 -3972408 -2958878 -1624407
14938a624407J564806J718001J819926J906357K000597K089009K136831K133382
$$ -1624407 -59601 1658400 3478326 5384683 7385280 9474289 11611120 13744502
14930A3744502K100708K048109J939445J727650J412461J044342O82030L68867
$$ 13744502 15845210 17893319 19832764 21560414 22972875 24017217 24699247 25068114
14922B5068114J43066M0450O6125J61444K05543N8382l80857j126654k083805
$$ 25068114 25211180 25251630 25317755 25479199 25684742 25743124 25362267 24235613 22151808
14913B2151808l054855l785289m046735l729872k898528j769717o15304L60531
$$ 22151808 19096953 15311664 11264929 7535057 4636529 2866812 2251508 2612039
14905B612039J075144J529649J751632J774463J639132J390096J068513P22344
$$ 2612039 3687183 5216832 6968464 8742927 10382059 11772155 12840668 13563012
14897A3563012M24045K62500L03076N43933R04830J269028J541082J653406J538108
$$ 13563012 13987057 14249557 14552633 15096566 16001396 17270424 18811506 20464912 22003020
14888B2003020J151683N55579n7444m57601n21288l00647K7712K75767L24534
$$ 22003020 23154703 23710282 23652838 23195237 22673949 22373302 22401014 22676781 23001315
14879B3001315J41643k28002o81556j102258j413679j594835j639030j506671
$$ 23001315 23142958 22914956 22233400 21131142 19717463 18122628 16483598 14976927
14871A4976927j132702m90103L45436J190342J828005K117976K052423J718042
$$ 14976927 13844225 13354122 13699558 14889900 16717905 18835881 20888304 22606346
14863B2606346J217833O31543K0670n69509j128770j683659k245708k753290l089811
$$ 22606346 23824179 24455722 24476392 23906883 22778113 21094454 18848746 16095456 13005645
14854A3005645l160128k934111k435329j728105r21984j59180M23711P32887P45028
$$ 13005645 9845517 6911406 4476077 2747972 1825988 1666808 2090519 2823406 3568434
14845C568434N21954J85106j52586m45532p09304r52911j130474j181943j111903
$$ 3568434 4090388 4275494 4122908 3677376 2968072 2015161 884687 -297256 -1409159
14836a409159j003714r56741j020363j178077j370182j526793j601592j586590
$$ -1409159 -2412873 -3369614 -4389977 -5568054 -6938236 -8465029 -10066621 -11653211
14828a1653211j479832j235539p72149m7368Q77662J845826K669525L205851L403775
$$ -11653211 -13133043 -14368582 -15140731 -15188099 -14310437 -12464611 -9795086 -6589235 -3185460
14819c185460L304576K999220K578166K111787J660759J285917J035560R09585
$$ -3185460 119116 3118336 5696502 7808289 9469048 10754965 11790525 12700110
14811A2700110Q23624O25742J92862m59067j156748j672023j864203j741358j399137
$$ 12700110 13523734 14149476 14342338 13883271 12726523 11054500 9190297 7448939 6049802
14802F049802r15477l03700M48135J305091K154016K831083L167358L038763K443428
$$ 6049802 5134325 4830625 5278760 6583851 8737867 11568950 14736308 17775071 20218499
14793B0218499J555814O66466M1239j82340j3438M29464R67959J412343J617305
$$ 20218499 21774313 22440779 22482018 22299678 22286240 22715704 23683663 25096006 26713311
14784B6713311J525920J170320O37170L0003n62087j083763j504348j799387j959402
$$ 26713311 28239231 29409551 30046721 30076724 29514637 28430874 26926526 25127139 23167737
14775B3167737k011511k016899k047709k165009k390987k672468k879505k871401
$$ 23167737 21156226 19139327 17091618 14926609 12535622 9863154 6983649 4112248
14767D112248k580942k038947j334145n69564J55217P55806J173122J371235J336408
$$ 4112248 1531306 -507641 -1841786 -2411350 -2256133 -1500327 -327205 1044030 2380438
14758B380438J091737P09919K95481o2941l27947m99742n77990n59920m81483
$$ 2380438 3472175 4182094 4477575 4414634 4086687 3586945 3008955 2449035 1967552
14749A967552m30835m92405o80292r34170j170777j332644j395584j342636j147727
$$ 1967552 1536717 1044312 364020 -570150 -1740927 -3073571 -4469155 -5811791 -6959518
14740f959518q00285l39452J49589N64654Q08979Q14523N79232J92883j93756
$$ -6959518 -7759803 -8099255 -7949666 -7385012 -6576033 -5761510 -5182278 -4989395 -5183151
14731e183151m57242n72143n86705n27050l38767O8257P30696J593650K528220
$$ -5183151 -5640393 -6212536 -6799241 -7326291 -7665058 -7596801 -6866105 -5272455 -2744235
14722b744235L354536L865500L887514L372785K449332J371474M00137l03228
$$ -2744235 610301 4475801 8363315 11736100 14185432 15556906 15957043 15653815
14714A5653815p01232q28064p30331m55475p3586L11354N88271O99003O83154
$$ 15653815 14952583 14124519 13394188 12938713 12865127 13176481 13764752 14463755 15146909
14705A5146909O49888O86634P88247Q64674Q00646N13255j7562p49478j599687
$$ 15146909 15796797 16483431 17271678 18136352 18936998 19450253 19432691 18683213 17083526
14696A7083526k472176l277028l926602m319588m353904l976351l228653k248363
$$ 17083526 14611350 11334322 7407720 3088132 -1265772 -5242123 -8470776 -10719139
14688a0719139j212345k51213O00357J374937K100300K750662L248404L507146
$$ -10719139 -11931484 -12182697 -11582340 -10207403 -8107103 -5356441 -2108037 1399109
14680A399109L489489L234871K837726K411496K068641J894925J900960J992862
$$ 1399109 4888598 8123469 10961195 13372691 15441332 17336257 19237217 21230079
14672B1230079K011981J827011J402938P93767Q4717o48064j330714j872199k176906
$$ 21230079 23242060 25069071 26472009 27265776 27350493 26702429 25371715 23499516 21322610
14663B1322610k190929j946897j571956j236934j057798j022425j015243r16175
$$ 21322610 19131681 17184784 15612828 14375894 13318096 12295671 11280428 10364253
14655A0364253o84747l77380j07024K6915J307j22148k49455l12228k76234j14137
$$ 10364253 9679506 9302126 9195102 9222017 9223324 9101176 8851721 8539493 8263259 8149122
14645H149122K01978O73974J255245J861686K401047K791094K970628K921548
$$ 8149122 8351100 9025074 10280319 12142005 14543052 17334146 20304774 23226322
14637B3226322K682526K328828J937455J565450J239841R50668O60462L35852
$$ 23226322 25908848 28237676 30175131 31740581 32980422 33931090 34591552 34927404
14629C4927404l9050m89258j059548j763345k521504l175933l579215l667186
$$ 34927404 34888354 34399096 33339548 31576203 29054699 25878766 22299551 18632365
14621A8632365l443552k921925k119095j103963k2529R40696J624276J927296
$$ 18632365 15188813 12266888 10147793 9043830 9021301 9961997 11586273 13513569
14613A3513569J825626J384914P54202J09770m37874r00860j370840j903953k438977
$$ 13513569 15339195 16724109 17478311 17588081 17150207 16249347 14878507 12974554 10535577
14604A0535577k824013k915987k664373k140201j510977r64505o23125n19740
$$ 10535577 7711564 4795577 2131204 -8997 -1519974 -2484479 -3107604 -3627344
14596c627344o38802r35215j290236j491052j309345o13674N84594K145417L824114
$$ -3627344 -4266146 -5201361 -6491597 -7982649 -9291994 -9905668 -9321074 -7175657 -3351543
14587c351543N317817O359573O817962O728398O243371N562231M882198M352878
$$ -3351543 1966274 8325847 15143809 21872207 28115578 33677809 38560007 42912885
14579D2912885M028799L858136L726855L518860L142116K524825J625214M64677
$$ 42912885 46941684 50799820 54526675 58045535 61187651 63712476 65337690 65802367
14571F5802367q61619k223182l499095m583285n365745n741401n664624n196990
$$ 65802367 64940748 62717566 59218471 54635186 49269441 43528040 37863416 32666426
14563C2666426m486259l692539k929502k251993j672837j186832p86097m60133
$$ 32666426 28180167 24487628 21558126 19306133 17633296 16446464 15660367 15200234
14555A5200234j89195N7666L12361N87931Q62016J076746J167225J102583Q93770
$$ 15200234 15011039 15068705 15381066 15968997 16831013 17907759 19074984 20177567 21071337
14546B1071337N61699J10764m59992j117520j766255k271194k527225k515335
$$ 21071337 21633036 21743800 21283808 20166288 18400033 16128839 13601614 11086279
14538A1086279k302086j995305j688833j424529j189815r41539o36849k62641
$$ 11086279 8784193 6788888 5100055 3675526 2485711 1544172 907323 644682
14530F44682J52639N54769Q81462J065103J044043P94644L57744j71861o92991
$$ 644682 797321 1352090 2233552 3298655 4342698 5137342 5495086 5323225 4630234
14521D630234j137755j463431j626899j595958j390976j102927q51398p01976
$$ 4630234 3492479 2029048 402149 -1193809 -2584785 -3687712 -4539110 -5241086
14513e241086o14993m84714k41383Q3708L99407O51057Q57850J064365J276994
$$ -5241086 -5856079 -6340793 -6582176 -6498468 -6099061 -5448004 -4590154 -3525789 -2248795
14504b248795J439573J457726J263336Q74763L99857p479j93709n5163M00103
$$ -2248795 -809222 648504 1911840 2786603 3186460 3178981 2985272 2930109 3330212
14495C330212J018552J550301J775376J623337J189518O46407J61874j08076l0606
$$ 3330212 4348764 5899065 7674441 9297778 10487296 11133703 11295577 11187501 11156895
14486A1156895M15089J055728J584417J756656J555400J177044Q68868P70012
$$ 11156895 11571984 12627712 14212129 15968785 17524185 18701229 19570097 20340109
14478B0340109Q58813R97839J015514P84896K93428l25751q54362j121827j095414
$$ 20340109 21198922 22196761 23212275 23997171 24290599 23964848 23110486 21988659 20893245
14469B0893245q50242m76929l1645M49452R27673J363419J712858J904741J839966
$$ 20893245 20043003 19566074 19534429 19983881 20911554 22274973 23987831 25892572 27732538
14460B7732538J444041P33863j57611j020544j660380j995048k079392k024804
$$ 27732538 29176579 29910442 29752831 28732287 27071907 25076859 22997467 20972663
14452B0972663j895506j693136j429920j187725j094737j259435j726396k455058
$$ 20972663 19077157 17384021 15954101 14766376 13671639 12412204 10685808 8230750
14444H230750l305639m060245m503188m516058m118028l435230k630012j835189
$$ 8230750 4925111 864866 -3638322 -8154380 -12272408 -15707638 -18337650 -20172839
14436b0172839j128892n42732o8979L38265P41136J175975J630590K060392K417843
$$ -20172839 -21301731 -21844463 -21913442 -21575177 -20834041 -19658066 -18027476 -15967084 -13549241
14427a3549241K656306K711184K510110K032192J362267O75965J51419j30684
$$ -13549241 -10892935 -8181751 -5671641 -3639449 -2277182 -1601217 -1449798 -1580482
14419a580482k20615k39983k88400m00935n65101p40695q51068p70623l54781
$$ -1580482 -1801097 -2041080 -2329480 -2730415 -3295516 -4036211 -4887279 -5657902 -6012683
14410f012683M76517J661691L008795M297563N369139O114498O414744O149545
$$ -6012683 -5536166 -3874475 -865680 3431883 8801022 14915520 21330264 27479809
14402B7479809N276879L890944K206052M88289j014949k112629k678918k657816
$$ 27479809 32756688 36647632 38853684 39341973 38327024 36214395 33535477 30877661
14394C0877661k085295j122167m1944Q60935J383788J464774J157998N84191j12883
$$ 30877661 28792366 27670199 27628255 28489190 29872978 31337752 32495750 33079941 32967058
14385C2967058q11027j446303k012077k521115k966879l306405l464150l362255
$$ 32967058 32156031 30709728 28697651 26176536 23209657 19903252 16439102 13076847
14377A3076847k969460k333969j577605q48197k45320K23903O10356R41340J175913
$$ 13076847 10107387 7773418 6195813 5347616 5102296 5326199 5936555 6877895 8053808
14368H053808J247032J143351R35152P29007O12494O11129O52829N81577K49398
$$ 8053808 9300840 10444191 11379343 12108350 12720844 13331973 13984802 14566379 14815777
14359A4815777l76918j187636j991307k604050k912422k884437k538035j913612
$$ 14815777 14438859 13251223 11259916 8655866 5743444 2859007 320972 -1592640
14351a592640j079792j44018P64371J521986K027040K215016K085667J716618
$$ -1592640 -2672432 -2816450 -2052079 -530093 1496947 3711963 5797630 7514248
14343G514248J231048P35450K85307j03503m41123p71150j162713j660267k232689
$$ 7514248 8745296 9480746 9766053 9662550 9221427 8450277 7287564 5627297 3394608
14334C394608k779756l192145l407471l420373l251890k908556k370754j633144
$$ 3394608 614852 -2577293 -5984764 -9405137 -12657027 -15565583 -17936337 -19569481
14326a9569481p60384J12395Q50749J401197J804998K129315K377434K460843
$$ -19569481 -20329865 -20217470 -19366721 -17965524 -16160526 -14031211 -11653777 -9192934
14318i192934K261904J746982J039084L69802n8355j75960m1321K32613N36160
$$ -9192934 -6931030 -5184048 -4144964 -3775162 -3833517 -4009477 -4050798 -3818185 -3282025
14309c282025P86249R47544J049958J161509J314829J460915J515531J458373
$$ -3282025 -2495776 -1548232 -498274 663235 1978064 3438979 4954510 6412883
14301F412883J378951J415724J645012K024968K432273K740468K874724K808321
$$ 6412883 7791834 9207558 10852570 12877538 15309811 18050279 20925003 23733324
14293B3733324K512641J931115J040896m5715j069162j749615j950631j736023
$$ 23733324 26245965 28177080 29217976 29172261 28103099 26353484 24402853 22666830
14285B2666830j286970p75970l07615N9372K78426L16524J65278j60882o18352
$$ 22666830 21379860 20603890 20296275 20355647 20634073 20950597 21115875 20954993 20336641
14276B0336641j116116j520677j704166j606736j260557p54770j76751M19169
$$ 20336641 19220525 17699848 15995682 14388946 13128389 12373619 12196868 12616037
14268A2616037R93924J482297J782846J805233J538715J083152O08648K62530
$$ 12616037 13609961 15092258 16875104 18680337 20219052 21302204 21910852 22173382
14260B2173382R2171L6247k2633j83087m70754q34675j190534j473718j664840
$$ 22173382 22265553 22301800 22279167 22096080 21625326 20790651 19600117 18126399 16461559
14251A6461559j783597j870443j959891k040962k034553j834976j402528q17219
$$ 16461559 14677962 12807519 10847628 8806666 6772113 4937137 3534609 2717390
14243B717390k37082J91704M00618M16644L39198K90637L62013N72650Q59974
$$ 2717390 2480308 2672012 3072630 3489274 3828472 4119109 4481122 5053772 5913746
14234E913746J114396J234513J150562Q22587K65507m23286j107909j692174k125294
$$ 5913746 7028142 8262655 9413217 10235804 10501311 10078025 8970116 7277942 5152648
14225E152648k350566k308711k006851j552760j110787q35286q32446j138737
$$ 5152648 2802082 493371 -1513480 -3066240 -4177027 -5012313 -5844759 -6983496
14217f983496j695487k355372k958836l422723l743272l919867l904253l631104
$$ -6983496 -8678983 -11034355 -13993191 -17415914 -21159186 -25079053 -28983306 -32614410
14209c2614410l082447k319104j453829n83678K57044J070172J834135K497185
$$ -32614410 -35696857 -38015961 -39469790 -40053468 -39796424 -38726252 -36892117 -34394932
14201c4394932L019989L390159L590125L582503L345062K898773K287279J555848
$$ -34394932 -31374943 -27984784 -24394659 -20812156 -17467094 -14568321 -12281042 -10725194
14193a0725194P75008O2344m60479p45358q47409q78027r26329j011427j092996
$$ -10725194 -9950186 -9887842 -10348321 -11093679 -11941088 -12819115 -13745444 -14756871 -15849867
14184a5849867j119678j062520r04850o30844k54054J55922N03118P27173Q34359
$$ -15849867 -16969545 -18032065 -18936915 -19567759 -19821813 -19665891 -19162773 -18435600 -17601241
14175a7601241Q69741Q66657Q38121Q13192Q52368J012593J299636J645143J922821
$$ -17601241 -16731500 -15864843 -15026722 -14213530 -13361162 -12348569 -11048933 -9403790 -7480969
14166g480969K000276J799413J335552P11743O1170n18641r82796j315994j517306
$$ -7480969 -5480693 -3681280 -2345728 -1633985 -1572815 -2091456 -3074252 -4390246 -5907552
14157e907552j604446j611927j566761j456145j216624p68336q3825P67328J645045
$$ -5907552 -7511998 -9123925 -10690686 -12146831 -13363455 -14131791 -14215616 -13448288 -11803243
14148a1803243K408775K974086L334394L545950L678746L762779L773125L665116
$$ -11803243 -9394468 -6420382 -3085988 459962 4138708 7901487 11674612 15339728
14140A5339728L424244L085360K712965K375139K132980K025129K032642K061403
$$ 15339728 18763972 21849332 24562297 26937436 29070416 31095545 33128187 35189590
14132C5189590J980315J691420J182223N35027j14175o52158j042558j307101
$$ 35189590 37169905 38861325 40043548 40578575 40464400 39812242 38769684 37462583
14124C7462583j467112j520815j462936j293751j010490o25289k11748Q3459J03493
$$ 37462583 35995471 34474656 33011720 31717969 30707479 30082190 29870442 29953901 30057394
14115C0057394k25538q45853j599256k315288k885391l264248l419109l301383
$$ 30057394 29831856 28986003 27386747 25071459 22186068 18921820 15502711 12201328
14107A2201328k877071k174821j286289l09710O93281J666981K512498L111122
$$ 12201328 9324257 7149436 5863147 5553437 6246718 7913699 10426197 13537319
14099A3537319L396205L385322L150683K772738K318898J848296J416959J070452
$$ 13537319 16933524 20318846 23469529 26242267 28561165 30409461 31826420 32896872
14091C2896872Q35106P18462P14413Q05764R61910J136499J270852J302443J180827
$$ 32896872 33731978 34450440 35164853 35970617 36932527 38069026 39339878 40642321 41823148
14082D1823148Q95197M96602P8350k85813n80219q18282j002594j137693j251142
$$ 41823148 42718345 43214947 43293297 43007484 42427265 41608983 40606389 39468696 38217554
14073C8217554j364206j463665j535659j606848j724413j908148k135700k361318
$$ 38217554 36853348 35389683 33854024 32247176 30522763 28614615 26478915 24117597
14065B4117597k537679k624892k586314k388229k022673j537130j028925o03146
$$ 24117597 21579918 18955026 16368712 13980483 11957810 10420680 9391755 8788609
14057H788609l36816k65058l78290o29156r44254j233462j409732j423585j279095
$$ 8788609 8451793 8186735 7808445 7179289 6235035 5001573 3591841 2168256 889161
14048H89161j007237o28946j54011L87622R25891J377960J708599J957920K197645
$$ 889161 -118076 -747022 -901033 -513411 412480 1790440 3499039 5456959 7654604
14039G654604K459896K705440K852500K839033K662744K367553K016438J694752
$$ 7654604 10114500 12819940 15672440 18511473 21174217 23541770 25558208 27252960
14031B7252960J510027J537605J752211K031842K231755K247441K036037J628797
$$ 27252960 28762987 30300592 32052803 34084645 36316400 38563841 40599878 42228675
14023D2228675J132960O82816L49377Q1366k67529q42565j686752k701408l704563
$$ 42228675 43361635 44044451 44393828 44475194 44207665 43365100 41678348 38976940 35272377
14014C5272377m544701n166862n575152n739009n539343m815630l494295j709990
$$ 35272377 30727676 25560814 19985662 14246653 8707310 3891680 397385 -1312605
14006a312605J85734J768767K754423L120835L060682K832216K640163K589588
$$ -1312605 -1126871 641896 3396319 6517154 9577836 12410052 15050215 17639803
13998A7639803K681080K832594K927770K873395K640879K270308J827156J337395
$$ 17639803 20320883 23153477 26081247 28954642 31595521 33865829 35692985 37030380
13990C7030380P68395Q9911o51055j335519j853463k159809k251430k132279j827973
$$ 37030380 37798775 37888686 37237631 35902112 34048649 31888840 29637410 27505131 25677158
13981B5677158j402530r31245m73307q0742J93495L16030K87659J26379j51917
$$ 25677158 24274628 23343383 22870076 22789334 22982829 23298859 23586518 23712897 23560980
13972B3560980n29017r70255j421697j823666k125031k281337k258758k065157
$$ 23560980 23031963 22061708 20640011 18816345 16691314 14409977 12151219 10086062
13964A0086062j766587j449997j179377j002286r69623j111589j398982j743349
$$ 10086062 8319475 6869478 5690101 4687815 3718192 2606603 1207621 -535728
13956e35728k033645k175895k110631j812670j297965o35323O9533P24774J293154
$$ -535728 -2569373 -4745268 -6855899 -8668569 -9966534 -10601857 -10532324 -9807550 -8514396
13947h514396J773192K142966K339627K299881K019733J577459J100121P10478
$$ -8514396 -6741204 -4598238 -2258611 41270 2061003 3638462 4738583 5449061
13939E449061M98811N08718P09781R91632J228998J370030J439583J456020J377235
$$ 5449061 5947872 6456590 7166371 8158003 9387001 10757031 12196614 13652634 15029869
13930A5029869J129847O60815l6930r07471j819290k597771l107268l313874l272073
$$ 15029869 16159716 16820531 16783601 15876130 14056840 11459069 8351801 5037927 1765854
13921A765854l063841k759949k424046k122850j915778j829437j831316j823910
$$ 1765854 -1297987 -4057936 -6481982 -8604832 -10520610 -12350047 -14181363 -16005273
13913a6005273j677344j289301o39156J92115J044791J739936K156711K279544
$$ -16005273 -17682617 -18971918 -19611074 -19418959 -18374168 -16634232 -14477521 -12197977
13905a2197977K172967J914250J555028J133017O90009K62612j25245m37659o04828
$$ -12197977 -10025010 -8110760 -6555732 -5422715 -4732706 -4470094 -4595339 -5032998 -5637826
13896e637826n46875k26886L07509R11290J375746J528803J349783R81717O06743
$$ -5637826 -6184701 -6411587 -6104078 -5192788 -3817042 -2288239 -938456 43261 650004
13887F50004L03975K6231l09489p22994j132024j388791j371937j051951m75839
$$ 650004 953979 980210 670721 -52273 -1184297 -2573088 -3945025 -4996976 -5472815
13878e472815K65389J039508J706746K200198K554161K835478L069151L238039
$$ -5472815 -5207426 -4167918 -2461172 -260974 2293187 5128665 8197816 11435855
13870A1435855L323085L326440L274267L208156L151764L063499K837015K378252
$$ 11435855 14758940 18085380 21359647 24567803 27719567 30783066 33620081 35998333
13862C5998333J685015Q40809o3184r82408j889721k717007l363968l770106l952727
$$ 35998333 37683348 38524157 38460973 37478565 35588844 32871837 29507869 25737763 21785036
13853B1785036l960929l804442l445339k861241k104376j298748n87863o8626
$$ 21785036 17824107 14019665 10574326 7713085 5608709 4309961 3722098 3653472
13845C653472K46561M03017M43916L89116K60062R5762o3337j94071k91738l53219
$$ 3653472 3900033 4303050 4746966 5136082 5396144 5491906 5428569 5234498 4942760 4589541
13835D589541l46774k03641J36242O58843J258526J785082K102321K104910J717676
$$ 4589541 4242767 4039126 4175368 4834211 6092737 7877819 9980140 12085050 13802726
13826A3802726R31213j58603j375883k534425l486892m132456m398799m245188
$$ 13802726 14733939 14575336 13199453 10665028 7178136 3045680 -1353119 -5598307
13818e598307l721637l015653k379605j965831j723544j452850r56098j67023
$$ -5598307 -9319944 -12335597 -14715202 -16681033 -18404577 -19857427 -20813525 -20980548
13810b0980548Q10135J755871K443307K731653K601927K141002J499864Q47138
$$ -20980548 -20170413 -18414542 -15971235 -13239582 -10637655 -8496653 -6996789 -6149651
13802f149651L29881L9105j9024Q0584K29393L38404L63460L07690K10371J21603
$$ -6149651 -5819770 -5780665 -5799689 -5719105 -5489712 -5151308 -4787848 -4480158 -4269787 -4148184
13792d148184P5442Q3430J42475K33290L25589M14129N45651P93213J203211J754965
$$ -4148184 -4072742 -3989312 -3846837 -3613547 -3287958 -2873829 -2328178 -1534965 -331754 1423211
13782A423211K347165K826285L052454K953602K531776J844055R97994J62970
$$ 1423211 3770376 6596661 9649115 12602717 15134493 16978548 17976542 18139512
13774A8139512m49229o76009n18798j66239J11511J11514k16750p81521j415465
$$ 18139512 17690283 17014274 16495476 16329237 16440748 16552262 16335512 15553991 14138526
13765A4138526j959484k334729k552564k648635k614780k396798j938268j214903
$$ 14138526 12179042 9844313 7291749 4643114 2028334 -368464 -2306732 -3521635
13757c521635k40119R35405K205124L384983M236337M552508M259031L448624
$$ -3521635 -3761754 -2826349 -621225 2763758 7000095 11552603 15811634 19260258
13749A9260258K329584J142474R7115o73322j145600j390038j491394j472138
$$ 19260258 21589842 22732316 22829431 22156109 21010509 19620471 18129077 16656939
13741A6656939j293995r35115m61011r465K97709M19835L77004J90780j32503
$$ 16656939 15362944 14427829 13966818 13957353 14255062 14674897 15051901 15242681 15110178
13732A5110178n78429j119054j727876k379877l036150l634771m097398m342501
$$ 15110178 14531749 13412695 11684819 9304942 6268792 2634021 -1463377 -5805878
13724e805878m294407l896454l142590k116086r91084K8947P92497J235149J363217
$$ -5805878 -10100285 -13996739 -17139329 -19255415 -20246499 -20217552 -19425055 -18189906 -16826689
13715a6826689J229561R14621M93844J3868m81511r03573j117215r99453n13189
$$ -16826689 -15597128 -14682507 -14188663 -14174795 -14656306 -15559879 -16677094 -17676547 -18189736
13706a8189736K56368J127121J888925K381196K549737K451090K198467J898459
$$ -18189736 -17933368 -16806247 -14917322 -12536126 -9986389 -7535299 -5336832 -3438373
13698c438373J624804J411541J236424J014724O39757O2153o54888j353053j848528
$$ -3438373 -1813569 -402028 834396 1849120 2488877 2551030 1896142 543089 -1305439
13689a305439k006911j789519j250214n01951L03618R87952J381483J379133R89016
$$ -1305439 -3312350 -5101869 -6352083 -6854034 -6550416 -5562464 -4180981 -2801848 -1812832
13680a812832L51700k97144p30036q37169o52385k92255J11843M43442O17843
$$ -1812832 -1461132 -1758276 -2488312 -3325481 -3977866 -4270121 -4158278 -3714836 -3096993
13671c096993O14186N01671M12619M53356O18034P88030Q19387O38508K73899
$$ -3096993 -2482807 -1981136 -1568517 -1115161 -497127 290903 1110290 1748798 2022697
13662B022697j72959n70175p99916q14898o65734m54442k63669j34470p0110k0008
$$ 2022697 1849738 1279563 479647 -335251 -1000985 -1455427 -1719096 -1853566 -1923676 -1943684
13652a943684J18031M31986R16282J465705J950917K297448K493083K531137K369547
$$ -1943684 -1825653 -1393667 -477385 988320 2939237 5236685 7729768 10260905 12630452
13643A2630452J968513J375372P50125K70626l701j71873l97725p74097j261778
$$ 12630452 14598965 15974337 16724462 16995088 16991387 16819514 16421789 15647692 14385914
13634A4385914j739076k099317k306640k379124k342115k209034k002918j784022
$$ 14385914 12646838 10547521 8240881 5861757 3519642 1310608 -692310 -2476332
13626b476332j637859j614896j672616j687167j543507j228930q42352n18180
$$ -2476332 -4114191 -5729087 -7401703 -9088870 -10632377 -11861307 -12703659 -13221839
13618a3221839l43383l35126m75950p48072j120387j514795j819687j954151j912142
$$ -13221839 -13565222 -13900348 -14376298 -15124370 -16244757 -17759552 -19579239 -21533390 -23445532
13609b3445532j741036j479136j111082n84402J31304J005253J950216K842473
$$ -23445532 -25186568 -26665704 -27776786 -28361188 -28229884 -27224631 -25274415 -22431942
13601b2431942L551113L994112M179979M171725M004941L653257L075081K291357
$$ -22431942 -18880829 -14886717 -10706738 -6535013 -2530072 1123185 4198266 6489623
13593F489623J417522O13329j3913m70982q45081j201045j508796j668467j594525
$$ 6489623 7907145 8520474 8506561 8035579 7190498 5989453 4480657 2812190 1217665
13584A217665j283349q34945m21975k11148k86771o38555j214797j975174k884432
$$ 1217665 -65684 -900629 -1322604 -1533752 -1820523 -2459078 -3673875 -5649049 -8533481
13575h533481l870282m807071n530200n864046n677166m951223l800979k417270
$$ -8533481 -12403763 -17210834 -22741034 -28605080 -34282246 -39233469 -43034448 -45451718
13567d5451718r85777L49923J479584K323785K858743L132331L237378L259033
$$ -45451718 -46437495 -46087572 -44607988 -42284203 -39425460 -36293129 -33055751 -29796718
13559b9796718L239840L179217L050151K817356K461369K007434J529978J123592
$$ -29796718 -26556878 -23377661 -20327510 -17510154 -15048785 -13041351 -11511373 -10387781
13551a0387781Q70668Q19693R67984J255057J573064J790404J802174J611282
$$ -10387781 -9517113 -8697420 -7729436 -6474379 -4901315 -3110911 -1308737 302545
13543C02545J368691J289865J489415J881852K239883K353417K152329J712144
$$ 302545 1671236 2961101 4450516 6332368 8572251 10925668 13077997 14790141
13535A4790141J179384O95659L48233J46018L5423n6008j87325l85485o26298
$$ 14790141 15969525 16665184 17013417 17159435 17194858 17138850 16951525 16566040 15939742
13526A5939742q41970r67676r71219q27821m94744M9462P37391J401712J828064
$$ 15939742 15097772 14130096 13158877 12331056 11836312 11885774 12623165 14024877 15852941
13517A5852941J825440J302068L31306q51154j941037k693997l011799k947833
$$ 15852941 17678381 18980449 19311755 18460601 16519564 13825567 10813768 7865935
13509G865935k646388k257709j873701j522876j218426r88355q42154p33815n94784
$$ 7865935 5219547 2961838 1088137 -434739 -1653165 -2641520 -3483674 -4217489 -4812273
13500d812273l98611j67988P4461L39206O51352J000255J300526J409032J205767
$$ -4812273 -5210884 -5378872 -5304411 -4965205 -4313853 -3313598 -2013072 -604040 601727
13491F01727O84235k0360o89849j132306j268864j145384q83545o15001m16591
$$ 601727 1285962 1265602 575753 -556553 -1825417 -2970801 -3854346 -4469347 -4885938
13482d885938k64578m8076L56612J002654J817148K599182L101492L157223K744072
$$ -4885938 -5150516 -5198592 -4841980 -3839326 -2022178 577004 3678496 6835719 9579791
13473I579791J934651Q17353n02146j847727k992622l775330m186420m327475
$$ 9579791 11514442 12331795 11829649 9981922 6989300 3213970 -972450 -5299925
13465e299925m297942m127176l788114l253038k549885j776577j040942l72714
$$ -5299925 -9597867 -13725043 -17513157 -20766195 -23316080 -25092657 -26133599 -26506313
13457b6506313K90980J015969J765750K391503K734728K747853K513856K152180
$$ -26506313 -26215333 -25199364 -23433614 -21042111 -18307383 -15559530 -13045674 -10893494
13449a0893494J721663J216278O26683j9729o63321j229829j657072j930563k091993
$$ -10893494 -9171831 -7955553 -7328870 -7348599 -8011920 -9241749 -10898821 -12829384 -14921377
13440a4921377k202966k297021k360102k350522k235647k003629j639794j114944
$$ -14921377 -17124343 -19421364 -21781466 -24131988 -26367635 -28371264 -30011058 -31126002
13432c1126002m33169K94968Q62892J101639J013057P67840N93497O63503J038936
$$ -31126002 -31559171 -31264203 -30401311 -29299672 -28286615 -27518775 -26925278 -26261775 -25222839
13423b5222839J656369K360151K970090L349896L451496L330410L118607K948242
$$ -25222839 -23566470 -21206319 -18236229 -14886333 -11434837 -8104427 -4985820 -2037578
13415b037578K865070K795508K594287K140150J415887N20922l91375j207231
$$ -2037578 827492 3623000 6217287 8357437 9773324 10294246 9902871 8695640
13407H695640j902290k498312k971673l223541l144892k701299j967375j099646
$$ 8695640 6793350 4295038 1323365 -1900176 -5045068 -7746367 -9713742 -10813388
13399a0813388k73534L73373P60950Q57733O73066K58921k91536q62419j346007
$$ -10813388 -11086922 -10713549 -9952599 -9094866 -8421800 -8162879 -8454415 -9316834 -10662841
13390a0662841j660894j753653j613357j293427q87704m60396r619M94296J050953
$$ -10662841 -12323735 -14077388 -15690745 -16984172 -17871876 -18332272 -18341891 -17847595 -16796642
13381a6796642J614300K120596K525120K815039K990764L035470K906423K576192
$$ -16796642 -15182342 -13061746 -10536626 -7721587 -4730823 -1695353 1211070 3787262
13373C787262K100835J624445J277748J078227R50142Q15451O33369L77559K9089
$$ 3787262 5888097 7512542 8790290 9868517 10818659 11634110 12267479 12645038 12674127
13364A2674127l85953p66754r64040q55960m30749J86738P98071J235879J426543
$$ 12674127 12288174 11521420 10557380 9701420 9270671 9457409 10255480 11491359 12917902
13355A2917902J382589J163076Q43107N03377K24627O2980J6862L2738O4445J32038
$$ 12917902 14300491 15463567 16306674 16810051 17034678 17097658 17114520 17147258 17211703 17343741
13345A7343741L11814O56795J116819J533399J729064J617199J228953O53203
$$ 17343741 17655555 18312350 19429169 20962568 22691632 24308831 25537784 26190987
13337B6190987k1235p07010j304698j736152k003544k185018k339462k416527
$$ 26190987 26169752 25462742 24158044 22421892 20418348 18233330 15893868 13477341
13329A3477341k277559j807050j006933r753R73587J729738K112961K090701J755005
$$ 13477341 11199782 9392732 8385799 8376046 9349633 11079371 13192332 15283033 17038038
13320A7038038J293910R14083P38114P46796Q09217P64287M98482J400o15643
$$ 17038038 18331948 19246031 19984145 20730941 21540158 22304445 22802927 22804327 22188684
13311B2188684j162409j463176j451980j212292r29137p84270q63481j121449
$$ 22188684 21026275 19563099 18111119 16898827 15969690 15185420 14321939 13200490
13303A3200490j406557j530176j359913q93764k63222L42072P76418J004286J097324
$$ 13200490 11793933 10263757 8903844 8010080 7746858 8088930 8865348 9869634 10966958
13294A0966958J162012J244388J287566J168611P71459M9454r37653k021514k975230
$$ 10966958 12128970 13373358 14660924 15829535 16600994 16650448 15712795 13691281 10716051
13285A0716051l611099l864313l786674l463066k951525k305555j620472j023656
$$ 10716051 7104952 3240639 -546035 -4009101 -6960626 -9266181 -10886653 -11910309
13277a1910309o23427m76406n76002q40547j128412j309972j345621j284851j190452
$$ -11910309 -12533736 -13010142 -13586144 -14426691 -15555103 -16865075 -18210696 -19495547 -20685999
13268b0685999j074554q95558o02218j94173K48217N99062P63004P32419N88060
$$ -20685999 -21760553 -22656111 -23258329 -23452502 -23204285 -22605223 -21842219 -21109800 -20521740
13259b0521740M51589M24477N46629P86461J052296J222871J204707R92787O72743
$$ -20521740 -20070151 -19645674 -19099045 -18312584 -17260288 -16037417 -14832710 -13839923 -13167180
13250a3167180L41343K2575l22983p10916j080721j339780j442923j409712j268781
$$ -13167180 -12825837 -12803262 -13126245 -13837161 -14917882 -16257662 -17700585 -19110297 -20379078
13241b0379078j013531o26530j30235L97313Q42498J099105J131391J011699Q84077
$$ -20379078 -21392609 -22019139 -22149374 -21752061 -20909563 -19810458 -18679067 -17667368 -16783291
13232a6783291Q82119J065899J404575J802829K163443K438706K610968K624884
$$ -16783291 -15901172 -14835273 -13430698 -11627869 -9464426 -7025720 -4414752 -1789868
13224a789868K365742J731813P44150m02795j400919j971288j999496j575014
$$ -1789868 575874 2307687 3051837 2649042 1248123 -723165 -2722661 -4297675
13216d297675r20652k75284J98170M54719N63237O48040P85244R32928R75980
$$ -4297675 -5218327 -5493611 -5295441 -4840722 -4277485 -3629445 -2844201 -1911273 -935293
13207i35293Q48179O00455L49961J81463R6263K5094j25089m11682q00915j158659
$$ -935293 -87114 513341 863302 1044765 1141028 1166122 1041033 629351 -171564 -1330223
13197a330223j323207j213626q77217m42689l8751K50966L89380L70311K00987
$$ -1330223 -2653430 -3867056 -4744273 -5186962 -5225713 -4974747 -4585367 -4215056 -4014069
13188d014069j01092m91856q97914j253288j530465j711084j745078j580669j235277
$$ -4014069 -4115161 -4607017 -5504931 -6758219 -8288684 -9999768 -11744846 -13325515 -14560792
13179a4560792q14725m60078k71495k60429l60619m92754o27016p78932r52925
$$ -14560792 -15375517 -15835595 -16107090 -16367519 -16728138 -17220892 -17847908 -18626840 -19579765
13170a9579765j125216j295599j512682j797536k044348k040769j618583p91730
$$ -19579765 -20704981 -22000580 -23513262 -25310798 -27355146 -29395915 -31014498 -31806228
13162c1806228K35857J179127J816635K092667K120747K085968K119137K238899
$$ -31806228 -31570371 -30391244 -28574609 -26481942 -24361195 -22275227 -20156090 -17917191
13154a7917191K395103K547289K675805K719684K555800K087799J352696N14680
$$ -17917191 -15522088 -12974799 -10298994 -7579310 -5023510 -2935711 -1583015 -1068335
13146a068335k49176q49473j284462j566891j671897j563048j260597q75353n67376
$$ -1068335 -1317511 -2166984 -3451446 -5018337 -6690234 -8253282 -9513879 -10389232 -10956608
13137a0956608m55032n55160q09673j154793j546116j922365k176700k192318
$$ -10956608 -11411640 -11966800 -12776473 -13931266 -15477382 -17399747 -19576447 -21768765
13129b1768765j906251j332421n41435L56654J206817J807873J957408J547224
$$ -21768765 -23675016 -25007437 -25548872 -25192218 -23985401 -22177528 -20220120 -18672896
13121a8672896O51076m75822j511456k219930k522190k449383k056549j381229
$$ -18672896 -18021820 -18497642 -20009098 -22229028 -24751218 -27200601 -29257150 -30638379
13113c0638379m64594O05108J688399K653654L441085M050979M471383M647790
$$ -30638379 -31102973 -30497865 -28809466 -26155812 -22714727 -18663748 -14192365 -9544575
13105i544575M533363M142906L540498K783688J895434Q98466j27405j038816
$$ -9544575 -5011212 -868306 2672192 5455880 7351314 8249780 8122375 7083559
13097G083559j699209k066000k215658k301513k482974k839556l305232l705588
$$ 7083559 5384350 3318350 1102692 -1198821 -3681795 -6521351 -9826583 -13532171
13089a3532171l896305l867432l711464l512064l277253k956364k487010j825724
$$ -13532171 -17428476 -21295908 -25007372 -28519436 -31796689 -34753053 -37240063 -39065787
13081c9065787r68377K9988J058110J983350K685750L071417L091641K780625
$$ -39065787 -40034164 -40004176 -38946066 -36962716 -34276966 -31205549 -28113908 -25333283
13073b5333283K268187J733787J333024J147021J172810J344683J572988J787962
$$ -25333283 -23065096 -21331309 -19998285 -18851264 -17678454 -16333771 -14760783 -12972821
13065a2972821J963143K098272K182639K173684K006827J634880J069952L99311
$$ -12972821 -11009678 -8911406 -6728767 -4555083 -2548256 -913376 156576 555887
13057E55887k22895o10608o29206k95605K04121O22311P93557O98405M27047R8519
$$ 555887 332992 -277616 -906822 -1202427 -998306 -375995 417562 1115967 1543014 1641533
13047A641533k12544n02509p94024j062485j231926j256128j172702j059140r60448
$$ 1641533 1428989 926480 132456 -930029 -2161955 -3418083 -4590785 -5649925 -6610373
13038f610373q68581p44168n44850k57235P2172L45777M82704M88990M54957M73468
$$ -6610373 -7478954 -8223122 -8767972 -9025207 -8953035 -8607258 -8124554 -7635564 -7180607 -6707139
13028f707139N48132N72559L95267q4161q48789j761082k615949l210846l398158
$$ -6707139 -6159007 -5586448 -5191181 -5275342 -6124131 -7885213 -10501162 -13712008 -17110166
13019a7110166l114985k400528j392425k83239P48723J585782K169937K484632
$$ -17110166 -20225151 -22625679 -24018104 -24301343 -23552620 -21966838 -19796901 -17312269
13011a7312269K552174K437123K225079J974250J682365J309572Q33336K80140
$$ -17312269 -14760095 -12322972 -10097893 -8123643 -6441278 -5131706 -4298370 -4018230
13003d018230k76774p40878j035791j141519j080001q64486m83202M9177O33201
$$ -4018230 -4295004 -5035882 -6071673 -7213192 -8293193 -9157679 -9640881 -9591704 -8958503
12994h958503J108299J350606J339674J138653Q47003N80229M42742M66363N84162
$$ -8958503 -7850204 -6499598 -5159924 -4021271 -3174268 -2594039 -2151297 -1684934 -1100772
12985a100772O98501P67655Q11608Q56935Q97746Q98293Q19559O51868M33573
$$ -1100772 -402271 365384 1176992 2033927 2931673 3829966 4649525 5301393 5734966
12976E734966K37793J40489J91454L82917O29135Q03297Q21659O95948N06670
$$ 5734966 5972759 6113248 6304702 6687619 7316754 8120051 8941710 9637658 10144328
12967A0144328L32353K04608J15517M9260K638j8073j0685J7300N4553R2910J25419
$$ 10144328 10476681 10681289 10796806 10846066 10848704 10830631 10819946 10837246 10891799 10984709 11110128
12956A1110128J43095J44122J46121J81268K74291M20965N84553P14308P73749
$$ 11110128 11253223 11397345 11543466 11724734 11999025 12419990 13004543 13718851 14492600
12947A4492600P64949P32209P29720P76106Q41285Q70044Q10283O22708K73393
$$ 14492600 15257549 15989758 16719478 17495584 18336869 19206913 20017196 20639904 20913297
12938B0913297k63002r70275j761227k500726l070586l408257l483829l267342
$$ 20913297 20650295 19680020 17918793 15418067 12347481 8939224 5455395 2188053
12930B188053k749844j994166j144468l81054J38298L23260J74805k17066p02045
$$ 2188053 -561791 -2555957 -3700425 -4081479 -3943181 -3619921 -3445116 -3662182 -4364227
12921d364227j122853j374451j427951j297667r86474m77981K05076R42601J537251
$$ -4364227 -5487080 -6861531 -8289482 -9587149 -10573623 -11051604 -10846528 -9903927 -8366676
12912h366676J811704J700802J270260O74542R2163l44477n90375o62007n71232
$$ -8366676 -6554972 -4854170 -3583910 -2909368 -2817205 -3161682 -3752057 -4414064 -4985296
12903d985296k92597K05070Q98406J672830K340983K713526K681685K264826J608839
$$ -4985296 -5277893 -5072823 -4174417 -2501587 -160604 2552922 5234607 7499433 9108272
12894I108272R44013N07655M42389P17464J138014J455301J513082J337646J109451
$$ 9108272 10052285 10559940 11002329 11719793 12857807 14313108 15826190 17163836 18273287
12885A8273287J023274J129927J289376J283436R85200M25627k80164j032034
$$ 18273287 19296561 20426488 21715864 22999300 23984500 24410127 24129963 23097929
$$ [...]
##END NTUPLES=NMR SPECTRUM
##END=
