##TITLE=1H ikalashn
DE2_HCl
20.7.2023
##JCAMPDX= 6.0         $$ Bruker NMR JCAMP-DX V2.0
##DATA TYPE= NMR FID
##DATA CLASS= NTUPLES
##ORIGIN= UXNMR, Bruker Analytische Messtechnik GmbH
##OWNER= root
$$ TOPSPIN		Version 1.3
$$ 2023-07-20 13:40:48.093 +0400  Irina@DPX200
$$ Compression mode = diff/dup
##.OBSERVE FREQUENCY= 200.131300845
##.OBSERVE NUCLEUS= ^1H
##.DELAY= (6, 6)
##.ACQUISITION MODE= SIMULTANEOUS
##.ACQUISITION SCHEME= undefined
##.AVERAGES= 32
##.DIGITISER RES= 18
##SPECTROMETER/DATA SYSTEM= spect
##.PULSE SEQUENCE= zg
##.SOLVENT NAME= D2O
##.SHIFT REFERENCE= INTERNAL, D2O, 1, 16.97976
##AUDIT TRAIL= $$ (NUMBER, WHEN, WHO, WHERE, WHAT)
$$ ##TITLE= Audit trail, TOPSPIN		Version 1.3
$$ ##JCAMPDX= 5.01
$$ ##ORIGIN= Bruker BioSpin GmbH
$$ ##OWNER= Irina
$$ $$ F:/spectra/data/iren/nmr/1H/4/audita.txt
$$ ##AUDIT TRAIL=  $$ (NUMBER, WHEN, WHO, WHERE, VERSION, WHAT)
(   1,<2023-07-20 13:40:32.109 +0400>,<Irina>,<DPX200>,<TOPSPIN 1.3>,
      <created by zg
	started at 2023-07-20 13:38:19.203 +0400,
	POWCHK disabled, PULCHK disabled
       configuration hash MD5:
       BE 6D 3F 07 2A EA 11 49 91 17 2B D3 AF B3 58 0D
       data hash MD5: 16K
       96 AD 85 35 2D DB 52 F2 E6 3A D3 19 FD CC 78 AF>)
$$ ##END=
$$ 
$$ $$ hash MD5
$$ $$ 36 4A 1E 12 63 CB 26 B4 6E 55 07 57 70 92 9A A9
##$RELAX= 
##$RELAX= 
##$RELAX= 
##$RELAX= 
##$RELAX= 
##$RELAX= 
##$RELAX= 
##$RELAX= 
$$ Bruker specific parameters
$$ --------------------------
##$DU= <F:/spectra>
##$EXPNO= 4
##$NAME= <1H>
##$PROCNO= 1
##$TYPE= <nmr>
##$USER= <iren>
##$AMP= (0..31)
100 100 100 100 100 100 100 100 100 100 100 100 100 100 100 100 100 100 
100 100 100 100 100 100 100 100 100 100 100 100 100 100 
##$ANAVPT= -1
##$AQSEQ= 0
##$AQ_mod= 1
##$AUNM= <au_zg>
##$AUTOPOS= <>
##$BF1= 200.13
##$BF2= 200.13
##$BF3= 200.13
##$BF4= 200.13
##$BF5= 200.13
##$BF6= 200.13
##$BF7= 200.13
##$BF8= 200.13
##$BYTORDA= 1
##$CFDGTYP= 0
##$CFRGTYP= 5
##$CHEMSTR= <none>
##$CNST= (0..63)
1 1 145 1 1 1 1 1 1 1 1 1 1 1 1 1 1 1 1 1 1 1 1 1 1 1 1 1 1 1 1 1 1 1 
1 1 1 1 1 1 1 1 1 1 1 1 1 1 1 1 1 1 1 1 1 1 1 1 1 1 1 1 1 1 
##$CPDPRG= <>
##$CPDPRG1= <>
##$CPDPRG2= <>
##$CPDPRG3= <>
##$CPDPRG4= <mlev>
##$CPDPRG5= <mlev>
##$CPDPRG6= <mlev>
##$CPDPRG7= <mlev>
##$CPDPRG8= <mlev>
##$CPDPRGB= <>
##$CPDPRGT= <>
##$D= (0..63)
0 2 0 0 0 0 0 0 0 0.06 0 0.03 0 0 0 0 0.0002 0 0 0 0 0 0 0 0 0 0 0 0 0 
0 0 0 0 0 0 0 0 0 0 0 0 0 0 0 0 0 0 0 0 0 0 0 0 0 0 0 0 0 0 0 0 0 0 
##$DATE= 1689846029
##$DBL= (0..7)
120 120 120 120 120 120 120 120 
##$DBP= (0..7)
150 150 150 150 150 150 150 150 
##$DBP07= 0
##$DBPNAM0= <>
##$DBPNAM1= <>
##$DBPNAM2= <>
##$DBPNAM3= <>
##$DBPNAM4= <>
##$DBPNAM5= <>
##$DBPNAM6= <>
##$DBPNAM7= <>
##$DBPOAL= (0..7)
0.5 0.5 0.5 0.5 0.5 0.5 0.5 0.5 
##$DBPOFFS= (0..7)
0 0 0 0 0 0 0 0 
##$DE= 6
##$DECBNUC= <off>
##$DECIM= 32
##$DECNUC= <off>
##$DECSTAT= 4
##$DIGMOD= 1
##$DIGTYP= 9
##$DL= (0..7)
0 120 120 120 120 120 120 120 
##$DP= (0..7)
150 150 150 150 150 150 150 150 
##$DP07= 0
##$DPNAME0= <>
##$DPNAME1= <>
$$ [...]
##$SW= 20.9593944314184
##$SWIBOX= (0..15)
0 0 2 0 0 0 0 0 0 0 0 0 0 0 0 0 
##$SW_h= 4194.63087248322
##$TD= 16384
##$TD0= 1
##$TE= 300
##$TE2= 300
##$TE3= 300
##$TEG= 300
##$TL= (0..7)
0 120 120 120 120 120 120 120 
##$TP= (0..7)
150 150 150 150 150 150 150 150 
##$TP07= 0
##$TPNAME0= <>
##$TPNAME1= <>
##$TPNAME2= <>
##$TPNAME3= <>
##$TPNAME4= <>
##$TPNAME5= <>
##$TPNAME6= <>
##$TPNAME7= <>
##$TPOAL= (0..7)
0.5 0.5 0.5 0.5 0.5 0.5 0.5 0.5 
##$TPOFFS= (0..7)
0 0 0 0 0 0 0 0 
##$TUNHIN= 0
##$TUNHOUT= 0
##$TUNXOUT= 0
##$USERA1= <user>
##$USERA2= <user>
##$USERA3= <user>
##$USERA4= <user>
##$USERA5= <user>
##$V9= 5
##$VALIST= <valist>
##$VCLIST= <CCCCCCCCCCCCCCC>
##$VD= 0
##$VDLIST= <DDDDDDDDDDDDDDD>
##$VPLIST= <PPPPPPPPPPPPPPP>
##$VTLIST= <TTTTTTTTTTTTTTT>
##$WBST= 1024
##$WBSW= 25
##$XGAIN= (0..3)
0 0 0 0 
##$XL= 0
##$YL= 0
##$YMAX_a= 1271567
##$YMIN_a= -804200
##$ZGOPTNS= <>
##$ZL1= 120
##$ZL2= 120
##$ZL3= 120
##$ZL4= 120
##$ABSF1= 10
##$ABSF2= 0
##$ABSG= 5
##$ABSL= 3
##$ALPHA= 0
##$AQORDER= 0
##$ASSFAC= 0
##$ASSFACI= 0
##$ASSFACX= 0
##$ASSWID= 0
##$AUNMP= <proc_1d>
##$AXLEFT= 0
##$AXRIGHT= 0
##$AXTYPE= 0
##$AXUNIT= <>
##$AZFE= 0.1
##$AZFW= 0.1
##$BCFW= 1
##$BC_mod= 2
##$BYTORDP= 1
##$COROFFS= 0
##$CY= 7568.61572265625
##$DATMOD= 1
##$DC= 2
##$DFILT= <>
##$DTYPP= 0
##$F1P= 17.4489326093798
##$F2P= -7.48496080290002
##$FCOR= 0.5
##$FTSIZE= 32768
##$FT_mod= 4
##$GAMMA= 1
##$GB= 1
##$INTBC= 1
##$INTSCL= 1
##$ISEN= 128
##$LB= 0.05
##$LEV0= 0
##$LPBIN= 0
##$MAXI= 945.577
##$MC2= 0
##$MEAN= 0
##$ME_mod= 0
##$MI= -402.1523
##$NCOEF= 0
##$NC_proc= 0
##$NLEV= 6
##$NOISF1= 8.587773
##$NOISF2= 6.764455
##$NSP= 1
##$NTH_PI= 0
##$NZP= 0
##$OFFSET= 16.97976
##$PC= 1
##$PHC0= 44.46233
##$PHC1= -5.170725
##$PH_mod= 0
##$PKNL= yes
##$PPARMOD= 0
##$PPDIAG= 0
##$PPIPTYP= 0
##$PPMPNUM= 100
##$PPRESOL= 1
##$PSCAL= 0
##$PSIGN= 0
##$REVERSE= no
##$SF= 200.13
##$SI= 32768
##$SIGF1= 18.5376
##$SIGF2= -6.396296
##$SINO= 400
##$SIOLD= 32768
##$SREGLST= <1H.CDCl3>
##$SSB= 3
##$STSI= 0
##$STSR= 0
##$SW_p= 4194.63087248321
##$SYMM= 0
##$S_DEV= 0
##$TDeff= 0
##$TDoff= 0
##$TI= <>
##$TILT= no
##$TM1= 0
##$TM2= 0
##$TOPLEV= 0
##$USERP1= <user>
##$USERP2= <user>
##$USERP3= <user>
##$USERP4= <user>
##$USERP5= <user>
##$WDW= 1
##$XDIM= 8192
##$YMAX_p= 0
##$YMIN_p= 0
$$ End of Bruker specific parameters
$$ ---------------------------------
##NTUPLES= NMR FID
##VAR_NAME=  TIME,          FID/REAL,        FID/IMAG
##SYMBOL=    X,             R,               I
##VAR_TYPE=  INDEPENDENT,   DEPENDENT,       DEPENDENT
##VAR_FORM=  AFFN,          ASDF,            ASDF
##VAR_DIM=   8192,          8192,            8192
##UNITS=     SECONDS,       ARBITRARY UNITS, ARBITRARY UNITS
##FACTOR=    0.0002384,     1,               1
##FIRST=     0,             0,               0
##LAST=      1.9527344,     -124,            -94
##MIN=       0,             -804200,         -804200
##MAX=       1.9527344,     1271567,         1271567
$$ Real data points
##PAGE= N=1
##DATA TABLE= (X++(R..R)), XYDATA
$$ [...]
1297A3J57j61j84L59m7k54j7J20J1m8PK05O1n00O1J52O1k77N9L18L2k26M9M96
$$ 13 170 9 -175 184 137 -117 -134 -14 -3 -51 -44 161 222 -278 -217 -65 -4 -281 -222 96 128 -98 -49 447
1321D47l14m08L47J41m69j66M71J32k43j26O46j52l28j39J14K47m21j25O34j99
$$ 447 133 -275 72 213 -256 -422 49 181 -62 -188 458 306 -22 -161 -47 200 -221 -346 288 89
1341H9m33K45M93l22k24L05J10j93l82L49M6k44qM57J06m78KK63jn35J96M12l10
$$ 89 -344 -99 394 72 -152 153 263 70 -312 37 83 -161 -169 288 394 -84 -82 181 180 -355 -159 253 -57
1364e7n5K1M80k05l64K28K99l91j24J65jj78K01L02j35l55R9L24j70k05j18J07
$$ -57 -112 -91 389 184 -180 48 347 -44 -168 -3 -4 -182 19 321 186 -169 -70 254 84 -121 -239 -132
1386a32K18k97j8N25j13r6Q1j23j63J9J49j8o6p9J53P1q5J34n7m8j08L8r6P8N
$$ -132 86 -211 -229 296 183 87 168 45 -118 -99 50 32 -34 -113 40 111 26 160 103 55 -53 -15 -111 -33 -28
1411b8j6j01J60q8Q5m3Q7O5j14j51K04L6k66k9L74Jj69K0L7m5k21L46p3j67N5
$$ -28 -44 -145 15 -73 12 -31 56 121 7 -144 60 96 -170 -199 175 176 7 27 64 19 -202 144 71 -96 -41
1436d1J53no8n6J99J2l00J19J36j0l93K11RP7j39K67J09l04m9J12J10k23M1K11
$$ -41 112 107 39 -17 182 194 -106 13 149 139 -254 -43 -34 43 -96 171 280 -24 -73 39 149 -74 -33 178
1460A78j82j70N6K57R0l91Q0J99m2l66L03J66k21mJ50J17j66r6L7J76l05j37M69
$$ 178 -4 -174 -118 139 229 -162 -82 117 75 -291 12 178 -43 -47 103 220 54 -42 -5 171 -134 -271 198
1483A98p4k89J22J66j33L8j3K0Q3k32Q4K38k36MPJ93j02j29n8P6j0Q8o6M1M8q0
$$ 198 124 -165 -43 123 -10 28 15 35 118 -114 -30 208 -28 -24 -17 176 74 -55 -113 -37 -47 41 -25 16 64 -16
1509a6J53r3j59Q1J73j68J05j06J3j45Q2K33k40K9P1q0J25k56K16N5j60p3M15
$$ -16 137 44 -115 -34 139 -29 76 -30 -17 -162 -80 153 -87 -58 13 -67 58 -198 18 73 -87 -160 255
1532B55l42j55L00qq8J34J9j81J03j02R9p1M9K11k74K7k9J78q0j53J38k17K68
$$ 255 -87 -242 58 50 -38 96 115 -66 37 -65 34 -37 12 223 -51 -24 -53 125 45 -108 30 -187 81
1555H1j02J05lj07O1pQ8j00P5k9p6j8o4J22j5m7J06j0j4q5l1K9J07j37J10k6j10
$$ 81 -21 84 81 -26 35 28 116 16 91 62 -14 -32 -96 26 11 -36 70 60 46 -39 -70 -41 66 -71 39 13 -97
1582i7N6R4o3l5k04L12N2j22k2R9J49l08P5J13m7m2J02j44j09o0J69J19j50m7
$$ -97 -41 53 -10 -45 -249 63 115 -7 -29 70 219 -89 -14 99 52 10 112 -32 -141 -201 -32 87 -63 -110
1606a10J10P8r4q0R6r4J87J0j00p2M4K01j19n1N7n9o7K21k35J04j14J03r2J02
$$ -110 0 78 -16 -96 0 -94 93 103 3 -69 -25 176 57 6 63 4 -63 158 -77 27 -87 16 -76 26
1630B6J42k35K8M7L1Q2k02l2O7R6lj96J39m0J57j34JJ14k1q3l0J8%m3L0o9M4K6
$$ 26 168 -67 -39 8 39 121 -81 -113 -46 50 47 -149 -10 -50 107 -27 -26 88 67 -16 -46 -28 -28 -71 -41 -110 -66 -40
1658d0j7K60k39q5Q4K5n9j9K35k39J68j16K3rL1j04L42j74j56n5L20l9k19J72
$$ -40 -57 203 -36 -121 -37 -12 -71 -90 145 -94 74 -42 -19 -28 3 -101 241 67 -89 -144 176 137 -82 90
1682I0K5j31p9J08M5j29M3L0j03J71j18K7J23j71O0j08J13R9M3k20K3l9J23j31
$$ 90 115 -16 -95 13 58 -71 -28 2 -101 70 -48 -21 102 -69 -9 -117 -4 95 138 -82 -59 -98 25 -106
1706a06J13M2o3J49j01l3L6K3q9Nj0P2j11J87j24pJ43k40J67j45K34k38R5M0J02
$$ -106 7 49 -14 135 34 1 37 60 -29 -24 -34 38 -73 114 -10 -17 126 -114 53 -92 142 -96 -1 39 141
1731A41j44j0J95k00J7O5Nj48L2N3o1J59k4m4O7o2j10J52j54O4l1k9K4m3N2k5
$$ 141 -3 -13 182 -18 -1 64 69 -79 -47 6 -55 104 80 36 103 41 -69 83 -71 -7 -38 -67 -43 -86 -34 -59
1757e9K16k67P7o2J03Nm6O0m4n8K5O7Rk5J57j99m8Q8J11q6J5j20P8J89q7j82J72
$$ -59 157 -110 -33 -95 8 13 -33 27 -17 -75 -50 17 26 1 158 -41 -89 -1 110 24 39 -81 -3 186 99 -83 89
1784H9r5J33n7Nk14J31K02j62j68K88j65JO4o0K2J08Rj29K6j07L9R7j9k1p4k9
$$ 89 -6 127 70 75 -139 -8 194 32 -136 152 -13 -12 52 -8 14 122 131 2 28 -79 -40 57 38 17 -57 -86
1810h6j16J89J14p9J9q3m6K10q4K06k11j13K60k94N9J65l0m9O3k6J26j4k44J46
$$ -86 -202 -13 101 22 41 -42 -88 122 38 244 33 -80 180 -114 -55 110 80 31 94 68 194 180 -64 82
1834H2K2l4r4O1j08J29j31K03k34J93on7Np8J78l65K31k48L16L1Q8l32J53K7J2
$$ 82 104 70 -24 37 -71 58 -73 130 -104 89 83 26 31 -47 131 -234 -3 -251 65 96 184 -148 5 32 44
1859D4j50J50k3k5p2Q9j5q7Q0j06J62k94M04n5o5j61J80O8po3j44PQ3L9J1Q1j61
$$ 44 -106 44 21 -4 -76 13 -2 -89 -9 -115 47 -247 157 102 37 -124 56 124 117 54 -90 -83 0 39 50 131 -30
1886c0J25o6k7L7j48P5qJ40j38J78o7n8r0J10q8J33j16j19K61j05o1oo8J26m0
$$ -30 95 29 2 39 -109 -34 -42 98 -40 138 71 13 -77 33 -55 78 -38 -157 104 -1 -62 -68 -136 -10 -50
1911e0J30J5k44L4O5J0L6m9K8J73l7j54K7Opj87L58j4q1l3n4J44j08OqO9j69K4
$$ -50 80 95 -149 -115 -50 -40 -4 -53 -25 148 111 -43 -16 -10 -17 -204 154 140 59 26 -28 116 8 14 6 75 -94 -70
1939g0J26J9j0p1j9o4qR7R7o0m6O6o4O3j87J61K3j50P1k8P1j0M6jk32K11O8j12
$$ -70 56 75 65 -6 -25 -89 -97 0 97 37 -9 57 -7 56 -131 30 53 -97 -26 -54 17 7 53 52 -180 31 99 -13
1967a3m6K11k09n1n2K45jq8p9K6M9J23k7o4q5J57j06n2L3l2J46kr8R4N7pq2M2
$$ -13 -59 152 -57 -108 -160 85 84 -4 -83 -57 -8 115 88 24 -61 96 -10 -62 -29 -61 85 83 -15 79 136 129 47 89
1995H9j02J45j71J16m5K8n7l8p7J58j24J29K1Q1j58j06Q0J26O9j03j49J8Q5m4
$$ 89 -13 132 -39 77 32 60 3 -35 -112 46 -78 51 72 153 -5 -111 -31 95 164 61 -88 -70 15 -29
2019b9J39j0j58J3J24k86K86o8k4J73j39p7K64k08J90k56M6KP8j08R4j89J90k2
$$ -29 110 100 -58 -45 79 -207 79 11 -13 160 21 -56 208 0 190 -66 -20 -18 60 -48 46 -143 47 25
2043B5j12K24p2k07K32q3j2j1mO2j07P3m9J74k26J68j20oJ8J30n4N9k2j10k7J43
$$ 25 -87 137 65 -142 90 7 -5 -16 -20 42 -65 8 -41 133 -93 75 -45 -51 -33 97 43 102 80 -30 -57 86
2069H6j44O5R9o4J31k13O3j27p6P6L25l61P6J72j23J06n9k8R2KPk00R6K0O4Nq2
$$ 86 -58 7 106 42 173 -40 23 -104 -180 -104 221 -140 -64 108 -15 91 32 4 96 98 105 -95 1 21 85 90 8
2096HP3j17l6J98k22L0R0O3j52K7m2J19L9j8o1P7N3r0j77L5J29n2J26k19J49j79
$$ 8 81 -36 -72 126 -96 -66 24 87 -65 -38 -80 39 78 60 -1 76 129 39 -138 -103 26 -26 100 -119 30 -149
2122a49R8N1j13J62J5J3K8j68Q8L5j0o4P1k04L24l7n8j09r4J12j11L11l53J37
$$ -149 -51 0 -113 49 64 77 105 -63 25 60 50 -14 57 -147 177 140 82 -27 -121 -9 -120 191 -162 -25
2146b5K0j72J64Q8j08K9ON2p0L2k7l9k3j9J32K7m1j27J49jj74J68M7m0q4n8O9
$$ -25 -5 -177 -13 75 -33 -4 2 54 -16 16 -11 -50 -73 -92 40 67 26 -101 48 47 -127 41 88 48 -36 -94 -25
2173b5r9MK75j06j60K54k09J49q7j19K41j46j2N6l7J2J30o5k44K18k21K12J42
$$ -25 -124 -120 155 49 -111 143 -66 83 -4 -123 118 -28 -40 16 -21 -9 121 56 -188 30 -191 21 163
2196A63o9J20k66K4J4L0J1m4p1J28k7j4j2ol4Jl3rO0O8J4J0k0o7J86q9j4j77K06
$$ 163 94 214 -52 -28 -14 16 27 -17 -88 40 13 -1 -13 -19 -53 -52 -85 -94 -34 34 48 58 38 -29 157 68 54 -123 83
2225H3j37M9J00j42R5K6j09n9K25j83J98k57J97j78L0R1M2l67J86J49j90K39p6
$$ 83 -54 -5 95 -47 48 74 -35 -94 131 -52 146 -111 86 -92 -62 29 71 -296 -110 39 -151 88 12
2248A2m6R0m4k27lJ70k9J16j4j00Q1l2N1o8Pk31Q6K36j08q5K77j47n8J51j30m
$$ 12 -34 56 12 -215 -218 -48 -77 39 25 -75 6 -26 25 -43 -36 -267 -181 55 -53 -138 139 -8 -66 85 -45 -49
2274d9J15K6p5q8J23k6k26K13Q9j06j7O3n4J23j49J9M2Q2j15o4j9M6j8N7PK2O9
$$ -49 66 92 17 -71 52 26 -200 13 102 -4 -21 42 -12 111 -38 -19 23 105 -10 -74 -93 -47 -65 -8 -1 21 90
2301I0j23j1o8qQ8n3o5J73q3j9N4J01q0P5q6l1M0M9o3Q9k05L30j87l8J07J0o4
$$ 90 -33 -44 -112 -120 -32 -85 -150 23 -60 -79 -25 76 -4 71 -15 -46 -6 43 -20 69 -136 194 7 -31 76 86 22
2328B2J03k30N3j37K05P0m4o0K1O1o0M5j38K14j17m2j6K3J41k13O0N8O4j58N3
$$ 22 125 -105 -52 -189 16 86 42 -18 3 64 4 49 -89 125 8 -34 -50 -27 114 -99 -39 19 83 -75 -22
2353b2J08p3kk6O4j03K4K2j25J33j4q4O5K41j19k58J28K09k3j24J3J4J1rn2qL5
$$ -22 86 13 11 -15 49 -54 -30 -8 -133 0 -14 -98 -33 208 89 -169 -41 168 145 21 34 48 59 50 -2 -10 25
2380B5K9J56k2l33J94j26O1j9J04j28m1R0J0M7j07K28j00l05K61j45K76k08J98
$$ 25 54 210 188 -145 49 -77 -16 -35 69 -59 -100 -10 0 47 -60 168 68 -237 24 -121 155 -53 145
2403A45j55O3j40K6J51n4n0J84k08j09K12j0o8K02k56L6qj04J04J37j68K27k08
$$ 145 -10 53 -87 -61 90 36 -14 170 -38 -147 65 55 -13 189 -67 -31 -39 -143 -39 98 -70 157 -51
2426e1k09L37k46N9m0K79L5j24J0n4o7R2l0P5j9k07K22pj70J14J33j73O9q4j10
$$ -51 -260 77 -169 -110 -150 129 164 40 50 -4 -71 21 -9 66 47 -160 62 55 -115 -1 132 -41 28 -56 -166
2451a66R9O7m5o2M1J98k68O5PPJ3Q8j69K3R8J70j84O4O5k09n7J16j7J05L4j68
$$ -166 -67 0 -45 -107 -66 132 -136 -71 -64 -57 -44 44 -125 -102 -4 166 -18 46 111 -98 -155 -39 -56 49 83 -85
2477h5J07r0P8M2R6r8p9R8j33J81j60J20r9OK6j1j21J86l8r6n0K43n4m2M4J0j2
$$ -85 22 -68 10 52 148 50 -29 69 -64 117 -43 77 -22 -16 10 -1 -122 64 26 -70 -120 123 69 27 71 81 69
2504F9L1j71O2J1p4J75r1q6J63q0k4R2j2l8j16J20R1j95J53k28R4N0m6J53p9o
$$ 69 100 -71 -9 2 -72 103 12 -74 89 9 -15 77 65 27 -89 31 122 -73 80 -148 -54 -4 -50 103 24 18
2530A8P3l8n6L3j22J00J6K4j40K25m2q4N2m9j19J43N4r8j24J21J66k98J95j6j00
$$ 18 91 53 -3 30 -92 8 24 48 -92 133 91 7 59 10 -109 34 88 -10 -134 -13 153 -145 50 34 -66
2555f6L0L5K8Q6j00l1J36r2j03OJ52k54K93k30J80J27k65J27kP3o5o4j5KJ07j1
$$ -66 -36 -1 27 113 13 -18 118 26 -77 -71 81 -173 120 -110 70 197 -68 59 57 130 65 1 -14 -12 95 84
2581H4o0j55K12j09n2J14rO4j01J21p4j15k9N5o8Q9l7J28N5j48J04q9O9m6q2j2
$$ 84 24 -131 81 -28 -80 34 25 89 -12 109 35 -80 -109 -54 -122 -33 -70 58 113 -35 69 -20 49 3 -79 -91
2607i1P4m4J2J2J8L0o2J10o5J82k25K03j49OL3J42j74N5o9q0J18j31K80j49j49
$$ -91 -17 -61 -49 -37 -19 11 -51 59 -6 176 -49 154 5 11 44 186 12 67 -2 -82 36 -95 185 36 -113
2632a13J82p4l3k7l3n9J63K4J04j91J12r3P5p7L5k64K36N0J47n8O3j80O4Kr2k8
$$ -113 69 -5 -38 -65 -98 -157 6 30 134 -57 55 -38 37 -40 -5 -269 -33 17 164 106 169 -11 53 55 -37 -65
2658f5M8P9m2j57K46j06l3J00M4n0p2Q0j07n9P9qM4J5O5r9n2M4L0qM3L6j29m0
$$ -65 -17 62 20 -137 109 3 -30 70 114 64 -8 72 -35 -94 -15 -23 21 36 101 2 -50 -6 24 16 59 95 -34 -74
2686g4M3J65Rk11r3L24k44J70k98K09J5j07J23L8k58J24R0j22J72j71K13k07%
$$ -74 -31 134 143 -68 -161 163 -81 89 -209 0 15 -92 31 69 -189 -65 25 -97 75 -96 117 -90 -90
2709i0J06n6k4J22p0J82j42l7k5Q0P7k3j43r7J84p1k2J34l1N3j06Q1j12J45m4
$$ -90 16 -40 -64 58 -12 170 28 -9 -34 46 123 100 -43 -140 44 -27 -49 85 54 107 1 82 -30 115 71
2734G1o2q4K18j53QJ0m8p9L5M4K01j53k12J94J7J35k28J3m2K52j93P4j00P1J3
$$ 71 9 -75 143 -10 -2 8 -40 -119 -84 -40 161 8 -204 -10 7 142 -86 -73 -115 137 -56 18 -82 -11 2
2759Bj70J72O0Lj33K11R2j93N6j47P5n4J11p9j75K26p0o6J06P1j26M0N3j12N8
$$ 2 -168 4 64 67 -66 145 237 44 100 -47 28 -26 85 6 -169 57 -13 -79 27 98 -28 12 65 -47 11
2784A1j26J2K26l9j52J18J26q5j39m7m2J61m1J46l0k34K61mj23R2J32k69P9j48
$$ 11 -115 -103 123 84 -68 50 176 91 -48 -95 -137 24 -17 129 99 -135 126 122 -1 91 223 -46 33 -115
2808a15Q1L7J89j91P3j27P4P0o3N6j30J11j48K59j72J6K8j41K62j65J52k4j61
$$ -115 -34 3 192 1 74 -53 21 91 28 84 -46 65 -83 176 4 20 48 -93 169 4 156 132 -29
2831b9J51j88L1P1q7m9J94j65Q7j0K3q3l9k9L6Q6n4N3k9m5J70n5pj04K31k19P1
$$ -29 122 -66 -35 36 -51 -100 94 -71 16 6 29 -54 -93 -122 -86 0 -54 -1 -30 -75 95 40 33 -71 160 -59 12
2858A2Nr8M7l2J60j5J6L9Nm4k06P7M7K4O5j53Pl0J44J7%j78J33k0Mm9Q6o9M2J28
$$ 12 17 -81 -34 -66 94 79 95 134 139 95 -111 -34 13 37 102 -51 -44 -74 70 87 87 -91 42 22 26 -23 63 -6 36 164
2888A64pr6O9j14N5j19Jj18J70j12J83j02p0K8K2Q1k28K57k41K6J08p1J02J15
$$ 164 157 61 130 16 71 -48 -47 -165 5 -107 76 -26 -96 -68 -46 35 -193 64 -177 -151 -43 -114 -12 103
2912A03j72J14olK4Q9j34q3K05j90n3Q8K6oN9k2n8o0J34q9j0J26j75J35p1j6J96
$$ 103 -69 45 39 36 60 149 15 -68 137 -53 -106 -18 8 2 61 39 -19 -79 55 -34 -44 82 -93 42 -29 -45 151
2939A51j23J3k8J39j62L1o5K7N8lj18J62nj77qN2OJ04J8o3j0LK5j3p1O9l1N0O9
$$ 151 28 41 13 152 -10 21 -44 -17 41 38 -80 82 77 -100 -108 -56 -50 54 72 9 -1 2 27 14 -57 12 -19 31 100
2968A00o6N0n4N8k49K29m1j21P5O0q0r2L7J3O1%l9M5R7j21R3J7j28J26j80M5O1
$$ 100 34 84 30 88 -161 68 27 -94 -19 41 -39 -131 -94 -81 -20 -20 -59 -14 83 -38 55 72 -56 70 -110 -65 -4
2995dM8R8j33M5L0j00l1J33o4o0j1P2j41R5j18K04j44r4J15P1n9L5J01j35O6O8
$$ -4 44 142 9 54 84 -16 -47 86 22 -38 -49 23 -118 -23 -141 63 -81 -175 -60 11 -48 -13 88 -47 19 87
3021H7j43o8J10J67j04N7j86J68O3n4L5j09J7M0k04k7K55r6N2k8j68P7p3O4O9
$$ 87 -56 -124 -14 153 49 106 -80 88 151 97 132 23 40 80 -124 -151 104 8 60 32 -136 -59 -132 -68 1
3046ArRp0Q1j37P2M8M2k79M24J8j22O3k46J02Q6Q6j90O3m4J2j09N6P9n8N9n3Q7
$$ 1 -8 1 -69 12 -125 -53 -5 37 -242 182 200 78 141 -105 -3 83 169 -21 42 -2 10 -99 -43 36 -22 37 -16 71
3074G1qPJJ16k61J32j41j1r3J58npK14j16k08J14K6P1j36L5J65k74J69J21j52
$$ 71 63 70 71 187 -74 58 -83 -94 -187 -29 -34 -41 173 57 -151 -37 -11 60 -76 -41 124 -150 19 140 -12
3099a2n6M9j77K81k32J38J20p8P9pr8M2J07j95L3PlJ79j90Q3L1k37K04L4k6Mj28
$$ -12 -68 -19 -196 85 -147 -9 111 33 112 105 7 49 156 -39 -6 1 -2 177 -13 70 101 -136 68 102 76 80 -48
3126d8j19K73j96K17k3n3R5m4r3j32K48q1q0K2P6j00K7K6M0j4m4j36J29J24j08
$$ -48 -167 106 -90 127 104 51 146 102 9 -123 125 44 -36 -14 62 -38 -11 15 55 41 -3 -139 -10 114 6
3151Fn7O0j4J64ro7o9R3j64K53j10k4J41k38j18J76o2O2P4p1J40j11q0N0N2k02
$$ 6 -51 9 -5 159 150 83 14 107 -57 196 86 62 203 -35 -153 23 -39 23 97 26 166 55 -25 25 77 -125
3177a25J25oJ5O5j15N1k3J0J52j74o5KJ42L1lj25J09j00%N4N1j09J36l5M7n1q5
$$ -125 0 -6 9 74 -41 10 -13 -3 149 -25 -90 -88 54 85 82 -43 66 -34 -34 20 71 -38 98 63 110 59 -26
3204b6M1j18Q0Q8j39J08J34j59k8Q0j06K9J21p7q5L4J44j19o3J09r5J81k72J18
$$ -26 15 -103 -23 65 -74 34 168 9 -19 61 -45 -16 105 28 -57 -23 121 2 -61 48 -47 134 -138 -20
3228b0Po0j08J62M6l8j3M3j05j10J70J32m6o4j33J92j08J72m3k54J48l6O1J5R7
$$ -20 -13 -73 -181 -19 27 -11 -24 19 -86 -196 -26 106 60 -4 -137 55 -53 119 76 -178 -30 -66 -5 10 107
3253A07j98J03j14K34K5nj31n6L9q5P1j5R8k69L87j67l7L6N9j74M1P8J9l3m6m9
$$ 107 -91 12 -102 132 157 152 21 -35 4 -81 -10 -25 73 -196 191 24 -13 23 82 -92 -51 27 46 13 -33 -82
3279h2P6O1Pk03R4J68j75J07r6r4P1O5r4j9J85j14J0n1k9P4J04j45N2K02pj59
$$ -82 -6 55 62 -141 -47 121 -54 53 -43 -137 -66 -1 -95 -114 71 -43 -33 -84 -113 -39 65 -80 -28 174 167 8
3305Hj4m1j6j24K79k32K80j0j67J13n8l8j18J80j68J59l0J28j67m9J55n7lJ52
$$ 8 -6 -47 -63 -187 92 -140 140 130 -37 76 18 -20 -138 42 -126 33 3 131 -36 -85 70 13 10 162
3329A62j67M0o3Pj44J73q4P5o6P5J6n8j05N5J05j25J01J4j10N9p4J35J35j33J33
$$ 162 -5 35 -28 -21 -165 8 -76 -1 -67 8 24 -34 -139 -84 21 -104 -3 11 -99 -40 -114 21 156 23 156
3354A56j29o1%J0NJ40l3j09m5J52j72N5P6p6K01j11k00J47p4qK39j35L6J2m4J1
$$ 156 27 -34 -34 -24 -19 121 88 -21 -66 86 -86 -31 45 -31 170 59 -141 6 -68 -76 163 28 64 76 32 43
3380D3m5L6j08l3K5J00L0J02r1j96J45qk4l0J3k7J63nj81J11J00j46p7K5J67k09
$$ 43 -2 34 -74 -107 -82 18 48 150 59 -137 8 0 -24 -54 -41 -68 95 90 -91 20 120 -26 -103 -78 89 -120
3406a20L2K58k64J96K3p9M6k51J51rlj72K15n9kmJ21M7j32O6m4P6j06M1k25K15
$$ -120 -88 170 -94 102 125 46 92 -159 -8 -17 -20 -192 23 -36 -38 -42 79 126 -6 60 16 92 -14 27 -198 17
3432A7J04jj55q0J46p4J11r8M0k7p1K51r7m6n1k5k5J3R4L0K8k9R5j40O3K5j71
$$ 17 121 120 -35 -115 31 -43 68 -30 10 -17 -88 163 66 20 -31 -56 -81 -68 26 56 84 55 150 10 73 98 -73
3459g3K1J60k9m9ol6j52K62L1j14pJ21n6p4J3l6q8J2J24j72P9J08m6M8l4j78J11
$$ -73 -52 108 79 30 24 -12 -164 98 129 15 8 129 73 -1 12 -24 -112 -100 24 -148 -69 39 -7 41 7 -171 -60
3486f0J32l3j39P1j58J07k7J6k0j4M1M2N7R0m5q1J20k3P6k34J3j4J64k7mm8M2
$$ -60 72 39 -100 -29 -187 -80 -107 -91 -111 -125 -84 -42 15 105 60 -21 99 76 152 -82 -69 -83 81 54 50 2 44
3513D4o8N2p3J32j71J48P7o3m3J13k84L4K20j21OJ5k9k10L08j88R3l6m7P4o5J50
$$ 44 -24 28 -45 87 -84 64 141 78 35 148 -136 -102 118 -3 3 18 -11 -221 87 -101 -8 -44 -91 -17 -82 68
3539F8Mk6l1R5pj38n1J33n8k5J37j38NJ67k40P8Q4Lj45J37K5j21J10p6R2n1L7
$$ 68 72 46 15 110 103 -35 -86 47 -11 -36 101 -37 -32 135 -105 -27 57 60 -85 52 77 -44 66 -10 82 31 68
3566F8J22j18j05P2p2J14q7o8J95Kk05Q4l5O0N7k28J41n7O5L3K5j77J87p0K0r5
$$ 68 190 72 -33 39 -33 81 -6 -74 121 123 -82 2 -33 27 84 -144 -3 -60 5 38 63 -114 73 3 23 -72
3592g2Q3q5R%k0M1J38P3k26P5K9k1lk13J41j3J59j16J26k17L67k38rk5k4J65M
$$ -72 11 -74 -65 -65 -85 -44 94 167 -59 16 45 24 21 -192 -51 -64 95 -21 105 -112 255 17 8 -17 -41 124 128
3619A28k30MP9o1Jo5J94j54J95j40j10K57k18K32j82M8M1L2k66K52J01j61J05
$$ 128 -102 -98 -19 -80 -79 -144 50 -104 91 -49 -159 98 -120 112 -70 -22 19 51 -215 37 138 -23 82
3642H2j77R9O6j27J15o1J10k37J7K6p5MJ19j1n5L3J6pR2j26L2L3m9kJ12l2N7k26
$$ 82 -95 4 70 -57 58 -3 107 -130 -113 -87 -162 -158 -39 -50 -105 -72 -56 -63 29 -97 -65 -32 -81 -83 29 -3 54 -172
3670a72J03Q0L3Nm6O5n9j4j60M4o6R9K57k97R5K8j10K40j35j84J05J03M7J4r3
$$ -172 -69 11 44 49 3 68 9 -5 -165 -121 -187 -88 169 -128 -33 -5 -115 125 -10 -194 -89 14 61 75 -18
3695a8o8J79j11j58L0N2J33o8R4m9K8j08r9K98k64K60jk43J18J33j32j3p5N4J77
$$ -18 -86 93 -18 -176 -146 -94 39 -29 65 16 44 -64 -163 135 -129 131 130 -113 5 138 6 -7 -82 -28 149
3720A49k00J45m8k2RQ6j02j79J02j24O4K4M0J09o8nO4j76J0J18j07K95k24L3j4
$$ 149 -51 94 46 24 33 119 17 -162 -60 -184 -120 -96 -56 53 -15 -20 44 -132 -122 -4 -111 184 -40 -7 -21
3745b1J23k28J61r4J37j70K3pl4Q8J69j22j10M4p8J94qj30J35j44J86k05m6K66
$$ -21 102 -126 35 -59 78 -92 -69 -76 -110 -22 147 25 -85 -41 -119 75 67 -63 72 -72 114 -91 -137 129
3769A29l03L25j60J3Q2r3j18P8N5R8j75J88j92J17m3j02J77j29P7l7ko8j34K04
$$ 129 -174 151 -9 4 86 -7 -125 -47 8 106 -69 119 -73 44 1 -101 76 -53 24 -13 -15 -83 -217 -13
3793a3K8l2m1N9o8J94j13M8n9j39K24K7j34L5j3j23J60m5J64m6r4J7j3j5J4O1
$$ -13 15 -17 -58 1 -67 127 14 62 3 -136 88 115 -19 16 3 -120 40 -5 159 113 19 36 23 8 22 83
3819H3p9p8O3Jk9J13L9j89J78k50P6j0J13N1k83O8M5K5J25n9J18k10Q8j12J13
$$ 83 4 -74 -11 -10 -39 74 113 -76 102 -148 -72 -82 31 82 -201 -133 -88 -63 62 3 121 -89 -1 -113 0
3844@Mk08J51R2o5Q2o7P4q3J00qm9P1r8k0K9J20o5O5k15J88m3j87J57On1L5P8
$$ 0 4 -204 -53 39 -26 56 -11 63 -20 80 72 23 94 -4 -24 5 125 60 125 -90 98 55 -132 25 31 -20 15 93
3872I3q8O0j44K3J7O8l6l2J49j28lj73K11l0P4l3l1K0Q4q1l4P3O9k20J52r3J94
$$ 93 5 65 -79 -56 -39 29 -7 -39 110 -18 -21 -194 17 -13 61 28 -3 17 101 20 -14 59 128 -92 60 -33 161
3899A61j12N9j9j32J60M3k04q5K88k33L1J04rL2nk7l5l7O1O4j02n0N6l0n4K10
$$ 161 49 108 89 -43 117 160 -44 -129 159 -74 -43 61 52 84 79 52 17 -20 41 105 3 -47 9 -21 -75 135
3925A35J0j19l1n4k6P9M7L7j82L6p1J23j37M7J96j70LM6J0K0J13O1M3k05Mq3k0
$$ 135 145 26 -5 -59 -85 -6 41 78 -104 -68 -139 -16 -153 -106 90 -80 -77 -31 -21 -1 112 173 216 11 15 -68 -88
3952h8l0P5J9K02r4j54J37n2k5l8P2r4P1R0j34J57j21j00J20n5K19j62l8m1R1
$$ -88 -118 -43 -24 178 84 -70 67 15 -10 -48 24 -70 1 91 -43 114 -7 -107 13 -42 177 15 -23 -64 27
3977B7n6p6J73k3q3k0q8J00J2J0P3j28K17r6P1j11o9m0J78l9j11J23k1j56J09
$$ 27 -29 -105 68 45 -38 -58 -146 -46 -34 -24 49 -79 138 42 113 2 -67 -107 71 32 -79 44 23 -133 -24
4002b4mJ69k1k52K91o0j61J38j13k3K8k2J20p9J3K9N0Q0j69P7N8p7j3pm5n0J93
$$ -24 -28 141 120 -132 159 99 -62 76 -37 -60 -32 -54 66 -13 0 29 79 159 -10 67 125 48 35 28 -17 -67 126
4029A26j74J81k53M0m6J95j15O1N1p2k3r0R5R7l40J08J99Q2j25q7%J91p1j75K61
$$ 126 -48 133 -120 -80 -126 69 -46 15 66 -6 -29 -119 -24 73 -267 -159 40 122 -3 -90 -90 101 30 -145 116
4054A16J5j66N2r0K2J40n8K7R9k30q1J37L2Nj21j8J49O2k10J23m1M1o3l5O0J4
$$ 116 131 -35 17 -73 -51 89 31 58 157 -73 -154 -17 15 20 -101 -119 30 92 -118 5 -36 5 -58 -93 -33 -19
4080a9j8j25K43r9N3M4j53J7J17K0n9l0o1O5j53J88r5N4j2J58q0J09m6k92J74
$$ -19 -37 -162 81 -18 35 79 -74 -57 60 80 21 -9 -70 -5 -158 30 -65 -11 -23 135 55 164 118 -174 0
4105@r6J07N0j95K52k96J39J30k70J57q9J14po5M4J5j20l3K07k3L4q8J25j25q2
$$ 0 -96 11 61 -134 118 -178 -39 91 -179 -22 -111 3 -4 -69 -25 -10 -130 -163 44 21 55 -33 92 -33 -115
4130a15P5J20j41M4J88j04R1j99J64Oq6O9k33R3K3P1m3j03L7P9N6k52K75J0j58
$$ -115 -40 80 -61 -17 171 67 158 -41 123 129 43 112 -121 -28 -5 66 23 -80 -43 36 92 -160 115 125 -33
4155c3J15o1J48k72K11j9mp4j48j8K19%R6j34j23J66j67K13j88Q2J51j30m9R4
$$ -33 82 21 169 -103 108 89 85 11 -137 -155 64 64 160 26 -97 69 -98 115 -73 9 160 30 -19 75
4179G5q0q1Q7Q3j10Qj29J40P0Nk9p4L8j31P1p5J91j72J24pJ0J31k89M3Q7P5r6
$$ 75 -5 -86 1 84 -26 -18 -147 -7 63 68 39 -35 3 -128 -57 -132 59 -113 11 4 14 145 -144 -101 -14 61 -35
4206c5j7N1K3n7K13k75L2L64l05p9J52p9M0q9L8L3m9j40K21M2j14%j46J09L10
$$ -35 -52 -1 22 -35 178 -97 -65 299 -6 -85 67 -12 28 -61 -23 10 -39 -179 42 84 -30 -30 -176 -67 243
4231B43l35nL9N6P9l8j8L1LO9j90K77j94K1R4l06L38p9q0L2j6o8P4N2j02O2K6
$$ 243 -92 -97 -58 -2 77 39 21 52 55 124 -66 211 17 38 132 -174 164 85 5 37 21 -47 27 79 -23 39 65
4258F5j65J16m0j19J76M0n7J86j70qk1N2R2r8%q3M6ml8K2K6O7q4R6q1k38J39J79
$$ 65 -100 16 -24 -143 33 73 16 202 32 24 3 55 147 49 49 -34 12 8 -30 -8 18 85 1 97 16 -222 -83 96
4286I6j08J2Q8j14L5J3J00r5j16P1K0J29l4k5J9j45J20p8LN2l7Q5q0J34m1NJ33
$$ 96 -12 0 88 -26 9 22 122 27 -89 -18 2 131 97 72 91 -54 66 -12 -9 43 6 91 11 145 104 109 242
4313B42k36M2n8J96m9j79on4J72n2j2l7j22K28j0k8K9n8J01j27L4n4j9k4J99j31
$$ 242 6 48 -10 186 137 -42 -48 -102 70 18 6 -31 -153 75 65 37 66 8 109 -18 16 -38 -57 -81 118 -13
4339a3j41J0P9K6R3O1O9k19P9k4Rn8J36j28j04K59k19L8J01o3J31j23j44J62J9
$$ -13 -154 -144 -65 -39 54 115 184 -35 44 20 29 -29 107 -21 -125 134 -85 -47 54 -9 122 -1 -145 17 36
4364C6j26K35j81J21k3k4O6n8o5O8Q6k17J30J2n6j30K4L8ll2J64m4j6J06j25J05
$$ 36 -90 145 -36 85 62 38 104 46 -19 49 135 -82 48 60 4 -126 -102 -64 -67 -99 65 21 5 111 -14 91
4390I1j4m8j70J98o0K3K6q4j84K76rQ5K0o0j3O9k25J75nk3J4j34J22q8Km4K7J20
$$ 91 77 29 -141 57 -3 20 46 -38 -222 54 45 130 150 90 77 146 -79 96 91 68 82 -52 70 -18 -16 -60 -33 87
4418H7k5q8Q0r1L6Q4j17N6k03N7J52m3K4j28O9j17K11m5R7q8o5l0R0J10r0J17
$$ 87 62 -26 54 -37 -1 83 -34 22 -181 -124 28 -15 9 -119 -50 -167 44 -1 96 8 -57 -87 3 113 23 140
4444A40o8K4J4k9p3p3J99k19J71o8o5J72j62K8K0l4m9k2l3O3J13j11RR4l4j17
$$ 140 72 96 110 81 8 -65 134 -85 86 18 -47 125 -37 -9 11 -23 -72 -94 -127 -64 49 -62 -53 41 7 -110
4470a10N6m9O7j14J52O5pLj31P4p4J09O9q5l2j4K01j44j16R4k5Km9J57j03j31
$$ -110 -54 -103 -36 -150 2 67 60 63 -68 6 -68 41 110 25 -7 -21 180 36 -80 14 -11 -9 -58 99 -4 -135
4496a35P5K36k12P3M8l4L0j33m0O2R8q6R6m8p1O3n0LO5p7L7p6n2M0R0M9j05L5
$$ -135 -60 176 -36 37 85 51 81 -52 -92 -30 68 -18 78 30 -41 22 -28 -25 40 -37 0 -76 -128 -88 2 51 -54 -19
4524a9M5N3j37Q6o9K0JJ9K1Jj07J81k6r9J08l4Q9j81J04om6m1R9k36J60N6p2L
$$ -19 26 79 -58 28 -41 -21 -20 -1 20 21 -86 95 69 -30 78 44 133 -48 56 50 4 -37 62 -174 -14 42 -30 -27
4552b7l0J64K4j70K6N4j5qP7k0o1p7J28O9j57J26j13K22k32J21M9k68J36q2j22
$$ -27 -57 107 131 -39 -13 41 26 18 95 75 14 -63 65 134 -23 103 -10 212 -20 101 150 -118 18 -64 -186
4577a86J29M4o8M9l5o3m6L8L9R8J02k79J92no4N9O1n2N6M5j20R9j27K7N3J66k75
$$ -186 -57 -13 -81 -32 -67 -130 -176 -138 -99 -1 101 -178 14 9 -55 4 65 13 69 114 -6 93 -34 -7 46 212 -63
4604f3J33j12K3K4j67J14J5P4j39J30j59K46o8O4r2j03J86n3O7r3o0k0LJ21Nj31
$$ -63 70 -42 -19 5 -162 -48 -33 41 -98 32 -127 119 51 115 23 -80 106 53 120 27 -33 -53 -50 71 76 -55
4630e5J07m0mn0K35j61m4J9P5j27l0J18J44j66o1k6J82%k3j36J5j00J24rl8k6
$$ -55 52 12 8 -42 193 32 -12 7 82 -45 -75 43 187 21 -40 -66 116 116 93 -43 -28 -128 -4 -13 -51 -77
4656g7m9L2k8N1L5oJ30m9Nj14J52j02m6J06J0l24L64j06L9j29R4K9j26L3rJ02
$$ -77 -126 -94 -122 -71 -36 -42 88 39 44 -70 82 -20 -66 40 50 -274 90 -16 23 -106 -12 17 -109 -76 -85 17
4682A7j8q5J16j18J37k5M4m0j59J00q3R5k7j00K4J4K14j7j46J83p7j59J94k15
$$ 17 -1 -86 30 -88 49 24 68 28 -131 -31 -114 -19 -46 -146 -122 -108 106 89 -57 126 49 -110 84 -131
4706a31J14m2J09k0K5M0j38K5oJ33j07lq4n5J6J81l9q1K1k4J03J19k52nM9K42
$$ -131 -17 -59 50 30 55 95 -43 -18 -24 109 2 -1 -85 -140 -124 57 18 -63 -42 -66 37 156 -96 -101 -52 190
4732A90k78K54k03q5N3Q0m3j4J90j37m5J19n9r3l6J55j53J08J11n9L9j02r7K03
$$ 190 -88 166 -37 -122 -69 11 -32 -46 144 7 -38 81 22 -71 -107 48 -105 3 114 55 94 -8 -105 98
4756I8j16J2K6j8j38J42p2OM7L8q3%l5J47J04k59K59j11j46R6K8jO3k18J09q0
$$ 98 -18 -6 20 2 -136 6 -66 -60 -13 25 -58 -58 -93 54 158 -101 158 47 -99 -3 25 24 87 -131 -22 -102
4782a02J03o6K4R0q7K8O5J2k48K34L1j25n8J82j67J06J0LJ31p4J41j45j25J47
$$ -102 1 -65 -41 49 -38 -10 55 67 -181 53 84 -41 -99 83 -84 22 32 35 166 92 233 88 -37 110
4806A10o5pp5P0M5n9J06j08m9J16k19K05k24%J79q9R3p6Q2qj50J06J1J6J03j12
$$ 110 45 38 -37 33 78 19 125 17 -32 84 -135 70 -154 -154 25 -64 29 -47 35 27 -123 -17 -6 10 113 1
4832Ak0K3j6Lq1O6J47j98M3M2o0J42L3j25j64J17m3P4N5q3P8j20N8J13K1j40K47
$$ 1 -19 4 -12 -9 -90 -24 123 -75 -32 10 -50 92 125 0 -164 -47 -90 -16 39 -44 34 -86 -28 85 106 -34 213
4859B13j13j29O5n6O4j79J7J18L4J6j14m3l2J15K5j74J30J9L4N8J02j95P8k0o2
$$ 213 100 -29 36 -20 44 -135 -118 0 34 50 -64 -107 -139 -24 1 -173 -43 -24 10 68 170 -25 53 33 -29
4884b9J50k31J69l12L67k30J23R6q7J33j49j11N1J53l8o1j1oQ8n0J2O4k8N6j08
$$ -29 121 -110 59 -253 114 -116 7 103 16 149 0 -111 -60 93 55 -6 -17 -23 65 15 27 91 63 119 11
4909A1l30K55J03O2o8N2o6q7J15j59J15o0J3O1r3j0qJ22j76J06m7J29J07k61N1
$$ 11 -319 -64 39 101 33 85 19 -68 47 -112 3 -57 -44 17 -76 -86 -94 28 -148 -42 -89 40 147 -114 -63
4934f3M7J82k30p6J48J04j76PJ81j99K24j75l9J89j4M6m5m4m1j8j3m5L1P5q8R
$$ -63 -16 166 -64 -140 8 112 -64 -57 124 -75 149 -26 -65 124 110 156 111 67 26 8 -5 -50 -19 56 -32 -23
4960b3j32J97L7l7k9j8P3L9j61l6J38j18R6j04K33j27j1q6O4m0J63k00J14O9J7
$$ -23 -155 42 79 42 13 -5 68 107 -54 -90 48 -70 26 -78 155 28 17 -69 -5 -45 118 -82 32 101 118
4985A18k08K1p2L10k92J56Q0j06J94o9n7j84O2r6J99q6j3K64k39q9J75K9j97K34
$$ 118 -90 -69 -141 169 -123 33 113 7 201 132 75 -109 -47 -143 56 -30 -43 221 -18 -107 68 97 -100 134
5009A34o3r4l2K9o0R6n8O2l1j56K79m8l6K2R1k11J52l6q7j74L20p9P7j20l4N9
$$ 134 71 -23 -55 -26 -86 10 -48 14 -17 -173 106 58 22 44 135 -76 76 40 -47 -221 99 20 97 -23 -57 2
5035BJ8l4o7J30k2r1J77j99J22J4K7k95K86p9L5N1%k6K7O2p9p2l3K6m2J70q5r7
$$ 2 20 -14 -81 49 27 -64 113 -86 36 50 77 -218 68 -11 24 75 75 49 76 138 59 -13 -46 -20 -62 108 23 -74
5063g4K1J33j61L9O3k9r4PP8J01j53P0P0j12l9J5N3J14l5o8R3K9j24j31P7Kk2
$$ -74 -53 80 -81 -42 21 -8 -102 -95 -17 84 -69 1 71 -41 -80 -65 -12 102 67 -1 92 121 -3 -134 -57 -55 -77
5090g7J87k8r0m6K7n4P2J43j67j03R5K3J29r9j42J86J7l3j36J77m9N8j61J15p2
$$ -77 110 82 -8 -54 -27 -81 -9 134 -33 -136 -41 -18 111 12 -130 56 73 40 -96 81 32 90 -71 44 -28
5115b8J02j03j92K5J22pl8J32l6k1j2j48K46j79J81j3j05J00m2M5q8P5%j4j0J59
$$ -28 74 -29 -221 -196 -74 -81 -119 13 -23 -44 -56 -204 42 -137 44 31 -74 26 -16 29 -59 16 16 2 -8 151
5141A51p2N6o7jj84J91njo9O0r7lO7J42o3j12j11Q6j21O0R2j89K11n3q5Q4P9L4
$$ 151 79 135 68 67 -117 74 69 68 -1 59 -38 -41 26 168 105 -7 -118 -32 -153 -93 -1 -190 21 -32 -117 -33 46 80
5169H0j99J30M0j54J95j81J03k7K6jQRk07K03P2m9K2k8k6o7L5N0J8m3j10J64J1
$$ 80 -119 11 51 -103 92 -89 14 -13 13 12 20 29 -178 25 97 48 70 42 16 -51 -16 34 52 9 -101 63 74
5196G4K5k67J35J23j11J8q0J46j41p2J80j6j1J7k7P1k18J78M3j68P3m5P8o4o7
$$ 74 99 -168 -33 90 -21 -3 -83 63 -78 -150 30 14 3 20 -7 64 -154 24 67 -101 -28 -73 5 -59 -126
5221a26K16j46O5j4J55Qj15k7j36K88r6j00n7qK47j48J13j26J57j97J17r2J13
$$ -126 90 -56 9 -5 150 158 43 16 -120 168 72 -28 -85 -93 154 6 119 -7 150 -47 70 -22 91
5244I1j3L5j08R1j21L2R8L8k54J87M5j59p4N0j3R6R5r8q6K9J80p3K6k08m7J23
$$ 91 78 113 5 96 -25 7 105 143 -111 76 121 -38 -112 -62 -75 21 116 18 -68 -39 141 68 94 -114 -161 -38
5270c8Q5j76J55j90J43J8J19l1q9Q6m1l1M8OJ0J18j89R9j58M8rN4J29j82J6k5
$$ -38 47 -129 26 -164 -21 -3 116 85 -4 82 41 10 58 64 74 192 3 102 -56 -8 -17 37 166 -16 0 -25
5296b5j10P3N2J4P5q2n1j0J20q4Q5r1Q5j95K7M8J23R4j71j76K57k4o6K8J39q2
$$ -25 -135 -62 -10 4 79 -3 -54 -64 56 -28 57 -34 51 -144 -117 -69 54 148 -23 -199 58 34 -32 -4 135 53
5322E3k25K22l6O1j37O8j20O3R6l8k6n1N0K8J0N3j63op6J70jPO1l9M8L4j9j32
$$ 53 -172 50 14 75 -62 6 -114 -51 45 7 -19 -70 -20 8 18 71 -92 -98 -174 -4 -5 2 63 24 72 106 87 -45
5350d5L7Q8Lj18K8jL6L6j00J46k23P9J19J2j10L9k9J9p0P3n8L8o8J9J53r5PRj59
$$ -45 -8 80 83 -35 -7 -8 28 64 -36 110 -113 -34 85 97 -13 26 -3 16 -54 19 -39 -1 -69 -50 103 8 15 24 -135
5379a35K12j18m0J19l9J09j60P9q9J19j66M3N8K14j22MR2j70p4O2R0P8j87K1J13
$$ -135 77 -41 -81 38 -1 108 -52 27 -62 57 -109 -66 -8 206 84 88 180 10 -64 -2 88 166 -21 0 113
5404A13j05O8pL9o3J18l14K06P6k72L7J29j3j7J6J29k02qn1J46j10J31%j95N5
$$ 113 8 76 69 108 45 163 -151 55 131 -141 -104 25 12 -5 11 140 -62 -70 -121 25 -85 46 46 -149 -94
5429i4l5K13j05J04o8J07N3l09N9O0o6M4m7R4N3o6j43L0L28j82j00K72k32p2K52
$$ -94 -129 84 -21 83 15 122 175 -134 -75 -15 -81 -37 -84 10 63 -3 -146 -116 212 30 -70 202 -30 -102 150
5454A50l00J16J70j80N2j29J99j79R1m2MM0J31K0r0j4q9lJ7j31K13p3L3J12m3
$$ 150 -150 -34 136 -44 8 -121 78 -101 -10 -52 -48 -8 123 143 53 39 -50 -53 -36 -167 46 -27 6 118 75
5479G5j26K35j70j8m0O7j22K30j73k7p4J52K5QM0j58J01j43Q7L6k8o5r7K8J0K4
$$ 75 -51 184 14 -4 -44 23 -99 131 -42 -69 -143 9 34 42 82 -76 25 -118 -31 5 -23 -88 -185 -157 -147 -123
5505a23N1Q2m0J04K6j66K6K5jq7J19r6J41j36J8J8n2K37j53kLJ08j36J65n0N6
$$ -123 -72 10 -30 74 100 -66 -40 -15 -16 -103 16 -80 61 -75 -57 -39 -91 146 -7 -9 -6 102 -34 131 81 137
5531A37j56L7N4j21K4L1P3j13Q1m7K6o6N9Oo2Q7p7Q4o2K9K0om5J25q7L5j16j7
$$ 137 -19 18 72 -49 -25 6 79 -34 47 0 26 -40 19 25 -37 50 -27 57 -5 24 44 38 -7 118 31 66 -50 -67
5559f7n3O4J89j81OK3J8N8j38L3O1j20K15j96J50o1j09O8M8MN5m9k8K28o8oj15
$$ -67 -120 -56 133 -48 -42 -19 -1 57 -81 -48 13 -107 108 -88 62 1 -108 -40 8 12 67 18 -10 218 150 144 29
5586B9J3N1p5j35J54KL9O7r1J4k45K82l51J76M5j70J31J23n9l3K0m0J14l1j40
$$ 29 42 93 18 -117 37 39 78 145 54 68 -177 105 -246 -70 -25 -195 -64 59 0 -33 -13 -53 61 30 -110
5611a10J37jR4j95R8M1j85J19R5Pj31K18l77J95m6L7r9O0J25m0p2j0J09k5p2J84
$$ -110 27 26 120 -75 23 64 -121 -2 93 100 -31 187 -190 5 -41 -4 -103 -43 82 42 -30 -40 69 44 -28 156
5637A56q3j16K5j5L4RJ07j62J48j55J29m9j9Q7j1k47J07J22p5L8p1K01j94n5r
$$ 156 73 -43 -18 -33 1 10 117 -45 103 -52 77 28 9 96 85 -162 -55 67 -8 30 -41 160 -34 -89 -98
5662i8P6j39n5K43k3Q3J00j78P3j51j6J16r7N4M1p2Nk4N2n2j30K36j16J16l6J89
$$ -98 -22 -161 -216 27 4 87 187 9 82 -69 -85 31 -66 -12 29 -43 -38 -62 -10 -62 -192 44 -72 44 8 197
5688A97j69J44k01M1m1Q3J1k7k7L0k8l6L7M4M6k73J58o5P0l1o2K7J53j02m4j30
$$ 197 28 172 -29 12 -29 54 65 38 11 41 13 -23 14 58 104 -169 -11 -76 -6 -37 -99 -72 81 -21 -65 -195
5714a95L63k17J50Nj0j01o3J14n8J30j60N8l3J46o2j12J71j81mr1K52J27l00P7
$$ -195 168 -49 101 106 96 -5 -68 46 -12 118 -42 16 -17 129 67 -45 126 -55 -59 -150 102 229 -71 6
5738FO3K6k02O3J08j16L4K07q4j46P8j22QJ81k54P0K03j29o1n9J63j96R4mL4q
$$ 6 69 95 -107 -44 64 -52 -18 189 105 -41 37 -85 -77 104 -150 -80 123 -6 -67 -126 37 -159 -65 -69 -35 -43
5764d3KJ9M9Q9j83J31j44P0j98K32n6j28J02nJ9J01n6k5O2m0l8J5mL7K2m9n6R3
$$ -43 -41 -22 27 116 -67 64 -80 -10 -208 24 -32 -160 -58 -63 -44 57 1 -24 38 -2 -40 -25 -29 8 30 -19 -75 18
5792A8M7r7j2nO2mN9L6M6k30J54o5k9L5p8P2P5p2Rk57M6J70j16J25Q8no3j10J15
$$ 18 65 -32 -44 -49 13 9 68 104 150 -80 74 9 -20 15 -63 9 84 12 21 -236 -190 -20 -136 -11 77 72 9 -101 14
5821A4r0J73o1J77j25m3L4j44K16q7j95J46j0j17P6O0K6k9j36q3R7J23k0R0j18
$$ 14 -76 97 36 213 88 45 79 -65 151 64 -131 15 5 -112 -36 24 50 21 -115 -198 -101 22 2 92 -26
5846b6l6k6J29Nq1L1R2j39M2l1k8Mk8QO8j5p0K72k19j0R2n7Q5pn8L2J14k06N7
$$ -26 -62 -88 41 46 -35 -4 88 -51 -9 -40 -68 -64 -92 -84 -16 -31 -101 171 -48 -58 34 -23 62 55 -3 29 143 -63 -6
5875fJ48o0j01R2j63K18j52M1l6MK9o3J47j63R2m8J56k91K82k29J36j05J56L3
$$ -6 142 82 -19 73 -90 128 -24 17 -19 -15 14 -49 98 -65 27 -21 135 -156 126 -103 33 -72 84 117
5899A17Pr3j31J85j02J1j05J03o1K75q0j33P6r8J56qk25K25j46J9m9N7M2q5j08
$$ 117 124 31 -100 85 -17 -6 -111 -8 -69 206 126 -7 69 -29 127 119 -106 119 -27 -8 -57 0 42 -43 -151
5924a51J89k00J17l8J60j46O6m9oQ6n4k4J57q1o4LJ91j81r9M06j94j1o1r1r3K31
$$ -151 38 -162 -45 -83 77 -69 -3 -52 -58 28 -26 -50 107 26 -38 -35 156 -25 -124 282 88 77 16 -75 -168 63
5950F3o0k7l6J30j4j31O6r3j28L7LK79j73R7J56m1j69J1Q5p4O6nm2J03j34J74
$$ 63 3 -24 -60 70 56 -75 -9 -102 -230 -193 -190 89 -84 13 169 128 -41 -30 55 -19 47 42 0 103 -31 143
5976A43p5j05J55k42J04J10k5p5L8J4P2k15J82n9r5O3O8l4kp6J24k7k6M7k3O0
$$ 143 68 -37 118 -124 -20 90 65 -10 28 42 114 -101 81 22 -73 -10 58 24 22 -54 70 43 17 64 41 101
6002A01K6j39O4j95M3R6j20J68Oj37K94j46Q4j69M3Q1j35R1j09m7J35k28L04j80
$$ 101 127 -12 52 -143 -100 -4 -124 44 50 -87 207 61 145 -24 19 100 -35 56 -53 -100 35 -193 111 -69
6026f9K4q3J03N8Q5o2j26J16q5l3J32j04J95k34J28n7j08R6K1O6q1R5N2j64J59
$$ -69 -45 -128 -25 33 118 56 -70 46 -39 -72 60 -44 151 -83 45 -12 -120 -24 -3 63 -18 77 129 -35 124
6051A24j57p8K03rj12K9j05J01No8P6lL2j03M5j08o6J99n4j4J58j61J46k37J1
$$ 124 -33 -111 92 83 -29 0 -105 -4 1 -67 9 6 38 -65 -20 -128 -194 5 -49 -63 95 -66 80 -157 -146
6076a46L25l24K16o8N4M2qj21RQ6q9P0p7J89k51J25n5J10j45M2Mo1QJ59j60q9
$$ -146 179 -145 71 3 57 99 91 -30 -21 65 -24 46 -31 158 -93 32 -23 87 -58 -16 -12 -73 -65 94 -66 -155
6102a55L9L4N1j53J58Nk0L3Nj66J29M5j04J0J80p8p9K40j12j64J59j68J51n1J04
$$ -155 -116 -82 -31 -184 -26 -21 -41 -8 -3 -169 -40 5 -99 -89 91 13 -66 174 62 -102 57 -111 40 -11 93
6127I3j9q5K4j9Oj00R7Q9K7j03l0P5O1q3J44p2j27J14n6R6m6r5K87l12L4l9m7
$$ 93 74 -11 13 -6 0 -100 -3 86 113 10 -20 55 116 33 177 105 -22 92 36 132 86 -9 278 -34 0 -39 -86
6154h6M6K5Q9j67J2J98j20l7P9j36JJ79l0J2r7J31r7O0j76K08k8j29kL1K9J87
$$ -86 -40 -15 74 -93 -81 117 -3 -40 39 -97 -96 83 53 65 -32 99 2 62 -114 94 66 -63 -65 -34 -5 182
6180A82p6j17J74J2j74nq3N5Q6q3r0k7J91k7jq5k9J9L8J00k7m1J42j78J06m9q4
$$ 182 106 -11 163 175 1 -4 -87 -32 54 -29 -119 -146 45 18 17 -68 -97 -78 -40 60 33 -8 134 -44 62 13 -71
6207g1pk0N6R0r1J15J37j05j06n5J34j25NJ59j33p1o1P5N2J1J1N3r7L1n6R4J05
$$ -71 -78 -98 -42 48 -43 72 209 104 -2 -57 77 -48 -43 116 -17 -88 -149 -74 -22 -11 0 53 -44 -13 -69 25 130
6234A30j20O8q0N8M2j67J55q4j58PMJ68n2k3J08L8J16k28P7K1j70J23j65lJ98
$$ 130 10 78 -2 56 98 -69 86 2 -156 -149 -145 23 -29 -52 56 94 210 -18 59 80 -90 33 -132 -135 63
6259F3q4J18q5K7Qn3M1ON9j03J22j34M2P6r8Q6j57J10P1r0R1k25L4K01j43J32
$$ 63 -21 97 12 39 47 -6 35 41 100 -3 119 -15 27 103 5 91 -66 44 115 25 116 -109 -75 126 -17 115
6285A15j37QJ28j73J4J22n5P4r1O0o0mO1j32R1k21K70j42RJ67j20j26J93k23J26
$$ 115 -22 -14 114 -59 -45 77 22 96 5 65 5 1 62 -70 21 -200 70 -72 -63 104 -16 -142 51 -172 -46
6310d6N4J14k55J38R0Nk0J7l8r2LM2n9N2K1j22P7O2O1O1q1M5q7M9j19Q0o1L6j01
$$ -46 8 122 -133 5 95 100 80 97 59 -33 -30 12 -47 5 26 -96 -19 43 104 165 84 129 42 91 -28 52 -9 27 -74
6339g4L4K9P9N1j42J38j15K06l44J76J0n9L9p2R4l1j30K25j3l36K10r0j4K21j22
$$ -74 -40 -11 68 119 -23 115 0 206 -138 38 48 -11 28 -44 50 19 -111 114 101 -235 -25 -115 -129 92 -30
6364c0O8L6j82J44j25J56j08J1J8PO9l7N2k3j9n7K9Q1r1Q3j33J5J01m9jj14j5
$$ -30 38 74 -108 36 -89 67 -41 -30 -12 -5 64 27 79 56 37 -20 9 90 -1 82 -51 -36 65 16 15 -99 -114
6391a14Q4N5j25oJ06p5R0J3j62J96n5k6O2j17K56j66l6KJ57j04M5k7O9j69R3n4
$$ -114 -30 25 -100 -106 0 -75 15 28 -134 62 7 -19 43 -74 182 16 -20 -18 139 35 80 53 122 -47 46 -8
6417hN3jj85J28j26J22r0J75M3j21M6n5k7l9J78j08J10J8j67N0k7M4j36J84j28
$$ -8 45 44 -141 -13 -139 -17 -107 68 111 -10 36 -19 -46 -85 93 -15 95 113 -54 -4 -31 13 -123 61 -67
6442f7J13j96J46L1p9k0J10K0k4L8n1j3K4q9J77j8o5K9k8j2n3K4R0O8k37n8J79
$$ -67 46 -150 -4 27 -52 -72 38 58 34 72 21 8 32 -57 120 102 37 66 38 26 -27 -3 87 155 -82 -140 39
6469C9l3j39J41P0O3o5j10J35J19j99r7J31r8p9J78K9r6L4J15m2m4M1p5J2L0o4
$$ 39 6 -133 8 78 141 76 -34 101 220 21 -76 55 -43 -122 56 85 -11 23 138 96 52 93 18 30 60 -4
6495dQ4R5j11p9p8K65k80J22p5N0o0j1L9R0p3KOk0o2J30K0J9m5j28O1rR9k16J22
$$ -4 80 175 64 -15 -93 172 -108 14 -61 -11 -71 -82 -43 47 -26 -24 -18 -38 -100 30 50 69 24 -104 -43 -52 47 -169 -47
6524d7J47q7N2j09J59m2m0j16M9O7o8J10J6m4O4k02M4j14J55R2j25N2j18J94k1
$$ -47 100 13 65 -44 115 73 33 -83 -34 33 -35 75 91 47 111 -91 -47 -161 -6 86 -39 13 -105 89 68
6549F8l31L06o3LO0m9j23J56O7O2l02P3R4k02K54j79K13o7J3R8k80K19n1pPJ08
$$ 68 -263 43 -20 -17 43 -6 -129 27 94 156 -146 -73 21 -181 73 -106 107 40 53 151 -129 90 39 32 39 147
6575A47j55M7Rj38K16j03P3p0K8j03M2r3N3K72j63n6N0n5J41j12nM5kJ8k16J94
$$ 147 -8 39 48 -90 126 23 96 26 54 -49 -7 -100 -47 225 62 6 56 1 142 30 25 70 68 86 -130 64
6601F4j46J15o7O3k13K28k3O2k08M5J05k0lO7J6m2l7J3%r3k1L04l35J30j09K00
$$ 64 -82 33 -34 29 -184 44 21 83 -125 -80 25 5 2 69 85 43 6 19 19 -74 -95 209 -126 4 -105 95
6627I5K5Nj10N6J5j27MK6K2N2j86j09J14K2M3K30p2k56K87n4o0j87R1J27r0J07
$$ 95 120 125 15 71 86 -41 -37 -11 11 63 -123 -232 -118 -96 -53 177 105 -151 136 82 22 -165 -74 53 -37 70
6653G0j09P1l2R3m0O3k63J13R4j86J60o6k8M1MJ71j70j05K05l9j76J61q3J49K
$$ 70 -39 32 0 93 53 116 -147 -34 60 -126 34 -32 -60 -19 -15 156 -14 -119 86 47 -129 32 -51 98 100
6678A00j01j3j14P8K54k05r3J87k69K77k16N0O0K1K1r2kj09K82q5j73J06P1r0
$$ 100 -1 -14 -128 -50 204 -1 -94 93 -176 101 -115 -65 -5 16 37 -55 -57 -166 116 31 -142 -36 35 -55
6702e5O4K4k3j65K10R6k81J83M1j42N7m1j12P1k6k6K78j79J36n2Q8j10l9J15k28
$$ -55 9 33 10 -155 55 151 -130 53 94 -48 9 -32 -144 -73 -99 -125 153 -26 110 58 146 36 -3 112 -116
6727a16J28P3l4l2l8j8J22K4j93j0J95j29K0M9J07k33N4m7pj46K68K0q2J29k94
$$ -116 12 85 51 19 -19 -37 85 109 -84 -94 101 -28 -8 41 148 -85 -31 -78 -85 -231 37 57 -25 104 -190
6752a90L12j2j05%k1J0j02J86k3j02P9j5l2L3q5O4K3j0J08n6j17O1J71k7q6r1
$$ -190 122 110 5 5 -16 -6 -108 78 55 -47 32 17 -15 18 -67 -3 20 10 118 62 -55 6 177 150 64 -27
6778b7M0K2M5q2j86K72k04J33O8j29l7J34n6n8K2M0j37K10q0NJ6M2j08R5J5N2
$$ -27 13 35 80 -2 -188 84 -120 13 81 -48 -85 49 -7 -65 -43 -3 -140 70 -10 -5 11 53 -55 40 55 107
6804A07k46J30j0J3N0k6O6j57K97j61l8K4j0r1J03r6N6k7L19k66K3o0L9K7o3O0
$$ 107 -139 -9 -19 -6 44 18 84 -73 224 63 25 49 39 -52 51 -45 11 -16 303 37 60 0 39 66 3 63
6830F3j7l7Pr0m5J59j19K97l07N4L0J08r6j9o6J1P2%J4r6J0N8l9J91j14j30J44
$$ 63 46 9 16 -74 -119 40 -79 218 -89 -35 -5 103 7 -12 -78 -67 5 5 19 -77 -67 -9 -48 143 29 -101 43
6857D3m4R7L4k49K46r7J24R4k92o8J09J12j93J55n2q2M4K1J28j93J09o0J18l00
$$ 43 -1 96 130 -119 127 30 154 248 -44 -112 -3 109 -84 71 19 -63 -19 2 130 -63 46 -14 104 -196
6881a96K26j21K44p8r0Q7j77M5p2K08r5M9r9J93k17j5pJ54r8k9o5K01m9r6M4j2
$$ -196 30 -91 153 75 -15 72 -105 -60 -132 76 -19 30 -69 124 -93 -108 -115 39 -59 -88 -153 48 -1 -97 -53 -65
6907f5J1Q2M3K6o1k06K44j38J90q4Ol9Q6j25O9K6q8P7q3J31j83l1J29j09L4m4
$$ -65 -54 28 71 97 36 -170 74 -64 126 42 48 9 95 -30 39 65 -23 54 -29 102 -81 -112 17 -92 -58 -102
6933a02J69k26r5L00P6k39R7j66J58q8j35J96N0k4m5L2J3%j25K13p0P0j66J55
$$ -102 67 -159 -254 46 122 -117 -20 -186 -28 -116 -251 -55 -5 -29 -74 -42 -29 -29 -154 59 -11 59 -107 48
6957D8M5m5o7q7J06j36K29n1q2P6j64R8kj22L8J06P4k21J25P0k8J56j28j08J13
$$ 48 93 48 -19 -106 0 -136 93 42 -40 36 -128 -30 -32 -154 -116 -10 64 -157 -32 38 10 166 38 -70 43
6982D3j40L5n4J21R2r2k5l4j43J26O5O9j03k0J07J97k61p5r7J57n7L8j7L3K2N7
$$ 43 -97 -62 -116 5 97 5 -20 -54 -197 -71 -6 63 -40 -60 47 244 -17 -92 -189 -32 -89 -51 -68 -35 -13 44
7008D4M9j57J12J3k6j80K74j18M8j80J08O6Rj69J68l9J00lj53J51k14M0NQ7j50
$$ 44 93 -64 48 61 35 -145 129 11 59 -121 -13 53 62 -107 61 22 122 119 -34 117 -97 -57 -52 35 -115
7033a15N1j19K56j39L9K4J09j78m0P3J23j47N8m5j38J95K1j77J51M5L0k30K33
$$ -115 -64 -183 73 -66 -27 -3 106 -72 -112 -39 84 -63 -5 -50 -188 7 28 -149 2 47 77 -153 80
7056H0L0o0j09O8jj11K9J06l5J0L6j17R9j81K86j19O4j08J91k5j07k6L1j61P7
$$ 80 110 50 -59 9 8 -103 -74 32 -3 7 43 -74 25 -156 130 11 75 -33 158 133 26 0 31 -130 -53
7081e3Q6j9O9J60k02r8J36j65mJ73r1p2J08N0k26M6J18j09N8oL9J71k67K13k10
$$ -53 33 14 83 243 41 -57 79 -86 -90 83 -8 -80 28 78 -148 -102 16 -93 -35 -41 -2 169 -98 115 -95
7106i5J49j37P8R9k21J33%qJ10m2j81K03J40l29O7J32K6q2m1p0N5L6j3J13l6J62
$$ -95 54 -83 -5 94 -127 6 6 -2 108 66 -115 88 228 -101 -34 98 124 42 1 -69 -14 22 9 122 86 248
7132B48k60j6K3j05J43Kk1o9M9K3k3l6K61l37J71l2N9j58j61L25j1k00J66j68
$$ 248 -12 -28 -5 -110 33 35 14 -55 -6 17 -6 -42 219 -118 53 21 80 -78 -239 86 75 -125 41 -127
7156a27O2J00j0L3qJ41j17N6q4J02j36J07j38J45p3o4J55j28q1k8J03J66j63l
$$ -127 -65 35 25 58 50 191 74 130 46 148 12 119 -19 126 53 -11 144 16 -65 -93 10 176 13 10
7180A0j4k2J49l8j26N2J9J3o5J76o8L0m4j03J73l46P6J89q7R9j40J59rl6K41k18
$$ 10 -4 -26 123 85 -41 11 30 43 -22 154 86 116 72 -31 142 -204 -128 61 -26 73 -67 92 83 47 288 70
7206G0j23P0K2n1O4l4o3R7j38J35K9r6j7J07r4O6M9j42R2%l1J09n0j14J89k78
$$ 70 -53 17 39 -12 52 18 -45 52 -86 49 78 -18 -35 72 -22 44 93 -49 43 43 12 121 71 -43 146 -132
7232a32J81N9j16K2n9M1K5m9M0P6j61n5J57O2j86R7N3n4o1K8J08L7p8J60r6j3
$$ -132 49 108 -8 14 -45 -4 21 -28 12 88 -73 -128 29 91 -95 2 55 1 -60 -32 76 113 35 195 99 86
7258H6l1n9n8N5P6m0N5j02r2L23j85l2P9q3j7Q8p7m2l9mQ1N2l5q3q9Q6Q1K5K4
$$ 86 55 -4 -62 -7 69 29 84 -18 -110 213 28 -4 75 -8 -25 63 -14 -56 -95 -99 -18 34 -1 -84 -173 -87 -6 19 43
7287D3k66R4J13J07j14J3p2P9Q5j04O7Q2k02N7p4J01p7j2K47k80J80n0j86J41
$$ 43 -223 -129 -16 91 -23 -10 -82 -3 82 -22 45 127 -75 -18 -92 9 -68 -80 167 -113 67 17 -169 -28
7311b8J34j65J22L7k46J84j2j3l2PN9Rk04K26o2N4j13n7K7J20J62k09K6q2O5O0
$$ -28 106 -59 63 100 -146 38 26 13 -19 -12 47 56 -148 78 16 70 -43 -100 -73 47 209 0 26 -56 9 69
7337F9l0j46oJ64M3j56J52o4o0Q4p4J7j03Q5J67j10k8J69k68J51L7j67K3J26o7
$$ 69 39 -107 -113 51 94 -62 90 26 -34 50 -24 -7 -110 -25 142 32 4 173 -95 56 93 -74 -51 75 8
7362Ho5N2K5n9J45l9Q5j07r2R8N0j60%R8O3J24k46J60k36K78j68PL9Lj92Q1Q8
$$ 8 -57 -5 20 -39 106 67 152 45 -47 51 101 -59 -59 39 102 226 -20 140 -96 182 14 21 60 63 -129 -48 40
7389D0q9RRr9k3J79j1n8N6n3R6m3j0m3J2kJ29N4l4r0j1Q3j09R4k8j02J4J24m8
$$ 40 -49 -40 -31 -130 -153 26 15 -43 13 -40 56 13 3 -40 -28 -30 99 153 119 29 18 101 -8 86 58 -44 -30 94 46
7418D6N0j17k3N2O5j09M1j71K04jL2o1O7j36J18k0J11L9k19j12R8m3Q7r0oM1M6
$$ 46 96 -21 -44 8 73 -36 5 -166 38 37 69 8 75 -61 57 37 148 187 -32 -144 -46 -89 -2 -92 -98 -57 -11
7445a1oj12R3R2K7n7M5J8q1j22K32j86J14J09L5p9j20K2k4j4J02O8j39J22j50
$$ -11 -17 -129 -36 56 83 26 71 89 8 -114 118 -68 46 155 190 111 -9 13 -11 -25 77 145 6 128 -22
7470b2j1p3J37m4q3q7J00P4j70K28P6Lk04n0K01j39j8Q4M9N5k29O5q3J01n2J37
$$ -22 -33 -106 31 -13 -96 -183 -83 -9 -179 49 125 128 -76 -126 75 -64 -82 2 51 106 -123 -58 -141 -40 -92 45
7496D5j02JNL6J61j35j39OJ51j1J71j53Rj31K7q7R9m1O7m8N9P4j07J43j16m5J81
$$ 45 -57 -56 -51 -15 146 11 -128 -122 29 18 189 36 45 -86 -59 -146 -47 -88 -21 -69 -10 64 -43 100 -16 -61 120
7523A20J26j99L6qj0j35l6R3K55k27n3P2Pj44P1O3k60K56nn4Mk8M9K9kq8o3j3
$$ 120 246 47 83 75 65 -70 -106 -13 242 15 -38 34 41 -103 -32 31 -229 27 22 -32 -28 -56 -7 22 20 -68 -131 -144
7551a44K13j45j8J57Q8m5l04J08J00M1j45QK21J6j69o8O1K38j71Nm5n7L11j90
$$ -144 69 -76 -94 63 151 106 -198 -90 10 51 -94 -86 135 151 -18 -86 -25 213 42 47 2 -55 256 66
7575F6j1P3j80J77j04q2J06j22P4n9n8O3m7Q6M2m2P7p2o1%L9j8R7j54QK33k32
$$ 66 55 128 -52 125 21 -61 45 -77 -3 -62 -120 -57 -104 -18 24 -18 59 -13 -74 -74 -35 -53 44 -110 -102 131 -101
7602a01P4Q3l8J18j38r8J00p2O2Q1k28J34l6O4q3N1m0K6J35k42L80j48l9m0N4
$$ -101 -27 56 18 136 -2 -100 0 -72 -10 71 -157 -23 -59 5 -78 -27 -67 -41 94 -148 232 84 45 5 59
7627E9j95L3J17p5o5R2R1k6m4J08k13J23p5j18K20n0J73k19P7K2j75P6J9J34j98
$$ 59 -136 -103 14 -61 -126 -34 57 31 -13 95 -118 5 -70 -188 32 -18 155 -64 13 35 -140 -64 -45 89 -109
7652a09K17k84J96l5nJ35k08P2P5L6j16PP6l2Q7n5r4N8J29j13L5K2p1R8j06lp3
$$ -109 108 -176 20 -15 -20 115 -93 -21 54 90 -26 -19 57 25 112 57 -37 21 150 37 72 94 23 121 15 12 -61
7679f1JQ0j23P0OJ19q8j9M2j73J29r5J24l8J63j41l5j15J12K19k38K09k1o9O3
$$ -61 -60 20 -103 -33 -27 92 4 -15 27 -146 -17 -112 12 -26 137 -4 -39 -154 -42 177 -61 148 127 58 121
7704A21j01Rj49J6J11r8J44M2q7Q7j90n5K56j26j5M9j42J99j95J70l9j45K53k6
$$ 121 20 29 -120 -104 7 -91 53 95 8 95 -95 -150 106 -20 -35 14 -128 71 -124 46 7 -138 115 89
7728H9OLJ2j38q6J28n5Q1p8O1j12P1ML1j13P0J15j26J95j46N7j1p3J19k21K29
$$ 89 95 98 110 -28 -114 14 -41 40 -38 23 -89 -18 -14 17 -96 -26 89 -37 158 12 69 58 -15 104 -117 112
7754A12n3j38K48n1k02K01k07K59j98O7J86j30l6K8j19J21mO0k2j48K6j31K94
$$ 112 59 -79 169 118 -84 117 -90 169 -29 38 224 94 58 86 -33 88 84 144 122 -26 0 -131 163
7777A63k40k7K20n8j49j33J95K18j88L1L5k52J13J08L4j44M8J09oj25J32j07K9
$$ 163 -77 -104 116 58 -91 -224 -29 189 1 32 67 -185 -72 36 70 -74 -26 83 77 -48 84 -23 6
7800FJ4l6Q7N9j50J49lj46j4J00j9P6j11o3R8rj38K27q3q8l2K5K20j77N5j8O0
$$ 6 20 -16 71 130 -20 129 126 -20 -34 66 47 123 12 -51 47 38 -100 127 44 -44 -76 -51 169 -8 47 29 89
7827H9j44M8j7Jj00M5p7J83l2j63J60j24M1J09M3j50J98k50J67O3l5o8p2M7J05
$$ 89 -55 -7 -24 -23 -123 -78 -155 28 -4 -167 -7 -131 -90 19 62 -88 110 -140 27 90 55 -13 -85 -38 67
7852F7J04j71N1j5J5k4j25J79k73J83N1m0R6Pk25j05J60J40j10o4K33j25n6J1
$$ 67 171 0 51 36 51 27 -98 81 -192 -9 42 2 98 105 -120 -225 -65 75 -35 -99 134 9 -47 -36
7876c6J8p2J5J22j05j22L24j33l8m8p6K00k1Q9q8j27K67k24MJ41J2R1p8o1om6
$$ -36 -18 -90 -75 47 -58 -180 144 11 -27 -75 -151 49 28 117 29 -98 169 -55 -51 90 102 193 115 54 48 2
7902BK2r4N4Kr3J01J36j99l3J81j52R4M5J04j31j15J79j68J6k9j44K84j01M1j96
$$ 2 24 -70 -16 -14 -107 -6 130 -69 -102 79 -73 21 66 170 39 -76 103 -65 -49 -78 -222 62 -39 2 -194
7927a94K50Ln9M5m1j8j49J70K2j8P5o3rJ0j01J6j33K61j04qj4o6O8J92j26N6p2
$$ -194 56 59 0 45 4 -14 -163 7 29 11 86 23 14 24 -77 -61 -194 67 -37 -45 -59 -125 -57 135 9 65 -7
7954gr2J26M8k52L01j38k1m9K01l32J22oO2O8P5k31K82j21k2J08r9L9Jk94J95
$$ -7 -99 27 75 -177 124 -14 -35 -84 117 -215 -93 -99 -37 31 106 -125 157 36 14 122 23 62 63 -231 -36
7979c6Q6j13l2Q1j16J88k07J11J39O8n4q7j07P2lj02L8L56j37k59J83M6j43Q8
$$ -36 50 -63 -95 -14 -130 58 -149 -38 101 169 115 28 -79 -7 -10 -112 -74 282 145 -114 69 115 -28 60
8003F0N1q0l8J6Q4K9j44m4J02N0k28J83m6J9J3J03q8J1j00P4j17P6j0lM8j06J01
$$ 60 111 31 -7 9 93 122 -22 -66 36 86 -142 41 -5 14 27 130 42 53 -47 27 -90 -14 -24 -27 21 -85 16
8030A6l7l9K3j16K1L80j03j83M4p5K32j90R0j80J23q6Q3J37j35kJ0m7J11j02p1
$$ 16 -21 -60 -37 -153 -132 248 145 -38 6 -69 163 -27 63 -117 6 -80 3 140 5 3 13 -34 77 -25 -96
8055i6L18j26j94J47J0L0J0J2J08l01P6K29r7q0j20p7R5j04Q4m8jK10j71J70q0
$$ -96 222 96 -98 49 59 89 99 111 219 -82 -6 223 126 46 -74 -151 -56 -160 -76 -124 -125 85 -86 84 4
8080Dj12J95r3J8p1P4n0J13k23Q5J00j24K01Q9l15j5o6J95r3J17J95p4k09J4J57
$$ 4 -108 87 -6 12 -59 15 -35 78 -145 -60 40 -84 117 206 -109 -124 -190 5 -88 29 224 150 -59 -45 112
8105A12k41J67n8K5j18J23p4M6J06q7p2P5m1N3l4j67J42Q2o8l1O4k7k5J3L8j6
$$ 112 -129 38 -20 5 -113 10 -64 -18 88 1 -71 4 -37 16 -18 -185 -43 39 -29 -60 4 -23 -48 -35 3 -13
8131a3j01nL8Q1n3K2j50J5M9J82k7N7k31N7J41q0r9k9L15j45q0Q7mrJ04j46J39
$$ -13 -114 -119 -81 0 -53 -31 -181 -166 -117 65 38 95 -136 -79 62 -18 -117 -146 169 24 -56 31 27 18 122 -24 115
8158A15Pj52N3m3k3J41q3nr4N8pK3j46O0K5N0J13pj38N2J13k6r8R8k3P0m6J4k02
$$ 115 122 -30 23 -20 -43 98 15 10 -84 -26 -33 -10 -156 -96 -71 -21 92 85 -53 -1 112 86 -12 86 63 133 87 101 -101
8187a01O5k1m6k1
$$ -101 -36 -57 -103 -124
8191a24
$$ Imaginary data points
##PAGE= N=2
##DATA TABLE= (X++(I..I)), XYDATA
0@%%%%%%%%%%%%%L2o4O4o4O4r6J28j60J92k24K84l16L52m16M80n76O72p64Q70
$$ 0 0 0 0 0 0 0 0 0 0 0 0 0 0 32 -32 32 -32 32 -64 64 -96 96 -128 156 -160 192 -224 256 -320 352 -412 458
32D58r77J119j272J435j616J808k022K256k516K801l108L447l819M224m663N142
$$ 458 -519 600 -672 763 -853 955 -1067 1189 -1327 1474 -1634 1813 -2006 2218 -2445 2697
48B697n667O247o883P579q354R214j0171J1245j2463J3852j5448J7313j9533K2219
$$ 2697 -2970 3277 -3606 3973 -4381 4833 -5338 5907 -6556 7296 -8152 9161 -10372 11847
62A1847k5543K9786l5425M3328n5291P5768j20175L86539m01957p13077M30882
$$ 11847 -13696 16090 -19335 23993 -31298 44470 -75705 310834 -91123 -804200 -373318
73c73318J19114k32739k1354M75477K11183N9122K60350K54115l50473n02381
$$ -373318 -254204 -486943 -508297 -32820 178363 237485 497835 751950 401477 -100904
83a00904j07012M5330k98683k12618K56962L87786J54682K47852L30959j20045
$$ -100904 -207916 -162586 -461269 -673887 -416925 -29139 125543 373395 704354 584309
93E84309n70333k26958K28835l5304m67811j69605L44669L14460J01928K48389
$$ 584309 13976 -212982 15853 -19451 -487262 -656867 -312198 2262 104190 352579
103C52579K63726j71825l96980p0563N5033l08321l65705J80167M60806J15565
$$ 352579 616305 444480 47500 -23063 31970 -276351 -642056 -461889 -1083 114482
113A14482r3175J78878K62855q4762k52636p0220q0111l11662k08250J86770K85223
$$ 114482 21307 200185 463040 378278 125642 55422 -24689 -336351 -544601 -357831 -72608
124g2608J00475J04958K10137L8320j86781r8734P070j95045l03649P578K51570
$$ -72608 27867 132825 342962 381282 194501 95767 102837 -92208 -395857 -388279 -136709
135a36709N6306p9506K06649L76339L8209k78767j48343l86j64579k29293M1504
$$ -136709 -80403 -159909 46740 423079 461288 182521 34178 33792 -130787 -360080 -318576
146c18576J98498M0206r54K08358K18789n8271j59287j2649m0843k41492j82464
$$ -318576 -120078 -79872 -80826 127532 346321 288050 128763 116114 75271 -166221 -348685
157c48685Q7694J31678N761R2377K52310J05844j47287j00082M9911p2063k41647
$$ -348685 -260991 -129313 -123552 -31175 221135 326979 179692 79610 129521 57458 -184189
168a84189j04655J00245N0809j1817J52549K36810K4844j28707r869K9063j73445
$$ -184189 -288844 -188599 -137790 -149607 2942 239752 264596 135889 126020 155083 -18362
179a8362k29971M755J28802j073j5875J68203J79184k5119p4560M2205k0019k08390
$$ -18362 -248333 -243578 -114776 -115849 -131724 36479 215663 190544 115984 158189 138170 -70220
191g0220j59723N1698O6691l7738M8294J93518J03810n8928j8114M9131q7020
$$ -70220 -229943 -178245 -111554 -149292 -100998 92520 196330 137402 119288 168419 81399
202H1399j99193o3166P2111o825n5510R8306J87328N0572m9064K2560K0262j30267
$$ 81399 -117794 -180960 -108849 -115674 -171184 -72878 114450 165022 115958 138518 158780 28513
214B8513j57428p456M3075m5777j4281J37213J38903L3k4507M4952j3961j35734
$$ 28513 -128915 -136371 -93296 -139073 -153354 -16141 122762 122795 98288 143240 129279 -6455
226f455r8975J3266p913o3933L5102J53487R0492k1171N705M6443m8557j28856
$$ -6455 -105430 -92164 -100077 -164010 -128908 24579 115071 93900 99605 146048 97491 -31365
238c1365n6765J3519l5890m5660P1722J28990L8519j5581M2940L8755p6722j13980
$$ -31365 -88130 -74611 -110501 -156161 -84439 44551 83070 67489 110429 149184 72462 -41518
250d1518l0341k717n2003j2648R8763R5931J943n62O1044J4814r0649q2778r205
$$ -41518 -71859 -74576 -126579 -139227 -40464 55467 57410 56848 117892 132706 42057 -40721 -49926
263d9926k2505n9363J2074R9396O3808m97L0444N7031k5203r5196m8239l78l8274
$$ -49926 -72431 -131794 -119720 -20324 43484 42987 73431 130462 105259 10063 -38176 -38554 -76828
276g6828m6320L6763P9044K7930R973N8264M1430n2662p8354k0678j5048n8292
$$ -76828 -123148 -86385 -7341 20589 30562 88826 130256 77594 -760 -21438 -36486 -94778
288i4778k4208O2078O2675O124J8693O2729J9015n9136n2239q920l1182n9506
$$ -94778 -118986 -56908 5767 11891 30584 93313 112328 53192 953 -7967 -39149 -98655
300i8655n108N8444M2724J3866L8868M6686j2079n1279k4280j3144m7410m2708
$$ -98655 -103763 -45319 -2595 11271 50139 96825 84746 33467 9187 -3957 -51367 -94075
312i4075J7197M2783J7721K2591N5289L4257k7186m0129j4705k6316n1681k1418
$$ -94075 -76878 -34095 -16374 6217 61506 95763 68577 28448 13743 -12573 -64254 -85672
324h5672K9728K9205Q666K8769N0747J8770k4565k3286j3615l7447m8881j0648
$$ -85672 -55944 -26739 -18073 10696 61443 80213 55648 32362 18747 -18700 -67581 -78229
336g8229K7845K4476J6227L2185L5786O452j6822j5131k0272l7738l3432l847
$$ -78229 -50384 -25908 -9681 22504 58290 64742 47920 32789 12517 -25221 -58653 -62500
348f2500J3855J5190K6058L9577K6843k121j4052j3663k5081l6045k1292L448
$$ -62500 -48645 -33455 -7397 32180 59023 56902 42850 29187 4106 -31939 -53231 -49783
360d9783R785R383K3339L6682K4400l3j1205j5816k7754l3491j7056M397J1779
$$ -49783 -39998 -30615 -7276 29406 53806 53773 42568 26752 -1002 -34493 -51549 -47152 -35373
373c5373J3217K2261K8377J7860O01r206j5890k4404k6672j6128j617R432J8744
$$ -35373 -22156 105 28482 46342 46943 37737 21847 -2557 -29229 -45357 -46974 -37542 -18798
386a8798K5979K4055J1954l70r522j7823k3386k0277j0226j137O009J5243K4552
$$ -18798 7181 31236 43190 42820 33298 15475 -7911 -28188 -38414 -39551 -33542 -18299 6253
399F253K4159J2657k272j2251j7064k0386j9291j0944K044J1246J5209J8096J8575
$$ 6253 30412 43069 40797 28546 11482 -8904 -28195 -39139 -37095 -25849 -10640 7456 26031
412B6031J1392j343r983j4622j9365k0564j0768M669J2040J3965J8253J9096P479
$$ 26031 37423 36080 26097 11475 -7890 -28454 -39222 -34553 -22513 -8548 9705 28801 36280
425C6280o904j0045r206j6713k0868r150O411J0469J1691J8900J8370M260p862
$$ 36280 29376 19331 10125 -6588 -27456 -36606 -30195 -19726 -8035 10865 29235 33495 25633
438B5633p900j0009j9044j7296j111O784M389R091K1279J7157o5o484l122j1074
$$ 25633 17733 7724 -11320 -28616 -29727 -22943 -18554 -9463 11816 28973 28908 22424 19302 8228
452H228k3411j5436L606Q048K775J0169K0251J1561k117j913j732j5821k3249
$$ 8228 -15183 -30619 -27013 -18965 -16190 -6021 14230 25791 23674 21761 20029 4208 -19041
465a9041q572O322L021J197J4739K0082N857m539M89j874j6948j9397k413M169
$$ -19041 -27613 -21291 -18270 -17073 -2334 17748 23605 19066 19555 17681 733 -18664 -21077 -16908
479a6908l779R43J9529K0746K837m473R9o303j8411j2123K991O78p942M483K2195
$$ -16908 -20687 -19744 -215 20531 23368 18895 18994 12691 -5720 -17843 -14852 -14174 -22116 -17633 4562
494D562J5112j879r58L928q678k0661q718M023l045o074J1655K2208N251o702
$$ 4562 19674 17795 16837 20765 12087 -8574 -17292 -13269 -16314 -22388 -10733 11475 16726 10024
508A0024M524P427j0802j9870n272J073p737j540J9313J7478k775m312J0737K851
$$ 10024 14548 21975 11173 -8697 -13969 -12896 -20633 -22173 -2860 14618 11843 7531 18268 21119
522B1119j8314j4819L538k83j2441Q78K0194J1124m286M502J2994o311k2432p518
$$ 21119 2805 -12014 -8476 -8759 -21200 -20322 -128 10996 6710 11212 24206 17895 -4537 -12055
536a2055O158n103j0354Q927J7120J201l979J2337J0303j3439j7811J722K401
$$ -12055 -5897 -11000 -21354 -12427 4693 5894 1915 14252 24555 11116 -6695 -4973 -2572
549b572j3925p483J6031J5337k701k47J2423J661j5479p549O247n115j6700l23
$$ -2572 -16497 -23980 -7949 7388 4687 4440 16863 18524 3045 -4504 1743 -3372 -20072 -20395
563b0395J7601P265m102P331J2557n030j5811k285M586r979j1833P505J4042r40
$$ -20395 -2794 4471 369 7700 20257 15227 -584 -2869 1717 -8262 -20095 -12590 1452 512
577E12l438J1969J0835p794j1606O19j738j3474m758J2978Q909n568K16J4460
$$ 512 -2926 9043 19878 12084 478 1097 -641 -14115 -18873 -5895 3014 -2554 -2338 12122
591A2122N380j0787o789L895m482j3950j689J1813M114m264P045J4032j622j3219
$$ 12122 17502 6715 -74 3821 -661 -14611 -16300 -4487 -373 -4637 2408 16440 14818 1599
605A599k047N364p240j2362K496J0267r95l336J1685J1590o220j0626K679K440
$$ 1599 -448 4916 -2324 -14686 -12190 -1923 -2918 -6254 5431 17021 10801 175 2854 5294
619E294j1789q893P994P279n674M06J4402O195j0194m620P522l494j6123l331
$$ 5294 -6495 -15388 -7394 -115 -5789 -5383 9019 15214 5020 400 7922 4428 -11695 -15026
633a5026J1941K539p178N596J4496j089j1007K269P729r393j4323M068R244n001
$$ -15026 -3085 -546 -7724 -2128 12368 11279 272 2541 10270 877 -13446 -9378 -134 -5135
647e135m793J2814J1481p478p511P191K179j3962p383R000L688q886J441J4091
$$ -5135 -9928 2886 14367 6889 -622 6569 8748 -5214 -12597 -3597 91 -8795 -7354 6737
661F737L964q699R01Q067o387j4456M24R677l031p647P709J2074l216o954O466
$$ 6737 10701 2002 2903 10970 4583 -9873 -9449 228 -2803 -10450 -2741 9333 6117 -837 5629
676E629N662j0082j0692M089M842o513j904J0630O859n408k344O619k94j0095
$$ 5629 11291 1209 -9483 -5394 -552 -7065 -8969 1661 8520 3112 768 7387 7093 -3002
690c002l168N452j262p539K428J0681K718m641J920N045m658q568M47M301l985
$$ -3002 -6170 -718 -1980 -9519 -7091 3590 6308 1667 3587 8632 3974 -4594 -4147 154 -3831
705c831n043N397P781r14l058M559L848o240o941J675J796m696k006P051N311
$$ -3831 -8874 -3477 4304 3390 332 4891 8739 2499 -4442 -2767 -971 -5667 -7673 -622 4689
720D689l044j523N478J769o591m451K466m84n210L16P389K772l483J484N640j519
$$ 4689 1645 122 5600 7369 778 -3673 -1207 -1691 -6901 -6585 804 3576 93 1577 7217 5698
736E698p525j474L795k262n570K661O774n40l167M847N329m669p149J578K543
$$ 5698 -1827 -3301 494 -1768 -7338 -4677 2097 1557 -1610 3237 8566 3897 -3252 -1674 869
751H69n182l236O044M570l440j172O464K460o386l099L714j144p228J10P354J636
$$ 869 -4313 -7549 -1505 3065 -375 -1547 4917 7377 991 -2108 1606 462 -6766 -6656 698 2334
767B334l900K413N723k160o396J465L786m325n884K761N180j832j323N696L537
$$ 2334 -1566 847 6570 4410 -1986 -521 3265 -1060 -6944 -4183 997 -835 -2158 3538 7075
782G075n065l953K950P87n438j848M718J407l306J403N891O53m569o45K668l043
$$ 7075 2010 -1943 1007 1794 -3644 -5492 -774 633 -2673 -1270 4621 5274 705 60 2728 -315
798c15m898J137M396n46k147K902L951j745k734J571J051m038l288K060K583j530
$$ -315 -5213 -4076 320 -226 -2373 529 4480 2735 1 1572 2623 -1415 -4703 -2643 -60 -1590
814a590l33L664K442k324j430J386m81l496j386K112P48j573R14L539J136j697
$$ -1590 -1923 1741 4183 1859 429 1815 1334 -2162 -3548 -1436 -688 -2261 -1347 2192 3328 1631
830A631p01J043j422l359l5K083r7j369J665L084nj775N01J321k325l211O25J725
$$ 1631 930 1973 551 -2808 -2843 -760 -857 -2226 -561 2523 2518 743 1244 2565 240 -2971 -2346 -621
848f21q04o61K678K463j380j643J444Q08k838k247J540Q41k142K16L686J468j820
$$ -621 -1425 -2086 592 3055 1675 32 1476 2284 -554 -2801 -1261 -420 -2562 -2346 1340 2808 988
865I88n04J826q39l164n40J909j44k086J264K999j34j269J111J486k490k795J103
$$ 988 484 2310 1471 -1693 -2233 -324 -468 -2554 -1290 1709 1575 306 1417 2903 413 -2382 -1279
882a279J184j650o42K809J588j636l73K191K44k873j178J345l77j951Q69L042
$$ -1279 -95 -1745 -2387 422 2010 374 1 2192 2436 -437 -1615 -270 -647 -2598 -1729 1313
898A313K26j311O67J443j440j923M40O91j336p93J219J555m06P5J531L1j799r49
$$ 1313 1539 228 895 2338 898 -1025 -585 106 -1230 -2023 -804 751 345 420 1951 1982 183 -766
916g66N95l27j227M44J064L74j95P75J288n22j219k33l36p00q14R35R37MJ87N90
$$ -766 -171 -498 -1725 -1281 -217 157 -38 737 2025 1503 284 51 -285 -985 -1799 -864 73 77 264 854
936H54M60l88o32k05m51n90m12J72P69O05O38L53j27l73n60k19l23m55j95J86
$$ 854 1314 926 294 89 -362 -952 -1364 -1192 -423 182 820 1173 1046 673 113 -106 -429 -884 -1079 -893
956h93M11N01N03O06J10m51p19m04p2n17k01N01N75J59n8Q15K79n76n39J2m50
$$ -893 -482 19 522 1128 1238 787 68 -336 -408 -925 -1126 -625 -50 109 51 866 1145 569 30 42 -408
977d08q38L5O48Q27lJ06O97k59l70k36K2p60m52L01L03J02M41N60M70n71k89m3
$$ -408 -1246 -1211 -563 264 261 367 1064 805 435 199 221 -539 -991 -690 -387 -285 156 716 1186 615 326 283
999B83n09k82j28J82J10J44K37M25J90R2j27l13q10l68m3K92M31K69K50l6P7L40
$$ 283 -226 -508 -636 -454 -344 -200 37 462 652 744 617 304 -506 -874 -917 -625 -194 75 325 289 366 706
1021G06j54l89k99l09m21J1L32P07J48J62J44j57l96q6j7l37l12J41K21K31J46
$$ 706 552 163 -136 -445 -866 -855 -523 184 332 494 638 481 85 -1 -18 -355 -667 -526 -305 -74 72
1042G2N31N45n05n84j84o9j98k08M93K02k00N5M70N56l05n53Q7m26m59Q7M03K20
$$ 72 603 1148 643 59 -125 -194 -392 -600 -107 95 -105 -50 420 976 671 118 205 -221 -680 -593 -190 30
1064C0L0K98K49J2o41J45K08m26m78jN22o2j17P11L69l90o12K91O6n06l39L44
$$ 30 60 358 607 619 -22 123 331 -95 -573 -574 -52 -114 -231 480 849 459 -153 138 204 -302 -641 -297
1086b97M78m23M3O96Q0l22j01L77m35p01K0N04J26l26K94M62j19n42L17L73l28
$$ -297 181 -242 -199 497 577 255 154 531 96 -605 -585 -81 45 -281 13 475 356 -186 131 504 176
1107A76o42o4N09l46oM58P24l49o96N15J88o52l93M34L90p05o9P14L55m14j07
$$ 176 -466 -530 -21 -367 -373 85 809 460 -236 279 467 -185 -578 -144 246 -459 -528 186 541 127 20
1128B0M26j57q80j5P93k77m80L94P24l17m06N12M06m99q44L30K40k49k22N80L44
$$ 20 446 289 -591 -606 187 -90 -570 -176 548 231 -175 337 743 244 -600 -270 -30 -279 -501 79 423
1149D23j33l61L83K41p96l4L57J0n37J16L83M94m45n8M22k33p02J88M39j18l83
$$ 423 290 -71 312 553 -243 -277 80 90 -447 -331 52 546 101 43 465 232 -470 -282 157 39 -344
1170c44O2M21Q5k73L14K35l71n05J31K54j73k96L95L73l45j87P72L0l45n73L04
$$ -344 -282 139 224 -49 265 500 129 -376 -245 9 -164 -460 -65 308 -37 -224 548 578 233 -340 -36
1191c6N3l12j32M30L24l40r7M11Jm18m1L40p5q20K61P29O1o91L65N68l87o41M74
$$ -36 17 -295 -427 3 327 -13 -110 301 302 -116 -157 183 108 -712 -451 278 339 -352 13 581 194 -447 27
1214B7Q5k45m52M80N18k85m62M73N42q89j13N12k9o93Q9P55Op47K91Q07k12q48
$$ 27 112 -133 -585 -105 413 128 -334 139 681 -208 -321 191 162 -531 -442 313 319 -428 -137 670 458 -390
1236c90J79O33m33l72J58N01l08m34Q64J87o09l98N81ml15m47Q70R2p25p9Q95
$$ -390 -211 422 -11 -383 -225 276 -32 -466 398 585 -24 -422 159 155 -160 -607 263 355 -370 -449 446
1257D46j05l76qN40l78p14M14L14qn35K86M97l77j16J49L16n03l72L44L04l05
$$ 446 341 -35 -43 497 119 -595 -181 133 125 -410 -124 373 -4 -120 29 345 -158 -530 -186 118 -187
1278a87m4L93J18k80k30N05l6k35p9j7J09j91k3K76K48k52RP6j23j11j88N08q4
$$ -187 -231 162 280 0 -230 275 239 4 -75 -92 17 -174 -197 79 327 75 84 160 37 -74 -262 246 162
1301A62j54l91N83K5m8k10J64j7k77o6L31L3k04J40J64n3l34J84J86k11l15P9
$$ 162 8 -383 200 225 177 -33 131 114 -163 -229 102 135 -69 71 235 182 -152 32 218 7 -308 -229
1323b29L37k08k38M87P1k80j55N65N8n30k26M39J45n38M9N57j58k47K14J78j76
$$ -229 108 -100 -338 149 220 -60 -215 350 408 -122 -348 91 236 -302 -253 304 146 -101 113 291 115
1344A15m37K78K69l35k31M67J89l82o4K44L18o43l8L66M5l70j23M33J39n95L92
$$ 115 -322 -44 225 -110 -341 126 315 -67 -131 113 431 -212 -250 116 161 -209 -332 101 240 -355 37
1365C7L14l49k47K7K91j17k42L34Nq7j51K39J44k83j53K46J50l32O7J87O6k63
$$ 37 351 2 -245 -218 73 -44 -286 48 53 -34 -185 54 198 -85 -238 8 158 -174 -107 80 146 -117
1387a17O3J82qj47o3J30k81J89M7J03j68j22J44K14j41QL5j54J20k12J15J7K03
$$ -117 -54 128 120 -27 -90 40 -241 -52 -5 98 -70 -192 -48 166 25 33 68 -86 34 -178 -63 -46 157
1410A57l0j76l6j12K28K6n1J07k93K2J58K1p9J76K09l05k30J70P7N5j61j01M18
$$ 157 127 -49 -85 -197 31 57 6 113 -180 -158 0 21 -58 118 327 22 -208 -38 39 94 -67 -168 250
1433B50l67L3J43l1r6JJ97j69j11J2L10j23k13O7K34l9j69K14%l32L4L02k7j38
$$ 250 -117 -84 59 28 -68 -67 130 -39 -150 -138 172 49 -164 -97 137 98 -71 143 143 -189 -155 147 120 -18
1457a8j41J43K94k72n4K63o4l11J31kMk11J24K04J17l58K89R9l48k25M65j12j39
$$ -18 -159 -16 278 6 -48 215 151 -160 -29 -31 -27 -238 -114 90 207 -151 138 237 -111 -336 129 17 -122
1480a22J82r2J16j16j30J98K18l46j80L04K1r9k8K16j81ML5K23j75j60L33k0l56
$$ -122 60 -32 84 -32 -162 36 254 -92 -272 32 53 -46 -74 142 -39 -35 0 223 48 -112 221 201 -155
1503a55J25O0R7l50L42j79R2j37K32q4j19L7J15l4j89j7J28j93J68JL6q1N8K28
$$ -155 -30 30 127 -223 119 -60 32 -105 127 43 -76 -39 76 42 -147 -164 -36 -229 -61 -60 -24 -105 -47 181
1527A81j82mlj8j0J0J20P2k18K5J29l7p5R7L3j11p2O6L8j67N2J46J9j15J3NP8
$$ 181 -1 -5 -8 -26 -36 -26 94 166 -52 -27 102 65 -10 87 120 9 -63 3 41 -126 -74 72 91 -24 -11 -6 72
1554G2p9n4J73j13J0j44lN4n6J43L7P3j83J84j13r7R2P4j25pj07L01l9k54K00
$$ 72 -7 -61 112 -1 9 -135 -138 -84 -140 3 40 113 -70 114 1 -96 -4 70 -55 -62 -169 132 93 -161 39
1579C9P5k10rL9J8L5Q9r1J61j20r8K30k2q4j10R8q3R0J9L0k02J46M4m8L4J4p1
$$ 39 114 -96 -105 -66 -48 -13 76 -15 146 26 -72 158 136 52 -58 40 -43 47 66 96 -106 40 84 36 70 84 13
1606A3L3r6m6J55NL1q9Q4q8M8n3Q3j41k15K72K8j63L1L0o9O4L9J08Nk14J07J48
$$ 13 46 -50 -96 59 64 95 6 90 2 50 -3 80 -61 -276 -4 24 -139 -108 -78 -147 -83 -44 64 69 -145 -38 110
1633A10r9q0J75j01Q0j70J71r6O5n2P4Qp0N5j06J82k42J2P0N3R1o6Mr6N9N8k02
$$ 110 11 -69 106 5 85 -85 86 -10 55 3 77 85 15 70 -36 146 -96 -84 -14 39 130 64 68 -28 31 89 -113
1660a13J38N8q3n9K12j98%O3q6J09o2J07l12K85j88J41j01Q2O9j11M2J03j32Q
$$ -113 25 83 0 -59 153 -45 -45 18 -68 41 -21 86 -226 59 -129 12 -89 -7 62 -49 -7 96 -36 -28
1684b8M5J27j32M3Q2j37j80M04l05R3m3K0J23j43jL5q1P2K0k10K37Qj08j4m1J58
$$ -28 17 144 12 55 137 0 -180 224 -81 12 -31 -11 112 -31 -32 3 -78 -6 14 -196 41 49 -59 -73 -114 44
1710D4N0j67K8L3R2j88N9J12j90L6l4K6J63q8N5O0j9j10Q9j9J2j43J04l9J16m2
$$ 44 94 -73 -45 -12 80 -108 -49 63 -127 -91 -125 -99 64 -24 31 91 72 -38 51 32 44 -99 5 -34 82 40
1736D0L6M9j30l6%K98j34j20l5O6J03j24n8NQ9N7j37P9n0N3L0j93J61q2J39q2
$$ 40 76 125 -5 -41 -41 257 123 3 -32 34 137 13 -45 -40 49 106 -31 48 -2 51 81 -112 49 -33 106 24
1762B4J18l8q7q7J93j36J8m4J67k49J79P5l42K14N2j80J32M6n2J2k13M08j65j84
$$ 24 142 104 17 -70 123 -13 5 -39 128 -121 58 133 -209 5 57 -123 9 55 3 15 -198 210 45 -139
1786a39R9J83j18m4r7K60j31J9P5L4j17l4R7l9Q3j67O1k5p6o3R4K15k87J67Q0
$$ -139 -40 143 25 -19 -116 144 13 32 107 141 24 -10 87 48 131 -36 25 0 -76 -139 -45 170 -117 50 130
1811A30j37j52j10J13Q8m9M2L8M0l8N4J61j27K6mJ27l61J07Nk3j15K32m3k37J21
$$ 130 -7 -159 -269 -156 -68 -117 -75 -37 3 -35 19 180 53 79 75 202 -159 -52 -47 -70 -185 47 4 -233 -112
1836a12Q2J12j30M1m4J45q5n7J26j9rJ25j41q5lQL7K7l3o1J16j40J12qqq9O2n1
$$ -112 -30 82 -48 -7 -51 94 9 -48 78 59 50 175 34 -51 -54 -46 -9 18 -15 -76 40 -100 12 4 -4 -93 -31 -82
1864h2J27k8j20R7R7n0j09m7lK68j56K4N1o4j45J64J32l6q8j7L7o9M2Q7j16q8
$$ -82 45 17 -103 -6 91 41 -68 -115 -118 150 -6 18 69 5 -140 24 156 120 32 15 52 -17 25 112 -4 -92
1890i2N4K9L7j10o7K33k0j16R4j00K53k23j6R5n9L0nk2p0l4J18M7r8K7p7J37j06
$$ -92 -38 -9 28 -82 -149 84 64 -52 42 -58 195 -28 -44 51 -8 22 17 -5 -75 -109 9 56 -42 -15 -92 45 -61
1917f1N4m3mq1O8J39m3p6j30Q0J70l8j4J42l30J86K00j26N9r7J29k89M6J33m5
$$ -61 -7 -50 -54 -135 -67 72 29 -47 -177 -97 73 35 21 163 -167 19 219 93 152 55 184 -105 -59 74 29
1942B9Q9j98J89j07j31J6K39o1N8k1j01J7kl2Oj53J53M4qK61l61k1K9N1n7MK1
$$ 29 118 -80 109 2 -129 -113 126 65 123 102 1 18 16 -16 -10 -163 -10 34 26 287 -74 -95 -66 -15 -72 -68 -47
1969d7m8j1P3J00j54QJ7J63k09J22K8J11k45J0J24j20J55k23J10j9R6n0J41Q3
$$ -47 -95 -106 -33 67 -87 -79 -62 101 -108 14 42 153 -92 -82 42 -78 77 -146 -36 -55 41 -9 132 215
1993B15j93M0j06N5P1N1q0o9oMk1N9M7R0j56p1J22m6J23L9j25p1p7P0L4r6L6R0
$$ 215 22 62 -44 11 82 133 53 -16 -22 -18 -39 20 67 157 1 -70 52 6 129 168 43 -28 -105 -35 -1 -97 -61 29
2021B9n9n0O9o7J40j16P4L8j52J33l1pP0r8J69j7j17L0p3J4m1q1K08q1m5L8J77
$$ 29 -30 -80 -11 -78 62 -54 20 58 -94 39 8 1 71 -27 142 125 8 38 -35 -21 -62 -143 65 -16 -61 -23 154
2048A54n6j11j19K67k04k6n0n3K45rJ3j25J95j17J8j6J05j42O9o2L6J02j79l1
$$ 154 98 -13 -132 135 -69 -95 -145 -198 47 38 51 -74 121 4 22 6 111 -31 38 -24 12 114 -65 -96
2072i6O1j4M8j93K20r6K7k0J60K9j99J28O3j6mj45pJ25m9r4N0J04j27M3K6k2j5
$$ -96 -35 -49 -1 -194 26 -70 -43 -63 97 126 -73 55 118 102 98 -47 -54 71 22 -72 -22 82 -45 -2 24 2 -13
2099a3k7J07q5J27j15r0R0j01Q1M9j47K4j8J25J4j41J15J6L6k67J10P2J30j05
$$ -13 -40 67 -18 109 -6 -96 -6 -107 -26 23 -124 -100 -118 7 21 -120 -5 11 47 -220 -110 -38 92 -13
2123a3k6p8J37N6k29J28J45k59O4nL1J11m9J42m9j15M5pJ23n2Q0m6j59N5R6Nq6
$$ -13 -39 -117 20 76 -153 -25 120 -139 -75 -80 -49 62 13 155 106 -9 36 29 152 100 180 134 -25 30 126 131 45
2150D5j43K5K38p1o4r8n4M0j67J48K46j78n4M3J75q3JM1p5MJ1j16K15q2L7j00
$$ 45 -98 -73 165 94 30 -68 -122 -82 -249 -101 145 -33 -87 -44 131 48 49 90 15 19 30 -86 129 47 84 -16
2176a6M8j12L8O2L3n9n0J76o9q3J65j93O0J7J33j31j74J61J05n2N4j33%L0j39
$$ -16 32 -80 -42 20 53 -6 -56 120 51 -32 133 -60 0 17 150 19 -155 6 111 59 113 -20 -20 10 -129
2201a29K8O0Lj1m9J92j09O5m5Jq5N1n4Q8J1q2Q8J27j43O7J4j14N4J37j91j2J00
$$ -129 -101 -41 -38 -49 -98 94 -15 50 5 6 -79 -28 -82 6 17 -65 23 150 7 74 88 -26 28 165 -26 -38 62
2228F2j03j46L32k61J34J26j67k1J17p1m4qJ22j7m7J0k4O7j1j42Q2j12J18N7m3
$$ 62 -41 -187 145 -116 18 144 -23 -44 73 2 -42 -50 72 55 8 18 -6 61 50 -92 -10 -122 -4 53 10
2253A0j03O4m7n2K42j02N7r2J54r7k0l8L5j16J39k3J0j7j32J66O8m7r0j4K26k28
$$ 10 -93 -29 -76 -128 114 12 69 -23 131 34 14 -24 11 -105 34 11 21 4 -128 38 106 59 -31 -45 181 -47
2279d7K8J64j06j40Q6J04r8P4O1j81L12l67J32J7j61J31r2J48n3J18k57k0J01
$$ -47 -19 145 39 -101 -15 89 -9 65 126 -55 257 -110 22 39 -122 9 -83 65 12 130 -127 -147 -46
2302d6J83j74J65k55M5j8M1k0J8j1k1J24j10J69j79N4j12K62j46J90j68N1o8l4
$$ -46 137 -37 128 -127 -82 -100 -59 -79 -61 -72 -93 31 -79 90 -89 -35 -147 115 -31 159 -9 42 -26 -60
2326f0K37j04j34rL7N5R7j53jK24j02Kj62O6N2j9k01J53J04p9k34K35L2m8R7j96
$$ -60 177 73 -61 -70 -33 22 119 -34 -35 189 87 89 -73 -7 45 26 -175 -22 82 3 -231 4 36 -12 85 -111
2352a11K03j47qJ31l2l7N1j89J79Q0p7p3k6J1L9L9l7M2j14Q1r8O3l7O7j8R2j08
$$ -111 92 -55 -63 68 36 -1 50 -139 40 120 43 -30 -56 -45 -6 33 -4 38 -76 5 -93 -30 -67 0 -18 74 -34
2379c4j04R7J02k0Pl0o3n3K18k15m7K0K14j43Q6r5L1pn6K13j24k4J76o7j70R3
$$ -34 -138 -41 61 41 48 18 -45 -98 120 -95 -142 -122 92 -51 35 -60 -29 -36 -92 121 -3 -27 149 82 -88 5
2405El8N8j7l5J6Q2o5j40J3R4j05O1l3J15j21L1j21L55K4k04J6J13p3K9j79K53
$$ 5 -33 25 8 -27 -11 71 6 -134 -121 -27 -132 -71 -104 11 -110 -79 -200 155 179 -25 -9 104 31 60 -119 134
2431A34Kjj21P5L8j9j60O1N4n9m5J79q3p4M1n0n3k01K65J3O2nM8j17M6j45k8J98
$$ 134 136 135 14 89 127 108 -52 9 63 4 -41 138 55 -19 22 -28 -81 -282 -17 -4 58 53 101 -16 30 -115 -143 55
2459E5j57J12n1K2r5K95k41oJ98j92J49j10N3r5J3o0K03j58J75j23%LN0mm1M6
$$ 55 -102 10 -41 -19 -114 181 -60 -66 132 -60 89 -21 32 -63 -50 -110 93 -65 110 -13 -13 -10 40 36 -5 41
2485D1L4k34J10J85j74K3K0J92l10R5K3M6j14J11j57LJ6J62j07p1J5pQ8N5j72
$$ 41 75 -159 -49 136 -38 -15 5 197 -113 -18 5 51 -63 48 -109 -106 -90 72 -35 -106 -91 -98 -10 45 -127
2510a27K1K72j93N2L2j28O5m1p8L4J86j42J61J8j83o3J64j63J24n4R6P5l8n0j2
$$ -127 -106 166 -27 25 57 -71 -6 -47 -125 -91 95 -47 114 132 -51 -114 50 -113 11 -43 53 128 90 40 28
2535B8k9m4R7om3J13J92k53J2r5P4pm0j75J38j41J58K4L6j82l7N7n1kR6O5jp6
$$ 28 -1 -45 52 46 3 116 308 55 67 -28 46 39 -1 -176 -38 -179 -21 3 39 -143 -180 -123 -174 -176 -80 -15 -16 -92
2563i2J91r1L6m9n7O1j6N7j14R5l8p7J46j26Q0Lj62J66n4J35n6M1o2K6m5k8J51
$$ -92 99 8 44 -5 -62 -1 -17 40 -74 21 -17 -94 52 -74 6 9 -153 13 -41 94 38 79 17 43 -2 -30 121
2590A21j96J96j20J06j07P2j6j92K03j59P8K2n8k2j08kK81k8k9l2N7j12R6p7q9
$$ 121 -75 121 1 107 0 72 56 -136 67 -92 -14 8 -50 -72 -180 -182 99 71 42 10 67 -45 51 -26 -115
2615a15lO0N1p7J05M9j45j33J13L02K4j44j2j31J54L5j81RJ24j68J44m5J50p8
$$ -115 -118 -58 -7 -84 21 70 -75 -208 -95 207 231 87 75 -56 98 133 -48 -39 85 -83 61 16 166 88
2639H8o9j43O5O7L2Q7j26O7k81K59m1j9jJ5J55j52J1p2M6j43J28o1N3P4j02K2
$$ 88 19 -124 -59 8 40 127 1 68 -213 46 5 -14 -15 0 155 3 14 -58 -12 -155 -27 -88 -35 39 -63 -41
2665d1nQ4j7J17r0j25J3N0rLJ50j11q2J44o4j13M9m9J22nj38J29j4kr8Q7n8K4
$$ -41 -46 38 21 138 48 -77 -64 -14 -23 -20 130 19 -63 81 17 -96 -47 -96 26 21 -117 12 -2 -4 -102 -15 -73 -49
2693d9O0o8m0N0j26J64J02j16Mj19J55n2J23q6R4j35m4P9m9j8Q9o0J86j28o8O1
$$ -49 11 -57 -97 -47 -173 -9 93 -23 -19 -138 17 -35 88 2 96 -39 -83 -4 -53 -71 18 -42 144 16 -52 9
2719IJ52j94p2o4P3J25Q8q2J27j95qJ00ML8k07m2M14k19n8K24k69P6R4K0j35n
$$ 9 161 -33 -105 -169 -96 29 117 35 162 -33 -41 59 63 101 -106 -148 266 47 -11 213 -56 20 114 134 -1 -6
2745fk7O7Oo1N5mk58J52r9J50r4J14K3n3k7L9K9rRj33L12k74J56q4J11L4j40Q0
$$ -6 -33 34 40 -21 34 30 -228 -76 -175 -25 -119 -5 18 -35 -62 -23 6 -3 6 -127 185 -89 67 -17 94 128 -12 68
2773F8j63j3J15J61k51J00k9K1n8J9O9L0M0q4m4J23J6j53J51k42o0Q1LO3q7J85
$$ 68 -95 -108 7 168 -83 17 -12 9 -49 -30 39 69 109 25 -19 104 120 -33 118 -124 -184 -103 -100 -37 -124 61
2799F1m1J3j22J01J7q9p1NM3J20j16j9Q8Rr1rO0Q9k3q1J15j30J05p0n0P2J0j3
$$ 61 20 33 -89 12 29 -60 -131 -126 -83 37 -79 -98 -10 -1 -92 -101 -41 48 25 -56 59 -71 34 -36 -86 -14 -4 -17
2827a7k2J02j46J44j21K9J79j44n2k2j2M6L8o3J8J01j38l8J74O4k34J15Qn6P4
$$ -17 -39 63 -83 61 -60 -31 148 4 -48 -70 -82 -36 2 -61 -43 58 -80 -118 56 120 -114 1 9 -47 27
2852B7J4rJr7O4K8R0j47m2M8J22j5j60K35j17l4r3R9j17L6J25j7k09J45n0q5K16
$$ 27 41 32 33 -64 0 28 118 -29 -71 -23 99 84 -76 159 42 8 -85 14 -103 -67 58 41 -168 -23 -73 -158 58
2879E8J1q1K2R1j80j4P1P2r9J63q9L1k1k5K7K9j79Q3m4J71n6pl3J07j49K36j82
$$ 58 69 -12 10 101 -79 -93 -22 50 -49 114 25 56 35 10 37 66 -113 -30 -74 97 41 34 1 108 -41 195 13
2906A3o0LJ35J21k90J03Mj32O7q8J43J6j61R9m7K08j59Q9l4r8J71j05o3P4N3M5
$$ 13 -47 -44 91 212 -78 25 29 -103 -36 -124 19 35 -126 -27 -74 134 -25 64 30 -68 103 -2 -65 9 62 107
2932A07k9o9J4LJ14j43k4J81j46q5J75l3N2j72J21Kk8o0j6J06p6j5O1j08R3j07
$$ 107 78 9 23 26 140 -3 -27 154 8 -77 98 65 117 -55 66 68 40 -20 -36 70 -6 -21 40 -68 25 -82
2958h2P7k6PP9j51l8J25O2p6k7qR2j3j03j17J62m2J84q9L7j10K25l72K85Pk86
$$ -82 -5 -31 -24 55 -96 -134 -9 53 -23 -50 -58 34 21 -82 -199 -37 -79 105 16 53 -57 168 -204 81 88 -198
2984a98J28j4qJ61K9N6k6q3k2O4r3J1l0n6m6Q5K2L3O9r4j78J74o9r7J10J19N6
$$ -198 -70 -84 -92 69 98 154 128 45 23 87 -6 5 -25 -81 -127 -42 -20 13 82 -12 -190 -16 -85 -182 -72 47 103
3011A03k02m3Q9J70j02R6j00J5L6Mm0P6J16k95m7K10J6j62K11p2J16k54Q9j97
$$ 103 -99 -142 -53 117 15 111 11 26 62 66 26 102 218 -77 -124 86 102 -60 151 79 195 -59 30 -167
3035a67J91j82J68Q7m7M7j72P4r9J75j0j94J83j83Q4Q9nr2K91p0j79Q1k20J51
$$ -167 24 -158 10 97 50 97 -75 -1 -100 75 65 -129 54 -129 -45 44 39 -53 238 168 -11 70 -150 1
3059Aq2J1l8P5o2K55j58J83k75M5J04k5Kj8L8j36Q6L6J15p1m6m2J24r4J09k16
$$ 1 -81 -70 -108 -33 -95 160 2 185 -90 -45 59 34 36 18 56 -80 6 42 157 86 40 -2 122 28 137 -79
3085g9J31J16m4j67MN1l3j19N6J22j22N2j11J2J70n8k7o2k0R7m9k4J54q8j5j4
$$ -79 52 168 124 -43 -39 12 -21 -140 -84 38 -84 -32 -143 -131 39 -19 -46 -108 -128 -31 -80 -104 50 -38 -53 -67
3111f7RK06j96J93j30k09K29r6J91j34n9J09K8k5N5m4o9j7j03R8R2n5J12j03r1
$$ -67 -58 148 -48 145 15 -194 35 -61 130 -4 -63 46 74 49 104 60 -9 -26 -129 -31 61 6 118 15 -76
3136g6J58kj90P2O2Mm4r9J58l6Q5j04O8j66pJ54o5r9K06n5P1j36j07K6L8q3J63
$$ -76 82 80 -110 -38 24 28 -16 -115 43 7 92 -12 56 -110 -117 37 -28 -127 79 24 95 -41 -148 -122 -84 -167 -4
3163dr0Q1K9M2j1n0Mp0J78k00N6P9r9J48r6K8N8j59R6o9Q0r9L7J5O8j42J2j67
$$ -4 -94 -13 16 58 47 -3 1 -69 109 -91 -35 44 -55 93 -3 25 83 -76 20 -49 31 -68 -31 -16 52 -90 -78 -245
3191b45K68j8j09J32r3KJ60p1J7j09J76o1j40K2R7j05M1O6j16J8J53k03J44j07
$$ -245 23 5 -104 28 -65 -63 97 26 43 -66 110 49 -91 -69 28 -77 -36 30 -86 -68 85 -118 26 -81
3215h1J7R3q8L5nj3J46k17J11n3J14o5L0j11J58k9J2j4r5RQNN3j0JJn3J7K7nJ56
$$ -81 -64 29 -59 -24 -29 -42 104 -113 -2 -55 59 -6 24 -87 71 42 54 40 -55 -46 -38 -33 20 10 11 12 -41 -24 3 -2 154
3246A54k90J51n5rL8n2J73k40kJ41q2j38J08M6j20K13M5o0pl2N2N4j71J16L3q4
$$ 154 -136 15 -40 -49 -11 -63 110 -130 -132 9 -73 -211 -103 -57 -177 36 81 21 14 -18 34 88 -83 33 66 -18
3272a8Q3p2PK8m6r2K79n3j00k2l4L2q3P4Q4r7l0J53k79J73k4J62j87q4O5Q8jJ11
$$ -18 65 -7 0 28 -18 -110 169 116 16 -6 -40 -8 -91 -17 67 -30 -60 93 -186 -13 -37 125 -62 -146 -81 7 6 117
3300A17q1m1n0m7J00j23J34p6l0K8P4nM7j07qm1R7J2j14K16J5r2l2K7j1p6K9P6
$$ 117 36 -5 -55 -102 -2 -125 9 -67 -97 -69 5 0 47 -60 -68 -109 -12 0 -114 102 117 25 -7 20 9 -67 -38 38
3328C8k25J80m1l8J27JO3L5k35J74r1j83K01j04J75k28K51L7p1j36j22P0L6O1
$$ 38 -187 -7 -48 -86 41 42 105 140 -95 79 -12 -195 6 -98 77 -151 100 137 66 -70 -192 -122 -86 -25
3352b5p0K68k34R1l2R0N7j13p0m4J10J9N7j84M9J79k16l9J81j60j1J86j70J31
$$ -25 -95 173 -61 30 -2 88 145 32 -38 -82 28 47 104 -80 -31 148 -68 -107 74 -86 -97 89 -81 50
3376E0N9k13M5J50q3R8K8j21PR9l4j22P3o1rR2j39O1n5l7K56k48J90o1l7J70p2
$$ 50 109 -104 -59 91 8 106 134 13 20 119 85 -37 36 -25 -34 58 -81 -20 -75 -112 144 -104 86 25 -12 158 86
3403H6q7j06K39j23j05K5L6M2p8Q4p7J44j21J58k52K11j64J58j53Q6M9P4k11J11
$$ 86 -1 -107 132 9 -96 -71 -35 7 -71 13 -64 80 -41 117 -135 76 -88 70 -83 3 52 126 -85 26
3427B6j8k40M72j99m5n7L8NN6p0L4j52J75j89R3Q6J7r9J09jR8l41K13K3r6J9P1
$$ 26 8 -232 240 41 -4 -61 -23 -18 38 -32 2 -150 25 -164 -71 15 32 -67 42 41 139 -202 11 34 -62 -43 28
3454B8j55J25k4j23J19%J21q8Q7m2j46J69M5L8o0o6J18j24o9M0N5j10m2J39m1
$$ 28 -127 -2 -26 -149 -30 -30 91 3 90 48 -98 71 116 154 94 28 146 22 -47 -7 48 -62 -104 35 -6
3479fK6J8Q2j41Q0O6q6l4KN7r2K1L0m2p8O1N6k4J2n6J46k19J28r1k5J34m5O2j13
$$ -6 20 38 120 -21 59 125 39 5 7 64 -28 -7 23 -19 -97 -36 20 -4 8 -48 98 -121 7 -84 -109 25 -20 42 -71
3508g1R1n9K1O2j0j3m0K34m60L35j23M7k0j1n8J55j06N3l3Rk9j37m6K13J04j87
$$ -71 20 -39 -18 44 34 21 -19 215 -245 90 -33 14 -6 -17 -75 80 -26 27 -6 3 -26 -163 -209 4 108 -79
3534g9N2k05K66j13k4J53Q7r8p6N4J60k19P8jj38J71k02J37J39o2q8J28r0m2P0
$$ -79 -27 -232 34 -79 -103 50 137 39 -37 17 177 -42 36 35 -103 68 -134 3 142 80 -8 120 30 -12 58
3559E8n2O9k06M5Q2m6J89k39O0Lo3K28k32J86J6j12L0J23j93q1K4J96O0l22K95
$$ 58 6 75 -131 -86 -4 -50 139 -100 -40 -37 -100 128 -104 82 98 -14 16 139 -54 -135 -111 85 145 -177 118
3584A18pk81P1R0P4r4k1p6J20q6n4J88m3j40L7L6K48j51j01K9M3q5R7n5J21M7
$$ 118 111 -170 -99 -9 65 -29 -50 -126 -6 -92 -146 42 -1 -141 -104 -68 180 29 -72 -43 0 -85 12 -43 78 125
3610A25K5k85K11j07J0J54k19j6K77j55J7K1p8O1o4J28q3K9r6J31m2J7j55J93
$$ 125 150 -135 76 -31 -21 133 -86 -102 175 20 37 58 -20 41 -23 105 22 51 -45 86 44 61 -94 99
3634I9J6j64M8K44l81J78lj08j08J59q6P6N2o4N3m7N1r7J07j82K13kk12R1K08
$$ 99 115 -49 -1 243 -138 40 37 -71 -179 -20 -106 -30 22 -42 11 -36 15 -82 25 -157 56 54 -158 -67 141
3659A41K2k15Q9j90J60pJ13o9r3k1j4M7k9K57k66J60j08J7J6m8K16j06m8N6j97
$$ 141 163 -52 37 -153 7 0 113 44 -49 -70 -84 -37 -66 191 -75 85 -23 -6 10 -38 178 72 24 80 -117
3684a17J2J61j62K0O0J6M8j02j4m6P5Q1J1kqrokj70K20N5j10k03p4L16j34J39
$$ -117 -105 56 -106 -86 -26 -10 38 -64 -78 -124 -49 32 43 41 33 24 18 16 -154 66 121 11 -192 -266 50 -84 55
3711E5k01J72L5l2k13K86K1j69L0n1N3L5R7j49R1Or2L9J48p9k0q7J41K6r4j15
$$ 55 -146 26 61 29 -184 102 123 -46 -16 -67 -14 21 118 -31 60 66 -26 13 161 82 62 -25 116 142 48 -67
3737f7RKo3N9jQ8lJ9n0M2k9lj11n1K79n7o4q3J85l7l6n8j77J28K30j20j87J00
$$ -67 -58 -56 -119 -60 -61 27 24 43 -7 35 6 3 -108 -159 120 63 -1 -84 101 64 28 -30 -207 -79 151 31 -156 -56
3765e6J29j38J10p1j23K57k00J35j32O0K44j84j10L10l17R3q3k1O8n8O2L4j36
$$ -56 73 -65 45 -26 -149 108 -92 43 -89 -29 215 31 -79 231 -86 7 -76 -97 -29 -87 -25 9 -127
3788a27R1l8K26j63p0Q2r5K48k50L8K07k31KJ70j80J47m0r1K9Q6Q3m2J2k5O8j48
$$ -127 -36 -74 152 -11 -81 1 -94 154 -96 -58 149 -82 -80 90 -90 57 17 -74 -45 41 124 82 94 69 137 -11
3814a1k3J48r7K01j00N2j24k2K7j7n3K15k48N3n9J2k2Q8n3k2K10j31m6qL9M9j11
$$ -11 -34 114 17 218 118 170 46 24 51 34 -19 196 -52 1 -58 -46 -68 20 -33 -55 155 24 -22 -30 9 58 -53
3841e3l9N6N1q4Q9j5P6k20J53kj41J80p5M0k12K24k80L35q4j55K17k2K49j55o8
$$ -53 -92 -36 15 -69 20 5 81 -139 14 12 -129 51 -24 16 -196 28 -252 83 -1 -156 61 39 288 133 65
3866F5j09J48m1r0QJ58k08N6j4K08r8p7j18J66j15J90j72r4j2K35m3r1k0k2J75
$$ 65 -44 104 63 -27 -19 139 -69 -13 -27 181 83 6 -112 54 -61 129 -43 -137 -149 86 43 -48 -68 -90 85
3891H5k25nQ6j29K63j65J50Pj67K34J6j34j94J79R7j0q1p0R6pp5N9m5jR5lJ03
$$ 85 -140 -145 -59 -188 75 -90 60 67 -100 134 150 16 -178 1 98 88 7 -63 33 26 -49 10 -35 -36 59 56 159
3918A59j19j76J56o4lL2J95j50o0M4M7n7o5M9Q2q2N0mQ1j68J35r5J6n1J06k25
$$ 159 40 -136 20 -44 -47 -15 180 30 -30 14 61 4 -61 -12 70 -12 38 34 115 -53 82 -13 3 -48 58 -167
3944a67J5K51j83P3k8J14j14j32J71J45j02j36J24m2O9p3Q3m2R8q0J6J5j26pn5
$$ -167 -152 99 -84 -11 -39 75 -39 -171 0 145 43 -93 31 -11 58 -15 68 26 124 44 60 75 -51 -58 -113
3969a13K85k52J33J27j39k23J98j08K47k33L1N7r5R6j22Q2j80K40j69KO7L0q1
$$ -113 172 -80 53 180 41 -182 16 -92 155 -78 -47 10 -85 11 -111 -29 -209 31 -138 -136 -69 -39 -120
3992a20J13np4N9j17J27N0m8O2N6j70Q0J36o9K4j01Kk8l5J5Q4nq7Q5L6j30P2n3
$$ -120 -7 -12 -86 -27 -144 -17 33 -15 47 103 -67 13 149 80 104 3 5 -23 -58 -43 41 36 -51 34 70 -60 12 -41
4020d1mJ14N6j83j9J16k7J1J4l0j1J01j34M5o7k7R9j22R0K1k0o0O1m8N1K7j55
$$ -41 -45 69 125 -58 -77 39 12 23 37 7 -4 97 -37 8 -59 -86 13 -109 -19 2 -18 -78 -17 -65 -14 13 -142
4047a42L8NJ90o2L4j42J18J0L4ro2P2O8j7k6j77J70j16r0M5J42j25j4j9O4J9J08
$$ -142 -104 -99 91 29 63 -79 39 49 83 74 12 84 152 135 109 -68 102 -14 -104 -59 83 -42 -56 -75 -11 8 116
4074A16k77K26o2L0p6O4q0R8j05LJ02j64R5j02J27Pj17K81k47J26k4m7O3pJ2l
$$ 116 -161 65 3 33 -43 21 -59 39 -66 -63 39 -125 -30 -132 -5 2 -115 166 -81 45 21 -26 37 30 42 39
4100C9p5l2K20j34q0N9k7Lm0r5J57K4p5P4o0L1M1j22P8K8j17Q8j00J40o6J22p3
$$ 39 -36 -68 152 18 -62 -3 -30 -27 -67 -162 -5 19 -56 18 -42 -11 30 -92 -14 14 -103 -15 -115 25 -41 81 8
4127Hp4o7M5qJ79k14pK08k72J36n8N4J05j59j38K81kM2R6p3n9k1n8J15J10l20
$$ 8 -66 -133 -88 -96 83 -131 -138 70 -202 -66 -124 -70 35 -124 -262 19 17 59 155 82 23 2 -56 59 169 -151
4153a51J72%k42L35p8j37R5J50j85M4J15p9o2r9J04N6n1l4P5j08J12L6J9k36o0
$$ -151 21 21 -221 114 36 -101 -6 144 -41 3 118 39 -23 -122 -18 38 -13 -47 28 -80 32 68 87 -149 -209
4178b09J47j6J29J5K5r4n9P8L8j44L6q9N7K7K31j88n5M3l3p0R1l2N6N5q7j72K53
$$ -209 -62 -78 51 66 91 -3 -62 16 54 -90 -54 -143 -86 -59 172 -16 -71 -28 -61 -131 -40 -72 -16 39 -48 -220 33
4205C3M7l8j03Q8q9K57p3k18j6j8J70O6L0k01L0J82j78k8K11j68O5Q6j94J45l3
$$ 33 80 42 -61 27 -62 195 122 -96 -112 -130 40 106 136 -65 -35 147 -31 -59 152 -16 49 135 -59 86 53
4230E3l5j02j9M9J16k2M1k14J53n1j2JP8j30J17L5j73K15p2Q1j08l8J18o2q8J27
$$ 53 18 -84 -103 -54 62 40 81 -133 20 -31 -43 -42 36 -94 23 58 -115 100 28 109 1 -37 81 19 -69 58
4256E8K9jp3o2J13M0q8k2M1p3n4J01J1R1j21q5M0J10j8j17J15k14J02N1r4K07
$$ 58 87 86 13 -49 64 104 16 -6 35 -38 -92 9 20 111 -10 -95 -55 55 37 -80 35 -179 -77 -26 -120 87
4282H7j17P8j09No9K8J85j7j76O4N6j56J67j42J52j09j06M7J03J34l9o0j12K1
$$ 87 -30 48 -61 -56 -125 -97 88 71 -105 -41 15 -141 26 -116 36 -73 -179 -132 -29 105 66 6 -106 -85
4306h5L8N3j1J5O8K7p3M1Np9j11J22j21J50m9r7L3P5k8JJ0k6O4Q5o6j60J16m9
$$ -85 -47 6 -5 10 78 105 32 73 78 -1 -112 10 -111 39 -10 -107 -74 1 -27 -26 -16 -42 22 107 41 -119 -3 -52
4334e2J5lM2p7Q4l1n8j5Q2mO8j99L07j87j12Q1J77k25J71J23k24J32k48K76j86
$$ -52 -37 -40 2 -75 9 -22 -80 -95 -13 -17 51 -148 159 -28 -140 -59 118 -107 64 187 -37 95 -153 123 -63
4359f3J27J3r3r2J7j1J10r4J68q8o1L4J7L2R2j68J27n9qj55O7%L1R9q9J94j34
$$ -63 64 77 -16 -108 -91 -102 8 -86 82 -6 -67 -33 -16 16 108 -60 67 8 0 -155 -88 -88 -57 42 -47 147 13
4386A3P3l10J49J8L4j47J61j37O1K47k2n6p5l0K7N5j66J56k5N4k22K22Pj56J61
$$ 13 86 -224 -75 -57 -23 -170 -9 -146 -85 162 140 84 9 -21 6 61 -105 51 26 80 -142 80 87 -69 92
4411I2ok6J2r8J00l2j99J09J79j98Q4j73J08m0K20k70J53n2Jk4L2K7LN2l7o8J49
$$ 92 86 60 72 -26 74 42 -157 -48 131 -67 17 -156 -48 -88 132 -138 15 -37 -36 -60 -28 -1 2 54 17 -51 98
4438I8j22O0J0j8P1q2j03p9K06k45L58j65j74J02K59r6k11K02J03k48M2J2M1j55
$$ 98 -24 36 46 28 99 17 -86 -165 41 -204 154 -11 -185 -83 176 80 -131 71 174 -74 -32 -20 21 -134
4462a34R6J16m9p0J32j41K0J13m6l5R3r7j03N3J21o0L0k9p5k8l9O1q4J71j08P
$$ -134 -38 78 29 -41 91 -50 -30 83 37 2 95 -2 -105 -52 69 9 39 10 -65 -93 -132 -71 -155 16 -92 -85
4488h5J13o5Pk4J26O9k50P5O5j19J26j4Q8j43J00j93K36j82J87j44O0M3K0m5p8
$$ -85 28 -37 -30 -54 72 141 -109 -34 31 -88 38 24 112 -31 69 -124 112 -70 117 -27 33 76 96 51 -27
4513b7l3l6M3J93j31l8J0J07j02P3K5q0o8Q9l5p9R0Qj89P4J26j15R0J8j04J17
$$ -27 -60 -96 -53 140 9 -29 -19 88 -14 59 84 4 -64 25 -10 -89 1 9 -180 -106 20 -95 -5 13 -91 26
4539B6j15J63j89M0l0K06o5L7M1j08j67O1J54j3J6j67J82j36L2O5O9j85m5J48
$$ 26 -89 74 -115 -75 -105 101 36 73 114 6 -161 -100 54 41 57 -110 72 -64 -32 33 102 -83 -128 20
4563B0m4J54j74Lm6L4J17l5l1L8Jm4N4q7O5j40Q3L4L6m5o7N6R1Pj78R8Qn7Q0j05
$$ 20 -24 130 -44 -41 -87 -53 64 29 -2 36 37 -7 47 -40 25 -115 -32 2 38 -7 -74 -18 73 80 -98 0 8 -49 31 -74
4593g4J09r2nJ15l0K28j99J32j18j6l4mRr3J9j4J17j52K47p9J9p7P4q1j41J77
$$ -74 35 -57 -62 53 23 251 52 184 66 50 16 12 21 -72 -53 -67 50 -102 145 66 85 8 82 1 -140 37
4619C7k4o5J8P9j63J36j63J91r3l5LK3J16j07K2J23j90K8J59p4l0j38J61J63q3
$$ 37 13 -52 -34 45 -118 18 -145 46 -47 -82 -79 -56 60 -47 -25 98 -92 -64 95 21 -9 -147 14 177 94
4644I4j01r4N7Lq4R9J64j53J52l0m8N8j96K03rj17k6K7nO2j86J67N8rj18r1J71
$$ 94 -7 -101 -44 -41 -125 -26 138 -15 137 107 59 117 -79 124 115 -2 -28 -1 -6 56 -130 37 95 86 -32 -123 48
4671D8p9K7K2P4N1l66L11r9o4j55J89j8j7j3O6M6l9R2q5r2J99j2j93J00k8L0r7
$$ 48 -31 -4 18 92 143 -223 88 -11 -75 -230 -41 -59 -76 -89 -23 23 -16 76 -9 -101 98 86 -107 -7 -35 -5 -102
4698a02k2J62p5J53m8j22nN5K7J89j29o4M2j34J31k5J1q9PJ6p2R7L2k07J76m4
$$ -102 -124 38 -37 116 68 -54 -59 -4 23 212 83 19 61 -73 58 33 44 -45 -38 -22 -94 3 35 -172 4 -40
4724d0k17P1M07k30j09K4j1k6J07n6J26j37K25k22J35Q7l4j13l4N4k4K5j37O8
$$ -40 -257 -186 221 -9 -118 -94 -105 -131 -24 -80 46 -91 134 -88 47 134 100 -13 -47 7 -17 8 -129 -61
4748f1J17j87K14J26k61o7K12j19l0J6M6K1p5P6L1k6N1N5l4J35k63o1KM0K07m4
$$ -61 56 -131 83 209 -52 -119 93 -26 -56 -40 6 27 -48 28 59 33 84 139 105 240 -23 -84 -82 -42 165 121
4774A21j04j05Ol9J33J61j43l8o8P3m1P9j10J33L8j51L0q7J22M2j16L7P3j11O3
$$ 121 17 -88 -82 -121 12 173 30 -8 -76 -3 -44 35 -75 58 96 -55 -25 -112 10 52 -64 -27 46 -65 -2
4799bj8qO7R6j99R0O8j5n8Pp4J3Q0j32K39r1ll5R0j38j30J82j04P0r4J80k50M8
$$ -2 -20 -28 39 135 -64 26 94 79 21 28 -46 -33 47 -85 154 63 60 25 115 -23 -153 29 -75 -5 -99 81 -169 -121
4827a21K6J25R2j83l1j54K41N2j0j39R9J56j32M5j48k0O8j03R7q4L03k21O1r1
$$ -121 -95 30 122 -61 -92 -246 -5 47 37 -102 -3 153 21 66 -82 -102 -34 -137 -40 -124 179 -42 19 -72
4851g2K61j51k6J12j68J26L1K7j44k7j12K40j96M2J37k40K19r7J1J60l5q0j89
$$ -72 189 38 12 124 -44 82 113 140 -4 -31 -143 97 -99 -57 80 -160 59 -38 -27 133 98 18 -171
4874a71J72j61K31r7o0Q0Q1j45m0K6J18o8N3J0n9M5l5l8KK40j75n2O9m4J29j60
$$ -171 1 -160 71 -26 -86 -6 75 -70 -110 -84 34 -34 19 29 -30 15 -20 -58 -56 184 9 -43 26 -18 111 -49
4900d9K07k61K08q6p2J41j97K17k84J46J5NJ0l6J47j94J16n8P7p7J39j15o8P7
$$ -49 158 -103 105 19 -53 88 -109 108 -176 -30 -15 -10 0 -36 111 -83 33 -25 52 -25 114 -1 -69 8
4924Hn6J45l5j00j7K4j97L22q0R4l6k16J69p8nJ06l9j8O8Oj6qp8J7p0J61O3k32
$$ 8 -48 97 62 -38 -55 -31 -228 94 14 108 72 -144 25 -53 -58 48 9 -9 59 65 49 41 -37 -20 -90 71 134 -98
4952i8O7q1J23m3L4P6J28k02O6j76J77k01J83j21M1R0p5ML3N4K9n1j99J1J94j0
$$ -98 -31 -112 11 -32 2 78 206 4 70 -106 71 -130 53 -68 -27 63 -12 -8 25 79 108 57 -142 -131 63 53
4978E3o4n9pJ60j07j03M3J08j3j06P5L2n2N1r7O8M0K00k29r2J17J2L9p2M0L2N
$$ 53 -11 -70 -77 83 -24 -127 -84 24 11 -95 -20 12 -40 11 -86 -18 22 222 -7 -99 18 30 69 -3 37 69 74
5005G4j28J0J18j77K29j78O5J4j10J50rr9OR9o2M5p0O0M8j45k5R6k21K49j14K07
$$ 74 -54 -44 74 -103 126 -52 13 27 -83 67 58 -41 -35 64 2 47 -23 37 85 -60 -85 11 -210 39 -75 132
5031A32k48L0M6j2l8oJ07K1J1j0j37J20k3M5l7q6M6N7J4K7j88J24o3R3L6p6M8
$$ 132 -116 -86 -40 -52 -90 -96 11 32 43 33 -104 16 -7 38 1 -85 -39 18 32 59 -129 -5 -68 25 61 -15 33
5058C3l0M0J33j24n4J4lP4n4m7l5l9O9l1P2m8K5j51J47k2L4j22O8Q3j88K35l27
$$ 33 3 43 176 52 -2 12 9 83 29 -18 -53 -92 -23 -54 18 -30 -5 -156 -9 -31 3 -119 -51 32 -156 79 -248
5085b48M74k38p3J69o9l2k7M1K1q2J47k2k1P6k00oJ16J3l2Q3q9J6J5k3O9o3L7
$$ -248 226 -12 -85 84 15 -17 -44 -3 18 -64 83 61 40 116 -84 -90 26 39 7 90 1 17 32 9 78 15 52
5112E2l3j57K71k62J05N5pl6J22j89O3j3kn5Q9M5k0L5J8l5m4o9m7JM9L14k06k
$$ 52 19 -138 133 -129 -24 31 24 -12 110 -79 -16 -29 -31 -86 3 48 28 63 81 46 2 -67 -114 -113 -64 250 44 42
5140D2j37j28L77j38J43l3p1J5p9Nj7M4O6K07k46p2N0R0j80K71k22J88k83J29
$$ 42 -95 -223 154 16 159 126 55 70 -9 -4 -21 23 89 296 50 -22 28 118 -62 209 -13 175 -108 21
5164B1L3j11o1J46J87j86j8q1J13j63R7N2l8j86J83j25K0Q0J5Q3j09O6n3J60k94
$$ 21 54 -57 -118 28 215 29 11 -70 43 -120 -23 29 -9 -195 -12 -137 -117 -37 -22 61 -48 18 -35 125 -169
5189a69J58j04J10R6o1k9j18J53M7q4R0p8R3j05kJ4O0j54N8J0P8j93K69k05o3
$$ -169 -11 -115 -5 91 30 1 -117 36 83 -1 89 11 104 -1 -3 11 71 -83 -25 -15 63 -130 139 -66 -129
5214a29J40o0Q0m1J33j65j6N6p2o0J86Q0j07Jm1r0N5l1j33L4J35J03j00K12k11
$$ -129 11 -49 31 -10 123 -42 -58 -2 -74 -134 52 132 25 26 -15 -105 -50 -81 -214 -180 -45 58 -42 170 -41
5239d1P1n8J2MM4j71K21j7j2k4R1qq2J9p8J54q8J03j54j62K13Ll9Mm1n2J2J24
$$ -41 30 -28 -16 -12 32 -139 82 65 53 29 120 112 30 49 -29 125 37 140 -14 -176 37 40 1 5 -36 -88 -76 48
5267D8Q4j53mNk24J58M2J63j45l4J77j57m0P2m7J34K8j17Q1q9O3q5O2r7J07K1
$$ 48 132 -21 -25 -20 -244 -86 -44 119 -26 -60 117 -40 -80 -8 -55 79 107 -10 71 -18 45 -40 22 -75 32 53
5293E3M2j58Q2j9l1Q3J13j65J2qK6o3K1K45k74P0o6P5r2J5M8k5j17K83j31q4J66
$$ 53 95 -63 19 0 -31 52 165 0 12 4 30 -33 -12 233 -41 29 -37 38 -54 -39 9 -16 -133 150 19 -65 101
5320A01k71P8j8J78n3j5k08K44J06j38m9j09J49J28j82N7N4q0q7J21K6j51R1L9
$$ 101 -170 -92 -110 68 15 0 -208 36 142 4 -45 -154 -5 123 -59 -2 52 -28 -115 6 32 -119 -28 11
5344A1k2o3J72pj38j4J41k5l5J48o7n8ro1Po2rJ49j13J46j13L0N7l9R2k44j12
$$ 11 -11 -74 98 91 -47 -61 80 55 20 168 101 43 34 -27 -20 -82 -91 58 -55 91 -22 8 65 26 118 -126 -238
5371b38K13M1j01K28k62j2O4n5J28o7j7lKl6J80k29O3K6J03J40k09l1J19pL4r8
$$ -238 -25 16 -85 143 -119 -131 -67 -122 6 -61 -78 -81 -79 -115 65 -164 -101 -75 28 168 -41 -72 47 40 74 -24
5397b4J14k5j03j49J66J6J8j02J22j75K61p7R1k57J58j36N3Q5K7L3r8j37l9O3
$$ -24 90 65 -38 -187 -21 -5 13 -89 33 -142 119 42 133 -124 34 -102 -49 36 63 96 -2 -139 -178 -115
5421a15J71J32j40n4R4j11J21M1k28m0J14q0M4J95j47n6N3p0P1J28k08k3K34j00
$$ -115 56 188 48 -6 88 -23 98 139 -89 -129 -15 -95 -51 144 -3 -59 -6 -76 -5 123 -85 -108 126 26
5445B6pl9J40j45L1L5j4L9N1j35l8n1J26m1J28j17pr9pl6mJ83q5J46k30R7J15
$$ 26 19 -20 120 -25 6 41 27 66 117 -18 -56 -107 19 -22 106 -11 -18 -117 -124 -160 -164 19 -66 80 -150 -53 62
5472F2K9n2O6mj40j04J28R8j44Q6j32L8J55J4nj51N9j6p3J45qo4j55K48l0J6L1
$$ 62 91 39 105 101 -39 -143 -15 83 -61 25 -107 -69 86 100 95 -56 3 -13 -86 59 51 -13 -168 80 50 66 97
5499I7j20OL9q1NJ68l8J06k10J41j56Q3k9O0j38P3O7n0J0r9J55k51K54J6k6j75
$$ 97 -23 -17 22 -59 -54 114 76 182 -28 113 -43 40 11 71 -67 6 73 23 33 -66 89 -162 92 108 82 -93
5525i3j19J75J04q5K7J2J7l4n1K22j26j16O4j7K2L1k2m2p0J42l0%j1J92l81J46
$$ -93 -212 -37 67 -18 9 21 38 4 -47 175 49 -67 -3 -20 2 33 11 -31 -101 41 11 11 0 192 -189 -43
5551d3p9R4R0j11J03l8l2J07m0R8j76j72K46q2j1J7R0J07j12k10R7M8r1K10j63
$$ -43 -122 -28 62 -49 54 16 -16 91 51 149 -27 -199 47 -35 -46 -29 61 168 56 -154 -57 -9 -100 110 -53
5576e3j7Q3j59N6LnO7j01K5J15K3j41K39l1j15R6j41j29J07J03O1k85K59q1j87
$$ -53 -70 13 -146 -90 -87 -92 -25 -126 -101 14 37 -104 135 104 -11 85 -56 -185 -78 25 86 -199 60 -21 -208
5601b08J94q7J88j93J54Q9j36N7k18J95P4r6k5N7J82k75NJ83k17K23l06K23l7
$$ -208 -14 -101 87 -106 48 137 1 58 -160 35 109 13 -12 45 227 -48 -43 140 -77 146 -160 63 26
5624B6n0n0J07j66L5J83n3J3J55l08R4O1j03K26M3l30R5j4lL2jm4J15n6J90k07
$$ 26 -24 -74 33 -133 -98 85 32 45 200 -108 -14 47 -56 170 213 -117 -22 -36 -39 -7 -8 -52 63 7 197 -10
5650a0L1j5J77j28Pq3Lj4R1j60O3K52k40M1m3j00J7J66j70Q8N6rj12J11k4K6j5
$$ -10 21 6 183 55 62 -21 -18 -32 59 -101 -38 214 -26 15 -28 -128 -111 55 -115 -27 29 20 -92 19 -5 21 6
5677Fj41J34M9j7m9r1J1J11r8L2L2j6O0J51j83j70K37k15P8K18j29Q6j18R1K4
$$ 6 -135 -1 48 31 -18 -109 -98 13 -85 -53 -21 -37 23 174 -9 -179 58 -157 -79 139 10 96 -22 69 93
5702I3j38J18k2l2p6J87p6Kj22N5j00O6Q3j15N9n7K8J5j8R5l3j02J74K7l5k01
$$ 93 -45 73 51 19 -57 130 54 56 -66 -11 -111 -45 38 -77 -18 -75 -47 -32 -50 45 12 -90 84 111 76 -125
5728a25J37N0j93K23j58k5M1kMQ6O8Qq1J98k27l1L3q2N8jjJ32q1m5J35k02J63
$$ -125 12 62 -131 92 -66 -91 -50 -52 -48 38 106 114 33 231 4 -27 6 -76 -18 -19 -20 112 31 -14 121 -81 82
5755H2On2k8o9L5o6M3j01K13L9k48K98j97k9Q4L0j73J02j2J77j96j07J59q0n4
$$ 82 88 36 8 -61 -26 -92 -49 -150 63 102 -146 152 -45 -74 10 40 -133 -31 -43 134 -62 -169 -10 -90 -144
5780a44J70K2J18m8j08J06n0j72R2j20J38J34j50P7K5Q4j99n5K92j12l7m7Rjl0
$$ -144 26 48 166 118 10 116 66 -106 -14 -134 4 138 -12 65 90 174 -25 -80 212 100 63 16 25 24 -6
5805fQ3o9R2j35mJ0R8l0j77l1K40j39k3P6j15K22k09K59j55n1N1M1k14J17o6J59
$$ -6 77 8 100 -35 -39 -29 69 39 -138 -169 71 -68 -91 -15 -130 92 -117 142 -13 -64 -13 28 -186 -69 -135 24
5831B4m7M9P6M1q0q8j02J19M4R3k24n7J57j11J47J9j62L6L3%M1kJ4l2M0j77Q6
$$ 24 -23 26 102 143 63 -25 -127 -8 36 129 -95 -152 5 -106 41 60 -102 -66 -33 -33 8 6 20 -12 28 -149 -63
5858f3Pl0J00K1j34N9m6K01j14J4j51J02M9o1j63K05pP2l34K04j17K07K0j00j
$$ -63 -56 -86 14 35 -99 -40 -86 115 1 15 -136 -34 15 -46 -209 -4 -11 61 -273 -69 -186 21 41 -59 -60
5883f0J81j85mJ17j12k5Q0M4k9K7l9j27J00N9l8o0K09p8j15J69q2l0R2J7j55J59
$$ -60 121 -64 -68 49 -63 -88 -8 36 7 34 -5 -132 -32 27 -11 -71 138 60 -55 114 32 2 94 111 -44 115
5909A15L3k38N5nK1J53k26J1N7L8r3J22j7p6K1%J12M2j68o9J78K9r9J17m9O3k8
$$ 115 148 -90 -35 -40 -19 134 -92 -81 -24 14 -79 43 26 -50 -29 -29 83 125 -43 -112 66 95 -4 113 64 127 99
5936I9L3r5m1n4J34m4k6Qj23J17J13q8n7N7l3PK0N7M5k72L4J09Po1j5J08j22K72
$$ 99 132 37 -4 -58 76 32 6 14 -109 8 121 33 -24 33 0 7 27 84 129 -143 -109 0 7 -54 -69 39 -83 189
5964A89k32j15J12L7K4j08J11O2l0Q4j87N1P7l0k3r1J57O8r2Lj64j12M12k50K42
$$ 189 -43 -158 -46 -9 15 -93 18 80 50 134 -53 -2 75 45 22 -69 88 156 64 67 -97 -209 203 -47 195
5989A95k15J27k4p9Q1M6j61J64j18J15j82OJ85l11J71P4M3m2k01QJ36j08l2M2
$$ 195 -20 107 83 4 85 131 -30 134 16 131 -51 -45 140 -171 0 74 117 75 -126 -118 18 -90 -122 -80
6013h0lJ6L7R7j79K34k76J21Q2m1k2k3rQM7j27J38j05J6O6J31k09M8N6N8K9j57
$$ -80 -83 -67 -30 67 -112 122 -154 -33 49 8 -14 -37 -46 -38 9 -118 20 -85 -69 -3 128 -81 -33 23 81 110 -47
6040d7R0p4J05q1M7n3J7R0k11R3M3j26M2J07j3L7J16k96P5J16j34PJ57j88J35
$$ -47 43 -31 74 -7 40 -13 4 94 -117 -24 19 -107 -65 42 29 66 182 -114 -39 77 -57 -50 107 -81 54
6065E4Q2q3j16K8o0N1n5J07O0j56M9Mk6j22J98q6KJ19r4j20K79j84J72Q2j5j35
$$ 54 136 53 -63 -35 -95 -44 -99 8 68 -88 -39 -35 -61 -183 15 -71 -69 50 -44 -164 115 -69 103 185 170 35
6091C5j05Q5M2Q9j09k6j22M0J27j36J23Q1k81K92j10k2j7M6o0M3Pk4m2J24j06
$$ 35 -70 15 57 146 37 11 -111 -71 56 -80 43 124 -157 135 25 3 -14 32 -28 15 22 -2 -44 80 -26
6116b6n0P6K8J2o4K3P6kj09J35j14PJ59j38J00k41O0J08J6KK9j45N7J1J10j95
$$ -26 -76 0 28 40 -24 -1 75 73 -36 99 -15 -8 151 13 113 -128 -68 40 56 58 87 -58 -1 10 120 -75
6142g5O4o7o5N4Q0L2l5p5J8P6k8m9P8ol3M3M2m0J00j89o3K02j08jJ31j68R9p4
$$ -75 -11 -78 -143 -89 -9 23 -12 -87 -69 7 -21 -70 8 2 -31 12 54 14 114 -75 -138 64 -44 -45 86 -82 17 -57
6170e7k5J77J09k84PJ27k05K52j04j21J39O7p9J43k56J31M7J04j11J1L6j00J40
$$ -57 -82 95 204 -80 -73 54 -151 101 -3 -124 15 82 3 146 -110 21 68 172 61 72 108 8 148
6193A48j20L1j99K38R1k33J06M5m0j1n7J30m3j38L8P4j58J33n4r2Q9LJ02p7M1
$$ 148 28 59 -140 98 189 -44 62 107 67 56 -1 129 86 -52 -14 60 -98 35 -19 -111 -22 -19 83 6 47
6218D7l5O6k8j34K7R3L1k14n4J54K12n8j9o3p7J8n9K11k17J42J27j83P7p1k8N5
$$ 47 12 78 50 -84 -57 36 67 -147 -201 -47 165 107 88 25 -52 -34 -93 118 -99 43 170 -13 64 -7 -35 20
6244B0J8Q6j71O5p6n1J63j19J07o2l5J93p2j07L6J72j75o5J87j60L1n5mrO8p1
$$ 20 38 124 -47 18 -58 -109 54 -65 42 -20 -55 138 66 -41 -5 167 -8 -73 114 -46 -15 -70 -74 -83 -15 -86
6270h6Qj6M1M5J9%L4m7r5J21m3J14k23N9J01J49k49J36k0J06k19o2J24N4j4pJ20
$$ -86 -78 -94 -53 -8 11 11 45 -2 -97 24 -19 95 -128 -69 32 181 -68 68 48 154 -65 -127 -3 51 37 30 150
6297A50j49J45q8m9N3k09M0O4L6M7Pr3Q6m0n0k6p8J62J66l18J23N0l9P8j18M9
$$ 150 1 146 58 9 62 -147 -107 -43 -7 40 47 -46 40 0 -50 -76 -154 8 174 -144 -21 29 -10 68 -50 -1
6323aJ23j87J83o2J1j96J50J6N9q7R7j87J20J8k19K21R6j00j37J12j02O6J42j59
$$ -1 122 -65 118 56 67 -129 21 37 96 9 106 -81 39 57 -162 59 155 55 -82 30 -72 -6 136 -23
6347b3KR1L9p8j4K7k9q9P1j13J33q0o8J36j03P1K0L3n0J36l0j51L4R1J80k91j5
$$ -23 -21 70 109 31 17 44 15 -74 -3 -116 17 -63 -131 5 -98 -27 -7 26 -24 112 82 -69 -35 56 236 -55 -70
6374g0R3K6j63N3K37k43J72r6l3r4J89j49q1K01J0r8Q3l8jl3p5k5J85l5j57P6
$$ -70 23 49 -114 -61 176 -67 105 9 -24 -118 71 -78 -159 42 52 -46 37 -1 -2 -35 -110 -135 50 15 -142 -66
6400f6j4N2P7j50O7J52j32K9j54K04j04L5JJ02n0j16J29j30n1O5J3l8J00j35Q3
$$ -66 -80 -28 49 -101 -34 118 -14 15 -139 65 -39 -4 -3 99 49 -67 62 -68 -119 -54 -41 -79 21 -114 -31
6425c1L7O2J44k12J8QJ25j9m9j34J51j09L8N9m8l1J01j52k2P5j58K29j06J26k03
$$ -31 6 68 212 0 18 26 151 132 83 -51 100 -9 29 88 40 9 110 -42 -64 11 -147 82 -24 102 -101
6450a01Q8p0J04J14l5k52RJ10j17L07n6p2N1j27N8qn1J88j22Pr3K5M9j26J96J2
$$ -101 -13 -83 21 135 100 -152 -143 -33 -150 157 101 29 80 -47 11 3 -48 140 18 25 -68 -43 6 -120 76 88
6476H8Lo7OJ2j52R9J27j33No1J18j54J45Ko2k8J8L1j16O7M2q6J89l8n1J0l0m1
$$ 88 91 24 30 42 -110 -11 116 -17 -12 -73 45 -109 36 38 -24 -52 -34 -3 -119 -52 -10 -96 93 55 4 14 -16 -57
$$ [...]
8191i4
##END NTUPLES=NMR FID
##END=
