##TITLE=1H ikalashn
CBPAd-2
19.7.2023
##JCAMPDX= 6.0         $$ Bruker NMR JCAMP-DX V2.0
##DATA TYPE= NMR FID
##DATA CLASS= NTUPLES
##ORIGIN= UXNMR, Bruker Analytische Messtechnik GmbH
##OWNER= root
$$ TOPSPIN		Version 1.3
$$ 2023-07-19 15:22:44.578 +0400  Irina@DPX200
$$ Compression mode = diff/dup
##.OBSERVE FREQUENCY= 200.131300845
##.OBSERVE NUCLEUS= ^1H
##.DELAY= (6, 6)
##.ACQUISITION MODE= SIMULTANEOUS
##.ACQUISITION SCHEME= undefined
##.AVERAGES= 32
##.DIGITISER RES= 18
##SPECTROMETER/DATA SYSTEM= spect
##.PULSE SEQUENCE= zg
##.SOLVENT NAME= Acetone
##.SHIFT REFERENCE= INTERNAL, Acetone, 1, 16.97976
##AUDIT TRAIL= $$ (NUMBER, WHEN, WHO, WHERE, WHAT)
$$ ##TITLE= Audit trail, TOPSPIN		Version 1.3
$$ ##JCAMPDX= 5.01
$$ ##ORIGIN= Bruker BioSpin GmbH
$$ ##OWNER= Irina
$$ $$ F:/spectra/data/iren/nmr/1H/4/audita.txt
$$ ##AUDIT TRAIL=  $$ (NUMBER, WHEN, WHO, WHERE, VERSION, WHAT)
(   1,<2023-07-19 15:21:38.765 +0400>,<Irina>,<DPX200>,<TOPSPIN 1.3>,
      <created by zg
	started at 2023-07-19 15:19:25.218 +0400,
	POWCHK disabled, PULCHK disabled
       terminated by command 'halt'
       configuration hash MD5:
       BE 6D 3F 07 2A EA 11 49 91 17 2B D3 AF B3 58 0D
       data hash MD5: 16K
       B5 60 EC B4 9E 24 B3 E6 CA 15 65 72 6D B0 04 CB>)
$$ ##END=
$$ 
$$ $$ hash MD5
$$ $$ 78 73 DC 2C 3B BF 17 49 AA 0D 45 21 19 F7 B9 16
##$RELAX= 
##$RELAX= 
##$RELAX= 
##$RELAX= 
##$RELAX= 
##$RELAX= 
##$RELAX= 
##$RELAX= 
$$ Bruker specific parameters
$$ --------------------------
##$DU= <F:/spectra>
##$EXPNO= 4
##$NAME= <1H>
##$PROCNO= 1
##$TYPE= <nmr>
##$USER= <iren>
##$AMP= (0..31)
100 100 100 100 100 100 100 100 100 100 100 100 100 100 100 100 100 100 
100 100 100 100 100 100 100 100 100 100 100 100 100 100 
##$ANAVPT= -1
##$AQSEQ= 0
##$AQ_mod= 1
##$AUNM= <au_zg>
##$AUTOPOS= <>
##$BF1= 200.13
##$BF2= 200.13
##$BF3= 200.13
##$BF4= 200.13
##$BF5= 200.13
##$BF6= 200.13
##$BF7= 200.13
##$BF8= 200.13
##$BYTORDA= 1
##$CFDGTYP= 0
##$CFRGTYP= 5
##$CHEMSTR= <none>
##$CNST= (0..63)
1 1 145 1 1 1 1 1 1 1 1 1 1 1 1 1 1 1 1 1 1 1 1 1 1 1 1 1 1 1 1 1 1 1 
1 1 1 1 1 1 1 1 1 1 1 1 1 1 1 1 1 1 1 1 1 1 1 1 1 1 1 1 1 1 
##$CPDPRG= <>
##$CPDPRG1= <>
##$CPDPRG2= <>
##$CPDPRG3= <>
##$CPDPRG4= <mlev>
##$CPDPRG5= <mlev>
##$CPDPRG6= <mlev>
##$CPDPRG7= <mlev>
##$CPDPRG8= <mlev>
##$CPDPRGB= <>
##$CPDPRGT= <>
##$D= (0..63)
0 2 0 0 0 0 0 0 0 0.06 0 0.03 0 0 0 0 0.0002 0 0 0 0 0 0 0 0 0 0 0 0 0 
0 0 0 0 0 0 0 0 0 0 0 0 0 0 0 0 0 0 0 0 0 0 0 0 0 0 0 0 0 0 0 0 0 0 
##$DATE= 1689765695
##$DBL= (0..7)
120 120 120 120 120 120 120 120 
##$DBP= (0..7)
150 150 150 150 150 150 150 150 
##$DBP07= 0
##$DBPNAM0= <>
##$DBPNAM1= <>
##$DBPNAM2= <>
##$DBPNAM3= <>
##$DBPNAM4= <>
##$DBPNAM5= <>
##$DBPNAM6= <>
##$DBPNAM7= <>
##$DBPOAL= (0..7)
0.5 0.5 0.5 0.5 0.5 0.5 0.5 0.5 
##$DBPOFFS= (0..7)
0 0 0 0 0 0 0 0 
##$DE= 6
##$DECBNUC= <off>
##$DECIM= 32
##$DECNUC= <off>
##$DECSTAT= 4
##$DIGMOD= 1
##$DIGTYP= 9
##$DL= (0..7)
0 120 120 120 120 120 120 120 
##$DP= (0..7)
150 150 150 150 150 150 150 150 
$$ [...]
##$SW= 20.9593944314184
##$SWIBOX= (0..15)
0 0 2 0 0 0 0 0 0 0 0 0 0 0 0 0 
##$SW_h= 4194.63087248322
##$TD= 16384
##$TD0= 1
##$TE= 300
##$TE2= 300
##$TE3= 300
##$TEG= 300
##$TL= (0..7)
0 120 120 120 120 120 120 120 
##$TP= (0..7)
150 150 150 150 150 150 150 150 
##$TP07= 0
##$TPNAME0= <>
##$TPNAME1= <>
##$TPNAME2= <>
##$TPNAME3= <>
##$TPNAME4= <>
##$TPNAME5= <>
##$TPNAME6= <>
##$TPNAME7= <>
##$TPOAL= (0..7)
0.5 0.5 0.5 0.5 0.5 0.5 0.5 0.5 
##$TPOFFS= (0..7)
0 0 0 0 0 0 0 0 
##$TUNHIN= 0
##$TUNHOUT= 0
##$TUNXOUT= 0
##$USERA1= <user>
##$USERA2= <user>
##$USERA3= <user>
##$USERA4= <user>
##$USERA5= <user>
##$V9= 5
##$VALIST= <valist>
##$VCLIST= <CCCCCCCCCCCCCCC>
##$VD= 0
##$VDLIST= <DDDDDDDDDDDDDDD>
##$VPLIST= <PPPPPPPPPPPPPPP>
##$VTLIST= <TTTTTTTTTTTTTTT>
##$WBST= 1024
##$WBSW= 25
##$XGAIN= (0..3)
0 0 0 0 
##$XL= 0
##$YL= 0
##$YMAX_a= 2055376
##$YMIN_a= -2869017
##$ZGOPTNS= <>
##$ZL1= 120
##$ZL2= 120
##$ZL3= 120
##$ZL4= 120
##$ABSF1= 10
##$ABSF2= 0
##$ABSG= 5
##$ABSL= 3
##$ALPHA= 0
##$AQORDER= 0
##$ASSFAC= 0
##$ASSFACI= 0
##$ASSFACX= 0
##$ASSWID= 0
##$AUNMP= <proc_1d>
##$AXLEFT= 0
##$AXRIGHT= 0
##$AXTYPE= 0
##$AXUNIT= <>
##$AZFE= 0.1
##$AZFW= 0.1
##$BCFW= 1
##$BC_mod= 2
##$BYTORDP= 1
##$COROFFS= 0
##$CY= 7568.61572265625
##$DATMOD= 1
##$DC= 2
##$DFILT= <>
##$DTYPP= 0
##$F1P= 17.4489326093798
##$F2P= -7.48496080290002
##$FCOR= 0.5
##$FTSIZE= 32768
##$FT_mod= 4
##$GAMMA= 1
##$GB= 1
##$INTBC= 1
##$INTSCL= 1
##$ISEN= 128
##$LB= 0.05
##$LEV0= 0
##$LPBIN= 0
##$MAXI= 945.577
##$MC2= 0
##$MEAN= 0
##$ME_mod= 0
##$MI= -402.1523
##$NCOEF= 0
##$NC_proc= 0
##$NLEV= 6
##$NOISF1= 8.587773
##$NOISF2= 6.764455
##$NSP= 1
##$NTH_PI= 0
##$NZP= 0
##$OFFSET= 16.97976
##$PC= 1
##$PHC0= 193.9316
##$PHC1= 9.931679
##$PH_mod= 0
##$PKNL= yes
##$PPARMOD= 0
##$PPDIAG= 0
##$PPIPTYP= 0
##$PPMPNUM= 100
##$PPRESOL= 1
##$PSCAL= 0
##$PSIGN= 0
##$REVERSE= no
##$SF= 200.13
##$SI= 32768
##$SIGF1= 18.5376
##$SIGF2= -6.396296
##$SINO= 400
##$SIOLD= 32768
##$SREGLST= <1H.CDCl3>
##$SSB= 3
##$STSI= 0
##$STSR= 0
##$SW_p= 4194.63087248321
##$SYMM= 0
##$S_DEV= 0
##$TDeff= 0
##$TDoff= 0
##$TI= <>
##$TILT= no
##$TM1= 0
##$TM2= 0
##$TOPLEV= 0
##$USERP1= <user>
##$USERP2= <user>
##$USERP3= <user>
##$USERP4= <user>
##$USERP5= <user>
##$WDW= 1
##$XDIM= 8192
##$YMAX_p= 0
##$YMIN_p= 0
$$ End of Bruker specific parameters
$$ ---------------------------------
##NTUPLES= NMR FID
##VAR_NAME=  TIME,          FID/REAL,        FID/IMAG
##SYMBOL=    X,             R,               I
##VAR_TYPE=  INDEPENDENT,   DEPENDENT,       DEPENDENT
##VAR_FORM=  AFFN,          ASDF,            ASDF
##VAR_DIM=   8192,          8192,            8192
##UNITS=     SECONDS,       ARBITRARY UNITS, ARBITRARY UNITS
##FACTOR=    0.0002384,     1,               1
##FIRST=     0,             0,               0
##LAST=      1.9527344,     -55,             -251
##MIN=       0,             -2869017,        -2869017
##MAX=       1.9527344,     2055376,         2055376
$$ Real data points
##PAGE= N=1
##DATA TABLE= (X++(R..R)), XYDATA
0@%%%%%%L2l2%l2O4o5R7j60J92k24K88l53M35n31O42p70R04j064J262j487J732
$$ 0 0 0 0 0 0 0 32 0 0 -32 32 -33 64 -96 96 -128 160 -193 242 -289 353 -417 487 -577 685 -802 930
27I30k015K330k662L050l487L960m485N067n714O424p207Q061q997J0027j1148
$$ 930 -1085 1245 -1417 1633 -1854 2106 -2379 2688 -3026 3398 -3809 4252 -4745 5282 -5866
42e866J2367j3703J5170j6766J8501k0409K2502k4783K7298l0083L3155l6570
$$ -5866 6501 -7202 7968 -8798 9703 -10706 11796 -12987 14311 -15772 17383 -19187
54a9187M0399m4702M9571n5152O1627o9225P8287q9334J03155j21006J45087j79552
$$ -19187 21212 -23490 26081 -29071 32556 -36669 41618 -47716 55439 -65567 79520 -100032
66a00032K33282l29409N53885k015684j211059L882537O66847j966729j580013
$$ -100032 133250 -196159 357726 -1657958 -2869017 1013520 1680367 -286362 -1866375
75a866375J623462J728827l87012j849785k59360J235593R07498o40322q45897
$$ -1866375 -242913 1485914 1098902 -750883 -1010243 225350 1132848 492526 -353371
84c53371p4877P20890L76846m93521r25332K4093R29827N52308o35668q08332
$$ -353371 -428248 292642 669488 175967 -749365 -725272 204555 756863 121195 -687137
94f87137N513O60218K66066m22226m08173L77921P30809K10749n25355n80116
$$ -687137 -681624 -21406 244660 -177566 -585739 -207818 522991 733740 208385 -371731
104c71731O5823O91996K88704p19510o70091O47474J090917k46541j320144l94711
$$ -371731 -305908 386088 674792 -44718 -714809 -67335 1023582 777041 -543103 -937814
114i37814J058208P28435q34611j015034N36010J206310j45237j199146l01023
$$ -937814 120394 848829 14218 -1000816 -464806 741504 596267 -602879 -903902
123i03902Q88401N76596l87517m75826J67931M47490N1926l33764k08380J00955
$$ -903902 -15501 561095 173578 -302248 -134317 313173 365099 31335 -177045 -76090
133g6090J93987J27316l8991k51347j58078K21059K36994k01949l80467l2321
$$ -76090 117897 245213 206222 -45125 -203203 17856 254850 52901 -327566 -359887
143c59887L39217K98612j12192m11739j35620L79379L21213k51324m32770R4319
$$ -359887 -20670 277942 165750 -245989 -381609 -2230 318983 67659 -365111 -270792
153b70792N68561K37146n01497m86138L52410O33057j71510o78716l7854O07608
$$ -270792 297769 534915 33418 -452720 -100310 532747 361237 -317479 -355333 252275
163B52275K10469m97118l99486K60554M14172j20527l83014N8628L63944J4943
$$ 252275 462744 -34374 -433860 -173306 240866 120339 -262675 -204047 159897 174840
173A74840k87339o9223J56514O0905m9096J3192Q1149K4430p8122m3677R4845
$$ 174840 -112499 -181722 -25208 35697 -13399 -207 80942 105372 27250 -16427 78418
184G8418N2465j34328q8599J24212R9855j06279j45492O338J33904P4072j35682
$$ 78418 130883 -3445 -92044 32168 132023 25744 -119748 -113410 20494 94566 -41116
195d1116j55193J26530K21799q3537k35768L9509K26578J2847k04710n6849K28995
$$ -41116 -196309 -69779 152020 68483 -167285 -127776 98802 111649 -93061 -149910 79085
206G9085J64248j86898k12252J61164K21159j67552k47524J32455K43694r0034
$$ 79085 243333 56435 -155817 5347 226506 58954 -188570 -56115 187579 97545
216I7545k63445n186K46685Q8776k38642j75018K08682K43901j35276k52634O0320
$$ 97545 -165900 -171086 75599 164375 -74267 -249285 -40603 203298 68022 -184612 -124292
227a24292K43359N3795j79352j40573J21603K29757k7307k55668o9204J95436
$$ -124292 119067 172862 -6490 -147063 -25460 204297 176990 -78678 -147882 47554
237D7554J14011j12493j39402N487J12736M4200j01393p8130O6164O2304k5943
$$ 47554 161565 49072 -90330 -84843 27893 72093 -29300 -107430 -41266 21038 -4905
248d905n12L84p4958M834J57824O2836j58119j30824J22929K22836k5069k83865
$$ -4905 -5417 -5033 -79991 -75157 82667 145503 -12616 -143440 -20511 202325 177256 -106609
260a06609q6097L00825J75101k94118k75112K01011L20085p2184l41772j08994
$$ -106609 -192706 108119 283220 -10898 -286010 -84999 235086 162902 -178870 -287864
270b87864K74923K40323j69170k96836O5727L00939N9678k15169j45426J12101
$$ -287864 -12941 227382 58212 -238624 -172897 128042 187720 -27449 -172875 -60774
280f0774K19589K7225k20010j28187J70634J84025p4632j82934n7050R8686J30255
$$ -60774 158815 186040 -33970 -162157 8477 192502 117870 -65064 -122114 -23428 106827
291A06827j3020j61570p5263J12035J06632m1995j23704o1035J14825J85271m5723
$$ 106827 93807 -67763 -143026 -30991 75641 33646 -90058 -151093 -36268 149003 103280
302A03280k50628m0211K67563J64077j75570k42156M7504K83009R3211k70110
$$ 103280 -147348 -187559 80004 244081 68511 -173645 -126141 156868 250079 -20031
312b0031k04832K04292K52578j30013k83382m356K40976J27409j60658k19749
$$ -20031 -224863 -20571 232007 101994 -181388 -185744 55232 182641 21983 -197766
322a97766M7643K32751M8180j67055q6049Q5475J07703K0930q1852q7586N2109
$$ -197766 -150123 82628 130808 -36247 -122296 -36821 70882 91812 9960 -77626 -25517
333b5517J28070n56j18529o0013N6189J06156K9649j32721j30631Q8007J67215
$$ -25517 102553 101997 -16532 -76545 -20356 85800 115449 -17272 -147903 -59896 107319
344A07319k4914j60311n4452J07806J21355m2705j68860j9618J98695R7945j60667
$$ 107319 82405 -77906 -132358 -24552 96803 54098 -114762 -134380 64315 162260 1593
355A593j42218Q8842J71770K3176j52006j15533J03304J55241n9904j60471J2371
$$ 1593 -140625 -51783 119987 143163 -8843 -124376 -21072 134169 74265 -86206 -73835
366g3835J22317J9785q8933o7785L0101R3115K2683q2355m3047M6925L2586O229
$$ -73835 48482 68267 -20666 -88451 -58350 34765 57448 -24907 -67954 -21029 11557 17786
378A7786J1455l1657m1987M4643O6802k5648o2873n450M9861M4203l6958r1936
$$ 17786 29241 -2416 -44403 240 67042 41394 -21479 -26929 22932 67135 30177 -61759
390f1759J3070J16979J0386j20884m7139P8170O4827k6440p5160k2817P9614N9460
$$ -61759 -48689 68290 78676 -42208 -89347 -11177 53650 27210 -47950 -70767 8847 68307
402F8307p0306o8275N7693P1182k0813n0748j6533L0702N1989p455o3902n761
$$ 68307 -1999 -70274 -12581 58601 37788 -12960 -29493 1209 53198 45743 -18159 -23920
414b3920M7830o110l2943R592R686j0222N804n18j7109K915N560o5K8343O608
$$ -23920 23910 17800 -15143 -5551 4135 -6087 -283 -801 -17910 -14995 -9435 -9500 18843 25451
428B5451n8838j6455P3735L3382n4961m0066K5046M3715J0258m8892l1910N7984
$$ 25451 -33387 -49842 23893 57275 2314 -37752 -12706 31009 41267 -7625 -39535 18449
440A8449M6152o7118n8579M9994N3249k1383l8537j4523J7334L2598p816l4586
$$ 18449 64601 -2517 -61096 -11102 42147 20764 -17773 -32296 -14962 17636 9820 -24766
452b4766J2132K8067j7003q774K3784m522j6946K0587Q311k4413o669J0997P842
$$ -24766 -12634 15433 -1570 -10344 13440 8918 -8028 12559 20870 -3543 -10212 785 8627
465H627J6672j0280m6266o54N0951P421l4138j5725P560K1093J8122l3392m0643
$$ 8627 25299 15019 -31247 -31901 19050 26471 -7667 -23392 -15832 5261 23383 -10009 -50652
478e0652M5832N8623m1568o3390K0560N7181J5646l7856m5096K1351O0492j6169
$$ -50652 -4820 53803 12235 -51155 -30595 26586 42232 4376 -40720 -19369 41123 24954
490B4954o2189J7595N5968j6568m2857J418J4196J0154R455j4591j6501J0167
$$ 24954 -37235 -19640 36328 19760 -23097 -21679 -7483 2671 12126 -2465 -18966 -8799
502h799L040k645J9034k097l0964J3040L6107j9780k8797J9655K0103p203j1442
$$ -8799 -5759 -8404 10630 8533 -22431 -9391 26716 6936 -21861 -2206 17897 10694 -748
515g48j6979o47L8764J3499m1752k1148K1895J7171L966j0264k7323R179M5134
$$ -748 -17727 -18374 20390 33889 -7863 -29011 -7116 10055 14021 3757 -23566 -14387 30747
528C0747j6308n7039J6386N8829l797m5916j6205K5034L8031m298m7235l267M7159
$$ 30747 14439 -42600 -26214 32615 28818 -17098 -33303 -8269 29762 25464 -21771 -25038 22121
541B2121m216m3505J2855L4645j0749j7341j306o262P631J5787n558p717O574
$$ 22121 17905 -25600 -12745 21900 11151 -6190 -7496 -13758 -6127 9660 4102 -3615 2959
554B959j1772q296K3611M963k2767N313J5081j5637m119J8004n922p118J2765
$$ 2959 -8813 -17109 6502 11465 -11302 -5989 9092 -6545 -10664 7340 1418 -5700 7065
567G065p082j6881J4693J5314o729k480n794j2981J4636J5399k1092l512K7123
$$ 7065 -17 -16898 -2205 13109 6380 3900 -1894 -14875 -239 15160 -5932 -9444 17679
580A7679j0977l0231J4621K3868r811j2456k26L327J4397l011k4516J0514L2780
$$ 17679 6702 -23529 -8908 14960 5149 -7307 -7533 -4206 10191 7180 -17336 -6822 25958
593B5958j7899l4955J6841K6633k775o615j1114j2870J7035J5978j8806q901K3546
$$ 25958 8059 -26896 -10055 16578 13803 7188 -3926 -16796 239 16217 -2589 -11490 12056
606A2056K015j9260o659p88J0205K3034j3158l5932J3894L2097j0541j5679R618
$$ 12056 14071 -5189 -11848 -12636 -2431 20603 7445 -28487 -14593 17504 6963 -8716 902
619I02j423m967J1420j477j0536J2754R403j2430p201p664n283K8397K1525l6028
$$ 902 -521 -5488 5932 4455 -6081 6673 16076 3646 -3555 -11219 -16502 11895 33420 -2608
633b608k9969K7782K0535j5353r761J0M944J5380k926k4268O867K7920p251k0974
$$ -2608 -32577 -4795 15740 387 -9374 -9364 -4420 10960 8034 -16234 -9367 18553 11302 -9672
647i672q40L644J4542K2139j9845l5237J8596K9022j8851k1432J3917J7759K036
$$ -9672 -10512 -6868 7674 29813 9968 -25269 -6673 22349 3498 -17934 -4017 13742 15778
660A5778j6272k6260P545L7614k748l1269M117J5073m786O647R018j9744j0011
$$ 15778 -494 -26754 -19209 18405 15657 -15612 -11495 3578 -1208 5439 14457 -5287 -15298
673a5298K2275O827j5652k145Q206J0595L070k9769k4385L4179L4653k5732k6524
$$ -15298 6977 13804 -1848 -3993 4213 14808 17878 -11891 -36276 -2097 32556 6824 -19700
686a9700J3699Q618l666J458q442m059J9268P710k0404n876J2830O264N939j0898
$$ -19700 -6001 2617 -1049 409 -8033 -12092 7176 14886 -5518 -11394 1436 7700 13639 2741
700B741k7528J1457M4897m552m1038j992K2424j062j0023n324K798J9196M692
$$ 2741 -24787 -13330 31567 27015 -14023 -16015 6409 5347 -4676 -10000 -7202 11994 16686
713A6686k8135j2039K1366P128m961Q012r953j6558K2209K2156k1575k0714J1285
$$ 16686 -11449 -23488 -2122 5006 45 8057 -1896 -18454 3755 25911 4336 -16378 -5093
726e093J3055Q63q815j2679J3753K5443k0090l7142J2536L0393l203p874L20r965
$$ -5093 7962 8825 10 -12669 1084 26527 6437 -30705 -18169 12224 9021 1147 1467 -8498
740h498N95J4947p398j2891J1019J1307l398l150r250l327K4308P268l4727j0370
$$ -8498 -7903 7044 -354 -13245 -2226 9081 5683 2533 -6717 -10044 14264 21532 -13195 -23565
754b3565L3168J1342j7605o604p70n69P325m919j2906J5217J4846j3335r180K275
$$ -23565 9603 20945 3340 -3264 -4034 -4603 2722 -2197 -15103 114 14960 1625 -7555 -5280
768e280n803Q053K1632j1270k5416J2887K1574p669j1029k777J64J3943J429k3488
$$ -5280 -11083 -3030 18602 7332 -18084 -5197 16377 8708 -2321 -5098 -4934 9009 10438 -13050
782a3050K564K9752k980k8086j954R941J759J0552J335j8460l24J4608n857p702
$$ -13050 -10486 19266 16286 -11800 -13754 -3813 -2054 8498 9833 -8627 -8951 5657 -200 -7902
796g902O891J393L617R329j5188j7374K2934K0287k0455j5789Q617N575N519K776
$$ -7902 -1011 382 3999 13328 -1860 -19234 3700 23987 3532 -12257 -3640 1935 7454 10230
810A0230j5126o005J7247j757j7401O162J2775k609K099l349j8552N093K6809
$$ 10230 -4896 -10901 6346 4589 -12812 -6650 6125 3516 5615 2266 -16286 -11193 15616
823A5616k912k0504J837P988K487M426r136j0681J8149J0271k4853r965K2845
$$ 15616 12704 -7800 -5963 2025 4512 8938 -198 -10879 7270 17541 -7312 -17277 5568
836E568P536r204m867r791j715J8606M160j6920J506Q930o396o29N037p617N146
$$ 5568 13104 3900 -967 -10758 -12473 6133 10293 -6627 -5121 3809 -2587 -3216 1821 -5796 -650
851f50J9293j2353k2953J1506J7571l070n948p402o447J3950R764j7948p736J8199
$$ -650 18643 6290 -16663 -5157 12414 9344 3396 -4006 -10453 3497 13261 -4687 -12423 5776
865E776J046j4357J023K016J798J4445k446k4120Q54K1846K546q735j067o116
$$ 5776 6822 -7535 -6512 -4496 -2698 11747 9301 -14819 -13965 7881 10427 1692 625 -5491
879e491N367J3122j0491j6590J7222J5137j8138j1968O646N597P482J900j8672
$$ -5491 -124 12998 2507 -14083 3139 18276 138 -11830 -5184 413 7895 9795 -8877
892h877o866J7463M902j1480M279L488o721O120K123j3258N276K0643o509j7775
$$ -8877 -15743 1720 6622 -4858 -579 2909 -3812 2308 4431 -8827 -3551 17092 10583 -7192
906g192J336M403M806Q988r284j7086J0791J3621j3948o335J2417J024l828J252
$$ -7192 -5856 -1453 3353 12341 3057 -14029 -3238 10383 -3565 -9900 2517 3541 -287 965
920I65r819j886K0956L643j9267k851R099J82N235K107j4274J651J6057q500j5851
$$ 965 -8854 -10740 10216 13859 -5408 -8259 840 1022 6257 8364 -5910 -4259 11798 3298 -12553
935a2553J2527J0915p552n591m350m043J3558R466j6905p280J3766j484o527J0033
$$ -12553 -26 10889 3337 -2254 -6604 -10647 2911 12377 -4528 -11808 1958 474 -6053 3980
949C980R24p714O570J914j2950M449J2873m957m570K013r950k99J6158k135j3863
$$ 3980 4904 -2810 3760 5674 -7276 -2827 10046 5089 519 2532 -7418 -7717 8441 6306 -7557
964g557N628M615j0352K376R345n544J196O478j2202m808J5612K417p776L225
$$ -7557 -1929 2686 -7666 -5290 4055 -1489 -293 6185 -6017 -10825 4787 7204 -572 2653
978B653j030q417Q536O700j1536O74J0959q156r705Q637K585k235M716o700j0038
$$ 2653 1623 -6794 1742 8442 -3094 -2420 8539 383 -9322 -685 1900 -335 4381 -2319 -12357
993a2357J0533Q569j1802P97J2079q384q927R969L048j826M995n485r452J0374
$$ -12357 -1824 6745 -5057 -4260 7819 -565 -9492 477 3525 1699 6694 1209 -8243 2131
1007B131N726j1277K230R804r956o590Q093q19k706R202l512j2058O359N976o347
$$ 2131 7857 -3420 -1190 8614 -1342 -7932 161 -658 -3364 5838 2326 -9732 -3373 2603 -3744
1022c744L855P734j0807l140R813m315l200J3042j780j3785M032N816n327M921
$$ -3744 111 7845 -2962 -6102 3711 -604 -3804 9238 7458 -6327 -2295 3521 -1806 3115
1036C115L976j1189j752Q340m855j570R725m605r902R260L226j1961N619J3049
$$ 3115 7091 -4098 -5850 2490 -2365 -3935 5790 1185 -8717 543 3769 -8192 -2573 10476
1050A0476p210p253J696k015O197R730j0842j0410J3541L707j4940L775J1602
$$ 10476 3266 -3987 -2291 -4306 1891 11621 779 -9631 3910 7617 -7323 -3548 8054
1063H054n831m313J312o369L830J2896o390j0130O218J852o999P773L883r982
$$ 8054 2223 -2090 -778 -7147 -3317 9579 3189 -6941 -723 1129 -5870 1903 5786 -4196
1077d196L885Q020j1818m683J4283L536q714L13l288l421J1633J561j1433K450
$$ -4196 -311 7709 -4109 -8792 5491 9027 313 626 -2662 -6083 5550 7111 -4322 -1872
1091a872O794j0389j72J2229n788p255J0287n73j2084M807J0384k186r74m600
$$ -1872 4922 -5467 -5639 6590 802 -6453 3834 3261 -8823 -4016 6368 4182 3208 -1392
1105a392q651R387J2469j2100q299J4774J56j3205K027P413k166M423p97j2941
$$ -1392 -10043 -656 11813 -287 -8586 6188 6344 -6861 -4834 2579 413 4836 4039 -8902
1119h902K830J3090m755n483M886m051l752J0397j417r954R691Q206j4667o012
$$ -8902 -6072 7018 2263 -3220 1666 -2385 -6137 4260 2843 -7111 2580 10786 -3881 -9893
1133i893J0786L124m49J782r092m377J2696j092r601P623N392j2058Q60Q912o713
$$ -9893 893 4017 3568 5350 -3742 -8119 4577 3485 -6116 1507 6899 -5159 -4299 4613 -2100
1148b100j640J0616l528j0563M684K667R01O201m913j2801P885J1322j0723m014
$$ -2100 -3740 6876 3348 -7215 -2531 136 1037 7238 2325 -10476 -2591 8731 -1992 -6006
1162f006J2526j863q501K544j349j968J2131J246j5461P08R682l373j149L936
$$ -6006 6520 4657 -3844 -1300 -2649 -4617 7514 8760 -6701 -5993 3689 316 -833 3103
1176C103o187j035J1092p378q792J2744Q494j4280m656N023L42N144L935j0089
$$ 3103 -3084 -4119 6973 -405 -9197 3547 12041 -2239 -6895 -1872 -1530 3614 7549 -2540
1190b540k892J0710n125p804R787M619q566J928J655r020L745J1526o459n974
$$ -2540 -5432 5278 153 -7651 2136 6755 -1811 117 1772 -7248 -3503 8023 1564 -4410
1204d410M559j733j488J0207l184j0730N782O205q862M67Q847l342j850L270r595
$$ -4410 149 -1584 -3072 7135 3951 -6779 -997 5208 -3654 -3187 5660 2318 468 3738 -5857
1219e857m235J5955L167j1896k09M740l786L016J989p741L977J0261j1463p778
$$ -5857 -10092 5863 9030 -2866 -3075 1665 -2121 895 2884 -4857 -880 9381 -2082 -9860
1233i860J2710N417q401m31m84n177P627O392j0128m61Q596o402o869P134K535
$$ -9860 2850 8267 -134 -565 -1049 -6226 1401 7793 -2335 -2796 5800 -602 -7471 -337 2198
1248B198k463N878l424j1278O348R065p343j716O728n509l688R666j066p411O672
$$ 2198 -265 5613 2189 -9089 -2741 6324 -1019 -2735 3993 -1516 -5204 4462 3396 -4015 2657
1263B657k48p932M223L894n325N253O211j3334o402J3282K354o697M188q59m762
$$ 2657 2409 -5523 -1300 2594 -2731 2522 8733 -4601 -11003 2279 4633 -2064 2124 1265 -3497
1278c497N095Q5r082P781J0178j0656p464Q448J263k347N953n640q955Q717O300
$$ -3497 1598 1683 -7399 382 10560 -96 -7560 888 2151 -196 5757 117 -8838 -121 6179
1293F179r289J513P835o157m579M236l825J854J1258m385j1603M811N494p305
$$ 6179 -3110 -1597 6238 81 -4498 -262 -4087 -2233 9025 4640 -6963 -2152 3342 -3963
1307c963L581O800p895k168P182l451l234P150k348n633N527j432p741R621Q879
$$ -3963 -382 6418 -1477 -3645 3537 86 -3148 4002 1654 -3979 1548 116 -7625 1996 10875
1322A0875j2311o696P158N79l02O153n184l925P985j188j2015P026J0041o540
$$ 10875 -1436 -8132 -974 -395 -697 5456 272 -3653 4332 3144 -8871 -1845 8196 1656
1336A656k803K120n673K116J1514o923r641P103L458o679L271L943m672K301K216
$$ 1656 -1147 973 -4700 -2584 8930 2007 -7634 -531 2927 -3752 -481 3462 -1210 1091 3307
1351C307j0650R04J4106l465p769M921q44o593P734L536q056J905M865o282o10
$$ 3307 -7343 -6439 7667 4202 -3567 1354 510 -6083 1651 5187 -2869 -964 3901 -2381 -2991
1366b991O121l486k098Q096n298j0741R406Q807o317k962K80m131M663P346q273
$$ -2991 3130 -356 -2454 5642 344 -10397 -991 7816 1499 -1463 -1183 -5314 -651 6695 -1578
1381a578l343J1458j842j2015L558O023j784M110j761j1933L912J3016n801o759
$$ -1578 -4921 6537 4695 -7320 -3762 2261 477 4587 2826 -9107 -5195 7821 2020 -4739
1395d739N377L06m026M752j671n122R395L475j3498j927J0398m67k050N180o823
$$ -4739 638 944 -3082 1670 -1 -5123 4272 7747 -5751 -7678 2720 2253 203 5383 -1440
1410a440n177R576O66p780N041L849p674R14M267o065Q77J0835n160j0150N653
$$ -1440 -6617 2959 3625 -4155 886 4735 -2939 -2025 2242 -3823 -2946 7889 2729 -7421 -1768
1425a768K988p91M648l418q968O560P808j0297k456J0879l07p204O99k045J331
$$ -1768 1220 429 5077 1659 -7309 -749 7059 -3238 -5694 5185 4878 -2326 -1627 -3672 -2341
1440b341R774j093j4651L495J0020n029k457N545l819j278N815o321n337J2353
$$ -2341 7433 6340 -8311 -4816 5204 175 -2282 3263 -556 -1834 3981 -2340 -7677 4676
1454D676M361j1457k388M625j800L547M327q364k248Q684l221o676P540L090o779
$$ 4676 9037 -2420 -4808 -183 -1983 1564 5891 -2473 -4721 3963 742 -5934 1606 4696 -2083
1469b083J915J717q119M323R860n261o021L667k168n84Q536l387q598Q009M277
$$ -2083 -168 1549 -6570 -2247 7613 2352 -3669 -2 -2170 -2754 5782 2395 -6203 1806 6083
1484F083j0893q60R720o98k799N98p192N50J3228l088j1528N147O055n876m57
$$ 6083 -4810 -5670 4050 3352 553 1151 -6041 -5491 7737 4649 -6879 -1732 4323 -1553 -2010
1499b010M218l982L137O178j1183o286J3050M999q590j558O54k230O193J619r965
$$ -2010 2208 -1774 1363 7541 -3642 -9928 3122 8121 -469 -2027 -1373 -3603 2590 4209 -5756
1514e756K848J0850p149q625P161L501j314L052m492q896P278Q947o677l260M472
$$ -5756 -2908 7942 793 -7832 -671 2830 1516 4568 76 -8820 -1542 7405 728 -2532 1940
1529A940l213p4M817n041l812J0777J918j3777j001R221R88J038j298j0380K966
$$ 1940 -1273 -1347 3470 -1571 -5383 5394 7312 -6465 -7466 1755 2743 3781 2483 -7897 -4931
1544d931J2585m435j0935P717N692n478j198j983k202R565O715j5290p434J2897
$$ -4931 7654 3219 -7716 1 5693 215 -983 -2966 -5168 4397 11112 -4178 -11612 1285
1558A285M724m930j194m096M43J0487k666j3606N249J4542n512j0411N71K592
$$ 1285 6009 1079 -115 -4211 -3768 6719 4053 -9553 -4304 10238 4726 -5685 -5114 -2522
1572b522O052O308j0187j0433J0370Q719q736l806L854R45J913J126j1173q96
$$ -2522 3530 9838 -349 -10782 -412 8307 -429 -4235 -381 564 2477 3603 -7570 -8466
1586h466J7537R86j5491k376N961L788N097m477j2187O574J3416q533j1399O844
$$ -8466 9071 10057 -5434 -7810 -1849 1939 7036 2559 -9628 -3054 10362 1829 -9570 -2726
1600b726Q308k98l128r263l074J5883P940j6670p753J0655N312k161l903o219
$$ -2726 5582 5284 2156 -7107 -10181 5702 13642 -3028 -10781 -126 5186 3025 -878 -7097
1614g097M129J5072o749j9178N865J7625o62r377o277k442J2517J0065j4547j2350
$$ -7097 -2968 12104 5355 -13823 -7958 9667 9005 -372 -6649 -9091 3426 13491 -1056 -13406
1628a3406J2965J0210q448o773k57N084J1520l783j9450N17K0780L226j4240m920
$$ -13406 -441 9769 1321 -5452 -5709 -625 10895 7112 -12338 -11821 8959 12185 -2055 -6975
1642f975J698P749P606q943j3593J1530J4212j0574j3337L461R814O740j389j7917
$$ -6975 -5277 2472 10078 1135 -12458 -928 13284 2710 -10627 -7166 2648 9388 7999 -9918
1656i918n071K1367R035j6703r965R138P929P41q219j0596R667J9239q007k2411
$$ -9918 -14989 6378 15413 -1290 -11255 -2117 5812 6553 -1666 -12262 -2595 16644 8637 -13774
1670a3774K027J6778O214o007j2769n304J6317J2188j7163j4328J3893J3015m269
$$ -13774 -11747 5031 11245 5238 -7531 -12835 3482 15670 -1493 -15821 -1928 11087 6818
1683F818j1932p942R295K0320l633k6443j863K2366O598j2421r089o26J1382J1315
$$ 6818 -5114 -13056 -3761 16559 12926 -13517 -15380 6986 13584 1163 -7926 -8552 2830 14145
1697A4145j4106j7025J3610J8611p296j6234m724Q770J7883J314k4687q944K3402
$$ 14145 39 -16986 -3376 15235 7939 -8295 -13019 -4249 13634 14948 -9739 -18683 4719
1710D719J2508j6544j2814O614J2433O752j3804j9043J1848K6500n850k3545m300
$$ 4719 17227 683 -12131 -5517 6916 13668 -136 -19179 -7331 19169 13319 -10226 -14526
1723a4526J3060J2954M45j9034j1133K0579J7144j7520j9775J0417J8599M444
$$ -14526 -1466 11488 11933 -7101 -18234 2345 19489 1969 -17806 -7389 11210 15654
1735A5654j6035k0143R576K9489J52l0087o974K0967J1648p903j5188o296J7730
$$ 15654 -381 -20524 -10948 18541 18693 -11394 -18368 2599 14247 6344 -8844 -15140 2590
1748B590J7668j7192k3659J0715K3890J329j6134j6140M771K6285O865k9523j3984
$$ 2590 20258 3066 -20593 -9878 14012 15341 -793 -16933 -12162 14123 20988 -8535 -22519
1761b2519K4862J7284j4039j9006l28J8195J7228j6476k8922R519L0284K299k2236
$$ -22519 2343 19627 5588 -13418 -13746 4449 21677 5201 -23721 -14202 16082 18381 -3855
1774c855j2102O877J9443P770k3248j7975K2984K3052j4503k5395R39K2038J6708
$$ -3855 -15957 -9080 10363 18133 -5115 -23090 -106 22946 8443 -16952 -16013 6025 22733
1787B2733j4421l0814K930L5751P775k9642j4466J5366J8687M11k1748j5496K1787
$$ 22733 8312 -22502 -19572 16179 23954 -5688 -20154 -4788 13899 14310 -7438 -22934 -1147
1800a147K6514j4673l1083K659K5563J3647j3163k6827j997L3377J3507l1243
$$ -1147 25367 10694 -20389 -17730 7833 21480 8317 -18510 -20507 12870 26377 -4866
1812d866j9356K0599K3214o540k3044j2491K1200K7730j3194l5496J444L0379
$$ -4866 -24222 -3623 19591 13051 -9993 -22484 -1284 26446 13252 -22244 -20800 9579
1824I579J1223j6086k0819j03K5507J4695k6380k4146K1111K8662q125k6975j1680
$$ 9579 20802 4716 -16103 -16206 9301 23996 -2384 -26530 -5419 23243 15118 -11857 -23537
1837b3537K0226K8947q355l7475m143L4877J3539k3210k0240P157K3800J1093
$$ -23537 -3311 25636 17281 -20194 -24337 10540 24079 869 -19371 -12214 11586 22679
1849B2679k5914k5034K0196L4368q094l2417q520K0640K4479n636l3898q088L4005
$$ 22679 -3235 -28269 -8073 26295 18201 -14216 -22736 -2096 22383 16747 -17151 -25239 8766
1862H766J9443k8073k4937J3921K6631O711k5509k5200J7568L6747n146l7277
$$ 8766 28209 136 -24801 -10880 15751 22462 -3047 -28247 -10679 26068 20922 -16355
1874a6355q202K5877J9925q410k7198p805K9345K1475k6695k9781J4947L1711
$$ -16355 -24557 1320 21245 12835 -14363 -22168 7177 28652 1957 -27824 -12877 18834
1886A8834L156k5000k2972J2807L5736L07l7193j1525K8925K0459j4688k4871
$$ 18834 21990 -3010 -25982 -13175 22561 22868 -14325 -25850 3075 23534 8846 -16025
1898a6025l656K6461K1513k2723l4477J2851L5820L118k7084j8869J1416L0261
$$ -16025 -19681 6780 28293 5570 -28907 -16056 19764 22882 -4202 -23071 -11655 18606
1910A8606M142l3794j6931L0807K4355j9353k8279J338K6912J9752k0347l4835
$$ 18606 22748 -11046 -27977 2830 27185 7832 -20447 -19109 7803 27555 7208 -27627
1922b7627Q694L9080N444l2727j6835J7042K5022P35k9643j6672K8928K9018k1613
$$ -27627 -18933 20147 25591 -7136 -23971 -6929 18093 18828 -10815 -27487 1441 30459 8846
1935H846l2840M750K8201J6609j8473l0601K912L7512R642l3892j8825K1807K4272
$$ 8846 -23994 -19244 8957 25566 7093 -23508 -20596 16916 26558 -7334 -26159 -4352 19920
1948A9920l262k7333j5710K5524L1372j7103l7903K903L2441J3386j8636k5942
$$ 19920 16658 -10675 -26385 -861 30511 13408 -24495 -21592 10849 24235 5599 -20343
1960b0343J796L2468J2544l2151k2204K3455K7760p309k7646j2852K1202L1028
$$ -20343 -18547 13921 26465 -5686 -27890 -4435 23325 16016 -11630 -24482 -3280 27748
1972B7748j0804l8756k351L5029J3726k2076k2616N056K8516J1262k9527k5175
$$ 27748 16944 -21812 -24163 10866 24592 2516 -20100 -15044 13472 24734 -4793 -29968
1984b9968K3978L1807r392l1391q792K1609K6388p681l5308n818L5139J5964k6464
$$ -29968 -5990 25817 16425 -14966 -23758 -2149 24239 16558 -18750 -24568 10571 26535 71
1997G1k2139J0200K6921P668k5845k6035J9881L5584o419l5237p535K3352K0394
$$ 71 -22068 -11868 15053 22721 -3124 -29159 -9278 26306 19887 -15350 -22885 467 20861
2010B0861p814k8547p369L1572J8361k6803k5812J4098K8415M628k4120k3732
$$ 20861 13047 -15500 -22869 8703 27064 261 -25551 -11453 16962 21590 -2530 -26262
2022b6262J3831L4863j28l6028j0533K6297J8667j1493k4073n903K7568K0857
$$ -26262 -12431 22432 22304 -13724 -24257 2040 20707 9214 -14859 -20762 6806 27663
2034B7663k5093l0067J4057L1632K180k3646j8951J1151L0170K101l3810j2072
$$ 27663 2570 -27497 -13440 18192 20372 -3274 -22225 -11074 19096 21197 -12613 -24685
2046b4685K8276J9829j7311k3136j058K5189J8478j9755l2071R981L5332K173
$$ -24685 3591 23420 6109 -17027 -18085 7104 25582 5827 -26244 -16263 19069 21242
2058B1242k7205j4871J3233K3914J537k8222j4462K8185K2598j9638k5463K974
$$ 21242 -5963 -20834 -7601 16313 17850 -10372 -24834 3351 25949 6311 -19152 -16178
2070a6178K3396J5330j6213k8266M509L3646N659k8464j3848J6646J9381o74k5199
$$ -16178 7218 22548 6335 -21931 -17422 16224 21883 -6581 -20429 -3783 15598 14924 -10275
2083a0275j3566K4093K5781j6463l0901L623K6813J1445j5223k3274J401K9931
$$ -10275 -23841 252 26033 9570 -21331 -17708 9105 20550 5327 -17947 -16546 13385
2095A3385Q672k8819j5345K0490J9802n946k1815j1813J9965K5108j2137l1193
$$ 13385 22057 -6762 -22107 -1617 18185 12239 -9576 -21389 -1424 23684 11547 -19646
2107a9646J329K8088Q556j5459j8260L227K3068R070k5257j8209K1822K2649r815
$$ -19646 -18317 9771 18327 2868 -15392 -12165 10903 19973 -5284 -23493 -1671 20978 11163
2120A1163k2521o671J6328K1368p446k9037j583K7617R381j9635j4407O750J9044
$$ 11163 -11358 -18029 -1701 19667 12221 -16816 -18399 9218 18599 -1036 -15443 -8693 10351
2133A0351Q236k1503k0138J7391K7669q526k5594m323J6434J6353n074k4099n404
$$ 10351 18587 -2916 -23054 -5663 22006 13480 -12114 -16437 -3 16350 11276 -12823 -18227
2146a8227K7151J1241k3331j5548J1886J8967L070j7376j7908J2201K6647m779
$$ -18227 8924 20165 -3166 -18714 -6828 12139 15209 -2167 -20075 -7874 18773 13994
2158A3994k5676l461J7517J1472o510j7305n400K1902J3545k0592j8926J2697
$$ 13994 -11682 -15143 2374 13846 7336 -9969 -15369 6533 20078 -514 -19440 -6743
2170f743K0032l9j6104j3327P834K2548Kk4971n231K0158J0225j1216j3628j610
$$ -6743 13289 13250 -2854 -16181 -8347 14201 14203 -10768 -15999 4159 14384 3168 -10460 -12070
2184a2070J6561J3792j5442k1968R983K2928j313j5300j0465O829J7387K094k1694
$$ -12070 4491 18283 2841 -19127 -9144 13784 12471 -2829 -13294 -6465 10922 13016 -8678
2197h678p357K0456J2460j5048j4517K353J4715J1364j0885k1113N078K3466R18
$$ -8678 -16035 4421 16881 1833 -12684 -10331 4384 15748 4863 -16250 -11172 12294 13212
2210A3212j8866n772Q908J1453J210j6707r169J7607J6180j4975j7077N530J4067
$$ 13212 -5654 -11426 -2518 8935 10145 -6562 -15731 1876 18056 3081 -13996 -8466 5601
2223E601N762p240j5553R29J9984L583j9230n531J2139R057l814j0678p789J2161
$$ 5601 11363 4123 -11430 -10501 9483 13066 -6164 -11695 444 9501 5687 -4991 -12780 -619
2237f19J6552r338j9807L783J5127L722p165r938j238J6475M935j6990j0137J5252
$$ -619 15933 6595 -13212 -9429 5698 9420 2255 -7683 -8921 7554 12489 -4501 -14638 614
2251F14J1859p934j0292m746R097J4506m783j8965O22J7549J589j0865n576J769
$$ 614 12473 4539 -5753 -10499 -1402 13104 8321 -10644 -10022 7527 9116 -1749 -7325 -5556
2265e556J0646N685j3687j2187J3831J5040q819j2718n05P245R427j256j4939
$$ -5556 5090 10775 -2912 -15099 -1268 13772 4953 -7765 -8270 -1025 8402 7146 -7793
2278g793j931J6556K965j3071n206P124O891K416q578j1765Q407J5515m753j4397
$$ -7793 -9724 6832 9797 -3274 -8480 -1356 5535 7951 -627 -12392 -3985 11530 6777 -7620
2292g620R81P625M261n71r203m353J3550O614j4049p591R317Q141j225o261p586
$$ -7620 -6639 986 5247 4676 -4527 -8880 4670 11284 -2765 -10356 -1039 7102 5877 -384 -7970
2307g970K624J3467j82j4367M20R511J715m846m229l132R866Q766j2156j1659
$$ -7970 -5346 8121 7939 -6428 -6008 3503 5218 372 -3857 -6989 2877 11643 -513 -12172
2321a2172R564J0810l628o403l401J409R271J321j2697j228J1897K122q474l345
$$ -12172 -2608 8202 4574 -1829 -5230 -3821 5450 6771 -5926 -7154 4743 6865 -1609 -4954
2335d954J335M801P615o966j1516N109J1558k880p594P12J511L792K071q561l587
$$ -4954 -3619 1182 8797 1831 -9685 -4576 6982 4102 -3492 -2780 -1269 2523 4594 -3967 -7554
2350g554J1238M557r275m976M322L317K860j340r136l13J0560O20q717Q95M871
$$ -7554 3684 8241 -1034 -6010 -1688 1629 4489 3149 -5987 -6300 4260 4880 -3837 -2942 1929
2365A929m2J59m208m851P386Q437p605q394M955N009m75m60l905k278P378K122
$$ 1929 1887 2046 -2162 -7013 373 8810 1205 -7189 -2234 2775 2300 1840 -2065 -4343 3035 5157
2381E157q943j467Q542N12l979j424k580K207Q991l574r604L098P044l024k356
$$ 5157 -3786 -5253 3289 3801 -178 -1602 -4182 -1975 7016 3442 -6162 -3064 3980 956 -1400
2396a400J201j523L471K747p594k738Q153K947n702j367J99j54M301J969q353
$$ -1400 -199 -1722 1749 4496 -3098 -5836 2317 5264 -438 -1805 -1606 -1760 2541 4510 -3843
2411c843o85P737j423m500J612J631J3L452m412n856N910P422o120l971K577o06
$$ -3843 -4528 3209 1786 -2714 -1102 529 542 3994 -418 -6274 -364 7058 938 -3033 -456 -1062
2427a062P88L062l780k233O094R46p827Q56M803o79M01mn627J119P888j643o830
$$ -1062 -274 2788 -992 -3225 2869 3815 -4012 -3156 1647 968 1369 1365 -4262 -3143 4745 3102 -3728
2444c728L482K628k905O93J47k985M256L089o834k583O403Q90l322J867j347k950
$$ -3728 -246 2382 -523 170 317 -2668 1588 4677 -2157 -4740 1663 2553 -769 1098 -249 -3199
2460c199M540J340n235J023N173l711k419L068j263j11M642l279n904M663M279
$$ -3199 1341 2681 -2554 -1531 3642 -69 -2488 580 -683 -794 3848 569 -5335 -672 3607
2475C607l985o26K833l474N86L898l807j831O017j141n231K148J479j468K884
$$ 3607 -378 -1004 1829 -1645 -1059 2839 -968 -2799 3218 2077 -3154 -1006 473 -995 1889
2490A889J821o598k66O279k422l552M260j20k480J803n01l233M094L815o571j242
$$ 1889 3710 -2888 -3154 3125 703 -2849 1411 1291 -1189 614 113 -3120 974 4789 -1782 -3024
2506c024M364j266j126K816j388l052L890L29m775L648L704n468M10K142l129
$$ -3024 1340 74 -1052 1764 376 -2676 1214 1543 -3232 416 4120 -1348 -938 1204 -1925
2521a925r7N862l229l670L102J370l746K340K386l693Q75J998m108M89N728k083
$$ -1925 -2022 3840 611 -3059 43 1413 -2333 7 2393 -1300 -425 1573 -2535 -2046 3682 1599
2537A599l703K612k16k943M470J582n828J760L026m149q04M576j356j318K308
$$ 1599 -2104 508 292 -2651 1819 3401 -2427 -667 2359 -1790 -2594 1982 626 -692 1616
2552A616k115l569N652J654m884Q84K493l627P40L602k945o30L714k709l168L535
$$ 1616 -499 -4068 1584 3238 -1646 -762 1731 -1896 -1156 2446 -499 -1129 2585 -124 -3292 243
2568B43K422l298Q41J212m449J257N129l415k084M021j413l359L403J121k853
$$ 243 2665 -633 208 1420 -3029 -1772 3357 -58 -2142 1879 466 -2893 510 1631 -1222
2583a222K718P24m877P61N093l290j201L461k340k845M640K97l940K890J855n116
$$ -1222 1496 2220 -2657 -1896 3197 -93 -1294 2167 -173 -3018 1622 1919 -2021 869 2724 -2392
2599b392R46K949k407J04L775l340k931M827k97k981K876J295m496J100K503k654
$$ -2392 -1446 1503 -904 -800 2975 -365 -3296 1531 1234 -1747 1129 2424 -2072 -972 1531 -1123
2615a123N83L721l377l015L674k35j635K755N33m991K717K698m128L56M079k081
$$ -1123 -540 3181 -196 -3211 463 228 -1407 1348 1881 -3110 -393 2305 -1823 -1467 2612 531
2631E31k808L232r53j940M114N92m823J594K470l739Q88L593l324j659L891k159
$$ 531 -2277 955 2 -1938 2176 2768 -2055 -461 2009 -1730 -842 2751 -573 -2232 1659 -500
2647e00k105M296J028m313J645N25k964J983L849l685j588L412j606k075M353
$$ -500 -2605 1691 2719 -1594 51 576 -2388 -405 3444 -241 -1829 1583 -23 -2098 2255
2662B255p86l216K895L09m126J361M662k886j858K883k497j630N509j111m077
$$ 2255 1469 -1747 1148 1457 -2669 -1308 3354 468 -1390 1493 -1004 -2634 2875 1764 -2313
2677b313K355K104m521J689K996l165L65L221m699j382N441l57l069J153J048
$$ -2313 42 2146 -2375 -686 2310 -855 -490 2731 -1968 -3350 2091 1734 -1335 -182 866
2692H66l467K849K359m368Q09L233k704k776M293k37k096L020q22m330L054L651
$$ 866 -2601 248 2607 -1761 -952 2281 -423 -3199 1094 857 -1239 1781 959 -3371 -317 3334
2708C334l432p07K297k485q06L292j631k272M580M3n202K030K646k208R67J257
$$ 3334 -98 -805 1492 -993 -1799 1493 -138 -2410 2170 2213 -2989 -959 1687 -521 446 1703
2724A703m171N33M573k087k756L351N01k695Q43Q56k425K927K060n296q89M179
$$ 1703 -2468 -1935 2638 551 -2205 1146 1647 -1048 -205 651 -1774 1153 3213 -2083 -2972 1207
2740A207l93j706K282j437j753K487Q87l917K185L280l648r58J926j452R84L236
$$ 1207 814 -892 1390 -47 -1800 687 1574 -2343 -158 3122 -526 -1484 442 -1010 -26 3210
2756C210j937m982L538K204k931M82K549l259L87K589l547n74M708k85m227J156
$$ 3210 1273 -3709 -171 2033 -898 -416 2133 -1126 -739 1850 -1697 -2271 2437 2152 -2075 -919
2772i19J363k048K937J214m370K58M460k779k465L406J70j700J822j915k292L838
$$ -919 444 -1604 1333 2547 -1823 -1565 2895 116 -2349 1057 1227 -473 1349 -566 -2858 980
2788I80K528m764r57K460k74j34K026k044k121M759j119m537K467L338k306m45
$$ 980 3508 -1256 -2213 247 -27 -161 1865 -179 -2300 2459 1340 -3197 -730 2608 302 -143
2804a43J021l341J610M289l202k569K586N92k301J561L54j883K064J286m726K91
$$ -143 878 -2463 -853 3436 234 -2335 251 843 -1458 103 457 -1426 638 1924 -2802 -2511
2820b511M703j046k151J808j658r76L902k94l789J061L295k969j346L131j151
$$ -2511 2192 1146 -1005 803 -855 -1831 2071 1777 -2012 -951 2344 -625 -1971 1160 9
2835IJ62K535l532l265M510K341l601j47J348k379J899K702m254k90N200j957
$$ 9 171 2706 -826 -4091 419 2760 -841 -988 360 -2019 -120 2582 -1672 -1962 3238 1281
2851A281m009J718J991m81R88r79m080K784M227l615j551L164j278j067J251n04
$$ 1281 -2728 -1010 981 500 1488 509 -3571 -787 3440 -175 -1726 1438 160 -907 344 -160
2867a60k078L828J019m462k23L048k59k86Q83k611j177M614q49l770K335K275
$$ -160 -2238 1590 2609 -1853 -2076 972 713 427 1310 -1301 -2478 2136 1287 -2483 -148 2127
2883B127k832k61Q78j871K301L594m769k885M686J152k387J173l64k450K303J878
$$ 2127 -705 -966 -88 -1959 342 3936 -833 -3718 968 2120 -267 906 542 -1908 395 2273
2899B273m624N53M492q73l432J202p89M44L582j594m933K894L291l007j104K281
$$ 2273 -2351 -1798 2694 1821 -1611 -409 -1198 -754 2828 1234 -3699 -805 2486 -521 -1625 656
2915F56m11o91K509l458r35M794K48l544k50R95n73J543J209m305O37M235k187
$$ 656 245 -446 2063 -1395 -2330 2464 2712 -832 -1082 -87 -660 883 2092 -2213 -1576 2659 472
2932D72l102K462J170j461J226q64l003L832K680l713k091K950j98j084K115j577
$$ 472 -2630 -168 1002 -459 767 -97 -3100 732 3412 -301 -2392 558 360 -724 1391 -186
2948a86j522L200N39m864J325L436j749m60J030k849Q81L495j102l695L072J260
$$ -186 -1708 1492 2031 -2833 -1508 1928 179 -281 749 -2100 -1219 2276 1174 -2521 551 1811
2964A811k578k12J772j064P01J712l593j374M245L75k717P72p49l56K198J212
$$ 1811 -767 -979 793 -271 430 2142 -1451 -2825 1420 1795 -922 -150 -899 -1255 943 2155
2980B155m240J391L987l793j643J936P75q70J811j109l891M003J856k656l71J606
$$ 2155 -2085 -694 3293 -500 -2143 -207 568 -302 1509 400 -3491 512 2368 -288 -659 947
2996I47k110K84J906j720q82L473n09m350K170J493j146R04N77l120Q27L054j899
$$ 947 -1163 -879 1027 -693 -1575 1898 1389 -2961 -791 702 -444 460 1037 -2083 -1256 1798 -101
3013a01j508L072n0k704J481J81k342L243J666m406j488M045o80j117J604j039
$$ -101 -1609 1463 1413 -1291 190 371 -1971 1272 2938 -1468 -2956 1089 409 -708 896 -143
3029a43j544K372M12l816K893K828l443r00J796r62j42L078j718k766K506k4j499
$$ -143 -1687 685 1097 -2719 174 3002 -441 -1341 455 -507 -649 2429 711 -2055 451 427 -1072
3046a072J135J205k785P72K397l035j49M060j011l217K219m55j466K576R99l529
$$ -1072 63 1268 -1517 -745 1652 -1383 -1532 2528 1517 -1700 519 64 -1402 1174 2173 -1356
3062a356Q98J998k544n29L443j608j109J603o82k036K630J724l384l42K164j653
$$ -1356 -458 1540 -1004 -1533 1910 302 -807 796 114 -1922 708 2432 -952 -1294 870 -783
3078g83N8K155j788p85K157j002k299L123J188k481J20J079k522R69K844j528
$$ -783 -725 1430 -358 -1143 1014 12 -2287 836 2024 -457 -337 742 -1780 -811 2033 505
3094E05k333L037j042k270K359Q39k240J279J213l726P70L350j761j010J820n77
$$ 505 -1828 1209 167 -2103 256 1095 -1145 134 1347 -2379 -1609 1741 -20 -1030 790 213
3110B13j893K710J90k068J288R19k838N91K459j944M49J647j989k333L293R18
$$ 213 -1680 1030 1220 -848 440 1359 -1479 -888 1571 -373 76 1723 -266 -2599 694 1612
3126A612k922J991P4k091O94K178k599Q50K405k213k375L156J46j816J860K55
$$ 1612 -1310 681 755 -1336 -642 1536 -1063 -213 2192 -21 -2396 760 906 -910 950 1205
3142A205l220J325K356k828O08K867k318j731K522n92j318L068M7l975J272K361
$$ 1205 -2015 -690 1666 -1162 -554 2313 -5 -1736 786 194 -1124 1944 1991 -1984 -712 1649
3158A649k368L75J972j897j310K589j025j366K981j39l312R15K329k961J640J526
$$ 1649 -719 -344 1628 -269 -1579 1010 -15 -1381 1600 1461 -1851 -936 1393 -1568 72 1598
3174A598j788j176K259m53j819K228O09l342J643P24k084K029J976k983o34K093
$$ 1598 -190 -1366 893 440 -1379 849 1458 -1884 -241 483 -1601 428 2404 -579 -1213 880
3190H80p71j853K796K10k507J680L11k741K086J894k310n38J611j855j83L351
$$ 880 109 -1744 1052 1262 -1245 435 746 -1995 91 1985 -325 -863 748 -1107 -1290 2061
3206B061j699k362K166Q34k599J159K406k114p56J769k080m69L409j53k945J850
$$ 2061 362 -2000 166 1000 -1599 -440 1966 -148 -904 865 -1215 -1684 1725 1572 -1373 477
3222D77O30k316J152J600j829k58K376k336j633L622n66j302J411m00k731K393
$$ 477 1107 -1209 -57 1543 -286 -544 1832 -504 -2137 1485 919 -383 1028 628 -2103 290
3238B90J931l509P28K287k206p49K907j453n80J902o60k802K045J127j495O64
$$ 290 2221 -1288 -560 1727 -479 -1228 1679 226 -354 1548 888 -1914 131 1258 -237 427
3254D27J207k932K35L081j640j956L126m89k715J243N94j456J219J691k276j570
$$ 427 1634 -1298 -1063 2018 378 -1578 1548 1059 -1656 -413 181 -1275 -56 1635 -641 -2211
3270b211L697r17j854K490p00k515K304P36k885K197J848l189n29K318q95j0J951
$$ -2211 1486 569 -1285 1205 505 -2010 294 1030 -1855 342 2190 -999 -1528 790 -105 -115 1836
3287A836j433k715K821Q67k947J544J630l120L66K431j826l60K422q81j800J198
$$ 1836 403 -2312 509 1376 -1571 -27 1603 -1517 -1151 1280 -546 -906 1516 635 -1165 33
3303C3M23j593K368L31l780R26K551k127k90K685r40k092J950k59j694K654J386
$$ 33 456 -1137 1231 1562 -2218 -1292 1259 -868 -1158 1527 587 -1505 445 186 -1508 1146 2532
3320B532m051Q18J183j430J38K749k208j406K286R9k425K115J950l185Q71R24
$$ 2532 -1519 -701 482 -948 -810 1939 -269 -1675 611 710 -1715 400 2350 -835 36 960
3336I60k658J275K648k354j177K534p98j627J789J24k874K571J600k971l54K419
$$ 960 -1698 -423 2225 -129 -1306 1228 430 -1197 592 716 -2158 413 2013 -958 -1312 1107
3352A107k91j169J413j942j355L534k7k805Q99J921j558R1J348k788J156L132
$$ 1107 816 -353 1060 -882 -2237 1297 1270 -1535 -636 1285 -273 -182 1166 -1622 -466 2666
3368B666k729k805L596J136j906K27p2j747K294J425k387j686L923j436k121J303
$$ 2666 -63 -2868 728 1864 -42 185 113 -1634 660 2085 -302 -1988 1935 499 -1622 -319
3384c19M44p80K230j81l593R62L606j366j477R91j076p0K396k020j988K901J613
$$ -319 125 -655 1575 1394 -2199 -1237 2369 1003 -474 517 -559 -629 1767 -253 -2241 660 2273
3401B273l542p7J247m80J532P95k723j148L623K76l161Q21J993j814J782r52k748
$$ 2273 -1269 -1346 -99 -579 953 1748 -975 -2123 1500 1776 -1385 -564 1429 -385 1397 445 -2303
3418b303K395L581l202l424K283J399j45M07j451k019L680J165l703k37K812L44
$$ -2303 92 3673 471 -2953 -670 729 584 991 -460 -2479 1201 2366 -1337 -1574 1238 1582
3434A582j511q3j625L22M474j179m806J289L586j110j032j64j604J793K826l679
$$ 1582 71 -12 -1637 -1315 3159 1980 -2826 -1537 2049 939 -93 -257 -1861 -68 2758 -921
3450i21k812M347J877k587j060N9o97L384J019m299j343M986J38l273M14N21L46
$$ -921 -3733 614 2491 -96 -1156 -1097 -1794 1590 2609 -1690 -3033 1953 2091 -1182 -768 -247 99
3467I9K577k712l791K414N401k791l333O12R63J993O79k817k722N213J408m498
$$ 99 2676 -36 -3827 -1413 3988 1197 -2136 -1524 -561 1432 2111 -706 -3428 1785 3193 -1305
3483a305j450K599J288Q10q97m614J167O466j034n665P96L092l52P79k245k359
$$ -1305 -2755 -156 1132 1942 1045 -3569 -2402 4064 3030 -2635 -1839 1253 901 1680 -565 -2924
3499b924L231M420n431l398L565K849r58j176k262r5M575J850o727o23N168K73
$$ -2924 307 4727 -704 -4102 -537 2312 1354 178 -2084 -2179 2396 4246 -2481 -3104 2064 2337
3515B337k663p83p22K018L973l409o261L397N394j032k922j585L42L398J805m702
$$ 2337 -326 -1109 -1831 187 4160 751 -5510 -2113 3281 2249 -673 -2258 -1916 1482 3287 -1415
3531a415k958N988K728m324k807M05K452L714j660o565J412O397j224l773j035
$$ -1415 -4373 1615 4343 19 -2788 -2383 69 3783 2123 -4442 -3030 3367 2143 -1630 -2665
3546b665J513K467J577m217l605M828M719l535m933J930K767K175m85n612p62
$$ -2665 -1152 1315 2892 -1325 -4930 -102 4617 1082 -3851 -1921 846 3021 2536 -3076 -3838
3561c838O981K256q058r20M080K124n91l660l101L175Q152m286p020J396N628
$$ -3838 3143 5399 -2659 -3579 501 2625 2034 -1626 -4727 -1552 6600 2314 -4706 -3310 2318
3576B318Q39k125l396j582O205K479o489l212N661L600k256l827k003K686O914
$$ 2318 3157 1032 -2364 -3946 2259 4738 -1751 -4963 698 4298 2042 -1785 -3788 -1102 5812
3591E812k259q506O20P830L6m030k140M44M243L014n327n756M995O810l835m938
$$ 5812 3553 -4953 -4333 3497 3533 -497 -2637 -2193 2050 5064 -263 -6019 -1024 5786 1951 -2987
3607b987o98K234N052L72q419j388Q431L200o941l515K861M369K108n070o599
$$ -2987 -3685 -1451 3601 3973 -4446 -5834 2597 5797 -1144 -4659 -1798 2571 4679 -391 -6990
3622f990M600Q505k232p304o47N079K413K96o532k771Q068M582q734m344M124
$$ -6990 -2390 6115 3883 -3421 -4068 1011 3424 3720 -2812 -5583 2485 7067 -1667 -6011 -1887
3637a887N360O14m057n428J598R352j020q496j211P010K981l239m837k296P759
$$ -1887 3473 4087 30 -5398 -3800 5552 4532 -3964 -5175 1835 4816 1577 -3260 -5556 2203
3652B203N064o587p933M933P601j122m579m141J001P747J842r704k655P911M925
$$ 2203 7267 680 -7253 -2320 5281 4159 -420 -4561 -3560 4187 6029 -3675 -6330 1581 6506
3667F506n591m968K7N341N390m895r289L385R822r38p038k617L308N204J750q342
$$ 6506 915 -4053 -4026 1315 6705 1810 -7479 -4094 5728 4790 -2248 -4865 -1557 3647 5397 -2945
3683b945m238Q592N905n865p204J551N676M491l587q883O87J1340R44r276k164
$$ -2945 -7183 1409 7314 1449 -5755 -4204 1472 5963 2376 -6507 -5820 5520 6464 -2812 -4976
3698d976M082M766M8o227n309P817Q238n793q617J504P679K253l858o736O6R684
$$ -4976 -894 3872 3920 -2307 -7616 201 8439 2646 -5971 -4467 3212 5465 1607 -5129 -5063 4621
3714D621K830j0146m665O686O527k201o435l837O068Q307m117j0799J785Q781
$$ 4621 7451 -2695 -7360 -674 5853 3652 -2783 -6620 -552 7755 3638 -7161 -5376 3405
3728C405J794n217m733L19Q628L109r302o346P962P312l930o412k476M392Q673
$$ 3405 5199 -18 -4751 -4432 4196 7305 -1997 -8343 -381 6931 3001 -3411 -5887 -1495 7178
3743G178k017j1930R09R787K581p878m211K239O899L201p380p886O379J0188l430
$$ 7178 5161 -6769 -5860 3927 6508 -1370 -5581 -3342 3557 6758 -622 -8508 -2129 8059 4629
3758D629r511o68M932O294j244r498j854J0670M562q900o416L859P348K326p016
$$ 4629 -4882 -5550 -618 5676 4432 -5066 -6920 3750 8312 -588 -7004 -3145 4203 6529 -487
3773d87p539M657J1080j878j1203j276P661M253k152p842k235R376O764r113q790
$$ -487 -8026 -3369 7711 5833 -5370 -6646 1015 5268 3116 -4726 -6961 2415 9179 66 -8724
3788h724N154Q990N73p005n497L236R584L65j1809k181R934L999n005o793j048
$$ -8724 -3570 5420 5993 -1012 -6509 -3273 6311 6676 -5133 -7314 2620 6619 1614 -5179 -6227
3803f227Q183P117p936j0383N118J0292p91o985m957L536Q765Q23j1114l605R922
$$ -6227 1956 9073 1137 -9246 -4128 6164 5373 -1612 -6569 -3033 5732 6555 -4559 -8164 1758
3818A758O324o339p360K11P168N865n546j0354L057J1497M13r879l506N129P228
$$ 1758 8082 1743 -5617 -5406 1762 7627 2081 -8273 -5216 6281 6694 -3185 -6691 -1562 5666
3833E666p5r075n345R765Q886q264q589J867P690M394m901r171J842J1509J664
$$ 5666 5591 -3484 -8829 936 9822 1558 -7031 -5164 2526 6920 2019 -7152 -5310 6199 7863
3848G863j1585l657P677N714r73q612m391P796R864o353j0993J977R749K380n346
$$ 7863 -3722 -7379 298 6012 5039 -3573 -7964 -168 9696 3343 -7650 -5673 4076 6456 1110
3863A110o393J63J0310K855j0745n834Q518P782m378o926l291N713R138l420j2368
$$ 1110 -5283 -5120 5190 8045 -2700 -8534 -16 7766 3388 -3538 -6829 -1116 8022 4602 -7766
3878g766J308J0794K549p390n485J813Q530L622j0031p520Q138R534l912q304
$$ -7766 -6458 4336 6885 -505 -5990 -4177 4353 7975 -2056 -9576 -1438 8096 4184 -4120
3892d120k057N913P152j778j1555l44J1454K333q944m601L312P743K209p400p850
$$ -4120 -6177 -264 6888 5110 -6445 -6789 4665 6998 -1946 -6547 -3235 4508 6717 -683 -8533
3907h533O030J0746l121r966r56P028M426j881q444k495J0591M803q964o817N278
$$ -8533 -2503 8243 5122 -4844 -5800 1228 5654 3773 -4671 -7166 3425 8228 -736 -7553 -2275
3922b275O743J640o800o372L500J0612j027j1236j295Q224M021m026o460j386
$$ -2275 4468 6108 -692 -7064 -3564 7048 6021 -5215 -6510 1714 5735 1709 -4751 -6137
3936f137R052N999q299r950N608R126j76o269n204L469Q682P31j1244k929J0385
$$ -6137 2915 8914 615 -9335 -3727 5399 5223 -1046 -6250 -2781 5901 6632 -4612 -7541 2844
3951B844L918n527o555j64O936O288o371q925L360J0380q06p654l151L637O854
$$ 2844 6762 1235 -5320 -5484 1452 7740 1369 -7556 -4196 6184 5378 -2276 -5427 -1790 5064
3966E064K67q729m526R697O456o981p217J735N976M426m042q519J743J0045P78
$$ 5064 5331 -3398 -7924 1773 8229 1248 -5969 -4234 1742 6168 2126 -6393 -4650 5395 6173
3981F173r434k331M535N711j71p190m162P447P857n534r156K712N951K741l373
$$ 6173 -3261 -5592 -1057 4654 4483 -2707 -6869 578 8435 2901 -6255 -3543 2408 5149 1776
3996A776o953N83R246J997r994l571P066N918k870n416l619M725Q609m349q743
$$ 1776 -5177 -4594 4652 6649 -3345 -6916 150 6068 3198 -2218 -5837 -1112 7497 3148 -5595
4011e595J108Q610R51n068m822J331P285L051q779n666P381O595l184o060k048
$$ -5595 -4487 4123 5074 6 -4816 -3485 3800 6851 -1928 -7594 -213 6382 3198 -2862 -4910
4026d910L831O453j921q587j086R853J642o213l510J742N739K597n955p343N764
$$ -4910 -1079 5374 3453 -5134 -6220 3633 5275 -938 -4448 -2706 3033 5630 -325 -7668 -1904
4041a904P526k264p068k68L109N263p45p896j311Q363L040o515m600L351N297
$$ -1904 5622 3358 -3710 -3978 -869 4394 3649 -4247 -5558 2805 5845 -670 -5270 -1919 3378
4056C378J369m801o274M119Q128j852p554p38N620K754k189n374j513P378M224
$$ 3378 4747 -54 -6328 -2209 5919 4067 -3487 -4225 1395 4149 1960 -3414 -4927 2451 6675
4071F675o859n972M167N889O8m320l824J558P040J59q326j662P149K598l397m521
$$ 6675 -184 -6156 -1989 3900 3968 -352 -4176 -2618 4422 4581 -3745 -5407 1742 4340 943 -3578
4087c578k95M637M876m231p805L508O373J04m986j331J086N059R24o911k527O704
$$ -3578 -3873 764 5640 1409 -6396 -2888 3485 3589 -1397 -2728 -1642 3417 4341 -2570 -5097 1607
4103A607L771m870l413n18L836L920k479o741J291P446k24n359j430L078K709
$$ 1607 5378 508 -2905 -3423 413 4333 1854 -4887 -3596 3850 3626 -1733 -3163 -85 2624
4118B624O10n042l586O016M663m127m823J527K939K141j391n190M72N963J409
$$ 2624 3234 -1808 -5394 622 5285 1158 -3665 -2138 801 2942 1551 -3639 -3167 2796 4205
4133D205o302j509L978J956o70k928l584L843N612k487o045J629M584K3j040l644
$$ 4205 -2097 -3606 372 2328 1658 -1270 -4854 -1011 4601 2114 -3931 -2302 2282 2305 1265 -2379
4149b379l57M471K624n992k882M989K887j646k837j685J426N006r88o113J000
$$ -2379 -2736 1735 4359 -1633 -4515 474 3361 1715 -1122 -2807 -1381 3625 2637 -3476 -2476
4164b476M974k8l025j675L93K775K944m103l897L956L802k024l650MP16L284L96
$$ -2476 2498 2470 -555 -2230 -1837 938 3882 -221 -4118 -162 3640 1616 -2034 -2030 -1314 1970 2366
4181B366m542j156N645J068m475j175J638J287K125k701l312J771N284k134l672
$$ 2366 -2176 -3332 2313 3381 -1094 -2269 -631 656 2781 80 -3232 -1461 3823 1689 -1983
4196a983M31K557K59P15l324j583L656K950m669k279L046Q84O27o59k995J96M807
$$ -1983 -1552 1005 1264 1979 -1345 -2928 728 3678 -991 -3270 -224 660 1287 628 -2367 -2171 2636
4213B636m91l766j004M138j6q31p76k370K489L456l041l432K068K888j097o55
$$ 2636 2145 -1621 -2625 1513 1497 666 -110 -2480 9 3465 424 -3008 -940 1948 851 196
4229A96j614n66L301J389m502j148M076J023k647o61l62P89L169r82l761J336
$$ 196 -1418 -1984 1317 2706 -1796 -2944 1132 2155 -492 -1153 -1515 -726 2443 1461 -2300 -964
4245i64L230j541j351N19m02N88K474k868k529L477K127l423m30L81k13J860M73
$$ -964 2266 725 -626 -107 -509 79 2553 -315 -2844 633 2760 -663 -1093 -712 -925 935 1408
4262A408l185J07K908ok712R00P21L26M85o67l025K374L198k199k431R97J000
$$ 1408 -1777 -1670 1238 1232 -1480 -580 141 467 952 285 -2740 -366 2832 633 -1798 -801 199
4279A99K55n9m97j655L071R72l411p93K337K53k0q20j258j55L717r29l521J742
$$ 199 454 395 -102 -1757 1314 2286 -1125 -1918 419 672 652 -168 -1426 -1581 2136 1207 -2314 -572
4297e72J998j001p30L80q18P86J954k185j976K541J050j054j29q5j445J761J302
$$ -572 1426 425 -305 75 -743 43 1997 -188 -2164 377 1427 373 244 159 -1286 475 1777
4314A777k849K05K175n10j620R64n02p9J682p35k023N41K730j869q36R25k59L9
$$ 1777 -1072 -867 1308 798 -822 142 -360 -439 1243 508 -1515 -974 1756 -113 -949 -24 -283 -244
4332b44J358j445j342K268N93k308N50R87p51P04P63j802l61K409r2k519J179
$$ -244 1114 -331 -1673 595 1188 -1120 -570 417 -334 370 1133 -669 -1030 1379 1287 -1232 -53
4349e3M60q08K10J18p85K12K121j752j603J836N37q05J640j443j021J591R50k533
$$ -53 407 -401 -191 -73 -858 -646 1475 -277 -1880 -44 493 -312 1328 -115 -1136 455 1405 -1128
4367a128O36J675r02j235J425j089q2J783m12j619M06J564j255P46P46j821l52
$$ -1128 -492 1183 281 -954 471 -618 -700 1083 671 -948 -542 1022 -233 513 1259 -562 -914
4384i14J684j013q87J797N92k068J158o6j059J160R59j914P7J584j376r46K104
$$ -914 770 -243 -1130 667 1259 -809 349 283 -776 384 1343 -571 -494 1090 -286 -1232 872
4401H72j71j218P02K14j072Q20J404j944P1Q02j230j91J793k59j495J476k32k078
$$ 872 701 -517 185 399 -673 147 1551 -393 -322 480 -750 -941 852 593 -902 574 342 -1736
4419a736J236J607j685J05J519j505k68J896m86j465J213k9j250Q48M87o32j22
$$ -1736 -500 1107 -578 -473 1046 -459 -727 1169 683 -782 431 402 -848 0 487 -145 -267
4436b67J423j389o32J805p24r84J652r24r26J494K00j522N79J084j135n89K055
$$ -267 1156 -233 -865 940 216 -768 884 -40 -966 528 728 -794 -215 869 -266 -855 1200
4453A200m69j096J162o86r25O91J148k013J203L15o26n88J867j314p80J858r88
$$ 1200 731 -365 797 111 -814 -123 1025 -988 215 530 -96 -684 1183 -131 -911 947 -41
4470d1j126J163L49q50K17J668k106M23J213p79j003J116N30j451J445k41r08
$$ -41 -1167 -4 345 -505 -288 1380 -726 -303 910 131 -872 244 774 -677 768 527 -381
4487c81L40J128k021P96Q07p54o23J857p85j308Q85M74j021R29L17j165p3J731
$$ -381 -41 1087 -934 -138 669 -85 -708 1149 364 -944 -59 415 -606 323 640 -525 -598 1133
4505A133j638j82K026q51j323J191J61j136Q08J071k180M74J087j893P87J510
$$ 1133 -505 -687 1339 488 -835 356 517 -619 189 1260 -920 -446 641 -1252 -465 1045
4521A045j245j198J890l81j204J086M13j022p8J461j514P88J128q72o39J094n76
$$ 1045 -200 -1398 492 111 -1093 -7 406 -616 -694 767 -747 41 1169 297 -342 752 176
4538A76r96R36J247j524K87P91j426J09J283n16j347J423r38k0J417p62n17O83
$$ 176 -820 116 1363 -161 126 917 -509 -400 883 367 -980 443 -495 -515 902 140 -377 306
4556C06j20j359M53J975j521k37R26p51p11J113N23j358N03J100k113J056Q98
$$ 306 186 -1173 -720 1255 -266 -503 423 -328 -1039 74 597 -761 -258 842 -1271 -215 683
4573F83l55l72J261j146l40J086j41j373J416N51j729l46J854j104n90J259r96
$$ 683 328 -44 1217 71 -269 817 676 -697 719 1270 -459 -805 1049 -55 -645 614 -382
4590c82p83J899m34r66O72R83j025K0O99j101l47J428n33j347J803l90q82J307
$$ -382 -1165 734 300 -666 6 989 -36 -16 683 -418 -765 663 130 -1217 586 196 -686 621
4608F21j28j826J530J84q29j17J693j558m61J736n29j553J825J4j586P04R23j015
$$ 621 493 -1333 197 381 -448 -565 1128 -430 -891 845 316 -1237 588 602 -984 -280 643 -372
4626c72K5R96q75k90J484j195l33Q28J98j185O03j75k67L52J326j231l32J191
$$ -372 -347 649 -226 -516 968 -227 -560 268 466 -719 -116 -291 -558 -206 1120 -111 -443 748
4644G48r21m11J034O82k262P93J242j411K12J293o49r85Q26j115L47J476l26j343
$$ 748 -173 -584 450 1132 -1130 -337 905 -506 -294 999 350 -635 191 -924 -577 899 573 -770
4662g70P76N01j130N57J073j374P20Q09j442q12J929m10j255R02K74j175O91J134
$$ -770 6 507 -623 -66 1007 -367 353 1162 -280 -1092 837 427 -828 74 348 -827 -136 998
4680I98j565m40K078j351p11J551n53o88P90j31j189Q29J856j193j112R86p10
$$ 998 -567 -1007 1071 -280 -991 560 7 -681 109 -22 -1211 -382 1474 281 -831 155 -555
4697e55j86J210n39q60J599k61j694J449P78j371L61O41j308O30J182q31o40Q05
$$ -555 -741 469 -70 -930 669 408 -1286 163 941 -430 -69 572 -736 -106 1076 245 -395 410
4715D10M29j420O55k09o20J146N51j638o48J614L18r26N17m59k92P74R62k128
$$ 410 839 -581 74 -135 -755 391 942 -696 -1344 270 588 -338 179 -280 -572 202 1164 -964
4733i64P41R11j276m11J452m86o45J795p88j628J175J176j313k31J081p43k58
$$ -964 -223 688 -588 -999 453 -33 -678 1117 329 -1299 -124 1052 -261 -492 589 -154 -412
4750d12R58j019r4J354l67j191J234l18p2J76Q64j573n69K062p93j022J697j339
$$ -412 546 -473 -567 787 420 -771 463 145 73 249 1113 -460 -1029 1033 240 -782 915 -424
4768d24O79M21r56k54R59P43j738L06R01n55m91J154j400P4J397n14j383R21J105
$$ -424 255 676 -280 -534 425 1168 -570 -264 637 82 -409 745 -655 -581 816 302 -1081 -160 945
4787I45r92j79N47q31k28K163q95j628J285jn65O33M87j336O76R36j347j057K192
$$ 945 -47 -226 321 -510 -738 1425 530 -1098 187 186 -379 254 741 -595 81 1017 -330 -1387 805
4806H05j02j273J116l06j122J803j7j678L02J369j324M00O57o71m77J012k92j228
$$ 805 703 -570 546 240 -882 921 904 -774 -472 897 -427 -27 630 -41 -518 494 202 -1026
4824a026R19O27r11r3Q62r39m7J768j712q5J634n99j026N24P44p70J24R55j527
$$ -1026 -107 520 -391 -484 378 -561 -608 1160 -552 -637 997 398 -628 -104 640 -130 -6 949 -578
4843e78k61J628p84k64O90L39j052K71J67p62J286l9j769L73J586j115k48J033
$$ -578 -839 789 5 -259 431 770 -282 -11 156 -606 680 641 -1128 -755 831 -284 -532 501
4861E01p68o84J752n38j115J173L02q69L32k68l22M1J600j774n13J701L69j047
$$ 501 -267 -951 801 263 -852 321 623 -246 86 -182 -504 -463 1137 -637 -1150 551 920 -127
4879a27L83J88r92O31N97j072m78J737m79j281J275j31q96J037O43k065Q75J312
$$ -127 256 444 -548 83 680 -392 -870 867 388 -893 382 251 -645 392 1035 -1030 -155 1157
4897A157j294o12J756j455J66N40m59p35J043O94j090p5Q28q60R2J534j852L15
$$ 1157 -137 -749 1007 -448 -282 258 -201 -936 107 801 -289 -364 464 -396 -304 1230 -622 -307
4915c07J267m26j265J471m3j443M70O27j333R53R82j357j06R11j82j172J315j3
$$ -307 960 534 -731 740 697 -746 -276 351 -982 -29 953 -404 -510 401 219 -953 362 349
4933C49j085Q13K97j232Q04N66n36k87L31m7q84J317k55j162J086J074k149R62
$$ 349 -736 77 374 -858 -54 512 -24 -311 20 -27 -911 406 151 -1011 75 1149 -1000 -38
4951c8P63j333R8J928j149o93R95K00r58N14O0r94O51O17j650M32J256j282k24
$$ -38 725 -608 -510 1418 269 -424 571 771 -187 327 387 -607 44 661 -989 -557 699 -583 -807
4970h07J395m36o21J153k58r85P09R75j645M01J087j734m8J552o78m83J292k92
$$ -807 588 152 -469 684 426 -559 150 1125 -520 -119 968 -766 -814 738 60 -423 869 577
4988E77j466L85O43p89N51J223r39p55J809j109n42P33K49q57J89Q24j348M72
$$ 577 -889 -504 139 -650 -99 1124 185 -570 1239 130 -412 321 570 -287 -98 726 -622 -150
5006a50Q37q87L6J110m94j362J285M54j434N13j5q50Q93J297j429q95J436o65
$$ -150 687 -200 -164 946 452 -910 375 829 -605 -92 -107 -957 -64 1233 -196 -1091 345 -320
5024c20o13J549P8j732J246j52j001J194R20j897K96J237r64j32O35j42r63O67
$$ -320 -933 616 694 -1038 208 56 -945 249 1169 -728 -432 805 -159 -291 344 202 -761 -94
5042i4J188j985P20J046j419K8R49p39j31J276k44r33J009j74o55K61N88j154
$$ -94 1094 -891 -171 875 -544 -516 433 -306 -437 839 595 -338 671 497 -158 103 691 -463
5060d63j73R72o68k01J383q59k91N89j65r36J036M58j329R52O93j473L15J094
$$ -463 -636 336 -332 -533 850 -9 -300 289 124 -812 224 682 -647 305 998 -475 -160 934
5078I34m89j012J240n23j005J332j71m90K68O51j110K22J305r56p04Q63k67r22
$$ 934 445 -567 673 150 -855 477 306 -184 84 735 -375 -153 1152 196 -508 355 88 -834
5096h34Q42N58p68M53j16q47K26R47p36L06N54l65j074J396m63p26M05O24q97
$$ -834 8 566 -202 251 135 -712 -486 461 -275 31 585 220 -854 542 79 -647 -242 382 -515
5115e15K31R08r12k0J190j248j77J015J39j058J034j20r96M54P80j314O52N93
$$ -515 -284 624 -288 -308 882 -366 -543 472 611 -447 587 467 -529 -75 705 -609 43 636
5133F36l30r08J317J5j174R68J16j235L03N96l11N4J245r29p07P69l99r83P40
$$ 636 306 -602 715 730 -444 524 640 -595 -292 304 -7 47 1292 363 -344 425 26 -957 -217
5152b17L10o21M10R75j564M28Q43p91j7R13j56j833J297K55j139J091N32p48K62
$$ -217 93 -528 -118 857 -707 -279 564 -227 -244 669 513 -1320 -23 232 -907 184 716 -32 230
5171B30P85j216q83J215J37j024J276k97m75p4M38m34L64M35l33o42P55K24j137
$$ 230 1015 -201 -1084 131 268 -756 520 223 -252 -326 112 -322 42 477 144 -498 257 481 -656
5190f56J286k03j009Q8R88j118M75L32o83n14J329o50o61J671k37p00P11n43n30
$$ -656 630 427 -582 -494 494 -624 -149 183 -500 -1014 315 -335 -996 675 438 -262 449 -94 -624
5209f24Q09Qn33n01R71m81M9J287n26j113J347m20r37J349K37j239O2R37j114
$$ -624 185 193 -340 -841 130 -351 -302 985 459 -654 693 273 -664 685 922 -317 -255 682 -432
5228d32M2J060l93j087R74K45p61J1N26n76N96L89q92l40J479r61o87P44J17q44
$$ -432 -390 670 277 -810 164 409 -352 -341 185 -391 205 594 -298 -638 841 -120 -807 -63 54 -790
5248g90R02K97q76M22J248r29p95Q59k99J5L29J17j697J269O54o31j5M83p25o97
$$ -790 112 409 -467 -45 1203 274 -521 338 39 54 383 500 -1197 72 726 95 80 563 -162 -859
5268h59R73n11m64J036k54n01N26L58k10l40P37p37nJ123r71k66R05L17j051K64
$$ -859 114 -397 -861 175 -79 -580 -54 304 94 -246 491 -246 -251 872 -99 -365 540 857 -194 70
5288G0q3q09R08J135k243K13J074L30j064M88n39P3R29j5j701J746M41q65m70
$$ 70 -13 -822 86 1221 -1022 -809 265 595 -469 19 -520 -447 482 467 -1234 512 953 88 -382
5307c82P82q15M67Q63p73j134J740k25o94O6K59p03O00n8n23P6J229j65j185O70
$$ -382 400 -415 52 915 142 -992 748 523 -171 -105 154 -549 51 -7 -530 -454 775 610 -575 95
5327I5n02L34P10k82j521J177R43p98j368J027O85q44O90m68q61J781n34l87l68
$$ 95 -407 -73 637 355 -1166 11 954 156 -1212 -185 500 -344 346 -122 -983 798 264 -123 -491
5346d91J072m26R0K26p90N4J315r02j244R02R41m85j67j1r78J076Q37o62j114
$$ -491 581 155 245 471 -319 -265 1050 148 -1096 -194 747 262 95 84 -894 182 1019 357 -757
5365g57J576m20m24L1m67J51J271L58k120l33K249k39j109l14K81J18Q92p72j151
$$ -757 819 399 -25 6 -461 -310 961 1319 -801 -1134 1115 876 -233 -547 -266 -148 744 -28 -1179
5384a179J507R09j049j227N84M51O52l81q95p26J961L70j863M36R73p22P43m62
$$ -1179 328 1237 188 -1039 -455 -4 648 267 -628 -1354 607 977 -886 -450 523 -199 544 82
5402H2j286J001J941j018j659P98R05J17o14m25n39P07J268j422j405J615p0o6
$$ 82 -1204 -203 1738 720 -939 -141 764 881 267 -158 -697 10 1278 -144 -1549 66 -4 -70
5420g0M17j338n24K435L6j538l9J389m70n88Q2q29J216J285j227j594J636N02
$$ -70 347 -991 -1515 920 956 -582 -621 768 298 -290 -208 -1037 179 1464 237 -1357 279 781
5438G81k29o01o36J61J935k11k494j0J731N80j251m02N58M09J387j474j788R84
$$ 781 552 -49 -685 -524 1411 1200 -1294 -1304 427 1007 -244 -646 -88 321 1708 234 -1554 -570
5456e70J685n80j845Q65M13M16Q60j663j019J573J097j649l30P03P17m20L15j597
$$ -570 1115 535 -1310 -445 -32 384 1244 -419 -1438 135 1232 -417 -747 -44 673 253 568 -1029
5474a029L97K174j030j798P08P74R54o00o27j146J356J453j339j697R19K009p00
$$ -1029 -632 1542 512 -1286 -578 196 1150 550 -77 -1223 133 1586 247 -1450 -531 1478 778
5491G78L4j653K01J555L33j904q65J455J762j353n68n92Q43J613p60k443K77L124
$$ 778 812 -841 -640 915 1248 -656 -1521 -66 1696 343 -225 -817 26 1639 879 -1564 -1287 1837
5509A837q60j478J68k68J590J1j567j275J782K102j903q02l20J283J261n82k102
$$ 1837 977 -501 -333 -601 989 1000 -567 -1842 -60 2042 139 -663 -983 300 1561 979 -1123
5526a123m73K611L46k241L07M63O08O21j327j431J180K112j461j470M60J464J8
$$ -1123 -1596 1015 1361 -880 -573 -110 498 1119 -208 -1639 -459 1653 192 -1278 -818 646 664
5543F64L73k074q7K192N46k253j241J950R98j406J61j432J020K781j013k765K71
$$ 664 1037 -1037 -1124 1068 1614 -639 -1880 70 1068 -338 -177 -1609 -589 2192 1179 -1586 -1315
5560a315J546J039j301m90j032K191J325k348j473K064J443n98j757n08P40K062
$$ -1315 231 1270 -31 -521 -1553 638 1963 -385 -1858 206 1649 1051 -706 -1214 -474 1588
5576A588n78k489L96K283J42j735q65K13J347J289j831k192J592L434j035k836
$$ 1588 1010 -1479 -1083 1200 1342 -393 -1258 -1045 302 1591 -240 -2432 -840 2594 1559 -1277
5592a277L63R05J063K20k725j18K897Q14k732q65J138J078O46j108k421J021L403
$$ -1277 -914 -9 1054 1274 -1451 -1569 1328 2142 -590 -1455 -317 761 1407 299 -2122 -1101 2302
5609B302n59l311j46J517J561j24k154j300K366K665k905j592J499J166l1q86
$$ 2302 1743 -1568 -1714 -197 1364 1240 -914 -2214 152 2817 -88 -1680 -181 985 954 68
5625F8j507R10K017K11l365L9K348J180j663j233r73K661J928k397k521J915K002
$$ 68 -1439 -529 1488 1699 -1666 -1627 721 1901 238 -995 -1968 693 2621 224 -2297 -382 1620
5642A620n95q83j585M98K061J120l230j437K995J880k385j366j16J286J859j465
$$ 1620 1025 142 -1443 -945 1116 2236 -994 -2431 564 2444 59 -1307 -1423 -137 1722 257
5658B57k415P26L378q84j692l12M29J587Q54k109j832K226K081j491k277P00J289
$$ 257 -2158 -1432 1946 1062 -630 -942 -513 1074 1928 -181 -2013 213 2294 803 -1474 -774 515
5675E15J148n43l150N73L214O83l792q9J278J759n13j878j364K051K814j803l514
$$ 515 1663 1120 -2030 -1457 1757 2440 -1352 -1441 -163 1596 1083 -795 -2159 -108 2706 903 -2611
5692b611J599K346k01n81k073o05L067Q87k598r81J693J893o12k546m35J540K598
$$ -2611 -1012 1334 1133 552 -1521 -2126 941 1828 -770 -1751 -58 1835 1223 -1323 -1758 -218 2380
5709B380j177l116M65L408L93k205j305O1K610N29k609j574J517K971j330k566
$$ 2380 1203 -1913 -1448 1960 2353 148 -1157 -1096 1514 2043 -566 -2140 -623 2348 1018 -1548
5725a548O1J459J911o34l157j90L842O12l260j209J640J683M60k058j687J665
$$ -1548 -1487 -28 1883 1249 -1908 -2098 1744 2356 -904 -2113 -473 1210 1670 -388 -2075 -410
5741d10K407j090k026o97K068J222M41l258p89L156J104k320j905J605J419P30
$$ -410 1997 907 -1119 -1816 252 1474 1915 -1343 -2132 1024 2128 -192 -2097 -492 927 1657
5757A657j494k211P20L712j095l395RK524Q68m42k136n15K617J600k713k467J760
$$ 1657 163 -2048 -1328 2384 1289 -2106 -2097 427 1295 853 -1283 -1798 819 2419 -294 -2761 -1001
5774a001K462j72j216j421O66K595j64l140o33L050N01j423j593k03K087J940
$$ -1001 1461 1289 73 -1348 -682 1913 1749 -1391 -2024 1026 1527 104 -1489 -1692 395 2335
5790B335j565l451J871K636m48k074m10N44J888n2k374j042L188J101j615k247
$$ 2335 770 -2681 -810 1826 1378 -696 -1106 -562 1326 1274 -1100 -2142 1046 2147 532 -1715
5806a715J49K371J512j829k278M94K975K3k547p81J801J599n04j652j567K850
$$ -1715 -1566 805 2317 488 -1790 -1296 1679 1702 -845 -1626 175 1774 1270 -382 -1949 901
5822I01J492j744k584R49J608Q52k37k777L45K489O38k779j242K616O17L17k182
$$ 901 2393 649 -1935 -986 622 1474 1237 -1540 -1195 1294 1932 -847 -2089 527 1144 1461 -721
5839g21j448J935K729j467l222N52K962K66j403j592J53K377Q76k736j790K449
$$ -721 -2169 -234 2495 1028 -2194 -1642 1320 1586 183 -1409 -1256 1121 1997 -739 -2529 -80
5855h0K429j449j613l09N80K810r17l161M85K354L53k111r02R14J623P12j983
$$ -80 2349 900 -713 -1022 -442 2368 1451 -1710 -1225 1129 1482 -629 -1531 -617 1006 1718 -265
5872b65j947K098K110j381j712J88J137J212K67l072j45K289J541k644j102J090
$$ -265 -2212 -114 1996 615 -1097 -909 228 1440 1707 -1365 -1510 779 2320 -324 -1426 -336
5888c36J330N91j537k648J956K814q89k427l48K326M14p50j040r19J878J662j487
$$ -336 994 1585 48 -2600 -644 2170 1281 -1146 -1494 832 1246 496 -544 -1463 415 2077 590
5905E90k172J112J408J55j207j279M57K301j50l178K27K701N24q52j965N91O14
$$ 590 -1582 -470 938 1093 -114 -1393 -936 1365 1215 -1963 -1736 965 1489 637 -1328 -737 -123
5922a23K412j705k839J621K042m23q60j329O37J745M07k716p85K642J125j624
$$ -123 2289 584 -2255 -634 1408 985 125 -1204 -567 1178 1585 -1131 -1916 726 1851 227
5938B27j067l20J370J326n66k608P65K992o71k451l11J561N39N49j761q36J625
$$ 227 -840 -1160 210 1536 970 -1638 -873 2119 1448 -1003 -1314 247 786 1335 -426 -1262 363
5955C63J942j752k049J408N96P04j000j412N31J409O81k349o59J664N99J28j374
$$ 363 2305 553 -1496 -88 508 1212 212 -1200 -669 740 1421 -928 -1587 77 676 804 -570
5972e70o06J283K010j310k764J532R99L2l37j306o66K145J057j938q71J247J379
$$ -570 -1176 107 2117 807 -1957 -425 574 606 269 -1037 -1703 442 1499 -439 -1310 -63 1316
5989A316j125p37j265J189K418o66k291n0J530P53j447n31J48O06J241j626j159
$$ 1316 191 -546 -1811 -622 1796 1130 -1161 -1211 319 1072 -375 -906 -758 -152 1089 -537 -1696
6006a696J545J335r26m35p39L72J023J78j558o09L022n95j552l0j0Q13J128j035
$$ -1696 -151 1184 258 -177 -916 -544 479 657 -901 -1510 1512 917 -635 -665 -675 138 1266 231
6024B31j771J280J693p33j273K9R03l69O66j152r65J828O39j374r18J345N62L50
$$ 231 -1540 -260 1433 700 -573 -544 359 -10 656 -496 -1461 367 1006 -368 -1286 59 621 971
6042I71n68j408M32J991n35j700J0J403l46O44j296j200J311K136j332j892J330
$$ 971 403 -1005 -573 1418 883 -817 -807 596 250 894 -402 -1602 -291 1845 513 -1379 -49
6059d9Q12n15j61m44k25J092Q57j970j96J867K93j474m61K79l89J918m87j825
$$ -49 763 248 87 -357 -582 510 1367 -603 -799 1068 1361 -113 -574 -295 -684 1234 747 -1078
6077a078O41J088l72q26j03M23M76J110j225j107J877K07r91l59n67R26Q75m05
$$ -1078 -437 651 279 -547 -650 -227 249 1359 134 -973 904 1111 120 -239 -806 120 995 590
6095E90j375J52K344j356j160N04M80J42J46k10j106J672K75j355j046R62P18
$$ 590 -785 -633 1711 355 -805 -301 179 321 467 257 -849 823 1098 -257 -1303 -341 377
6112C77L6L0r12j26J539N76k081l82J545K93j237O10r97K25J391j063n37M52J051
$$ 377 413 443 -469 -595 944 1520 -561 -943 602 895 -342 268 -729 -504 887 -176 -713 -261 790
6131G90p31k68j6j71R31J77r28q94J208K19o49L03J71p01Q09j7o76j54J167r45
$$ 790 59 -209 -225 -396 535 712 -216 -1110 98 317 -332 -29 142 -559 250 233 -443 -597 570 -375
6151c75l32J016k65m52J000k96j072Q76Q21j118k65O76K76p59J323j182j94N77
$$ -375 -707 309 44 -408 592 296 -776 100 921 -197 -462 214 490 -269 1054 -128 -322 255
6169B55P24j456L01M71L1j07M8o33k48J048K04j772L36J224n79k9j24m18J142
$$ 255 979 -477 -176 295 326 219 267 -366 -614 434 638 -1134 -798 426 -153 -182 -306 -724 418
6188D18N31j167m71J433o96r7K67n12m38Q82M89j410O26O44p18m29O36r3l61J199
$$ 418 949 -218 -689 744 48 -49 218 -294 -732 150 639 -771 -145 499 -219 -648 -12 -105 -466 733
6208G33j055n73R88N15q77L78O03r24M57K05r84Q6J274l51q75l29P57m99O38K41
$$ 733 -322 -895 93 608 -269 109 712 -212 245 450 -534 -448 826 475 -400 -729 28 -471 167 408
6228D08j228O79N56r51J55Q60p76M87J30k55j438J549K29o47p75N86M18j54P80
$$ 408 -820 -141 415 -536 -381 479 -297 190 320 65 -1373 176 405 -242 -1017 -431 -13 -167 613
6247F13q39o12J068N3q23M63M75n08k93P56o85k02Q62J27j099P61n83k92Q58J44
$$ 613 -226 -838 230 283 -540 -77 398 -110 -403 353 -332 -534 328 455 -644 117 -466 -758 100 244
6267B44n82N42O12j727O24J296j388L02N44l26m92M36N09m91l00Q01p21J71O95
$$ 244 -338 204 816 -911 -287 1009 -379 -77 467 141 -351 85 594 103 -197 604 -117 54 749
6286G49p64j7O43j53j967J882N02r78o2Q52j035M78P28j315m72J433j84r95N47
$$ 749 -15 -32 611 458 -1509 373 875 -103 -165 687 -348 130 858 -457 -929 504 320 -675 -128
6305a28L80l04P64k42j348O85M50Q3n08p49O19j42O30K13p55J20M88r86Q83P24
$$ -128 252 -52 712 470 -878 -193 257 340 -168 -917 -298 -440 190 403 -352 -232 256 -730 153 877
6325H77j007n49J010p29K60O25q31k84N92M19q84q3O13l56j55J233j133P4j30
$$ 877 -130 -679 331 -398 -138 487 -344 -628 -36 383 -501 -584 29 -327 -482 751 -382 -308 -438
6344d38O73n63J76O17j112L89N33p23m02Q93J83j139J134r3l13M92J71j177M78
$$ -438 235 -328 -152 465 -647 -258 275 -448 -850 43 226 -913 221 128 -185 307 478 -699 -221
6363b21N35k93l25M42L56o96J025q57n80Q62K80j660J234M27j206P98K95j056
$$ -221 314 21 -304 138 494 -202 823 -34 -614 248 528 -1132 102 529 -677 121 416 -640
6381f40O34P90o59l87M72J75q53J10J161q63p15J238m54l7P04m0j088Q85L50j732
$$ -640 -6 784 125 -262 210 385 -468 -358 803 -60 -775 463 9 -28 676 636 -452 433 783 -949
6401i49O12P67n79l58P13J04j280J260j28l32M41N02j523J092L47j313N20O07
$$ -949 -337 430 -149 -507 206 310 -970 290 162 -170 271 773 -750 342 689 -624 -104 503
6419E03r43P39L53n67k2Q1n9o21P42j44n79P33L97l57m14j7o3l05Q72J04p30J44
$$ 503 -440 299 652 85 63 144 85 -536 206 62 -517 216 613 256 -158 -175 -238 -543 329 433 -297 -153
6441a53L67p83L65R23p62k88K15j43Q3P80m03j175R67O62j542Q97J26l64K11J11
$$ -153 214 -569 -204 719 -43 -331 -116 -259 -176 604 201 -974 -7 655 -887 10 136 -228 -17 94
6461I4l00o62Q28r5q8L58m44o06R23K83l3m4N35r27k76O83j46o41J029m02n21
$$ 94 -206 -868 -40 -135 -223 135 -309 -915 8 291 258 214 749 -178 -454 229 83 -558 471 69 -452
6482d52N42q1r85R19K11l05N45Lo28l9Q29j80n55l22J218j445J068L2l14j81K16
$$ -452 90 9 -976 -57 154 -151 394 397 -231 -270 559 379 -176 -498 720 -725 343 375 61 -120 96
6503I6M3o98Q77L08j466R57K79q91K88P50l4k99O96j085m91Q67P4o20N53n2p80
$$ 96 139 -559 318 626 -840 117 396 -495 -207 543 509 210 906 -179 -670 197 271 -349 204 152 -628
6524f28K71Q73p53J95J86n02J13L29L50l88L88n5j039J133k14n47k11O37m75j45
$$ -628 -357 516 -237 -42 144 -358 -245 84 434 46 434 379 -660 473 259 -288 -499 138 -337 -482
6544d82J043m50l90R20p43qK93n1K6p17J500j415l5R00n98J99P31n85q08R14k30
$$ -482 561 111 -279 641 -102 -110 183 132 158 -559 941 -474 -509 391 -207 -8 723 138 -670 244 14
6565A4l54L18n4n19j00R21k27k42N13J10j104J142l0q38j11N51m67N15L70K00
$$ 14 -340 -22 -76 -595 -695 226 -1 -243 270 380 -724 418 388 -450 -561 -10 -477 38 408 608
6585F08q90J025q27K05K96o58K50OJ58J65m86M94m21m49J323p97K67j92K83r98
$$ 608 -282 743 -84 121 417 -241 9 15 173 338 -148 346 -75 -524 799 2 269 77 360 -638
6605f38P12P42j171j27O14o48J93J254j031n25O42L9K54J1pl15n21J334j099K48
$$ -638 74 816 -355 -482 132 -516 -323 931 -100 -625 17 56 310 321 314 -1 -522 812 -287 -39
6625c9J435j665j84M84m4p1M32j25j225J208P6j368O28P89Q0l28M47n7p97O27
$$ -39 1396 -269 -453 31 -13 -84 348 223 -1002 206 282 -1086 -458 331 411 83 530 473 -324 303
6645C03L94q23k01N93l48n35J323r87L37k90K65l72M35K56p92J036p30l47N77
$$ 303 697 -126 -327 266 -82 -617 706 -281 56 -234 31 -341 94 350 -442 594 -136 -483 94
6664I4N33r71n0O60n13m81J020J5n77M32J42n65N46L5m74j88K37L3lN50J58o96
$$ 94 627 -344 -394 266 -247 -728 292 307 -270 162 304 -261 285 320 -154 -342 -105 -72 -75 475 633 -63
6686f3K16M93j021l41J277o34q4m74P78m67K04K28l05j05Q21o40l02J172n44o96
$$ -63 153 646 -375 -716 561 -73 -157 -631 147 -320 -116 112 -193 -298 523 -117 -419 753 209 -487
6706d87R93q92J09P82l30Q6L8j23n41L23K14n39K90N60j35p85N72m07N98j51M67
$$ -487 506 -386 -277 505 175 261 299 176 -365 -42 172 -367 -77 483 348 -437 135 -272 326 175 642
6727F42j034L29M59q12N2J024o70o06J178j511O49M77K68o14J8M16j92r0L71j25
$$ 642 -392 -63 396 -416 -364 660 -10 -616 562 -949 -300 177 445 -169 -151 265 73 -17 354 229
6747B29p26J279o35o33N61K86n57L9J97l47O78j78l05Q2Q35n93j34K34l79J5n9
$$ 229 -497 782 147 -486 75 361 -196 -157 40 -307 371 193 -112 -30 805 212 78 312 -67 -52 -111
6768a11N43p12m31R40r00L35J000j138K58mL23l67K86l5J65K84j18k42N0K07n76
$$ -111 432 -280 -711 229 -671 -336 664 -474 -216 -220 103 -264 22 -13 152 436 318 76 126 333 -243
6789b43J10O46k01r18R97j95m76LP04j71o36J040q87k54O24L3k48M16k78l06N95
$$ -243 -133 513 312 -606 391 196 -280 -277 427 256 -380 660 -227 -481 143 176 -72 344 66 -240 355
6810C55j87k66l99O73l23RK38J92p86L92N26n91L60k22j20J05K5m70L23L84n82
$$ 355 168 -98 -497 176 -147 -138 100 292 -494 -102 424 -167 193 -29 -149 -44 -19 -489 -166 218 -364
6831c64L80L11q31L45N23K1n59L98K43k10K9J28p6o56P22m49o1J72L57m68N8M9
$$ -364 16 327 -504 -159 364 385 -174 224 467 257 286 414 338 -318 404 -45 -106 66 423 -45 13 62
6853F2j80L86pl49l30Q83l39l41N97l24K4J47J35m39j33N04q32J15O70j0o33M04
$$ 62 -118 268 261 -88 -418 465 126 -215 382 58 82 229 364 -75 -208 296 -536 -421 249 239 -394 10
6875A0Q1m11M45JKl34L68k39p69J381m94l16L41P4l80j42J43L9P20j11r61J82
$$ 10 91 -320 125 126 128 -206 162 -77 -846 535 41 -275 66 140 -240 -382 -239 -200 520 409 -552 -370
6897c70P22K48j202Q16j05n28M04J24K21m79K06K67k25N85n90n83O06qJ73J9m42
$$ -370 352 600 -602 214 109 -419 -15 109 330 -149 57 324 99 684 94 -489 117 109 282 301 -141
6918a41k6R1L01o34M45J5N2Jk53O20j255J079j25l94L33N55q09J01N49j20q8Q0
$$ -141 -167 -76 225 -409 36 51 103 104 -149 471 -784 295 170 -224 109 664 -145 -44 505 385 297 377
6940C77m58q8M48J96n56K5O07k76k93J72l76J36P89p88l45O55k96k74K15J32n77
$$ 377 -81 -169 279 475 -81 -56 551 275 -18 154 -222 -86 703 -85 -430 225 -71 -345 -130 2 -575
6961e75L73K07N32m89J21m74j50N95k05J12M85n49n42N70K58q17R75N8m55J11
$$ -575 -202 5 537 48 169 -305 -455 140 -65 47 532 -17 -559 11 269 -548 427 485 30 141
6981A41j10n09l19Q08K16n33K85K12J96l56l49l24M02K47N0j95O1L95q56Q51K51
$$ 141 31 -478 -797 11 227 -306 -21 191 387 31 -318 -642 -240 7 57 -138 -77 318 -538 313 564
7002E64j077L61J75n9j15N0n5M4J96R1p18O67M95n04l87K19M30p60M26J61o68
$$ 564 -513 -152 23 -36 -151 -101 -156 -112 84 175 -543 124 619 115 -272 -53 377 -383 43 204 -464
7023d64K35N96o47K37L91l92l37M14K81o67Q51j53o30L06J22o21K62N75n51N6
$$ -464 -229 367 -280 -43 348 -44 -381 33 314 -353 498 345 -285 21 143 -478 -216 359 -192 -136
7043a36P96k96n85K32k16Q5J63j87l75N09K54o9o16N75m61O78j56K33q20N22L2
$$ -136 660 364 -221 11 -205 -120 43 -144 -519 -10 244 175 -441 134 -327 351 195 428 -392 130 162
7064A62k30l10K88O4P5J09n42M91N4n07p7N86Q0j69k5n74j76J051l58j21J47P9
$$ 162 -68 -378 -90 -26 49 158 -384 107 161 -346 -423 163 243 74 49 -525 -701 350 -8 -129 18 97
7086I7l1l40R08m77j89J97k53j08N88k67m77O44np81k79Q18L39n09K73L63q74
$$ 97 66 -274 634 157 -32 165 -88 -196 392 125 -352 292 287 -494 -773 45 384 -125 148 511 -363
7107c63N35L83n47m17N76o3l53Q70n51o22O93k80J39k70L15r3k79P31p57J40J11
$$ -363 172 555 8 -409 167 104 -249 621 70 -552 141 -139 0 -270 45 -48 -327 404 -353 -213 -102
7128a02N95o51N2Rl99L78R3K05j92K83j15K9M92j093M67L61q89k22L70P48m59
$$ -102 493 -158 -106 -97 -496 -118 -25 180 -12 271 156 185 677 -416 51 412 -477 -699 -329 419 -40
7149d0Pok7n26R29o10%L46j70J89k01K18m40J08N87j158N70Q12k37k94l26J27
$$ -40 -33 -39 -66 -592 337 -273 -273 73 -97 92 -109 109 -331 -223 364 -794 -224 588 351 57 -269 -142
7171a42n78J126j93q23N85N31q39K35K71m20K57N10n29n13R14l29m12N17m4J10
$$ -142 -720 406 213 -610 -25 506 -333 -98 173 -247 10 520 -9 -522 392 63 -349 168 124 234
7191B34k23N1j45j59M76j59o21K29L86m19j4L69m33M28R3k87l47N88K26n42K42
$$ 234 11 62 -83 -242 234 75 -546 -317 69 -350 -364 5 -428 0 93 -194 -541 47 273 -269 -27
7212b7l58L48M9N73n66l84P23r3l58M68n03j37L07%k40L92M09q03L12j72n62N74
$$ -27 -385 -37 12 585 19 -365 358 265 -93 375 -128 -265 42 42 -198 194 603 -200 112 -60 -622 -48
7234d8N61l12k86P88m88m72M55r5L6K04K9l95l75O5J4M2M37n25N14L35j87m95
$$ -48 513 201 -85 703 215 -257 198 103 139 343 372 -23 -398 -333 -319 -277 160 -365 149 484 297 -198
7256a98K68l3n64P24L26n12J04J39n74j08J27J16k22L18N50O5p79m0R3K17J032
$$ -198 70 37 -527 197 523 11 115 254 -320 -428 -301 -185 -407 -89 461 526 -253 -293 -200 17 1049
7277A049r09o79Q13J17n79J76L4m44M23N95m78j65R1l5k94R91o93p3L14k35l3
$$ 1049 140 -539 274 391 -188 -12 22 -422 1 596 118 -47 44 9 -285 706 13 -60 254 19 -14
7298a4J16L14j99l80J86q2L14l1l75n68J040O6n43J70O44p12l82J11K29rK44L04
$$ -14 102 416 217 -163 23 -59 255 224 -151 -719 321 387 -156 14 658 -54 -436 -325 -96 -105 139 443
7320D43l96Q5j00L60n06j10R3K63J58n29j41P06p3k91M6j65J01R95q13n16J25
$$ 443 47 132 32 392 -114 -224 -131 132 290 -239 -380 326 253 -38 8 -157 -56 939 126 -390 -265
7341b65P23o27L69l64M69m37O59l83k91L58k34K76r74Q31l67P87p8o47j91K24
$$ -265 458 -169 200 -164 305 -132 527 144 -147 211 -23 253 -721 110 -257 530 452 -195 -386 -162
7361a62j72j63P07K23j1r1j003L90M30M10k23n30N52k99k20O72k69n70O77K28
$$ -162 -334 -497 210 433 422 331 -672 -282 148 558 335 -195 357 58 -162 510 241 -329 348 576
7381E76r37l68R32o14M39M38l92m86J066j61o08l28P78o47Q96j69l87N17j1j7
$$ 576 -361 -729 203 -411 28 466 74 -412 654 493 -115 -443 335 -312 584 415 28 545 534 517
7401E17o76J99j18L59m27q1j4N75k45q90J073O24n07j003N80k78M7M36l15m48
$$ 517 -159 40 -78 281 -146 -227 -241 334 89 -801 272 896 389 -614 -34 -312 -265 171 -144 -592
7421e92Q08J33k05N6m0l42N3L09n46l76P24L86k92l81M85k75K74r3l01J89K81
$$ -592 216 349 144 200 160 -182 -129 180 -366 -742 -18 368 76 -305 180 -95 179 86 -215 -26 255
7442B55J84q38J09J11O17r3j29r32P57L00l49m04O62k01l9N21p70r4J94O69j228
$$ 255 439 -399 -290 -179 438 345 216 -716 41 341 -8 -412 250 49 10 531 -239 -333 -139 530 -698
7463f98j2J094q2r8l29J78j99R40p5j158R9P32m18k94O14o05N25L74j086l24J447
$$ -698 -710 384 302 204 -125 53 -146 794 719 -439 -340 392 -26 -320 294 -311 214 588 -498 -822 625
7484F25j89m18J07o67Q18L10p21m94M91Q69k7n02o51L00N08J69l00m64M41P17
$$ 625 436 18 125 -542 276 586 -135 -629 -138 731 704 202 -449 -149 359 528 228 -236 205 922
7504I22m28m67rL31k4j7j76l55K93M65n18n30N20qR8l08o47P95M73J71j059J17
$$ 922 494 27 18 349 325 308 132 -223 70 535 17 -513 7 -1 97 -211 -858 -63 410 581 -478 -361
7526c61N76L47k68n90o95R88Q80r16q7M84k41L26o06p2l14J040k92r24L12K93
$$ -361 215 562 294 -296 -991 -3 877 -39 -126 358 117 443 -163 -235 -549 491 199 -725 -413 -120
7546a20N77n21J43m82M71K97q46l54Q12P06l83m37k4o1K06M1n36j44O10M80r65
$$ -120 457 -64 79 -403 68 365 -481 -835 -23 683 300 -137 -161 -222 -16 25 -511 -655 -45 435 -530
7567e30j43K22O22L10j85r29N75L90j00l56m65O99m9j52k78j43Q45rk33n87JO88
$$ -530 -673 -451 171 481 296 -633 -58 332 232 -124 -589 110 61 -91 -369 -512 333 324 91 -496 -495 193
7589A93l5p9l41l45J226K79j517j08J181l38Q1K55j238Q48M63J6r49K64K06K80
$$ 193 158 79 -262 -607 619 898 -619 -727 454 116 197 452 -786 62 525 541 -408 -144 62 342
7609C42K75r70K18P86L91j068o66P68n2K71q72J7O42J09M12j182N39L79k55O7
$$ 342 617 -353 -135 651 1042 -26 -692 76 24 295 -577 -560 82 191 603 -579 -40 339 84 151
7629A51k73o7J03O78j216L68O64q5L43j038M24l94N15j69n64L80J29J288r53p24
$$ 151 -122 -189 -86 592 -624 -256 408 323 666 -372 52 -342 173 4 -560 -180 -51 1237 284 -440
7649d40O08k2L22o65p47R26Q18m14m97m62N10K70k6n47J61P79J12o91p41O63j09
$$ -440 168 146 468 -197 -944 -18 800 386 -111 -573 -63 207 181 -366 -205 574 686 -5 -746 -83 -192
7670a92J59J1l76L64N61k04j303N17N40N73o32n73L88K63M43n22n95O39O89m87
$$ -192 -33 -22 -398 -34 527 323 -980 -463 77 650 18 -555 -167 96 539 17 -578 61 750 263
7690B63j76j80M07M57j51p59m87J361q07j42O74o64k01J095L0j505Q86J25L45
$$ 263 87 -93 314 771 620 -139 -626 735 -72 -214 460 -204 -405 690 720 -785 101 226 571
7709E71r88M66M29J71l52k07p45N47P19q17j30O86l21L66N6q98p1R52l10l40J68
$$ 571 -417 49 478 649 297 90 -655 -108 611 -206 -336 350 29 395 451 -447 -518 434 124 -216 -48
7730d8l2L84J68m93q93P35R79p15o82R73L2k3n32p47O48J245l92o02m55P82k23
$$ -48 -80 304 472 -21 -914 -179 800 85 -597 376 408 385 -147 -894 -246 999 607 5 -450 332 109
7751A09P5L2r82K86J452q58o62P0L53K19l29P2p61O65P01m11m70O01r5n79P07
$$ 109 184 216 -766 -480 972 114 -548 -478 -125 94 -235 -163 -924 -259 442 31 -439 162 67 -512 195
7772A95j75j70J96N45j678J479k11K59k19k54k03j82Q67m62p62J013K90n59k52
$$ 195 20 -150 46 591 -1087 392 181 440 221 -33 -236 -418 449 -13 -775 238 528 -31 -283
7791b83K61j70M81k3j289J215j11J3L27n29k32R08N95o99r90M28O38n61m78O41
$$ -283 -22 -192 289 266 -1023 192 81 94 421 -108 -340 568 1163 464 -526 -98 540 -21 -499 142
7811A42N73p92k01K72n99M85N72l82q13M93N53r3K77p75j87M87O31q72k65J047
$$ 142 715 -77 -278 -6 -605 -120 452 70 -743 -250 303 210 487 -288 -475 12 643 -229 -494 553
7831E53o1l47k68j0K96N29l96o82j50J243k33n24j40k47O51J76m51n24M56O37
$$ 553 492 145 -123 -133 163 692 296 -386 -536 707 474 -50 -190 -437 214 390 -61 -585 -129 508
7851E08n46P5j31k3O85j6j088K36P30j60n56K29N6K76o7M4j281Q68N99j40n95
$$ 508 -38 37 -94 -117 568 552 -536 -300 430 270 -286 -57 -1 275 208 252 -1029 -161 438 298 -297
7872b97l16P88j86O98q49j302K512r45l42n61J079k67L73n83j21l0Q77n05l32
$$ -297 -613 175 -11 687 -162 -1464 1048 103 -239 -800 279 12 385 -198 -319 -349 528 23 -309
7891c09J75k21oL00k08k09L38J025r85K81j57l49P30m40P8l4J80J17o73m55J090
$$ -309 -134 -355 -361 -61 -269 -478 -140 885 -100 181 24 -325 405 -35 43 9 189 306 -367 -822 268
7912B68K44l38l53j24K79Q02p46n71K57O12J07j00l71m40L27P35p06r5N67L43
$$ 268 512 174 -179 -303 -24 778 32 -539 -282 330 437 337 -34 -474 -147 588 -118 -213 354 697
7932F97o88p6J36n27N34J92o10J79P66j011L53q8K2K49O83r92m23P27K02k64m42
$$ 697 9 -67 69 -458 76 268 -342 -163 603 -408 -55 -143 -121 128 811 -181 -604 123 325 61 -381
7953c81J05P49k86J90l31N26n16L57q81L24O2O96m09k51k90M4M13j81k66K1J131
$$ -381 -276 473 187 377 46 572 56 413 -468 -144 -82 614 205 -46 -336 -292 121 -60 -326 -305 826
7974H26k57j146O54k31N84l25j95j04L17j20k88O14j31k91P13l30q39j37R60n52
$$ 826 569 -577 77 -154 430 105 -90 -194 123 3 -285 329 198 -93 620 290 -549 -686 274 -278
7994b78l8J76K97m5l54K13o84L67J030p47k5K48m44M56N9N9j100Q34J20j43m00
$$ -278 -316 -140 157 112 -242 -29 -713 -346 684 -63 -88 160 -284 172 231 290 -810 24 144 1 -399
8015c99K30j28O19p96R6O86J6k04j69K62O3l80L17M5n25M67p5p22N11K66j13k9
$$ -399 -169 -297 322 -474 -378 308 324 120 -49 213 276 -104 213 258 -267 200 125 -597 -86 180 67 38
8037C8j09L49m84Q08k89p92Q67l50l30M43K40r56L45L97l58P0O21l55q6k41Qr4
$$ 38 -71 278 -206 602 313 -479 388 38 -292 151 391 -565 -220 177 -181 -111 510 155 69 -172 -164 -258
8059b58j2L30N2n29O41l32m03M00k28q8P53l49o93O64R8k73n27R13R8l62L95l42
$$ -258 -270 60 112 -417 224 -108 -511 -111 -339 -427 326 -23 -716 -52 46 -227 -754 159 257 -105 290 -52
8081e2l21P57J11l92k09J70k58L20j33k22k66N48j04q9pM31j46O5k68R7J84K2
$$ -52 -373 384 495 103 -106 64 -194 126 -7 -229 -495 53 -51 -140 -147 284 138 203 -65 32 216 238
8103B38q11J37R0K07p3P24j23n70k2K71M8n84O04J16l01K43K40p99N26n51K15
$$ 238 -573 -436 -346 -139 -212 512 389 -181 -203 68 116 -468 136 252 -49 194 434 -365 161 -390 -175
8124a75J1P36r66K81L73q2m70N26o20K16N45n28J76l5J70k12Q1J20K52n75N07
$$ -175 -164 572 -394 -113 260 178 -292 234 -386 -170 375 -153 23 -12 158 -54 27 147 399 -176 331
8145C31k56K01j65k65L6L2L86k07J21K95n63K47l12J05o17P30J83j057J059L13
$$ 331 75 276 111 -154 -118 -86 300 93 214 509 -54 193 -119 -14 -631 99 282 -775 284 597
8165E97k76m59L58l69O83n72k44K09L12j22j84L39L09j130J097l16n28rj03P99
$$ 597 321 -138 220 -149 534 -38 -282 -73 239 117 -67 272 581 -549 548 232 -296 -305 -408 391
8185C91o21M70L6o70L35M
$$ 391 -230 240 276 -394 -59 -55
8191e5
$$ Imaginary data points
##PAGE= N=2
##DATA TABLE= (X++(I..I)), XYDATA
0@%%%%%%%%%%Jl3O4o4O4r6J28j33J65k16K49k90L54m19N09o04O98q18R49j087
$$ 0 0 0 0 0 0 0 0 0 0 0 1 -32 32 -32 32 -64 64 -69 96 -120 129 -161 193 -226 283 -321 377 -441 508 -579
30e79J245j429J627j847K098k370K664k991L354l746M179m659N177n739O356p035
$$ -579 666 -763 864 -983 1115 -1255 1409 -1582 1772 -1974 2205 -2454 2723 -3016 3340 -3695
46c695P769q570R453j0418J1477j2642J3931j5358J6938j8719K0731k3010K5628
$$ -3695 4074 -4496 4957 -5461 6016 -6626 7305 -8053 8885 -9834 10897 -12113 13515
59A3515k8672L2257l6559M1843m8496N7170o9020Q6279j13965J66788m19447J887617
$$ 13515 -15157 17100 -19459 22384 -26112 31058 -37962 48317 -65648 101140 -318307 1569310
71A569310M86066k993309j090159J808290J789174j002912j789874J5090J628271
$$ 1569310 2055376 -937933 -2028092 -219802 1569372 566460 -1223414 -1208324 419947
80D19947O40244q81562q89721L30907Q19150K73598o33094o60515K66115R83740
$$ 419947 1060191 178629 -711092 -380185 438965 712563 79469 -581046 -314931 668809
90F68809K55530q44891p81887K59218O83675Q7490o08869l74900M06044O11620
$$ 668809 924339 79448 -702439 -443221 240454 327944 -280925 -655825 -249781 361839
100C61839o8396o26471l79736L45103O83144J37270o98204m44844P50498R36402
$$ 361839 293443 -333028 -712764 -367661 315483 452753 -245451 -690295 60203 996605
110I96605m39828j217697o4456J214736N63681r81221r17452O61429J095468l81594
$$ 996605 556777 -660920 -725376 489360 1053041 71820 -845632 -184203 911265 529671
120E29671j265764j16285J045541M48116o51545n53607K66546M85763j8462l64192
$$ 529671 -736093 -852378 193163 641279 -10266 -563873 -297327 188436 169974 -194218
130a94218j12264K49515K35649K8058j16988j88798m1139K70334K18080k23049
$$ -194218 -306482 -56967 178682 206740 89752 -99046 -140185 130149 348229 125180
140A25180l30402P3774L48016J35669k71423l98453k7438M05440K31636l29611
$$ 125180 -205222 -131448 216568 352237 80814 -317639 -345077 60363 291999 -37612
150c7612l90034J75379N07812P2359n35273l45158M67071O01930k45227o59159
$$ -37612 -427646 -252267 255545 327904 -207369 -552527 -85456 516474 271247 -387912
160c87912P0974O55555J30220n56049l07568L85677M17833j91085m25150N5033
$$ -387912 -316938 338617 468837 -87212 -394780 -9103 408730 217645 -207505 -152472
170a52472L48097m4286l43167m7662K30767P8933r0515k5407M9967n776p6078
$$ -152472 195625 151339 -191828 -239490 -8723 70210 -20305 -45712 4255 -1521 -77599
181g7599k1350J07117P4138r3088n4385J39466R3296j25893j27400N9020J43154
$$ -77599 -98949 8168 82306 -10782 -65167 74299 167595 41702 -85698 -26678 116476
192A16476L2739j42538j29576J12103J69397j28073k47045N9782K39066l314k03762
$$ 116476 149215 6677 -122899 -10796 158601 30528 -216517 -156735 82331 79017 -124745
203a24745k6592K17441J06536k12239j91239J83961K37299j44220k16310J62900
$$ -124745 -151337 66104 172640 -39599 -230838 -46877 190422 46202 -170108 -7208
213g208K46254j22736k65449L4930K49425M5103k44901j37213K18412K00487j91526
$$ -7208 239046 116310 -149139 -114209 135216 180319 -64582 -201795 16617 217104 25578
224B5578k67924R2592K53670L291k01425q5956J61624J94203p6694k51272j8957
$$ 25578 -242346 -149754 103916 107207 -94218 -180174 -18550 175653 98959 -152313 -171270
235a71270K43514J11701j40869j20104O0336J23967J2554j23350q1094P6293O9410
$$ -171270 72244 183945 43076 -77028 -16692 107275 119829 -3521 -84615 -8322 61088
246F1088m8484l8430N425m3262q60J12696J8575j63611q6110J61414J93067o4353
$$ 61088 12604 -25826 -20401 -63663 -64523 48173 66748 -96863 -182973 -21559 171508 107155
258A07155k49666k7476K98506J33070l00438k20369K63439L07102j42319l45747
$$ 107155 -142511 -169987 128519 261589 -38849 -259218 4221 311323 169004 -176743
268a76743l0637L00763J67986k36479k84865J14995L05987l488k67917j09699
$$ -176743 -207380 93383 261369 24890 -259975 -144980 161007 157519 -110398 -220097
278b20097J64209J87003l8517k18145o9371K18452J77349j18075j86544R049J46865
$$ -220097 -55888 131115 92598 -125547 -194918 23534 200883 82808 -103736 -94687 52178
289E2178R9808n4672j54228l5252J38484Q8015r2131j30910j9961J13401J17821
$$ 52178 151986 97314 -56914 -92166 46318 134333 42202 -88708 -108669 4732 122553
300A22553q7596k24288R596K72216J05262k30274k05732J20666K77067L6175k71113
$$ 122553 34957 -189331 -179735 92481 197743 -32531 -238263 -117597 159470 195645 -75468
311g5468j45659K48690K36551j72506k75903O3212K66386O4293k08408j86885
$$ -75468 -221127 27563 264114 91608 -184295 -121083 145303 209596 1188 -185697
321a85697R8424K27330m462k15946p9771J24871J01419k7920r1481n3114P3459
$$ -185697 -87273 140057 135595 -80351 -160122 -35251 66168 38248 -53233 -106347 -32888
332c2888J17268k3744j24193k1743J00870R3196r633j23261q3953J12446J50522
$$ -32888 84380 60636 -63557 -85300 15570 108766 99133 -24128 -108081 4365 154887
343A54887o4879j75686k0187J33647Q4654p9747j52953N874J84859N6336j86152
$$ 154887 90008 -85678 -105865 27782 112436 32689 -120264 -114390 70469 126805 -59347
354e9347j20017J36170J67770k8107j62224p0109J32394J44955p7502j58525L9533
$$ -59347 -179364 -43194 124576 96469 -65755 -135864 -3470 141485 63983 -94542 -55009
365e5009J45629L203j10372m8803N4882P8371o983r6042l9740O4111M1102k3006
$$ -55009 90620 93823 -16549 -65352 -10470 67901 60918 -35124 -74864 -10753 30349 7343
377G343j5877k4200k8767M2862O1658l2693o0603J7583O1409K6786m1442o7774
$$ 7343 -8534 -32734 -61501 -18639 43019 10326 -50277 -32694 28715 55501 14059 -53715
389e3715K7538J08888r41j23858l0275J00549N2783n6849p6384m477P6206M2477
$$ -53715 -26177 82711 81770 -42088 -72363 28186 80969 24120 -52264 -56741 19465 61942
401F1942p5604o6150O5292P0456m1387o2381L557M4064M0297j3328n7212J898
$$ 61942 -13662 -79812 -14520 55936 14549 -47832 -44275 -211 40086 26758 -30454 -28556
413b8556N9132K710m0650Q190K0393j0872j690L287j4350q51J0604m808N961N44
$$ -28556 30576 33286 -7364 826 21219 10347 8657 11944 -2406 -3257 7347 2539 8500 9044
427I044m5782j0149P0129K5979o7489l6792M2044M3616m743m2806j9078N5711
$$ 9044 -36738 -46887 23242 49221 -18268 -55060 -13016 30600 25857 -16949 -36027 19684
439A9684M2355o3684n2974N8843N6610l7596m8617J199K7081K4567j2208l7570
$$ 19684 62039 -1645 -54619 4224 60834 23238 -25379 -24180 2901 27468 15260 -22310
451b2310P630L0680j6439j8655K2344K783k0317J4972J2730k3001m928K0574Q850
$$ -22310 -14680 16000 -439 -19094 3250 6033 -14284 688 13418 -9583 -14511 6063 14913
464A4913K908q194l1684O130N2177M020m6901j2966J9690J6309M886k7644l1240
$$ 14913 17821 9627 -22057 -15927 36250 40270 -6631 -19597 93 16402 21288 -6356 -37596
477c7596L9432M9041m6535o3641L2996O2795j572m6161l0988L0201N5101j6550
$$ -37596 1836 50877 4342 -59299 -26303 36492 34920 -11241 -42229 -12028 43073 26523
489B6523o2450J7415O0516j9051m9981R877K9303M561j635j5821j7370J3050J1293
$$ 26523 -35927 -18512 42004 22953 -27028 -17151 12152 16713 15078 -743 -18113 -5063 6230
502F230p271Q077j096k7235P716L4232j7502l1666K1678K5854j4275j5650l078
$$ 6230 -1041 7036 5940 -21295 -13579 20653 3151 -28515 -6837 19017 4742 -10908 -13986
515a3986O299K9002P752m1980j8266L4346K0436q989j3861j7796P905L5257j2644
$$ -13986 -7687 21315 29067 -12913 -31179 3167 23603 14614 753 -17043 -9138 26119 13475
528A3475n1522J7743N9125j2251n4043n373L4690K8426j2340m3290j407M8929
$$ 13475 -38047 -20304 38821 26570 -27473 -32846 1844 30270 17930 -25360 -26767 22162
540B2162J028m5611R996L7986j3258k7445N347N647O128J4100p027j5059N227
$$ 22162 23190 -22421 -12425 25561 12303 -15142 -9795 -4148 1980 16080 9053 -6006 -779
553g79k396p287J8606P739k4777m87J8738j3278r503J7950j28j4441J0383J480
$$ -779 -3175 -10462 8144 15883 -8894 -9381 9357 -3921 -13424 4526 4398 -10043 340 1820
567A820j5661J2957J7524j3161j0505O68n699J1549J6623j7407j0798K4372n273
$$ 1820 -13841 -884 16640 3479 -7026 -6358 -12057 -508 16115 -1292 -12090 12282 7009
580G009k9314J4567K7916j3358j7219M600O737O352k264k0562N578K8698j4876
$$ 7009 -22305 -7738 20178 6820 -10399 -5799 938 7290 5026 -15536 -9958 18740 3864
593C864l3459J9344L2736j0361j7717m326m350J5062J8687j7411j2407K1658M286
$$ 3864 -29595 -10251 22485 12124 -5593 -9919 -14269 793 19480 2069 -10338 11320 15606
606A5606k3929m469R989Q658J1911j2912l0920J2690L5630j2525k5155Q854O642
$$ 15606 -8323 -12792 -2803 5855 17766 4854 -26066 -13376 22254 9729 -15426 -6572 70
619G0p300Q531K873j1088P158J0193j4153q109M367L038J9463J5144l4653k7388
$$ 70 -7230 1301 4174 -6914 244 10437 -3716 -11825 -7458 -4420 15043 30187 -4466 -31854
633c1854L2969K5026k3068j5041P676N418O617l917k1411M170K7384p946k5176
$$ -31854 1115 26141 3073 -11968 -4292 1126 7743 3826 -17585 -13415 13969 6023 -19153
646a9153M377J4600R653R638j7968k9782K0130L4391j7884k4812J8580J8468q317
$$ -19153 -14776 -176 9477 19115 1147 -28635 -8505 25886 8002 -16810 1770 20238 11921
659A1921j8182j5480J2359L3199n619l7065L570K2646m271m468N862j4400r727
$$ 11921 -6261 -21741 -9382 23817 18198 -18867 -15297 7349 3078 -1390 4472 -9928 -19655
672a9655K3953R756j9064k480J2940N270k976j9852j3197L3984L1874l0800l4167
$$ -19655 4298 14054 -5010 -7490 5450 10720 7744 -12108 -25305 8679 40553 9753 -24414
685b4414J8604J6659r626k778k151m626J3398O777k1393p326J7119O623m058p470
$$ -24414 -5810 10849 1223 -1555 -3706 -8332 5066 11843 -9550 -16876 243 6866 2808 -4662
699d662j5644J3146L8832p473m6149J210L2089R08j4916p77N306J1347K48k5717
$$ -4662 -20306 -7160 31672 24199 -21950 -20740 11349 12257 -2659 -3436 1870 13217 13465 -12252
713a2252j0904K6580R464j3293O28l605j3305J7254K0434k3085k2309J8239J7732
$$ -12252 -23156 3424 12888 -405 223 -3382 -16687 567 21001 -2084 -24393 -6154 11578
726A1578m532r266n389J0433J9207j7681l2642J7340L5861q378k0000J349m575
$$ 11578 7046 -2220 -7609 2824 22031 4350 -28292 -10952 24909 16531 -3469 -2120 -6695
739f695o37J3648m542j5566J1094J1859q589o634k454q6J7836O632l0040q441
$$ -6695 -7332 6316 1774 -13792 -2698 9161 572 -6062 -8516 -8602 9234 15866 -14174 -22615
753b2615L6408J0708k5253r341P107K335N168j200j0650J0045J4159j6501j4627
$$ -22615 13793 24501 -752 -10093 -2986 -651 4517 3317 -7333 2712 16871 370 -14257
766a4257Q652K414K381J4875j0399k5547J2700K4900j0537j6162L421N402R713
$$ -14257 -5605 -3191 -810 14065 3666 -21881 -9181 15719 5182 -10980 -7559 -2157 7556
779G556J105j7493N60K7527l607l0908J491J9125J894J111r1j7091k642J6619
$$ 7556 8661 -8832 -8272 19255 15648 -15260 -13769 5356 7250 8361 8270 -8821 -11463 5156
793E156k820j1845P215M932k238L713r241j3238J9942K0077k1843j8394J5620
$$ 5156 2336 -9509 -2294 2638 400 4113 -5128 -18366 1576 21653 -190 -18584 -2964
806b964J1436q53r68j1194m941J6263K639j8407M598J6142n343p528j388j1762
$$ -2964 8472 7619 6651 -4543 -9484 6779 9418 -8989 -4391 11751 6408 -1120 -2508 -14270
820a4270N766K4125m767k4949K504J4450M21r02m957p477J4315J2041k2011r556
$$ -14270 -8504 15621 10854 -14095 -11591 2859 3280 2378 -2579 -10056 4259 16300 -5711 -15267
834a5267K5276Q540j7576o707n90J039J5484L392k0333k183J2309m030n358P563
$$ -15267 10009 18549 973 -5734 -6324 -5285 10199 13591 -6742 -8925 3384 -646 -6004 1559
848A559m270J1J3956r684k1709J2537K3446p853j2490p25q27J0905J0424j6090
$$ 1559 -2711 -2700 11256 1572 -20137 -7600 15846 7993 -4497 -5222 -6049 4856 15280 -810
862h10j0416J8486L709j7836L92Q705J40N500l557k0360J192K4841P27j5688j947
$$ -810 -11226 7260 10969 -6867 -6475 2230 2370 7870 4313 -16047 -14855 9986 10713 -4975 -6922
877f922J684L638J0369o259j5541J5268J5793j8080j3995J3920R576m92j801j4922
$$ -6922 -5238 -1600 8769 2510 -13031 2237 18030 -50 -14045 -125 9451 8959 7158 -7764
891g764o196J9305O478j5784m49P413p230J025N628q980J885J7747o292k0242
$$ -7764 -13960 5345 11823 -3961 -4410 3003 -4227 -3202 2426 -6554 -4669 13078 6786 -13456
905a3456M402J2747K500L566p533j4314J0915J6384j4193r687J3621K534j0276
$$ -13456 -9054 3693 6193 9759 2226 -12088 -1173 15211 1018 -8669 4952 7486 -2790
918b790K44k422k115J5796K884k1327l906J5061K007j443K058j0186o41J6585
$$ -2790 -2546 -4968 -7083 8713 11597 -9730 -13636 1425 3432 1989 4047 -6139 -6780 9805
932I805m888j5623J1011J4597j1088q729J464N85Q674P339j7075r702J5682L108
$$ 9805 4917 -10706 305 14902 3814 -4915 -3451 -2866 5808 13147 -3928 -13630 2052 5160
946E160j0123N151M163r370K713N017r763K355J4303m036r326L560k425j55J3474
$$ 5160 -4963 188 4351 -5019 -2306 2711 -7052 -4697 9606 5570 -3756 -196 -2621 -2776 10698
961A0698k17j6545L424Q892q718n46Q819m112m536M588o855n689J4968M283j2797
$$ 10698 10481 -6064 -2640 6252 -2466 -3012 5807 1695 -2841 1747 -5108 -10797 4171 8454 -4343
976d343M34L907o109N411R857r736l640J1549m495j0444Q620O790o597R86k418
$$ -4343 -3909 -2 -6111 -700 9157 -579 -4219 7330 2835 -7609 1011 7801 1204 2190 -228
991b28q695Q511J0443j2482m416J2160n724j1061J0809O033n931J017k157p301
$$ -228 -8923 -412 10031 -2451 -6867 5293 -431 -11492 -683 5350 -581 436 -1721 -9022
$$ [...]
8191b51
##END NTUPLES=NMR FID
##END=
