##TITLE=1H ikalashn
11P153_mk
26.7.2023
##JCAMPDX= 6.0         $$ Bruker NMR JCAMP-DX V2.0
##DATA TYPE= NMR SPECTRUM
##DATA CLASS= NTUPLES
##ORIGIN= UXNMR, Bruker Analytische Messtechnik GmbH
##OWNER= root
$$ TOPSPIN		Version 1.3
$$ 2023-07-26 13:42:59.718 +0400  Irina@DPX200
$$ Compression mode = diff/dup
##.OBSERVE FREQUENCY= 200.131300845
##.OBSERVE NUCLEUS= ^1H
##.ACQUISITION MODE= SIMULTANEOUS
##.ACQUISITION SCHEME= undefined
##.AVERAGES= 32
##.DIGITISER RES= 18
##SPECTROMETER/DATA SYSTEM= spect
##.PULSE SEQUENCE= zg
##.SOLVENT NAME= CDCl3
##.SHIFT REFERENCE= INTERNAL, CDCl3, 1, 16.97976
##AUDIT TRAIL= $$ (NUMBER, WHEN, WHO, WHERE, WHAT)
$$ ##TITLE= Audit trail, TOPSPIN		Version 1.3
$$ ##JCAMPDX= 5.01
$$ ##ORIGIN= Bruker BioSpin GmbH
$$ ##OWNER= Irina
$$ $$ F:/spectra/data/iren/nmr/1H/4/pdata/1/auditp.txt
$$ ##AUDIT TRAIL=  $$ (NUMBER, WHEN, WHO, WHERE, VERSION, WHAT)
(   1,<2023-07-26 13:42:33.562 +0400>,<Irina>,<DPX200>,<TOPSPIN 1.3>,
      <created by zg
	started at 2023-07-26 13:40:20.640 +0400,
	POWCHK disabled, PULCHK disabled
       configuration hash MD5:
       BE 6D 3F 07 2A EA 11 49 91 17 2B D3 AF B3 58 0D
       data hash MD5: 16K
       8F FE BE 33 CD A6 4B 59 9F 4E 33 71 C7 AD E0 93>)
(   2,<2023-07-26 13:42:34.906 +0400>,<Irina>,<DPX200>,<TOPSPIN 1.3>,
      <Start of raw data processing
       efp BC_mod = 2 LB = 0.05 FT_mod = 6 PKNL = 1 PHC0 = 42.39502 PHC1 = 2.129774 SI = 32K 
       data hash MD5: 32K
       46 F8 0A F0 A9 50 E2 43 A3 69 08 B3 CC CA 1B CA>)
(   3,<2023-07-26 13:42:37.546 +0400>,<Irina>,<DPX200>,<TOPSPIN 1.3>,
      <apk 
       data hash MD5: 32K
       8B B4 2A FD 88 9C F3 8F 4F D1 6B CA 79 91 A0 3D>)
(   4,<2023-07-26 13:42:48.078 +0400>,<Irina>,<DPX200>,<TOPSPIN 1.3>,
      <pk fgphup PHC0 = 4.988696 PHC1 = -22.8 
       data hash MD5: 32K
       16 56 98 6E 2E E7 B8 45 FD 62 EF B6 8C C9 3B FA>)
(   5,<2023-07-26 13:42:49.750 +0400>,<Irina>,<DPX200>,<TOPSPIN 1.3>,
      <abs n ABSG = 5 
       data hash MD5: 32K
       34 C9 3E E3 8A 42 18 E0 AC AC 3D 16 EC EA 6C E1>)
$$ ##END=
$$ 
$$ $$ hash MD5
$$ $$ EB D9 39 D9 84 0F A6 82 2D 14 40 75 B3 FC 2E 99
##$RELAX= 
##$RELAX= 
##$RELAX= 
##$RELAX= 
##$RELAX= 
##$RELAX= 
##$RELAX= 
##$RELAX= 
$$ Bruker specific parameters
$$ --------------------------
##$DU= <F:/spectra>
##$EXPNO= 4
##$NAME= <1H>
##$PROCNO= 1
##$TYPE= <nmr>
##$USER= <iren>
##$AMP= (0..31)
100 100 100 100 100 100 100 100 100 100 100 100 100 100 100 100 100 100 
100 100 100 100 100 100 100 100 100 100 100 100 100 100 
##$ANAVPT= -1
##$AQSEQ= 0
##$AQ_mod= 1
##$AUNM= <au_zg>
##$AUTOPOS= <>
##$BF1= 200.13
##$BF2= 200.13
##$BF3= 200.13
##$BF4= 200.13
##$BF5= 200.13
##$BF6= 200.13
##$BF7= 200.13
##$BF8= 200.13
##$BYTORDA= 1
##$CFDGTYP= 0
##$CFRGTYP= 5
##$CHEMSTR= <none>
##$CNST= (0..63)
1 1 145 1 1 1 1 1 1 1 1 1 1 1 1 1 1 1 1 1 1 1 1 1 1 1 1 1 1 1 1 1 1 1 
1 1 1 1 1 1 1 1 1 1 1 1 1 1 1 1 1 1 1 1 1 1 1 1 1 1 1 1 1 1 
##$CPDPRG= <>
##$CPDPRG1= <>
##$CPDPRG2= <>
##$CPDPRG3= <>
##$CPDPRG4= <mlev>
$$ [...]
##$SW_h= 4194.63087248322
##$TD= 16384
##$TD0= 1
##$TE= 300
##$TE2= 300
##$TE3= 300
##$TEG= 300
##$TL= (0..7)
0 120 120 120 120 120 120 120 
##$TP= (0..7)
150 150 150 150 150 150 150 150 
##$TP07= 0
##$TPNAME0= <>
##$TPNAME1= <>
##$TPNAME2= <>
##$TPNAME3= <>
##$TPNAME4= <>
##$TPNAME5= <>
##$TPNAME6= <>
##$TPNAME7= <>
##$TPOAL= (0..7)
0.5 0.5 0.5 0.5 0.5 0.5 0.5 0.5 
##$TPOFFS= (0..7)
0 0 0 0 0 0 0 0 
##$TUNHIN= 0
##$TUNHOUT= 0
##$TUNXOUT= 0
##$USERA1= <user>
##$USERA2= <user>
##$USERA3= <user>
##$USERA4= <user>
##$USERA5= <user>
##$V9= 5
##$VALIST= <valist>
##$VCLIST= <CCCCCCCCCCCCCCC>
##$VD= 0
##$VDLIST= <DDDDDDDDDDDDDDD>
##$VPLIST= <PPPPPPPPPPPPPPP>
##$VTLIST= <TTTTTTTTTTTTTTT>
##$WBST= 1024
##$WBSW= 25
##$XGAIN= (0..3)
0 0 0 0 
##$XL= 0
##$YL= 0
##$YMAX_a= 380536
##$YMIN_a= -216661
##$ZGOPTNS= <>
##$ZL1= 120
##$ZL2= 120
##$ZL3= 120
##$ZL4= 120
##$ABSF1= 16.97976
##$ABSF2= -3.979771
##$ABSG= 5
##$ABSL= 3
##$ALPHA= 0
##$AQORDER= 0
##$ASSFAC= 0
##$ASSFACI= 0
##$ASSFACX= 0
##$ASSWID= 0
##$AUNMP= <proc_1d>
##$AXLEFT= 0
##$AXRIGHT= 0
##$AXTYPE= 0
##$AXUNIT= <>
##$AZFE= 0.1
##$AZFW= 0.1
##$BCFW= 0
##$BC_mod= 2
##$BYTORDP= 0
##$COROFFS= 0
##$CY= 7568.61572265625
##$DATMOD= 1
##$DC= 0
##$DFILT= <>
##$DTYPP= 0
##$F1P= 12.6985496478733
##$F2P= 1.34767866218088
##$FCOR= 0.5
##$FTSIZE= 32768
##$FT_mod= 6
##$GAMMA= 0
##$GB= 0
##$INTBC= 0
##$INTSCL= 2.627456e-011
##$ISEN= 128
##$LB= 0.05
##$LEV0= 0
##$LPBIN= 0
##$MAXI= 10000
##$MC2= 0
##$MEAN= 0
##$ME_mod= 0
##$MI= 50
##$NCOEF= 0
##$NC_proc= -8
##$NLEV= 6
##$NOISF1= 8.587773
##$NOISF2= 6.764455
##$NSP= 0
##$NTH_PI= 0
##$NZP= 0
##$OFFSET= 16.97976
##$PC= 4
##$PHC0= 13.87176
##$PHC1= 53.43653
##$PH_mod= 1
##$PKNL= yes
##$PPARMOD= 0
##$PPDIAG= 0
##$PPIPTYP= 0
##$PPMPNUM= 100
##$PPRESOL= 1
##$PSCAL= 1
##$PSIGN= 0
##$REVERSE= no
##$SF= 200.13
##$SI= 32768
##$SIGF1= 15.25833
##$SIGF2= -3.509519
##$SINO= 10.81358
##$SIOLD= 32768
##$SREGLST= <1H.CDCl3>
##$SSB= 0
##$STSI= 32768
##$STSR= 0
##$SW_p= 4194.63087248321
##$SYMM= 0
##$S_DEV= 0
##$TDeff= 16384
##$TDoff= 0
##$TI= <>
##$TILT= no
##$TM1= 0
##$TM2= 0
##$TOPLEV= 0
##$USERP1= <user>
##$USERP2= <user>
##$USERP3= <user>
##$USERP4= <user>
##$USERP5= <user>
##$WDW= 1
##$XDIM= 32768
##$YMAX_p= 446362899
##$YMIN_p= -4672982
$$ End of Bruker specific parameters
$$ ---------------------------------
##NTUPLES= NMR SPECTRUM
##VAR_NAME=  FREQUENCY,     SPECTRUM/REAL,   SPECTRUM/IMAG
##SYMBOL=    X,             R,               I
##VAR_TYPE=  INDEPENDENT,   DEPENDENT,       DEPENDENT
##VAR_FORM=  AFFN,          ASDF,            ASDF
##VAR_DIM=   32768,         32768,           32768
##UNITS=     HZ,            ARBITRARY UNITS, ARBITRARY UNITS
##FACTOR=    0.128013882030189, 1,           1
##FIRST=     4194.63087248321, -1417324,     -364034
##LAST=      0,             -4563925,        -2632853
##MIN=       0,             -4672982,        0
##MAX=       4194.63087248321, 446362899,    0
$$ Real data points
##PAGE= N=1
##DATA TABLE= (X++(R..R)), XYDATA
$$ [...]
20271B543648J19992k34344k48606n3873K2726M3805J88077K72043N7895k46721
$$ 2543648 2663640 2429296 2180690 2126817 2149543 2193348 2381425 2653468 2711363 2464642
20261B464642k81479j03041k0771o2239k7043R1894J38484J06519P7440L118j32359
$$ 2464642 2183163 2080122 2059351 1997112 1970069 2061963 2200447 2306966 2384406 2387524 2255165
20250B255165j39071N8009J68689j7397k07625p1795J46471K1013k87921k75467
$$ 2255165 2116094 2174103 2342792 2325395 2117770 2045975 2192446 2213459 1925538 1650071
20240A650071M9055K09977J04402J00530K73885K49041o7090k61038j20696M6521
$$ 1650071 1699126 1909103 2013505 2114035 2387920 2636961 2569871 2308833 2188137 2234658
20230B234658K2756O932R1554K6373k05780k04383J05245J87079k03044m74907
$$ 2234658 2257414 2264346 2355900 2382273 2176493 1972110 2077355 2264434 2061390 1586483
20220A586483j35003L33343K18781k72739m01224p2052J75938J35723Q5328J02943
$$ 1586483 1451480 1784823 2003604 1730865 1329641 1257589 1433527 1569250 1654578 1757521
20210A757521J351j12586M3975K79940J44180k12281j78639K47932L82085J4425
$$ 1757521 1758872 1646286 1690261 1970201 2114381 1902100 1723461 1971393 2353478 2367903
20200B367903k19056M3578K62503k0074l55210j91923J51611Q0304k15988j30153
$$ 2367903 2148847 2192425 2454928 2434854 2079644 1887721 2039332 2119636 1903648 1773495
20190A773495K47155K48494k27711n01960j49424L94355M80724N4120m03583m51204
$$ 1773495 2020650 2269144 2041433 1539473 1390049 1784404 2265128 2319248 1915665 1464461
20180A464461p0431L50614L84214M2587k14691j07493P2864k4948k17343j48103
$$ 1464461 1394030 1744644 2128858 2171445 1956754 1849261 1922125 1897177 1679834 1531731
20170A531731L5022l5801j82831O6132N13169M15201k64327n87661k8622O51110
$$ 1531731 1566753 1530952 1348121 1414253 1927422 2342623 2078296 1490635 1462013 2113123
20160B113123N18746j62380m40476j18428J63372Q1639j0317Q9887O6501k10313
$$ 2113123 2631869 2469489 2029013 1910585 2073957 2155596 2145279 2235166 2301667 2091354
20150B091354l07061M6285L84031J60662l72447m94719n4428L63299L14869M7243
$$ 2091354 1784293 1830578 2214609 2375271 2002824 1508105 1453677 1816976 2131845 2179088
20140B179088j3158P5573l6328l34745m00220o1972K72591J75651j47680j25665
$$ 2179088 2165930 2241503 2205175 1870430 1470210 1408238 1680829 1856480 1708800 1583135
20130A583135L16764N82139K44898l05589m10950p9581R9623j01468k43195R861
$$ 1583135 1899899 2482038 2726936 2421347 2010397 1930816 2030439 1928971 1685776 1695637
20120A695637L26252K56556m7089j25468J9420o809k36126k29489J66500M77803
$$ 1695637 2021889 2278445 2231356 2105888 2125308 2118499 1882373 1652884 1819384 2297187
20110B297187K86428j47866k96367j02751O8392L8462k6545J4658J08051J85821
$$ 2297187 2583615 2435749 2139382 2036631 2105023 2143485 2116940 2131598 2239649 2425470
20100B425470K16950R6029k18609m69703l34835P2119K75020R5521j07362r658
$$ 2425470 2642420 2738449 2519840 2050137 1715302 1787421 2062441 2157962 2050600 2040942
20090B040942K01252J69197p1231j83637m1934J30942J02328r4692k36737j60289
$$ 2040942 2242194 2411391 2340160 2156523 2114589 2245531 2347859 2253167 2016430 1856141
20080A856141O0359J73983N6722r2743k4773J56896J37534q0031j56070J2533
$$ 1856141 1916500 2090483 2147205 2054462 2029689 2186585 2324119 2244088 2088018 2100551
20070B100551J18322k736q9406K9091R3120p7327j89103j6917J13677q7763k44818
$$ 2100551 2218873 2216137 2126731 2155822 2248942 2171615 1982512 1965595 2079272 1991509 1746691
20059A746691O9869M64242K73435k80989l83254L3593K10998j05332k67601P6663
$$ 1746691 1816560 2280802 2554237 2273248 1889994 1923587 2134585 2029253 1761652 1838315
20049A838315L62590J39824j47470j3454J86489n8424m38766l21206J83720M18836
$$ 1838315 2200905 2340729 2193259 2179805 2366294 2307870 1869104 1547898 1731618 2150454
20039B150454J97282p1107j15667n4291j076N7557O9423P879K1771J47673J21694
$$ 2150454 2347736 2276629 2160962 2106671 2105595 2163152 2232575 2240454 2262225 2409898 2531592
20028B531592j41883k31673J10753L99161Q9309m71223n19350o7552J90112L4286
$$ 2531592 2389709 2158036 2268789 2667950 2757259 2286036 1766686 1699134 1889246 1923532
20018A923532o7969J00191K08873J24665J29918K20591r421n18417o38393j18261
$$ 1923532 1855563 1955754 2164627 2289292 2419210 2639801 2630380 2111963 1473570 1355309
20008A355309L78543K76579o2539l0554K47739K50598k4807j35025K5460R4045
$$ 1355309 1733852 2010431 1947892 1917338 2165077 2415675 2390868 2255843 2281303 2375348
19998B375348j39584m07294l28055J01019M42517K77401k10912l20513K16792
$$ 2375348 2235764 1828470 1500415 1601434 2043951 2321352 2110440 1789927 2006719
19989B006719O70213K74610m98959n16035K40668N64032o2895o37795l07601K82121
$$ 2006719 2676932 2951542 2452583 1936548 2177216 2741248 2678353 2040558 1732957 2015078
19979B015078K04001j79864j2791M53168L57275j65399k45350J25270J39935k49591
$$ 2015078 2219079 2039215 2026424 2479592 2836867 2671468 2426118 2551388 2691323 2441732
19969B441732k10899L56866M71546k39283p58340k69268N21494M94905k28374
$$ 2441732 2230833 2587699 3059245 2819962 2061622 1792354 2313848 2808753 2580379
19960B580379o44670l64996J05231L03907K73023J74481L2510j16887j84231j46365
$$ 2580379 1935709 1570713 1675944 1979851 2252874 2427355 2459865 2342978 2158747 2012382
19950B012382k8556J36600K32450J38175m0154q4323m6964j53063k89698r9656
$$ 2012382 1983826 2120426 2352876 2491051 2450897 2366574 2319610 2166547 1876849 1777193
19940A777193L08785L53661q4197l65572j00296K09736M7770k30853o8898K69667
$$ 1777193 2085978 2439639 2355442 1989870 1889574 2099310 2147080 1916227 1847329 2116996
19930B116996J71515j97443j45137L23671M52658m1585n18272m07485K8104K41255
$$ 2116996 2288511 2091068 1945931 2269602 2722260 2680675 2162403 1754918 1783022 2024277
19920B024277J73354J11792J45515J30196N624j21652j37334m1432L6356l8992
$$ 2024277 2197631 2309423 2454938 2585134 2590758 2469106 2331772 2290340 2326696 2287704
19910B287704j76095q2494K82938M71455J00345m93581o03178j20028L24095K54938
$$ 2287704 2111609 2029115 2312053 2783508 2883853 2390272 1787094 1667066 1991161 2246099
19900B246099p5773j91041l4572J44043K20775K11995Q1591j65894l21518j64237
$$ 2246099 2170326 1979285 1944713 2088756 2309531 2521526 2603117 2437223 2115705 1951468
19890A951468K16492M72329L74612L7981k39558k95979k28526j96719j77008m4540
$$ 1951468 2167960 2640289 3014901 3052882 2813324 2517345 2288819 2092100 1915092 1870552
19880A870552J36803J54902L9671R0465L39205L58104p2496m70117l04212J49807
$$ 1870552 2007355 2162257 2201928 2292393 2631598 2989702 2917206 2447089 2142877 2292684
19870B292684K14676j20290k38890M0781K07608q570j89606j2906J80566K1031
$$ 2292684 2507360 2387070 2148180 2188961 2396569 2387999 2198393 2185487 2366053 2387084
19860B387084k30445j42338J74566L00947J59318j2055j03377j53897j17917M2389
$$ 2387084 2156639 2014301 2188867 2489814 2649132 2637077 2533700 2379803 2261886 2304275
19850B304275J90552K12358J90085J69292K3089k25648k81100m4501J57839J18519
$$ 2304275 2494827 2707185 2897270 3066562 3089651 2864003 2582903 2538402 2696241 2814760
19840B814760R8550K60562K36973k16917o03781l81852J00044J31228j82153j32324
$$ 2814760 2913310 3173872 3410845 3193928 2590147 2208295 2308339 2439567 2257414 2125090
19830B125090L38701N30498J72566j77106j17037M1185o605m3743Q3958O6390
$$ 2125090 2463791 2994289 3166855 2989749 2872712 2913897 2907292 2863549 2947507 3013897
19820C013897k40633l97260q8039K88754K62126L2979J9881J04818m0363k38978
$$ 3013897 2773264 2376004 2287965 2576719 2838845 2871824 2891705 2996523 2956160 2717182
19810B717182j09752J69532J14798j82279j54835K52196M06692k6898n33293m73937
$$ 2717182 2607430 2776962 2891760 2709481 2554646 2806842 3213534 3186636 2653343 2179406
19800B179406O0953M49069L17107j40711m64901l73093m30K36361J18271q6708
$$ 2179406 2240359 2689428 3006535 2865824 2400923 2027830 2027400 2263761 2382032 2295324
19790B295324j5632K11592J60904j95946l77681j22629K23031K72106J45768J36453
$$ 2295324 2279692 2491284 2652188 2456242 2078561 1955932 2178963 2451069 2596837 2733290
19780B733290J69391J5662j92345j18587K02243L72444K02436q6364k40962k25270
$$ 2733290 2902681 2918343 2725998 2607411 2809654 3182098 3384534 3298170 3057208 2831938
19770B831938o9069J86513L33995J41538k38763l47093n5974K09081J03591j28585
$$ 2831938 2762869 2949382 3283377 3424915 3186152 2839059 2783085 2992166 3095757 2967172
19760B967172r4246J11566J25737l8029n2426J05222J08220j13682k20011n2616
$$ 2967172 2872926 2984492 3110229 3072200 3019774 3124996 3233216 3119534 2899523 2846907
19750B846907P4839q3644k77748j86342N3871J15318K9549N9354J77678J12406
$$ 2846907 2921746 2838102 2560354 2374012 2427883 2543201 2572750 2632104 2809782 2922188
19740B922188j32254k18503l252K24104J62202r7741k34707j03783J39977K35305
$$ 2922188 2789934 2571431 2568179 2792283 2954485 2856744 2622037 2518254 2658231 2893536
19730B893536P7404j62461k10708m0826P4200k5576j18751K5889K22259J63878
$$ 2893536 2970940 2808479 2597771 2556945 2631145 2605569 2486818 2512707 2734966 2898844
19720B898844k1998K5451K40046K08563p9819j62517Q6458K01132n7284k50047
$$ 2898844 2876846 2902297 3142343 3350906 3271087 3108570 3195028 3396160 3338876 3088829
19710C088829l4796K00232K1977k50382j14755J75067N2368k75117j22906L83469
$$ 3088829 3054033 3254265 3276242 3025860 2911105 3086172 3138540 2863423 2740517 3123986
19700C123986L55905l51124p19881j19291O45352N50736j01978k77046J32939
$$ 3123986 3479891 3128767 2408886 2289595 2934947 3485683 3383705 3106659 3239598
19691C239598K80403j45825m58620j87208J76915Q1911j81807q0886K01645J17934
$$ 3239598 3520001 3374176 2915556 2728348 2905263 2987174 2805367 2724481 2926126 3044060
19681C044060k52347l12247N3845L16536J99922O1399J68079K30019L372k03290
$$ 3044060 2791713 2479466 2533311 2849847 3049769 3111168 3279247 3509266 3512638 3309348
19671C309348r0675M7449j28724k90054K4649M62803L02547k79069l43890K81432
$$ 3309348 3218673 3266122 3137398 2847344 2871993 3334796 3637343 3358274 3014384 3295816
19661C295816O17570O9293n89599m33675J91084L28042o9157k62809n0157P4797
$$ 3295816 3913386 3982679 3393080 2959405 3150489 3478531 3409374 3146565 3096408 3171205
19651C171205k5783O4840L71390L43190j27580l89144j12904J27696j24772l66636
$$ 3171205 3145422 3210262 3581652 3924842 3797262 3408118 3295214 3422910 3298138 2931502
19641B931502K588N65663M74186j97812n51754k07426K55906K80198M2975m5882
$$ 2931502 2934090 3499753 3973939 3776127 3224373 3016947 3272853 3553051 3596026 3550144
19631C550144P265j4277p4642j8487O0790l5709j98265r9048K64189M33525R0796
$$ 3550144 3557409 3543132 3468490 3450003 3510793 3475084 3276819 3177771 3441960 3875485 3966281
19620C966281m17926m66979o061L43910J72009j42980o6110K24201J55238k24179
$$ 3966281 3548355 3081376 3075315 3419225 3591234 3448254 3382144 3606345 3761583 3537404
19610C537404k56711K12688M79756P4582m49195l66606R1086J57719k36033m23441
$$ 3537404 3280693 3493381 3973137 4047719 3598524 3231918 3323004 3480723 3244690 2821249
19600B821249j03582K60517K47662M1704l2672r934k1541N1687L09941M94293
$$ 2821249 2717667 2978184 3225846 3267550 3234878 3224944 3203403 3255090 3565031 4059324
19590D059324K83625j94069m55965k57071J23425K41569K4232j56953K1433L61424
$$ 4059324 4342949 4148880 3692915 3435844 3559269 3800838 3825070 3668117 3689550 4050974
19580D050974L58205r2472m90044m06967o9016N8464j1879M8811J92200N6297
$$ 4050974 4409179 4316707 3826663 3419696 3350680 3409144 3397265 3446076 3638276 3694573
19570C694573k93171l21277J08929M22448K00369j53267n5211L37067L90765k0911
$$ 3694573 3401402 3080125 3189054 3611502 3811871 3658604 3603393 3940460 4331225 4310314
19560D310314l57725k28048J03806J72122m8657j83754m933K74482K86141j8987
$$ 4310314 3952589 3724541 3828347 4000469 3951812 3768058 3763125 4037607 4323748 4304761
19550D304761l05133k75441k0152J69270J96248J70598J28840J2720j12835j06784
$$ 4304761 3999628 3724187 3704035 3873305 4069553 4240151 4368991 4381711 4268876 4162092
19540D162092j6749j5390q0890n6259p602j25787k56078k1782M63893N64518O5248
$$ 4162092 4145343 4129953 4049063 3992804 3985202 3859415 3603337 3581555 4045448 4609966 4675214
19529D675214l90808k17447K40462K72297j26479l55036j65804R0296J10358j3344
$$ 4675214 4284406 4066959 4307421 4579718 4453239 4098203 3932399 4022695 4133053 4119709
19519D119709j15357j75098j59443j3673J47934J46492L3557K214N3583M9573
$$ 4119709 4004352 3829254 3669811 3656138 3804072 3950564 3984121 3986335 4039918 4089491
19509D089491K0081Q3804J42465K1517j52305j11719O1663L8026j82437k43738
$$ 4089491 4109572 4193376 4335841 4357358 4205053 4093334 4154997 4193023 4010586 3766848
19499C766848k7141J77580J78135J26614J47097J30166L7260J8394Q0731K4588
$$ 3766848 3739707 3917287 4095422 4222036 4369133 4499299 4536559 4554953 4635684 4660272
19489D660272j40271j18137J46722K77438M4018k44010k18851J156P6640q101
$$ 4660272 4520001 4401864 4548586 4826024 4870042 4626032 4407181 4408337 4484977 4476876
19479D476876j2549J20560K08820J26800o4103k20565k26901q8339L4824J9995
$$ 4476876 4464327 4584887 4793707 4920507 4856404 4635839 4408938 4320599 4355423 4375418
19469D375418j4242Q1728J50472m0982k86723j59703K18685K32158k27511m64865
$$ 4375418 4361176 4442904 4593376 4552394 4265671 4105968 4324653 4556811 4329300 3864435
19459C864435m1421M87839M05381j14401l70115j60720J53814L15615L07805Q2659
$$ 3864435 3823014 4310853 4716234 4601833 4231718 4070998 4224812 4540427 4848232 4930891
19449D930891k87068m15849j02622K31658J46801r1403k2014J24881j41037n26926
$$ 4930891 4643823 4227974 4125352 4357010 4503811 4412408 4390394 4515275 4374238 3847312
19439C847312l14030L36751M88854m6442l55774P7058N36362K94282k18405k02848
$$ 3847312 3533282 3870033 4358887 4312445 3956671 4033729 4570091 4864373 4645968 4443120
19429D443120K14756L21007K1991j35859L6771J28176j06003l58303l04571q3116
$$ 4443120 4657876 4978883 5000874 4865015 4901786 5029962 4923959 4565656 4261085 4177969
19419D177969k7700j68613k08985M9937L87057L86812K2449k05194M7147L73629
$$ 4177969 4150269 3981656 3772671 3822608 4209665 4596477 4618926 4413732 4460879 4834508
19409D834508J72886l55715m22690J11501M64708J55805k64920j70513J55360
$$ 4834508 5007394 4651679 4228989 4340490 4805198 4961003 4696083 4525570 4680930
19400D680930J24668j32943j12530J16714J13850n4901L6635K98335K17732j98048
$$ 4680930 4805598 4672655 4560125 4676839 4790689 4735788 4772423 5070758 5288490 5090442
19390E090442l68380j03921J21029J8277r3242M5482J84452R1191k7522K6783
$$ 5090442 4722062 4618141 4739170 4757447 4664205 4709687 4894139 4985330 4957808 4984591
19380D984591N3097j34196l13859k45823q6576m9803J0222K68680M64826K26551
$$ 4984591 5037688 4903492 4589633 4343810 4257234 4207431 4217653 4486333 4951159 5177710
19370E177710k95594n55018l24447P3366K56746K08901J48903J92015K40557J36005
$$ 5177710 4882116 4327098 4002651 4076017 4332763 4541664 4690567 4882582 5123139 5259144
19360E259144j24314l26966k57053K3352K26328J98149Q6524Q6006J63918J43818
$$ 5259144 5134830 4807864 4550811 4574163 4800491 4998640 5085164 5171170 5335088 5478906
19350E478906m0097k66839l48324j89137J04105K76509J81850m0011j50354j10729
$$ 5478906 5438809 5171970 4823646 4634509 4738614 5015123 5196973 5156962 5006608 4895879
19340D895879m7435j2082J8338J080o7455k2074J96321K80478k4007l69782k10297
$$ 4895879 4848444 4836362 4854700 4855780 4788325 4766251 4962572 5243050 5219043 4849261 4638964
19329D638964K99374M38041K3050l17814j80604M6478M566P57K77442L52894j55175
$$ 4638964 4938338 5376379 5399429 5081615 4901011 4947489 4952055 4952812 5230254 5583148 5427973
19318E427973o20373k43141N71852O88718m0068n60510k37806K87997K28528j91725
$$ 5427973 4807600 4564459 5136311 5825029 5784961 5224451 4986645 5274642 5503170 5311445
19308E311445k61584Q6515L00956J01373j93306j78441J43303M18187L35716m4295
$$ 5311445 5049861 5136376 5437332 5538705 5345399 5166958 5310261 5728448 6064164 6019869
19298F019869l39981k81781l3930O5980j8117n8380J2794M4614r09r838K19p6055
$$ 6019869 5679888 5398107 5364177 5430157 5412040 5353660 5366454 5411068 5410159 5400321 5400540 5324485
19286E324485j13941R2328L46565K16719k18105l38130P9911M47723K39213k18616
$$ 5324485 5210544 5302872 5649437 5866156 5648051 5309921 5389832 5837555 6076768 5858152
19276E858152k98990k2749J07711l2712r9809L8900J04403l8041j06717J10863
$$ 5858152 5559162 5536413 5644124 5611412 5511603 5550503 5654906 5616865 5510148 5621011
19266E621011L46650K13192j92539l50859j1956M13004L52927j35819m05371j17759
$$ 5621011 5967661 6180853 5988314 5637455 5625499 6038503 6391430 6255611 5850240 5732481
19256E732481K72062K25995n2088j7550K43980J50275l26599n29039j89960J40795
$$ 5732481 6004543 6230538 6178450 6160900 6404880 6555155 6228556 5699517 5509557 5650352
19246E650352O4079l7138J89745L42987M897l97018k36178K51705L59253L5104
$$ 5650352 5714431 5677293 5867038 6210025 6214922 5817904 5581726 5833431 6192684 6227788
19236F227788j92231j77293k10884k63000k0253L69385M07714J14386l572J24919
$$ 6227788 6035557 5858264 5647380 5384380 5364127 5733512 6141226 6255612 6252040 6376959
19226F376959O3106k10250j81634K14106L75562Q2336j11493R3643J91665j50982
$$ 6376959 6440065 6229815 6048181 6262287 6637849 6720185 6608692 6702335 6894000 6743018
19216F743018m02881r2469L21254K42854m2029L4619K55561O5008l22906k44584
$$ 6743018 6340137 6247668 6568922 6811776 6769747 6804366 7059927 7124935 6802029 6557445
19206F557445K09223K96193j22875l78200j39282J15787K3235p1012J71943M24152
$$ 6557445 6766668 7062861 6939986 6561786 6422504 6538291 6561526 6490514 6662457 7086609
19196G086609K47354j44013k08373Q4083K35104j7301l21059k14389K15945M07291
$$ 7086609 7333963 7189950 6981577 7065660 7300764 7283463 6962404 6748015 6963960 7371251
19186G371251O9887l57684k62687K34789L84456p2392m38240j01175M74754M36766
$$ 7371251 7441138 7083454 6820767 7055556 7440012 7367620 6929380 6828205 7302959 7739725
19176G739725j34420l85185l4818K88239J36099j45731j50345l1834k6995K1557
$$ 7739725 7605305 7220120 7185302 7473541 7609640 7463909 7313564 7281730 7254735 7276292
19166G276292K23102K56365o9453l18615m8096M21093M40130R887k76783j57444
$$ 7276292 7499394 7755759 7686306 7367691 7319595 7740688 8180818 8190705 7913922 7756478
19156G756478K8466J2397j2890J45720K63344M0743l66158m76828j12960L38486
$$ 7756478 7784944 7797341 7784451 7930171 8193515 8234258 7868100 7391272 7278312 7616798
19146G616798L85210K6571k85913k59930p8585P165R3211L25094M59809K08393
$$ 7616798 8002008 8028579 7742666 7482736 7404151 7411316 7504527 7829621 8289430 8497823
19136H497823j46349p8523K75513K44689k38548m22955K5082L92827Q5828l41363
$$ 8497823 8351474 8272951 8548464 8793153 8554605 8131650 8156732 8549559 8635387 8294024
19126H294024j16842L95150K74796l74963n36564Q4077N92102L00196l11220m24996
$$ 8294024 8177182 8572332 8847128 8472165 7935601 8019678 8611780 8911976 8600756 8175760
19116H175760J885L97125L74585J4460l23082k53186K35897N73471K41394l72439
$$ 8175760 8177645 8574770 8949355 8963815 8640733 8387547 8623444 9196915 9438309 9065870
19106I065870l88112K18294M93123J5945l74788M8753O49991M24452l59358n74119
$$ 9065870 8677758 8896052 9389175 9405120 9030332 9079085 9729076 10153528 9794170 9220051
19096I220051J1122M76227K42671j83047j91257M6567P1630j04527j81743r8546
$$ 9220051 9231173 9707400 9950071 9767024 9575767 9622334 9693964 9589437 9407694 9309148
19086I309148J2835J13971J94057J45164m6622j79868j04695O6509J59998J63981
$$ 9309148 9321983 9435954 9630011 9775175 9728553 9548685 9443990 9510499 9670497 9834478
19076I834478J37406R9296J00195J84249K24101O5746j24686k4046K61625K36093
$$ 9834478 9971884 10071180 10171375 10355624 10579725 10645471 10520785 10496739 10758364 10994457
19066A0994457j78335l90953l9308L73629K37440k03960k82036J9635J54787J4355
$$ 10994457 10816122 10425169 10385861 10759490 10996930 10792970 10510934 10530569 10685356 10699711
19056A0699711L0833K71965K58033j14133k57902J18112M32676J67130k48680
$$ 10699711 10730544 11002509 11260542 11146409 10888507 11006619 11439295 11606425 11357745
19047A1357745j59546K07420J72923j81248j55558K99546M27440m7139l92930
$$ 11357745 11198199 11405619 11578542 11397294 11241736 11541282 11968722 11921583 11528653
19038A1528653o0080L98171K28931k93946l39616J33205L62052L8046k52151k1908
$$ 11528653 11468573 11866744 12095675 11801729 11462113 11595318 11957370 11995416 11743265 11721357
19028A1721357L75669L70003L1684j45228j4536J27603Q2852k3774m7991l0163
$$ 11721357 12097026 12467029 12498713 12353485 12338949 12466552 12549404 12525630 12477639 12447476
19018A2447476k9420R339J18011J87157J03691o3229j15277L8590K58955L22696
$$ 12447476 12418056 12427395 12545406 12732563 12836254 12773025 12657748 12696338 12955293 13277989
19008A3277989J71254m0811j47387j33556n3446R0876K63907L03484J13695j13966
$$ 13277989 13449243 13408432 13261045 13127489 13074043 13164919 13428826 13732310 13846005 13732039
18998A3732039j12153N5107P7115r1484j36212Q8013K78801J56703q7152j07984
$$ 13732039 13619886 13674993 13752108 13660624 13524412 13612425 13891226 14047929 13960777 13852793
18988A3852793O3196J41387O6529M332j6539r9391j69510l8709K18561K98565
$$ 13852793 13915989 14057376 14123905 14128237 14111698 14012307 13842797 13804088 14022649 14321214
18978A4321214J17708p9276j00364K761J54426L39353M18111K14507j20250j99980
$$ 14321214 14438922 14359646 14259282 14262043 14416469 14755822 15173933 15388440 15268190 15068210
18968A5068210J1068J00315j21939k86377r1665J60539Q1961j15319M308K85815
$$ 15068210 15079278 15179593 15057654 14771277 14679612 14840151 14922112 14806793 14811101 15096916
18958A5096916J95088k31234l37558J16910N19168L19553j39330j84764J54160
$$ 15096916 15292004 15060770 14723212 14840122 15359290 15678843 15539513 15354749 15508909
18949A5508909K57182p6598l26578q1254L16183K74232j72836m00958o2004M50737
$$ 15508909 15766091 15689493 15362915 15281661 15597844 15872076 15699240 15298282 15236278 15687015
18939A5687015N44146J85287j30802o9579J79770K75006J83349R4697N9442k5550
$$ 15687015 16231161 16416448 16285646 16216067 16395837 16670843 16854192 16948889 17008331 16982781
18929A6982781j40120j30348q307k027j86967k88645n1162L44140M73720K29585
$$ 16982781 16842661 16712313 16704006 16701979 16515012 16226367 16175205 16519345 16993065 17222650
18919A7222650o8179j33734l9322K0402M8037J25851J52043k2310k56676k31481
$$ 17222650 17154471 17020737 16981415 17001817 17049854 17175705 17327748 17305438 17048762 16817281
18909A6817281O2138K42670Q1302j49574r1047J64637K48610Q0583q3297j05014
$$ 16817281 16879419 17122089 17203391 17053817 16962770 17127407 17376017 17456600 17373303 17268289
18899A7268289j03900j19978l584K44613L48220J49320j28205j97729p4796N6468
$$ 17268289 17164389 17044411 17040827 17285440 17633660 17782980 17654775 17457046 17382250 17438718
18889A7438718J28097J50496J01052M6743J51930L49856K77399j67260m82429
$$ 17438718 17566815 17717311 17818363 17865106 18017036 18366892 18644291 18477031 17994602
18880A7994602j92475L90525N31025Q9989l50541l74656j90147r1385j3221J33036
$$ 17994602 17802127 18192652 18723677 18813666 18463125 18088469 17898322 17806937 17793716 17926752
18870A7926752J50002p6531k55957j13003J36053J07535j44068k39946q8282J3228
$$ 17926752 18076754 18000223 17744266 17631263 17767316 17874851 17730783 17490837 17402555 17415783
18860A7415783j12890k57142j68105P2836J69176l488k48210k83323p6579J19026
$$ 17415783 17302893 17045751 16877646 16950482 17119658 17116170 16867960 16584637 16508058 16627084
18850A6627084R0957p2388j66356j96367k79918l01555k2960M23689N49182J76852
$$ 16627084 16718041 16645653 16479297 16282930 16003012 15701457 15678497 16102186 16651368 16828220
18840A6828220k60010l10967o8913J10871J20601L5970j26250k47336m3341M34841
$$ 16828220 16568210 16257243 16188330 16299201 16419802 16455772 16329522 16082186 16038845 16473686
18830A6473686N90295P4686n29738m38445J78342M74705K02871q3150o0731k9295
$$ 16473686 17063981 17138667 16608929 16170484 16348826 16823531 17026402 16943252 16882521 16853226
18820A6853226j50682j37824N2550K0772k57383k22230K37554L83252j55701n86871
$$ 16853226 16702544 16564720 16617270 16638042 16380659 16158429 16395983 16779235 16623534 16036663
18810A6036663j75223M67625L12860m07972n97739o6597K92310N4105j88434j1964
$$ 16036663 15861440 16329065 16641925 16233953 15636214 15569617 15861927 15916032 15727598 15715634
18800A5715634J80592M7325q9215K7998P9539j28955k09916M5490J78776q7311
$$ 15715634 15896226 15943551 15854336 15882334 15961873 15832918 15623002 15668492 15847268 15759957
18790A5759957k34145J31583M37083O9649m57590k72520L60296M41276r1279k98633
$$ 15759957 15525812 15657395 16094478 16164127 15706537 15434017 15794313 16235589 16144310 15845677
18780A5845677J15645L19783j62873n99477k69569L52947L91293r3763l49814
$$ 15845677 15961322 16281105 16118232 15518755 15249186 15602133 15993426 15899663 15549849
18771A5549849j25896J36190J10288o0410j53811j17985L3979K08522J93930n0835
$$ 15549849 15423953 15560143 15670431 15610021 15456210 15338225 15372204 15580726 15774656 15723821
18761A5723821k20070q8028R9321L0219j13663K4279K90334K14318j89418l90147
$$ 15723821 15503751 15415723 15515044 15545263 15431600 15455879 15746213 15960531 15771113 15380966
18751A5380966j43386K05859L18051K67273K12030J04398q5409k21866k48652
$$ 15380966 15237580 15443439 15761490 16028763 16240793 16345191 16259782 16037916 15789264
18742A5789264k61373k34439l0828K31327K34351k698q8802R5739K09140Q6494
$$ 15789264 15527891 15293452 15262624 15493951 15728302 15725604 15636802 15732541 15941681 16028175
18732A6028175K0373J32191N9697l20520m55549K9441N61032M05531j70401l16368
$$ 16028175 16048548 16180739 16240436 15919916 15464367 15493808 16054840 16460371 16289970 15973602
18722A5973602Q4896L60713K02016J7452P4752R1628j19922k93037k36262j30843
$$ 15973602 16058498 16419211 16621227 16638679 16713431 16805059 16685137 16392100 16155838 16024995
18712A6024995p4285R6243L07872J92176k12669l36631P044K38034k2849k73847
$$ 16024995 15950710 16046953 16354825 16547001 16334332 15997701 16004745 16242779 16219930 15946083
18702A5946083j3029L28113J04449l75797l12496K38759M45352O6131k05319P6474
$$ 15946083 15933054 16261167 16365616 15989819 15677323 15916082 16361434 16427565 16222246 16298720
18692A6298720M38025L36983j7068j40937n4218q2469k26028k04077L6100K28664
$$ 16298720 16736745 17073728 17056660 16915723 16861505 16779036 16553008 16348931 16385031 16613695
18682A6613695J52009j34682l61938k71380J01896L52756J52785k22265j85180
$$ 16613695 16765704 16631022 16269084 15997704 16099600 16452356 16605141 16382876 16197696
18673A6197696K67720M47070p4m71688k75083L14949M76045O4318k71600j45232
$$ 16197696 16465416 16912486 16912412 16440724 16165641 16480590 16956635 17020953 16749353 16604121
18663A6604121R6870R3866K1576J17019J68234q5832l86117k63358K40094N85270
$$ 16604121 16700991 16794857 16816433 16933452 17101686 17015854 16629737 16366379 16606473 17191743
18653A7191743M34747j006l10362k88268R703L53601M46366J85211j44611j62511
$$ 17191743 17626490 17625484 17315122 17026854 17036557 17390158 17836524 18021735 17877124 17714613
18643A7714613R8971K42047R7755o0512k0904K0692j23735k13348L2215L60344
$$ 17714613 17813584 18055631 18153386 18092874 18071970 18092662 17968927 17755579 17787794 18148138
18633A8148138K85049j39122l46203r2237K19985J83229p5615k06719j28929K6522
$$ 18148138 18433187 18294065 17947862 17855625 18075610 18258839 18183224 17976505 17847576 17874098
18623A7874098J66716K06526O4247j08340J129L48467M54586J23952j71657k0677
$$ 17874098 18040814 18247340 18311587 18203247 18204376 18552843 19007429 19131381 18959724 18939047
18613A8939047K39808J03583k06319j10096K94957L59287k6396k66472o9432J60367
$$ 18939047 19178855 19282438 19076119 18966023 19260980 19620267 19593871 19327399 19257967 19418334
18603A9418334J35712J30180K97912K76005j00018l34487n0418L31748K75279
$$ 19418334 19554046 19684226 19982138 20258143 20158125 19823638 19773220 20104968 20380247
18594B0380247o333q598J59322N7034k00079j17781K53492L39077j0274k88084
$$ 20380247 20373914 20365316 20524638 20581672 20381593 20263812 20517304 20856381 20846107 20558023
18584B0558023j60523Q7605J15401J7636K5677J10458J05626l7095k40993l44785
$$ 20558023 20397500 20485105 20600506 20618142 20643819 20754277 20859903 20822808 20581815 20237030
18574B0237030j57681K68675N11544K70678j17753j04775K29356L05917p936k21113
$$ 20237030 20079349 20348024 20859568 21130246 21012493 20907718 21137074 21442991 21435055 21213942
18564B1213942p6288P5670k5930j12985L9734J84194J09328M9008J78784K20240
$$ 21213942 21137654 21213324 21187394 21074409 21114143 21298337 21407665 21456673 21635457 21855697
18554B1855697l924j29852J10078L04931M8197k46046K3841N24016L87290l64627
$$ 21855697 21851773 21721921 21831999 22136930 22185127 21939081 21962922 22486938 22874228 22509601
18544B2509601p17907j44013O18411O13891q2340n96126l80400K72022O70946
$$ 22509601 21791694 21647681 22266092 22879983 22797643 22201517 21821117 22093139 22764085
18535B2764085M38473j44491m30719j41754K78125K63536q1442j99285K8078J61803
$$ 22764085 23202558 23058067 22627348 22485594 22763719 23027255 22945813 22746528 22774606 22936409
18525B2936409J9240j8500K65582M74451K48864j15749j65156j5081o0853k38759
$$ 22936409 22955649 22937149 23202731 23677182 23926046 23810297 23645141 23630060 23569207 23330448
18515B3330448j60683J46707K29303m1967k38831m9622K53134K67666O4706J9812
$$ 23330448 23169765 23316472 23545775 23503808 23264977 23215355 23468489 23736155 23800861 23820673
18505B3820673K13692L25494J25721j70950j71809J74388M78367L71721l2894
$$ 23820673 24034365 24359859 24485580 24314630 24142821 24317209 24795576 25167297 25134403
18496B5134403k65106o3320L22182M45781J71547k24662l78153j73625J81026
$$ 25134403 24869297 24805977 25128159 25573940 25745487 25520825 25142672 24969047 25150073
18487B5150073L48719J87983p1557p2201K04461L66907J33243k43678k99532j1009
$$ 25150073 25498792 25686775 25615218 25543017 25747478 26114385 26247628 26003950 25704418 25693409
18477B5693409J80754L2430j35649O4620M57616N01569O9880l27749k50420N3076
$$ 25693409 25874163 25906593 25770944 25835564 26293180 26794749 26864629 26536880 26286460 26339536
18467B6339536M3209k69339l29415Q7892M83413L57237o8042k31398n5234Q9378
$$ 26339536 26382745 26113406 25783991 25871883 26355296 26712533 26644491 26413093 26357859 26447237
18457B6447237O1679N9207J06359k96j84495r5346K40842L45530Q3952n9582J67854
$$ 26447237 26508916 26568123 26674482 26674186 26489691 26394345 26635187 26980717 27064669 27005087 27172941
18446B7172941K80397j02790m76384j95562M21526N35411P9851k25771o7819J15020
$$ 27172941 27453338 27350548 26874164 26678602 27100128 27635539 27715390 27489619 27421800 27536820
18436B7536820M8853M8525K80834L61300O3156k05583p3020J80061J48625m399
$$ 27536820 27585673 27634198 27915032 28276332 28339488 28133905 28060885 28240946 28389571 28385172
18426B8385172R3480L24251K87770r071j81975o8610J27793K10687J59839K4897
$$ 28385172 28478652 28802903 29090673 29081602 28899627 28831017 28958810 29169497 29329336 29354233
18416B9354233o0273R6756M24851M99184J05279l33668k90576J16313L58415K88855
$$ 29354233 29293960 29390716 29815567 30314751 30420030 30086362 29795786 29912099 30270514 30559369
18406C0559369J83444J36938L757j17366M2576L28525K58391j67114l55033j4502
$$ 30559369 30742813 30879751 30883508 30766142 30808718 31137243 31395634 31228520 30873487 30858985
18396C0858985M13460M68667K62255O2415j53041l56845k26303K87613O18360
$$ 30858985 31272445 31741112 32003367 32065782 31912741 31555896 31329593 31617206 32235566
18387C2235566L46981j05080j23817J46400J74119L0279J95666N57006M90730
$$ 32235566 32582547 32477467 32353650 32500050 32674169 32704448 32900114 33457120 33947850
18378C3947850j6967k21036J82120N27295K57912j79694p8824M20804O08160K65359
$$ 33947850 33930883 33709847 33891967 34419262 34677174 34497480 34418656 34839460 35447620 35712979
18368C5712979j50968k32799n518L23577N53022M74860P4682k82095k16556J43635
$$ 35712979 35562011 35329212 35323694 35647271 36200293 36675153 36749835 36467740 36251184 36394819
18358C6394819L45315K52986J29290J04533J5859j46190q5223K94426O01225M73986
$$ 36394819 36740134 36993120 37122410 37226943 37242802 37096612 37011389 37305815 37907040 38381026
18348C8381026J24791L2255K46475L53975J19071j62635q5344K90059N00415K95052
$$ 38381026 38505817 38538072 38784547 39138522 39257593 39094958 39009614 39299673 39800088 40095140
18338D0095140l3098o7159J40242J81477j8453k8037L74746P04484M21282j70439
$$ 40095140 40062042 39994883 40135125 40316602 40298149 40270112 40644858 41349342 41770624 41600185
18328D1600185k61004K74507O59469L54286j81206k18813K11413M97795L51134
$$ 41600185 41339181 41613688 42273157 42627443 42446237 42227424 42438837 42936632 43287766
18319D3287766L8046j34530j14548N1672K80837L81374K52099J17639K46368M86276
$$ 43287766 43325812 43191282 43076734 43128406 43409243 43790617 44042716 44160355 44406723 44892999
18309D4892999M44394J11000r3578M9372K72837K95521K06547J87155J76314P3246
$$ 44892999 45337393 45448393 45354815 45404187 45677024 45972545 46179092 46366247 46542561 46615807
18299D6615807K1752J90913M23153M02674J25512o0281P9224L47126L67755P1475
$$ 46615807 46637559 46828472 47251625 47654299 47779811 47719530 47798754 48145880 48513635 48585110
18289D8585110k01646j26222J79950L17404J78458R3306K79237M52016K84528
$$ 48585110 48383464 48257242 48437192 48754596 48933054 49026360 49305597 49757613 50042141
18280E0042141q549J7327L02123L81738J63827K2297P4423J66k46217k11494K46131
$$ 50042141 50033592 50050919 50353042 50734780 50898607 50920904 50995327 50995493 50749276 50537782 50783913
18269E0783913N65689L59649P9537K24031M41886J72243k69960j51497L96240
$$ 50783913 51349602 51709251 51788788 52012819 52454705 52626948 52356988 52205491 52601731
18260E2601731N34835J09472j21648J89001M01971L1067l98401k16302L20081
$$ 52601731 53136566 53246038 53124390 53313391 53715362 53746429 53348028 53131726 53451807
18251E3451807M86722J79954j13832j42141n9113N3247K65691M65710M21017J81151
$$ 53451807 53938529 54118483 54004651 53862510 53803397 53856644 54122335 54588045 55009062 55190213
18241E5190213M6263J36175K81926L10486J87872l9133k07866q7768K69820M18202
$$ 55190213 55236476 55372651 55654577 55965063 56152935 56113802 55905936 55818168 56087988 56506190
18231E6506190R4789k80040j32555L65009M66920n6816n51699l80021K54143O49000
$$ 56506190 56600979 56320939 56188384 56553393 57020313 56963497 56411798 56031777 56285920 56934920
18221E6934920M67714j0780l10322k08321J19185K80482R4562j51004m9442L36058
$$ 56934920 57402634 57391854 57081532 56873211 56992396 57272878 57367440 57216436 57166994 57503052
18211E7503052N23617K96944j0988n6960M6364M3575j527J06774K67518K24342
$$ 57503052 58026669 58323613 58312625 58255665 58302029 58345604 58344077 58450851 58718369 58942711
18201E8942711L1362M552K10606L38522J67431j00117j22361J26769L55198L41721
$$ 58942711 58974073 58978625 59189231 59527753 59695184 59595067 59472706 59599475 59954673 60296394
18191F0296394J75914Q5908J38309K11106K21414K22202K27385J26907p6539j25545
$$ 60296394 60472308 60558216 60696525 60907631 61129045 61351247 61578632 61705539 61629000 61503455
18181F1503455J47123M65929M34892J36337Q999J41553J70562k0028m7928K56392
$$ 61503455 61650578 62116507 62551399 62687736 62696735 62838288 63008850 62988822 62940894 63197286
18171F3197286M35431J40623j92167O661M65229M53296l6483k51556J53994O39795
$$ 63197286 63632717 63773340 63581173 63587834 64053063 64506359 64469876 64218320 64372314 65012109
18161F5012109O47932L16374M5026r9578j87817r0722K44784N12039M32892J87317
$$ 65012109 65660041 65976415 66021441 65921863 65734046 65643324 65888108 66400147 66833039 67020356
18151F7020356J11207J93760K11230J45965J26360J32258R2847J03789K24130
$$ 67020356 67131563 67325323 67536553 67682518 67808878 67941136 68033983 68137772 68361902
18142F8361902K53024N8653q7089Q5016L16579K07974m4343Q6762N16561N68155
$$ 68361902 68614926 68673579 68586490 68671506 68988085 69196059 69151716 69238478 69755039 70323194
18132G0323194N1191l69900j72012K83300M16419L04942L57320N16219M15226
$$ 70323194 70374385 70004485 69832473 70115773 70532192 70837134 71194454 71710673 72125899
18123G2125899J11821L6984K70965M33237L34406K30206L08441L78813K71991
$$ 72125899 72237720 72274704 72545669 72978906 73313312 73543518 73851959 74230772 74502763
18114G4502763J67396K62139L99043L22253J23613J29667M06409O37871N35396
$$ 74502763 74670159 74932298 75331341 75653594 75777207 75906874 76313283 76951154 77486550
18105G7486550J98576j7031P5190K90638L30213J84353J46685L75969O16241N31641
$$ 77486550 77685126 77668095 77743285 78033923 78364136 78548489 78695174 79071143 79687384 80219025
18095H0219025J97228m291O9874J77711J32190P5924J84829L63467M23562L64468
$$ 80219025 80416253 80411962 80481836 80659547 80791737 80867661 81052490 81415957 81839519 82203987
18085H2203987K87423K09178J54676K56408N27373O85851M80883J01720j8003
$$ 82203987 82491410 82700588 82855264 83111672 83639045 84324896 84805779 84907499 84889496
18076H4889496K27916N02701M91851K56618Q7660J86598N18744Q32522Q32781
$$ 84889496 85117412 85620113 86111964 86368582 86456242 86642840 87161584 87994106 88826887
18067H8826887M89705J45279J40311L87927N28937M45177L32234K90493K03498
$$ 88826887 89316592 89461871 89602182 89990109 90519046 90964223 91296457 91586950 91790448
18058I1790448R1361K05535N87832Q64626P35787M06426K47396K53579J82952
$$ 91790448 91881809 92087344 92675176 93539802 94275589 94682015 94929411 95182990 95365942
18049I5365942P3517K14241O20727R16075Q31723N48293M01630M51902N02693
$$ 95365942 95439459 95653700 96274427 97190502 98022225 98570518 98972148 99424050 99926743
18040I9926743M25649L07857L04549M41409N79990N61632L80945J91065J25509
$$ 99926743 100352392 100660249 100964798 101406207 101986197 102547829 102928774 103119839 103245348
18031A03245348J75832K83270M53388O70784P73513N82525J78289q8665M8191
$$ 103245348 103421180 103704450 104157838 104828622 105602135 106184660 106362949 106274284 106322475
18022A06322475M54297P13199N86445K98777K67153N45871P26330N22425K37899
$$ 106322475 106776772 107489971 108076416 108375193 108642346 109188217 109914547 110436972 110674871
18013A10674871L29713O53489O41073K50421J27651N63080R07794N51548l1971
$$ 110674871 111004584 111658073 112299146 112549567 112677218 113240298 114148092 114699640 114667669
18004A14667669M4058O76378R12884M42757M5502L40815Q98728J008774O90840
$$ 114667669 114711727 115388105 116300989 116743746 116789248 117130063 118028791 119037565 119728405
17995A19728405M23265L43885K75687K22467L06996M17299L68056K58560K85955
$$ 119728405 120151670 120495555 120771242 120993709 121300705 121718004 122086060 122344620 122630575
17986A22630575L73188L54688L48794N46104P82298P31884M18362J57324J02063
$$ 122630575 123003763 123358451 123707245 124253349 125035647 125767531 126185893 126343217 126445280
17977A26445280J90354L84774N94954N59672K37193Q7551M45121Q47319O53282
$$ 126445280 126635634 127020408 127615362 128175034 128412227 128499778 128944899 129792218 130445500
17968A30445500J45174J70564P11060P90870O7101m80811j3063Q54952R81462
$$ 130445500 130590674 130761238 131472298 132263168 132330269 131849458 131836395 132691347 133672809
17959A33672809L49515r1246J12868N02170O23598N48920M29343K38485J01693
$$ 133672809 134022324 133931078 134043946 134546116 135169714 135718634 136147977 136386462 136488155
17950A36488155K85430O73790P76391M66471K22666L75525N82175M22193J27974
$$ 136488155 136773585 137447375 138223766 138690237 138912903 139288428 139870603 140292796 140420770
17941A40420770K24918O51789P84163L55647j16843l8009M52996O96608M14035
$$ 140420770 140645688 141297477 142081640 142437287 142320444 142282435 142735431 143432039 143846074
17932A43846074M1104Q7628M57080O40047M26339J19547O1039K33434M12146M59165
$$ 143846074 143887178 143974806 144431886 145071933 145498272 145617819 145678858 145912292 146324438 146783603
17922A46783603L48771J22903l9029R1372M76246P63128O97461M05575J50002
$$ 146783603 147132374 147255277 147216248 147307620 147783866 148546994 149244455 149650030 149800032
17913A49800032L9679J18771M33055P88582P76445L42324J0238J75184N03261
$$ 149800032 149839711 149958482 150391537 151180119 151956564 152298888 152309126 152484310 152987571
17904A52987571M87660K71576L31988N99630N90746K91464J74384L38940L76293
$$ 152987571 153475231 153746807 154078795 154678425 155269171 155560635 155735019 156073959 156450252
17895A56450252J79101J43831L87927M96344L02838K03930L74686M03504J18518
$$ 156450252 156629353 156773184 157161111 157657455 157960293 158164223 158538909 158942413 159060931
17886A59060931L3474M26157O87608K85271k48937j14920M57756O09009K16054
$$ 159060931 159094405 159520562 160208170 160493441 160244504 160129584 160587340 161196349 161412403
17877A61412403o8283L1806J46168J07838J93012M21337M09134R0233j09460J266
$$ 161412403 161344120 161375926 161522094 161629932 161822944 162244281 162653415 162743648 162634188 162635454
17867A62635454J13524N7177P9756K75696L37637J31750k4073Q5545K45622K69878
$$ 162635454 162748978 162806155 162885911 163161607 163499244 163630994 163606921 163692466 163938088 164207966
17857A64207966K79786L00070J13743k22167k68358R0993L82484L03582J72656
$$ 164207966 164487752 164787822 164901565 164679398 164411040 164502033 164884517 165188099 165360755
17848A65360755K47571K13021j50892l69381K7345O56401P98803M32949J19479
$$ 165360755 165608326 165821347 165670455 165301074 165328419 165984820 166783623 167216572 167336051
17839A67336051J22075K44616L17914K90968O5337k39495j43728N08839J053326
$$ 167336051 167458126 167702742 168020656 168311624 168376961 168137466 167993738 168502577 169555903
17830A69555903Q34833K11191j288K35638L45419K63125M06523O59136M68362
$$ 169555903 170390736 170601927 170600639 170836277 171181696 171444821 171851344 172510480 172978842
17821A72978842r939J7350N88264Q05612L72452J30475N41956Q15995L32308j52563
$$ 172978842 172968903 172986253 173574517 174380129 174752581 174883056 175425012 176241007 176573315 176420752
17811A76420752K38494R32818Q24054J24423l7636M88446P63627M60330L14624
$$ 176420752 176659246 177592064 178416118 178540541 178502905 178991351 179754978 180215308 180529932
17802A80529932O73888Q53365M11385m327K61264P80880P85845L82758K43811
$$ 180529932 181203820 182057185 182468570 182464243 182725507 183506387 184292232 184674990 184918801
17793A84918801M82929O19338M65855L40613M20602M85887L91746L15456L89741
$$ 184918801 185401730 186021068 186486923 186827536 187248138 187734025 188125771 188441227 188830968
17784A88830968M65505M15756L87705N45020P54203P52033N36788L88312M92587
$$ 188830968 189296473 189712229 190099934 190644954 191399157 192151190 192687978 193076290 193568877
17775A93568877P01902P45271N85808M42492M69860N64692N66149N18948N87391
$$ 193568877 194270779 195016050 195601858 196044350 196514210 197078902 197645051 198163999 198751390
17766A98751390P75092R03551Q59626P12675N86409N58953O75928Q88032R81390
$$ 198751390 199526482 200430033 201289659 202002334 202588743 203147696 203823624 204711656 205693046
17757B05693046P86239M85094M64359P73905J007381Q88805P06642Q75977J260449
$$ 205693046 206479285 206964379 207428738 208202643 209210024 210098829 210805471 211681448 212941897
17748B12941897J316822Q89560M85848O24144J169384J521878J340780Q84810
$$ 212941897 214258719 215148279 215634127 216258271 217427655 218949533 220290313 221175123
17740B21175123O57474Q53157J196497J279944J015924P21936P44759J068624
$$ 221175123 221832597 222685754 223882251 225162195 226178119 226900055 227644814 228713438
17732B28713438J385282J491181J441899J320597J109180R06067R91480J397231
$$ 228713438 230098720 231589901 233031800 234352397 235461577 236367644 237359124 238756355
17724B38756355J632505J264502O74357O89291J377871J829658J457763R09999
$$ 238756355 240388860 241653362 242327719 243017010 244394881 246224539 247682302 248592301
17716B48592301J081833J703502J768280J152886Q16348J274840J855923J853838
$$ 248592301 249674134 251377636 253145916 254298802 255115150 256389990 258245913 260099751
17708B60099751J548164J491025J546385J387943J319794J709251K076933J748623
$$ 260099751 261647915 263138940 264685325 266073268 267393062 269102313 271179246 272927869
17700B72927869J104762J106499J722243J975607J602909J441559J872745K108954
$$ 272927869 274032631 275139130 276861373 278836980 280439889 281881448 283754193 285863147
17692B85863147J628291J194714J583455K209297K081545J454893J358726J885962
$$ 285863147 287491438 288686152 290269607 292478904 294560449 296015342 297374068 299260030
17684B99260030K160639J871802J661428J876939K021481J765675J575266J863018
$$ 299260030 301420669 303292471 304953899 306830838 308852319 310617994 312193260 314056278
17676C14056278K263399K287951K109721K124026K199313J993850J710801J884485
$$ 314056278 316319677 318607628 320717349 322841375 325040688 327034538 328745339 330629824
17668C30629824K508750K943665K753268K224297J936364K108603K503909K779488
$$ 330629824 333138574 336082239 338835507 341059804 342996168 345104771 347608680 350388168
17660C50388168K786047K617416K485615K538796K745282K923856K886373K599217
$$ 350388168 353174215 355791631 358277246 360816042 363561324 366485180 369371553 371970770
17652C71970770K256411K141756K316337K474144K247906J665798J146932R84021
$$ 371970770 374227181 376368937 378685274 381159418 383407324 385073122 386220054 387204075
17644C87204075R82169P40609K05681k32819k32430N4438J76522p294j51022J9339
$$ 387204075 388186244 388926853 389132534 388899715 388667285 388721723 388898245 388890951 388739929 388759268
17634C88759268K33373J04966j46676N2049O43099Q63438M22582P0952M61027
$$ 388759268 388992641 389097607 388950931 389002980 389646079 390509517 390932099 391003051 391464078
17625C91464078J050123R30545L31205L03279J046278J596279J338908Q52125
$$ 391464078 392514201 393444746 393775951 394079230 395125508 396721787 398060695 398912820
17617C98912820Q55404J165557J246441J127020J143186J253908J236159J201639
$$ 398912820 399768224 400933781 402180222 403307242 404450428 405704336 406940495 408142134
17609D08142134J338451J427491J178311Q21338Q17688J131953J304792J154273
$$ 408142134 409480585 410908076 412086387 412907725 413725413 414857366 416162158 417316431
17601D17316431R40871Q84102R23348R51033R61851R69754R84325J007522R42648
$$ 417316431 418257302 419141404 420064752 421015785 421977636 422947390 423931715 424939237 425881885
17592D25881885P05378N14768P11279J128262J146099O62153M10317Q40428J309264
$$ 425881885 426587263 427102031 427813310 428941572 430087671 430749824 431160141 432000569 433309833
17583D33309833J081356N59301O05468J066002J051219M85906K31623O17855R57602
$$ 433309833 434391189 434950490 435555958 436621960 437673179 438159085 438390708 439008563 439966165
17574D39966165P67728M70087N12939O73673O52708N85378N54340L30065o647
$$ 439966165 440733893 441203980 441716919 442390592 443043300 443628678 444183018 444513083 444506436
17565D44506436N8082N44965P25133K82685r8785Q4612K59771j53213o03181l41684
$$ 444506436 444564518 445109483 445834616 446117301 446018516 446103128 446362899 446209686 445606505 445264821
17555D45264821J91500P8627m74627n19910p1538q7523p60686j164238q53830
$$ 445264821 445456321 445534948 445060321 444540411 444468873 444381350 443620664 442456426 441602596
17546D41602596n74792q92232j234389r90000o31378q91354j497644j652360j345708
$$ 441602596 441027804 440135572 438901183 437911183 437279805 436388451 434890807 433238447 431892739
17537D31892739j260936j563570j679838j327668r90939j123239j473024j557097
$$ 431892739 430631803 429068233 427388395 426060727 425069788 423946549 422473525 420916428
17529D20916428j397864j372986j550635j605633j375396j129852j157850j354514
$$ 420916428 419518564 418145578 416594943 414989310 413613914 412484062 411326212 409971698
17521D09971698j446836j450172j578119j753016j601811j071767o88787r14598
$$ 409971698 408524862 407074690 405496571 403743555 402141744 401069977 400381190 399466592
17513C99466592j494152j789943j609457j322353j233777j253189j225685j212458
$$ 399466592 397972440 396182497 394573040 393250687 392016910 390763721 389538036 388325578
17505C88325578j296356j386463j386676j373169j455755j586304j619365j494445
$$ 388325578 387029222 385642759 384256083 382882914 381427159 379840855 378221490 376727045
17497C76727045j306297j235838j382795j610238j651484j463918j321758j412728
$$ 376727045 375420748 374184910 372802115 371191877 369540393 368076475 366754717 365341989
17489C65341989j556092j553752j569009j793319j965462j718899j273913j207007
$$ 365341989 363785897 362232145 360663136 358869817 356904355 355185456 353911543 352704536
17481C52704536j553551j761811j631654j636340k046994k360151k042012j385499
$$ 352704536 351150985 349389174 347757520 346121180 344074186 341714035 339672023 338286524
17473C38286524j116758j426589j862106k018004j928873j846135j928310k128757
$$ 338286524 337169766 335743177 333881071 331863067 329934194 328088059 326159749 324030992
17465C24030992k237341k116567j941047j983607k136895k016984j649206j578498
$$ 324030992 321793651 319677084 317736037 315752430 313615535 311598551 309949345 308370847
17457C08370847k043271k513254k429317j991275j767043j874443k031233k105648
$$ 308370847 306327576 303814322 301385005 299393730 297626687 295752244 293721011 291615363
17449B91615363k109721j925285j569007j465262j875752k302538k114787j577826
$$ 291615363 289505642 287580357 286011350 284546088 282670336 280367798 278253011 276675185
17441B76675185j511426k002944k273326j917878j484285j544351j880238j983960
$$ 276675185 275163759 273160815 270887489 268969611 267485326 265940975 264060737 262076777
17433B62076777j826428j694912j654470j589353j524541j559887j649225j680685
$$ 262076777 260250349 258555437 256900967 255311614 253787073 252227186 250577961 248897276
17425B48897276j638135j557146j487848j539673j729359j807874j572441j305772
$$ 248897276 247259141 245701995 244214147 242674474 240945115 239137241 237564800 236259028
17417B36259028j445187j823793j827837j398923j192875j499578j742496j484796
$$ 236259028 234813841 232990048 231162211 229763288 228570413 227070835 225328339 223843543
17409B23843543j213054j483847j907271j785842j314904j230853j525369j500743
$$ 223843543 222630489 221146642 219239371 217453529 216138625 214907772 213382403 211881660
17401B11881660j074546j020841j659603k197030j865688j066704p66777j158968
$$ 211881660 210807114 209786273 208126670 205929640 204063952 202997248 202230471 201071503
17393B01071503j551275j433164j093128j097282j516444j863066j688847j118794
$$ 201071503 199520228 198087064 196993936 195896654 194380210 192517144 190828297 189709503
17385A89709503p36295r20294j393888j577846j324240j048125j103027j317813
$$ 189709503 188973208 188052914 186659026 185081180 183756940 182708815 181605788 180287975
17377A80287975j316163j067564q76859r40233j150814j312755j339291j220371
$$ 180287975 178971812 177904248 177027389 176087156 174936342 173623587 172284296 171063925
17369A71063925r81486p51242p21355r13485j083471j018468q71112r72203j289469
$$ 171063925 170082439 169331197 168609842 167696357 166612886 165594418 164723306 163751103 162461634
17360A62461634j368218r87719n84632o72180j048206j085398p43298o63820j100715
$$ 162461634 161093416 160105697 159521065 158848885 157800679 156715281 155971983 155308163 154207448
17351A54207448j411400j034745m23146l83941q65705j126207r24861p63401r10578
$$ 154207448 152796048 151761303 151338157 150954216 150088511 148962304 148037443 147274042 146363464
17342A46363464r61258o21113k76324l74147p16406q31734p17067p25410r08138
$$ 146363464 145402206 144781093 144504769 144130622 143414216 142582482 141865415 141140005 140231867
17333A40231867r43917o86962m01333l82982o00966p94451p72620n62696l58861
$$ 140231867 139287950 138600988 138199655 137816673 137215707 136421256 135648636 135085940 134727079
17324A34727079l60000n98282r01573j035001q82676n32827k37629k30951m84083
$$ 134727079 134367079 133768797 132867224 131832223 130949547 130416720 130179091 129948140 129464057
17315A29464057o95883o46269m79901m67679n83386n76751m18455l57888n05652
$$ 129464057 128768174 128121905 127642004 127174325 126590939 126014188 125595733 125237845 124732193
17306A24732193o63018o48297n24566m20346l73308m08481n10727n01557k60011
$$ 124732193 124069175 123420878 122896312 122475966 122102658 121694177 121183450 120681893 120421882
17297A20421882n9000k62239o67006o87217k99163j60111n26886p67124m10374
$$ 120421882 120362882 120100643 119433637 118746420 118447257 118287146 117760260 116993136 116582762
17288A16582762J0979j53328n48463m41195l0953j25786p20137r60320n54461
$$ 116582762 116593741 116440413 115891950 115450755 115419802 115294016 114573879 113613559 113059098
17279A13059098j83322k84728l98044j19699J47368n5549m39191n20307m26208
$$ 113059098 112875776 112591048 112193004 112073305 112220673 112165124 111725933 111205626 110779418
17270A10779418n18617o59601n07909k27170k50215n35775o53596m87221l18106
$$ 110779418 110260801 109601200 109093291 108866121 108615906 108080131 107426535 106939314 106621208
17261A06621208k92909k94993k90153l55554m14463l53270l29271n39246p69914
$$ 106621208 106328299 106033306 105743153 105387599 104973136 104619866 104290595 103751349 102981435
17252A02981435o56082l32178k95084n94916p24308m46758j87512l43361o71751
$$ 102981435 102325353 101993175 101698091 101103175 100378867 99932109 99744597 99401236 98729485
17243I8729485p12857m72895l12307l75645m83080m74559l87107l44996m43309
$$ 98729485 98016628 97543733 97231426 96855781 96372701 95898142 95511035 95166039 94722730
17234I4722730o66237q23101p07242m11482k87753m67405o52311n62984l56379
$$ 94722730 94056493 93233392 92526150 92114668 91826915 91359510 90707199 90144215 89787836
17225H9787836l46095n05555n56931m32453l32278l72109m58869n12817n63499
$$ 89787836 89441741 88936186 88379255 87946802 87614524 87242415 86783546 86270729 85707230
17216H5707230o00725n42039l93492k85780l16602m61165o21633o76264n60805
$$ 85707230 85106505 84564466 84170974 83885194 83568592 83107427 82485794 81809530 81248725
17207H1248725m13136m94726p92838q89594n21892j02319k47079q36698j068125
$$ 81248725 80835589 80340863 79548025 78658431 78136539 78034220 77787141 76950443 75882318
17198G5882318n69362N1459P0952l67432n87530m16786l30073n99947q41691o13694
$$ 75882318 75312956 75364415 75435367 75067935 74480405 74063619 73733546 73133599 72291908 71678214
17188G1678214j17878L0446l75450q43023q05687l59711j42826m63200q34360
$$ 71678214 71560336 71590782 71215332 70372309 69566622 69206911 69064085 68600885 67766525
17179F7766525o36124m5370J53584k93019p08962n01595n5995q9142m87797n25949
$$ 67766525 67130401 67085031 67238615 66945596 66236634 65735039 65679044 65589902 65102105 64576156
17169F4576156j13239J4440m68204q52380m82026J71838K03935l59519o74082
$$ 64576156 64462917 64477357 64009153 63156773 62674747 62846585 63050520 62691001 62016919
17160F2016919m01013r8184j91440l36627j54019N2780j45705m87902m20284o1192
$$ 62016919 61615906 61517722 61326282 60989655 60835636 60888416 60742711 60254809 59834525 59773333
17150E9773333n0408m79714p00457l67992M348r8722l76883k96433k7867r8056
$$ 59773333 59722925 59243211 58542754 58174762 58179110 58080388 57703505 57407072 57379205 57281149
17140E7281149l84125k76818J97056K83034k66463o96869m21782M6609l9000m67445
$$ 57281149 56897024 56620206 56817262 57100296 56833833 56136964 55715182 55761791 55722791 55255346
17130E5255346n23277k08269j09415k73045j76337J91731K00998k73311n15745
$$ 55255346 54732069 54523800 54414385 54141340 53965003 54156734 54357732 54084421 53568676
17121E3568676j65703J24830k11371o70415n14419J4020J54022j21995k15307
$$ 53568676 53402973 53527803 53316432 52646017 52131598 52145618 52299640 52177645 51962338
17112E1962338j6404N70k58713l28659p2935M3790k01460l80716j65283J15319
$$ 51962338 51945934 51946504 51687791 51359132 51286197 51329987 51128527 50747811 50582528 50697847
17102E0697847M5902k22128k90384j23549K6063K4483j08943l09784l77898q8743
$$ 50697847 50743749 50521621 50231237 50107688 50133751 50158234 50049291 49739507 49361609 49272866
17092D9272866L67495M21462r7247n89720m83019n1814L7919k57671l73379n6677
$$ 49272866 49640361 50061823 49964576 49374856 48891837 48840023 48877942 48620271 48246892 48190215
17082D8190215K87597K35827j16442l82299l35877m3084K06666O0114n32618j061643
$$ 48190215 48477812 48713639 48597197 48214898 47879021 47835937 48042603 48102717 47570099 46508456
17072D6508456q73127K6590Q31582P85696K2311o14656n09275J16465N27275L04332
$$ 46508456 45635329 45661919 46493501 47279197 47301508 46686852 46177577 46294042 46821317 47125649
17062D7125649k34255m60233j82098J95569K44991J0736j81892j99358j72814
$$ 47125649 46891394 46431161 46249063 46444632 46689623 46700359 46518467 46319109 46146295
17053D6146295k20362k98660k82134q0793K30054L50791M3808m30332m83806j4015
$$ 46146295 45925933 45627273 45345139 45264346 45494400 45845191 45888999 45458667 44974861 44960846
17043D4960846L28410M1597m25412l13861K59887M49495m5345n69661n34130j86636
$$ 44960846 45289256 45330853 44905441 44591580 44851467 45300962 45255617 44685956 44151826 43965190
17033D3965190m6790j15216q7179K3871l3583k33154k71100m3060J91998J45004
$$ 43965190 43918400 43803184 43716005 43739876 43706293 43473139 43202039 43158979 43350977 43495981
17023D3495981j87593n43525o31891l88909m8345J11463Q3445N3664M1522j25306
$$ 43495981 43308388 42764863 42132972 41744063 41695718 41807181 41890626 41944290 41985812 41860506
17013D1860506m31457n66415l44493R421J66647Q7756n7257j70982k44481k43724
$$ 41860506 41429049 40862634 40518141 40527562 40694209 40781965 40724708 40553726 40309245 40065521
17003D0065521j65696j08140j44712k12676k09258j10232L9620J39796O2752j60148
$$ 40065521 39899825 39791685 39646973 39434297 39225039 39114807 39154427 39294223 39356975 39196827
16993C9196827k50493l8218J77348j4474m65549o15339l23875k7107L1636J17510
$$ 39196827 38946334 38908116 39085464 39070990 38605441 37990102 37666227 37639120 37670756 37788266
16983C7788266L41263L31394o4491l61542j94343O5711r258j46113N7838K94431
$$ 37788266 38129529 38460923 38396432 38034890 37840547 37906258 37897000 37750887 37808725 38103156
16973C8103156M6679m34701m83619j02860J35240R8115J39730K34140k0355m88568
$$ 38103156 38149835 37715134 37231515 37128655 37263895 37362010 37501740 37735880 37715525 37226957
16963C7226957n03808L0444L91320J56982k11769k38865j28085j72232j57315
$$ 37226957 36723149 36753593 37144913 37301895 37090126 36851261 36723176 36550944 36393629
16954C6393629J26001L38190J12533k99382m17336k34826p4983l6067p134M392
$$ 36393629 36519630 36857820 36970353 36670971 36253635 36018809 35943826 35907759 35900625 35905017
16944C5905017n8067j00489n0405k8403j11350j60346q7698k8926p6755j43300
$$ 35905017 35846950 35746461 35696056 35667653 35556303 35395957 35308259 35279333 35202578 35059278
16934C5059278k11005l45065l63686k519M57832L64165k58922n44104o6561M44390
$$ 35059278 34848273 34503208 34139522 34137003 34594835 34959000 34700078 34155974 34089413 34533803
16924C4533803K40552l10378m46494k38531k38869m00398k81729O746m12k03670
$$ 34533803 34774355 34463977 34017483 33778952 33540083 33139685 32857956 32864702 32864290 32660620
16914C2660620j19220J79491J84038j06529k42316k13567l69706n29938j76775
$$ 32660620 32541400 32720891 32904929 32798400 32556084 32342517 31972811 31442873 31266098
16905C1266098M43130M69591j63565n32318k14355Q2379j83765m83673k26093
$$ 31266098 31709228 32178819 32015254 31482936 31268581 31350960 31167195 30683522 30457429
16896C0457429K07294J68352j98135l37994k02890j00858o8967j2372p6244l17048
$$ 30457429 30664723 30833075 30634940 30296946 30094056 29993198 29924231 29911859 29835615 29518567
16886B9518567l90692r9161J56643K667k54171j65712Q5381P2498j06379j07871
$$ 29518567 29127875 29028714 29185357 29188024 28933853 28768141 28853522 28926020 28819641 28711770
16876B8711770m2927k01189l74579j87283J32008N9974k99642l61927m6796J27098
$$ 28711770 28668843 28467654 28093075 27905792 28037800 28097774 27798132 27436205 27389409 27516507
16866B7516507o2463k54734j89420n1558k7303n1301q3391j70021k08407r4103
$$ 27516507 27454044 27199310 27009890 26958332 26931029 26879728 26796337 26626316 26417909 26323806
16856B6323806l5618k30633l69984p2774L29408J90590l34455m28474O8302L83773
$$ 26323806 26288188 26057555 25687571 25614797 25944205 26134795 25800340 25371866 25440168 25823941
16846B5823941P8351l22985l24915k12429l06573k86097J03891L68905M0679m23315
$$ 25823941 25902292 25579307 25254392 25041963 24735390 24449293 24553184 24922089 24962768 24539453
16836B4539453l19641J44550K15255j65288l38692n6529J84731J3184k92865l31434
$$ 24539453 24219812 24364362 24579617 24414329 24075637 24019108 24203839 24217023 23924158 23592724
16826B3592724j16389J05489J96811J24813r3350l12323l41129j75814P155P6071
$$ 23592724 23476335 23581824 23778635 23903448 23810098 23497775 23156646 22980832 22987987 23064058
16816B3064058J5268j36458k46732j37714J18203J52169j79800m63393k75110
$$ 23064058 23079326 22942868 22696136 22558422 22676625 22828794 22648994 22185601 21910491
16807B1910491J60902L09778J23948k5469o9964k62852n02482l34403K19456M99762
$$ 21910491 22071393 22381171 22505119 22479650 22409686 22146834 21644352 21309949 21529405 22029167
16797B2029167J69010k58197k30282J8269m5634l51288l91318n7092K65219L34921
$$ 22029167 22198177 21939980 21709698 21727967 21682333 21331045 20939727 20882635 21147854 21482775
16787B1482775K72430J57802q7620l53517l40266n9835P6586j06650k12970R2073
$$ 21482775 21755205 21913007 21825387 21471870 21131604 21071769 21148355 21041705 20828735 20920808
16777B0920808M29626J83794n01982p76000k46985M16464L93354j65616m19453
$$ 20920808 21350434 21534228 21032246 20256246 20009261 20425725 20819079 20653463 20234010
16768B0234010n4032L62180K81795j10314l22226k55923j44885r6231n9901n4645
$$ 20234010 20179978 20542158 20823953 20713639 20391413 20135490 19990605 19894374 19834473 19779828
16758A9779828r1862l7777J46102K11676r63k08177r4091J30210N6293k06123
$$ 19779828 19687966 19650189 19796291 20007967 20007004 19798827 19704736 19834946 19891239 19685116
16748A9685116k15884p43o919k36877j74324K57192M18549q889m22839k49980
$$ 19685116 19469232 19468489 19461570 19224693 19050369 19307561 19726110 19717221 19294382 19044402
16738A9044402J31075P6053k25080j33276K78818L31322r1018l36846p5978J92186
$$ 19044402 19175477 19251530 19026450 18893174 19171992 19503314 19412296 19075450 18999472 19191658
16728A9191658O274l33001l17809k4670J16958K3621m3378L642n218j25342k03503
$$ 19191658 19197932 18864931 18547122 18522452 18639410 18663031 18619653 18623295 18618077 18492735 18289232
16717A8289232j67882j25146j21404m7844J24016K04805K9317k68292l77639j90289
$$ 18289232 18121350 17996204 17874800 17826956 17950972 18155777 18185094 17916802 17539163 17348874
16707A7348874P8400J75720R8971J3910o558j1425Q94Q5495J74657J07827j04588
$$ 17348874 17427274 17602994 17701965 17715875 17709317 17697892 17698786 17784281 17958938 18066765 17962177
16696A7962177k50510k26977j61883j25316J5656K82502L99905J74929j75088
$$ 17962177 17711667 17484690 17322807 17197491 17213147 17495649 17895554 18070483 17895395
16687A7895395l44782l46911k94960q1137L02736M20408m6196n91552m50156K01518
$$ 17895395 17550613 17203702 16908742 16827605 17130341 17550749 17504553 16913001 16462845 16664363
16677A6664363M00259j46057o02667l23832J97664K27315p9561j46432j8084j10587
$$ 16664363 17064622 16918565 16315898 15992066 16189730 16417045 16337484 16191052 16172968 16062381
16667A6062381k90985r7953K90122K08108l53244o13040k00046K85832K41556
$$ 16062381 15771396 15673443 15963565 16171673 15818429 15205389 15005343 15291175 15532731
16658A5532731q0128j31183M9126N8468j21442j74569o4253o4407k23423k66060
$$ 15532731 15452603 15321420 15370546 15429014 15307572 15133003 15068750 15004343 14780920 14514860
16648A4514860r3714J1672j53089l40893j90412K09060L71243O6552l14560k51497
$$ 14514860 14421146 14432818 14279729 13938836 13748424 13957484 14328727 14395279 14080719 13829222
16638A3829222J68084L15381j02989n74475m59083J13940M41219K29631r0845
$$ 13829222 13997306 14312687 14209698 13635223 13176140 13290080 13731299 13960930 13870085
16629A3870085r3106P1342L1155k24188l94871k86782L2950L25301L01898j08962
$$ 13870085 13776979 13848321 13879476 13655288 13260417 12973635 13006585 13331886 13633784 13524822
16619A3524822n12741l83253J96067N10481J84443k54634j77020J97694K16271
$$ 13524822 13012081 12628828 12824895 13335376 13519819 13265185 13088165 13285859 13502130
16610A3502130j36979k76765j7534J78864K9955j57527j09545l1228j37341k34606
$$ 13502130 13365151 13088386 13070852 13249716 13279671 13122144 13012599 12981371 12844030 12609424
16600A2609424j23415j875q8385j88636m6006J59499R1785j71519k75187j40879
$$ 12609424 12486009 12484134 12395749 12207113 12161107 12320606 12412391 12240872 11965685 11824806
16590A1824806K1830J29166K26974J87249j29317m42865k91920K26196M50211
$$ 11824806 11846636 11975802 12202776 12390025 12260708 11817843 11525923 11752119 12202330
16581A2202330P2823l93300l54695M3743K24779L3159j66501j27679q678P447
$$ 12202330 12275153 11881853 11527158 11570901 11795680 11828839 11662338 11534659 11525981 11533428
16571A1533428o105M6517O3034n1863j61643r1740P5281J13828k86p6769l0000
$$ 11533428 11527323 11573840 11636874 11585011 11423368 11331628 11406909 11520737 11520451 11443682 11413682
16560A1413682J1305l5025n0228N6888J51491Q2071n3605p2656l0867j09842k35628
$$ 11413682 11424987 11389962 11339734 11396622 11548113 11630184 11576579 11503923 11473056 11363214 11127586
16549A1127586j42082J44393K36971m4031l57326l25777o1274Q1567M3270R632
$$ 11127586 10985504 11129897 11366868 11322837 10965511 10639734 10578460 10660027 10703297 10712929
16539A0712929L421q5469j69962p1214R4666M1257j90599k77705j64183j05716
$$ 10712929 10716350 10630881 10460919 10389705 10484371 10525628 10335029 10057324 9893141 9787425
16529I787425j21444O0520L71186L14939j90169m82241j17599L78117L12649q4734
$$ 9787425 9665981 9726501 10097687 10412626 10222457 9740216 9622617 10000734 10313383 10228649
16519A0228649j17294J79403J75221j59832j66345K90811M70983l3137n82181
$$ 10228649 10111355 10290758 10465979 10306147 10139802 10430613 10901596 10868459 10286278
16510A0286278n05014j04200p12q0634J18554M11380K49207k19330k92209R7627
$$ 10286278 9781264 9677064 9676352 9595718 9714272 10125652 10374859 10155529 9863320 9960947
16500I960947K35576j63649m54437j36891L19173K70238p7148j09380J33386Q9547
$$ 9960947 10196523 10032874 9578437 9441546 9760719 10030957 9953809 9844429 9977815 10067362
16490A0067362l07787m86960j51454K93288L94135K18341M3727q2291j92720j66631
$$ 10067362 9759575 9272615 9121161 9414449 9808584 10026925 10070652 9988361 9795641 9629010
16480I629010L2209J52874J8229j41346n8937P9246o2941l30628k55198J43605
$$ 9629010 9661219 9814093 9832322 9690976 9632039 9711285 9648344 9317716 9062518 9206123
16470I206123K92777m0778l30452q9912L60917L98484M0320j77442q9676m1231
$$ 9206123 9498900 9458122 9127670 9037758 9398675 9797159 9837479 9660037 9570361 9529130
16460I529130j50661r5821J88036K29760j88470n03298j65645M27767M48644j26118
$$ 9529130 9378469 9282648 9470684 9700444 9511974 9008676 8843031 9270798 9719442 9593324
16450I593324m98705k53668J35964J80779Q1921J92001L18826R7984k93829l75001
$$ 9593324 9094619 8840951 8976915 9157694 9239615 9431616 9750442 9848426 9554597 9179596
16440I179596j25004M1305j1349J958J85437K62141J18222M4142J82648J92549
$$ 9179596 9054592 9095897 9084548 9086506 9271943 9534084 9652306 9696448 9879096 10071645
16430A0071645j71833n22603l59040J15254K47091p1590k39779J08280N21377
$$ 10071645 9899812 9377209 9018169 9133423 9380514 9308924 9069145 9177425 9698802
16421I698802L97175j42471m45239k17692J71245K47658k4908l22073l58420j22459
$$ 9698802 10095977 9953506 9508267 9290575 9461820 9709478 9684570 9362497 9004077 8881618
16411H881618J63291K58910J43958J9695J9652K7993p9028j57415r076K35273
$$ 8881618 9044909 9303819 9447777 9467472 9487124 9515117 9436089 9278674 9269598 9504871
16401I504871K71699J10648K4918J4371j98526n41327n29274r3686J36044j67028
$$ 9504871 9776570 9887218 9912136 9926507 9727981 9186654 8657380 8563694 8699738 8532710
16391H532710l66024J00429N93658K22980m43624J6325J470577J933208L61735
$$ 8532710 8166686 8267115 8860773 9083753 8640129 8656454 10127031 12060239 12421974
16382A2421974j570784j669811k39325N66371q1642q09395m16210M40522N65017
$$ 12421974 10851190 9181379 8942054 9508425 9426783 8617388 8201178 8641700 9206717
16373I206717L9141k04525Q7673L26381J22359k72442m61107l07489P7305L87520
$$ 9206717 9245858 9041333 9129006 9455387 9577746 9305304 8844197 8536708 8614013 9001533
16363I001533L06005o5050j93732J38539M00654N9233n39157o09865q0696L32099
$$ 9001533 9307538 9242488 9048756 9187295 9587949 9647182 9108025 8498160 8417464 8749563
16353H749563J87539j42384j37057J63599L44808J86575j61034l82347k70253
$$ 8749563 8937102 8794718 8657661 8821260 9166068 9352643 9191609 8809262 8539009
16344H539009O5313K71331J81116M6136J13790J82878m2658l53485l06813J3650
$$ 8539009 8604322 8875653 9056769 9102905 9216695 9399573 9356915 9003430 8696617 8710267
16334H710267J14948m6774o077L08723L48497j01157m48330k17658J81527J55683
$$ 8710267 8825215 8778441 8772364 9081087 9429584 9328427 8880097 8662439 8843966 8999649
16324H999649j40500k01514n5651m4383n6357K36530N75974L74723k51900n17289
$$ 8999649 8859149 8657635 8601984 8557601 8501244 8737774 9313748 9688471 9436571 8919282
16314H919282j47523K21736Q3886k04399j32982J07755L7935k37948j96391K13543
$$ 8919282 8771759 8993495 9077381 8872982 8740000 8847755 8885690 8647742 8451351 8664894
16304H664894M35483J38101k81042k58742J50384L75191J30004k22790k34132
$$ 8664894 9100377 9238478 8957436 8698694 8849078 9224269 9354273 9131483 8897351
16295H897351p367L7377j17571o5315K81635M36237Q6399l55481l58830o0993
$$ 8897351 8889984 8927361 8809790 8744475 9026110 9462347 9548746 9193265 8834435 8773442
16285H773442M8079p3011j03927k3685m9693p5711J35058L04437j8475m90137
$$ 8773442 8821521 8748510 8644583 8620898 8571205 8495494 8630552 8934989 8916514 8426377
16275H426377k70030N56546Q55299J41255n94232m04667J74454J15047m01802
$$ 8426377 8156347 8712893 9568192 9709447 9115215 8710548 8885002 9000049 8598247
16266H598247l96512K08799M93664P3553l57233j96320K44658L86425J60910j61127
$$ 8598247 8201735 8410534 8904198 8977751 8620518 8424198 8668856 9055281 9216191 9055064
16256I055064l80902l60124o0403K30312J58633j06573o3350K64174K94276j06496
$$ 9055064 8674162 8314038 8253635 8483947 8642580 8536007 8472657 8736831 9031107 8924611
16246H924611l09094K9537L20118J870m60193k73968L89590O30835J91496k16852
$$ 8924611 8615517 8645054 8965172 8967042 8506849 8232881 8622471 9253306 9444802 9227950
16236I227950m2976L37997K81940j81596m64494k60756R9888J50296j09262k74798
$$ 9227950 9184974 9522971 9804911 9623315 9158821 8898065 8997953 9148249 9038987 8764189
16226H764189j39541K5207n6763j58789J01565N24168M79858j01158m84791j84581
$$ 8764189 8624648 8649855 8593092 8434303 8535868 9060036 9539894 9438736 8953945 8769364
16216H769364K92466K38226j75902k52488R4888K88988P9880j24261N196K62451
$$ 8769364 9061830 9300056 9124154 8871666 8966554 9255542 9335422 9211161 9216357 9478808
16206I478808L47714K52092M5242k51234m29365k12106K24755L39762L3465j60867
$$ 9478808 9826522 10078614 10123856 9872622 9443257 9231151 9455906 9795668 9829133 9668266
16196I668266M5617K17110q752k31980J4509L74413K12002k88706l99134n5777
$$ 9668266 9713883 9930993 9922241 9690261 9704770 10079183 10291185 10002479 9603345 9547568
16186I547568R2750j35550j57309K52801M40508l4773n59375m06243Q2550Q7178
$$ 9547568 9640318 9504768 9347459 9600260 10040768 10005995 9446620 9040377 9122927 9210105
16176I210105l16987l29879J74276M12680j871m48372l60872r6593j82442l59598
$$ 9210105 8893118 8563239 8737515 9150195 9148324 8699952 8339080 8242487 8060045 7700447
16166G700447j10847L21104K78825j79526l53683p2618O1216k37309m24398r1442
$$ 7700447 7589600 7910704 8189529 8010003 7656320 7583702 7644918 7407609 6983211 6891769
16156F891769K75183Q2155l54693l01334J89583L46577q7479m34681j16619M73815
$$ 6891769 7166952 7249107 6894414 6593080 6782663 7129240 7041761 6607080 6490461 6964276
16146F964276N39762j6651n11858m13086L0332J95619r9869m11300k78770J67810
$$ 6964276 7504038 7487387 6975529 6562443 6592775 6788394 6688525 6277225 5998455 6166265
16136F166265L80914J05677l14916m12325j49853J50702K56843J73029l3583k80230
$$ 6166265 6547179 6652856 6337940 5925615 5775762 5926464 6183307 6356336 6322753 6042523
16126F042523l84445k09097P6392J22103j37943l55460k20357J19806K55129M5366
$$ 6042523 5658078 5448981 5525373 5647476 5509533 5154073 4933716 5053522 5308651 5354017
16116E354017k19602k12395K0003J58746O7547n9326o8347j11819l04116l50863
$$ 5354017 5134415 4922020 4942023 5100769 5168316 5108990 5040643 4928824 4624708 4273845
16106D273845M3673N20944M08426k26032n31023j34631K64512M2957l20527j01135
$$ 4273845 4317518 4838462 5246888 5020856 4489833 4355202 4619714 4662671 4342144 4241009
16096D241009L83262L10761k00772l04481O7658J03291l80518n41786L876M56466
$$ 4241009 4624271 4935032 4734260 4429779 4497437 4600728 4220210 3678424 3682300 4138766
16086D138766J83324k36546r4608K23729L6160l49011k12013K33392K12445j98315
$$ 4138766 4322090 4085544 3990936 4214665 4250825 3901814 3689801 3923193 4135638 3937323
16076C937323j91988L16796M90742l2293n53925m47989k9484J27089M9529O9341
$$ 3937323 3745335 4062131 4552873 4520580 3966655 3518666 3489182 3616271 3665800 3735141
16066C735141J73437J38026j9060j17233j26171j18998r6411m9015j7854K0578
$$ 3735141 3908578 4046604 4027544 3910311 3784140 3665142 3568731 3519716 3501862 3522440
16056C522440J28367K09527R1022j55157k53499j31938Q321N6665J00016J43479
$$ 3522440 3650807 3860334 3951356 3796199 3542700 3410762 3419083 3475748 3575764 3719243
16046C719243Q5085J390P2193J86746N3355k46717k90587M025K25695J38290o649
$$ 3719243 3804328 3805718 3877911 4064657 4118012 3871295 3580708 3584733 3810428 3948718 3942069
16035C942069m0R957n5323q383J28220K4243k90642k91148J38185L43268m4574
$$ 3942069 3942029 3951986 3896663 3888280 4016500 4040743 3750101 3458953 3597138 3940406 3895832
16024C895832l94375j06074L03586M7932n11549l83852L74707O71069R7340m77141
$$ 3895832 3501457 3395383 3698969 3746901 3235352 2851500 3226207 3897276 3994616 3517475
16014C517475l21632J43236K29881N0112O1519J67596k804k94833k35984J07989
$$ 3517475 3195843 3339079 3568960 3619072 3680591 3848187 3845383 3550550 3314566 3422555
16004C422555J55470k68228n93043l06223L03655N37699K29131q5586L6249L32569
$$ 3422555 3578025 3309797 2716754 2410531 2714186 3251885 3481016 3395430 3431679 3764248
15994C764248K72796j26545l36744j32258J00702K3997j41674p8239N4965n1458
$$ 3764248 4037044 3910499 3573755 3441497 3542199 3566196 3424522 3346283 3401248 3349790
15984C349790k51427j83834O4556Q4923j44924k23696p947J85858J36430O801
$$ 3349790 3098363 2914529 2979085 3064008 2919084 2695388 2687441 2873299 3009729 3016530
15974C016530l0816l8224o3377l4473k275j15465k79965k34974k4147M9739m763
$$ 3016530 2985714 2947490 2884113 2849640 2847365 2731900 2451935 2216961 2192814 2242553 2237790
15963B237790J32705M12237L39984j62738m44495p6161M23235L39298j79655m16675
$$ 2237790 2370495 2782732 3122716 2959978 2515483 2439322 2862557 3201855 3022200 2605525
15953B605525j69613P7391k7683k63874k68010j2467K49834K91331J05890r2199
$$ 2605525 2435912 2513303 2485620 2221746 1953736 1941269 2191103 2482434 2588324 2496125
15943B496125j01930o018m6547k00720j76502O4157J57007p0895k50293l5576
$$ 2496125 2394195 2388177 2341630 2140910 1964408 2028565 2185572 2114677 1864384 1828808
15933A828808L30827M07458K06158L6041m1973j55988k33753j32050R778j9850
$$ 1828808 2159635 2567093 2773251 2809292 2767319 2611331 2377578 2245528 2255306 2235456
15923B235456j01215j4898J03914J255j81470j26774P5452Q6375o3996n8123J13392
$$ 2235456 2134241 2119343 2223257 2224512 2043042 1916268 1991720 2078095 2014099 1955976 2069368
15912B069368J90641J74811K33299J93805j90908n65214l49028K08061K45138
$$ 2069368 2260009 2434820 2668119 2861924 2671016 2105802 1756774 1964835 2209973
15903B209973k98555m67783J63417P20606M07236k32976k58210J63919J74827
$$ 2209973 1911418 1443635 1607052 2327658 2734894 2501918 2243708 2407627 2582454
15894B582454k92772m96113j75200J29428R8864Q2454L02833L81138K6472l80433
$$ 2582454 2289682 1793569 1618369 1747797 1846661 1929115 2231948 2613086 2639558 2259125
15884B259125l34533M4734K40610Q3505j23882j23379p857J0424q7862j43056
$$ 2259125 1924592 1969326 2209936 2293441 2169559 2046180 2038323 2048747 1960885 1817829
15874A817829n5794P5573P7046p3055k05035j68326q019J18652J34085Q8051O8992
$$ 1817829 1762035 1837608 1914654 1841599 1636564 1468238 1460219 1578871 1712956 1801007 1869999
15863A869999J13109J52052N4563j83143l22952j44034J91542K86252O6119j13161
$$ 1869999 1983108 2135160 2189723 2006580 1683628 1539594 1731136 2017388 2083507 1970346
15853A970346l3907N7552q7550k72955j96076M3166J51216J40304K05120K67100
$$ 1970346 1936439 1993991 1906441 1633486 1437410 1480576 1631792 1772096 1977216 2244316
15843B244316R3570k20050l39060k25405j48728j73337q6217J28540K05788Q0703
$$ 2244316 2337886 2117836 1778776 1553371 1404643 1231306 1145089 1273629 1479417 1560120
15833A560120K448L9501o0863l23728l36890R4971N00756L55225j57537m24629
$$ 1560120 1562568 1602069 1541206 1217478 880588 975559 1476315 1831540 1674003 1249374
15823A249374k45220M3859J61321J59043J21058j0979k19121l14256j82893O3757
$$ 1249374 1004154 1048013 1209334 1368377 1489435 1478456 1259335 945079 762186 825943
15813H25943K60139L32543K35758m3279l30104l24554J6315L11063J83775k14966
$$ 825943 1086082 1418625 1654383 1611104 1281000 956446 972761 1283824 1467599 1252633
15803A252633l60510m5410L35381L28783L3658j02534K4566O7340j42251k63537
$$ 1252633 892123 846713 1182094 1510877 1544535 1442001 1466567 1533907 1391656 1128119
15793A128119K186L62936L24283p3887l47906k99373j78886j26119L7947L30911
$$ 1128119 1130305 1493241 1817524 1743637 1395731 1096358 917472 791353 829300 1160211
15783A160211M18805J54421j20871j12447j7964r0810j46388M7823K31184N3652
$$ 1160211 1579016 1733437 1612566 1500119 1482155 1391345 1244957 1292780 1523964 1577616
15773A577616k30195j12043K61662K49829j94742l61357O7337M33835J22068m47066
$$ 1577616 1347421 1235378 1497040 1746869 1552127 1190770 1258107 1691942 1814010 1366944
15763A366944m51900R6255M44855K43049q5468j17757K9583R1682R1654J38537
$$ 1366944 915044 1011299 1456154 1699203 1613735 1495978 1525561 1617243 1708897 1847434
15753A847434J44716J0688j46942j79354j32364j01280l8064J05067K01429J25803
$$ 1847434 1992150 2002838 1855896 1676542 1544178 1442898 1404834 1509901 1711330 1837133
15743A837133j9076m9185K7885P0955M1807m452q1088k18102l01086j67378J39275
$$ 1837133 1818057 1768872 1796757 1867712 1909519 1905067 1823979 1605877 1304791 1137413 1276688
15732A276688L72319L53920J38696p6843j31945l8051J4789j10250k41323q6285
$$ 1276688 1649007 2002927 2141623 2064780 1932835 1894784 1909573 1799323 1558000 1471715
15722A471715K71747L95077J60021o350J53844K43672p9721l83628j37797K77541
$$ 1471715 1743462 2138539 2298560 2292210 2446054 2689726 2610005 2226377 2088580 2366121
15712B366121J24700l90009m12533O4940K05132r6388j415N55294M60468n41278
$$ 2366121 2490821 2100812 1688279 1753219 1958351 1861963 1860548 2415842 2876310 2335032
15702B335032r88754p2118O61458l01997j605445q49929J433534K247443N95994
$$ 2335032 1346278 1274160 1935618 1633621 28176 -821753 611781 2859224 3455218
15693C455218j120042q70362K63284L88352k21547k12723K91565K02967l68582
$$ 3455218 2335176 1464814 1728098 2116450 1894903 1682180 1973745 2176712 1808130
15684A808130l73425K27415M79209J61604l4477O3864n8096l65885k44711K15453
$$ 1808130 1434705 1662120 2141329 2302933 2268456 2332320 2274224 1908339 1663628 1879081
15674A879081K22641k62317l61112J63766M51748M9426l35614j27912J82604N3130
$$ 1879081 2101722 1839405 1478293 1642059 2093807 2143233 1807619 1679707 1862311 1915441
15664A915441j68281m5038R3868j04477k16413J59924M98706J64466m26720m33160
$$ 1915441 1747160 1702122 1795990 1691513 1475100 1635024 2133730 2298196 1871476 1438316
15654A438316M8488K32618k6104j47306N6987J40862o1550j51294M7974J71016
$$ 1438316 1486804 1719422 1693318 1546012 1602999 1743861 1682311 1531017 1578991 1750007
15644A750007R907j10307O6830K83998K29142J5612r4414j08978j59320j89790
$$ 1750007 1759914 1649607 1716437 2000435 2229577 2245189 2150775 2041797 1882477 1692687
15634A692687p3060J23055K12245J52093P4980R4041J65532J45698k0126j86168
$$ 1692687 1619627 1742682 1954927 2107020 2182000 2276041 2441573 2587271 2567145 2380977
15624B380977j75850n4174m3597j38714q9599J23257J62847q9265k32452J7999
$$ 2380977 2205127 2150953 2107356 1968642 1879043 2002300 2165147 2075882 1843430 1861429
15614A861429K86284J19111k26232j87768J57794K53253J5633j15841l4415p0542
$$ 1861429 2147713 2266824 2040592 1852824 2010618 2263871 2279504 2163663 2129248 2058706
15604B058706j96226J6240M58021M10428k28614n41245K1914O72511M61884k55609
$$ 2058706 1862480 1878720 2336741 2747169 2518555 1977310 1999224 2671735 3133619 2878010
15594B878010m54310m2684J86005m4583j89771K3838J75255O629j32176R456J33449
$$ 2878010 2423700 2381016 2567021 2522438 2332667 2356505 2531760 2538389 2406213 2415669 2549118
15583B549118j3949k00885k01258j74966k09232l4162L88209N30178P6278m32743
$$ 2549118 2535169 2334284 2133026 1958060 1748828 1714666 2102875 2633053 2709331 2276588
15573B276588l45845Q3982J27323k35612l37082L5423L11619J08178j72577m1992
$$ 2276588 1930743 2014725 2142048 1906436 1569354 1604777 1916396 2024574 1851997 1810005
15563A810005L06209L43718m486l21178k87660j0623J81927J02544j03720j10243
$$ 1810005 2116214 2459932 2455446 2134268 1846608 1835985 2017912 2120456 2016736 1906493
15553A906493J49351K96873K8922l13430j57122L56391M55523p8200m93362k06000
$$ 1906493 2055844 2352717 2381639 2068209 1911087 2267478 2723001 2644801 2151439 1945439
15543A945439K97782K71233j24406j97722R8612J98273m5043j74986J8672K11929
$$ 1945439 2243221 2514454 2390048 2192326 2290938 2489211 2444168 2269182 2287854 2499783
15533B499783J92562J27675P3416j45716m26249l75161J3316K61693J68249O3171
$$ 2499783 2692345 2820020 2893436 2747720 2321471 1946310 1959626 2221319 2389568 2452739
15523B452739J24469Q7462j22375j43299J21916K30724j3320j83246m0287R760
$$ 2452739 2577208 2664670 2542295 2398996 2520912 2751636 2738316 2555070 2514783 2524543
15513B524543k38597k76284J50828L55025j83111p48392m40846L10496M29968
$$ 2524543 2285946 2009662 2160490 2515515 2332404 1584012 1143166 1453662 1883630
15504A883630m9012j68740K46381L84633m0428l41465j36133Q0987j8666l4027
$$ 1883630 1834618 1665878 1912259 2296892 2256464 1914999 1778866 1859853 1841187 1807160
15494A807160K57902L73967J562m05795l97256j67354J670K05525L90706J40805
$$ 1807160 2065062 2439029 2440591 2034796 1637540 1470186 1471856 1677381 2068087 2208892
15484B208892m88911o93615r6766N13930L35894k24470k91933P2739J43687j53951
$$ 2208892 1719981 1026366 929600 1443530 1779424 1554954 1263021 1335760 1479447 1325496
15474A325496j84562K29084M65523Q5962m96659n94527j17279L73027L49833p0393
$$ 1325496 1140934 1370018 1835541 1921503 1424844 830317 713038 1086065 1435898 1365505
15464A365505k90927n0097J84649k9322k86305M6410N94959L71488n46685r10145
$$ 1365505 1074578 1024481 1209130 1179808 893503 939913 1534872 1906360 1359675 449530
15454D49530k22887M64666L13171j9903K23946M46944j04396p18080l18297N67401
$$ 449530 226643 691309 1004480 984577 1208523 1655467 1551071 832991 514694 1082095
15444A082095N87170j87290m89114n2600J55020j57291k02932J99961K27726k98444
$$ 1082095 1669265 1481975 992861 940261 1095281 937990 735058 935019 1162745 864301
15434H64301m52885R5036M32576P5759j73080K01051M06699j55110o60766k45995
$$ 864301 411416 506452 939028 1014787 841707 1042758 1449457 1294347 633581 387586
15424C87586M71500M50345q4059k33202Q076J0865k04232j32548J54814K06067
$$ 387586 859086 1309431 1225372 992170 1000246 1011111 806879 674331 829145 1035212
15414A035212J19634K63556L77330k1435n86947n38884M7056L44986J03330j02885
$$ 1035212 1154846 1418402 1795732 1774297 1187350 648466 695522 1040508 1143838 1040953
15404A040953M2870J78685M5265j17970j22523j04218j08248J4497K04850K19587
$$ 1040953 1083823 1262508 1307773 1189803 1067280 963062 854814 869311 1074161 1293748
15394A293748R0721N1826M5352j43260l23450r9728L70837M71272N4274l27050
$$ 1293748 1384469 1436295 1481647 1338387 1014937 915209 1286046 1757318 1811592 1484542
15384A484542k49060O3876K07300J15738m7204j43344q5614J00533K13403J18826
$$ 1484542 1235482 1299358 1506658 1622396 1575192 1431848 1346234 1446767 1660170 1778996
15374A778996k9015n8458o3213j16380k6812K17013J73161l27883o25283j28576
$$ 1778996 1749981 1691523 1628310 1511930 1485118 1702131 1875292 1547409 922126 793550
15364G93550O14861O32069Q181l24972r2772J01275O86J5573K20381J55678j43310
$$ 793550 1408411 2040480 2048661 1723689 1630917 1732192 1732878 1748451 1968832 2124510 1981200
15353A981200k5283N30198O28883r8163p82469o35544p7487J02877p6268j41846
$$ 1981200 1955917 2486115 3114998 3016835 2234366 1598822 1521335 1624212 1547944 1406098
15343A406098k5084R7530K53432L80078J46799l85518n28096L5238O04930M39569
$$ 1406098 1381014 1478544 1731976 2112054 2258853 1873335 1345239 1380477 1985407 2424976
15333B424976j78567m79754l00064j7674J35511J11676j51408m39817k70084L22818
$$ 2424976 2246409 1766655 1466591 1448917 1584428 1696104 1544696 1104879 834795 1157613
15323A157613N92749J91011k30616j31199M633l37843n97608o6685P17727O80992
$$ 1157613 1750362 1941373 1710757 1579558 1584191 1246348 648740 582055 1299782 1980774
15313A980774j04910n94953l66066L8189J77054J25824m2064k80826k52039J86968
$$ 1980774 1875864 1280911 914845 953034 1130088 1255912 1213848 933022 680983 867951
15303H67951M67174J46844j71693J96737O48569J94588o77050o10830L19065O44285
$$ 867951 1335125 1481969 1310276 1507013 2155582 2350170 1673120 1062290 1381355 2025640
15293B025640m9445m87824M2317N33226R9653n49701m54245M9568J57518n7193
$$ 2025640 1976195 1488371 1530688 2063914 2163567 1613866 1159621 1209189 1366707 1309514
15283A309514j26575j22110j77361O8579O48088P57534K3331o07453k94937K51788
$$ 1309514 1182939 1060829 883468 952047 1600135 2357669 2381000 1773547 1478610 1730398
15273A730398j5270o30595m20776M06751N75612r9382m59414J3255M45230J59115
$$ 1730398 1715128 1084533 663757 1070508 1646120 1546738 1087324 1100579 1545809 1704924
15263A704924k86404k01999J28886J14228j55894k44903j35636n6789M0219K75705
$$ 1704924 1418520 1216521 1345407 1459635 1303741 1058838 923202 866413 906632 1182337
15253A182337M10836J46775l01423l89851J4664M32671L90125j40k40434j23054
$$ 1182337 1593173 1739948 1438525 1048674 1063338 1496009 1886134 1885994 1645560 1522506
15243A522506M2357n0181k22014j30076J30936J85338M0652N0394K13411J54877
$$ 1522506 1564863 1514682 1292668 1162592 1293528 1478866 1519518 1569912 1783323 1938200
15233A938200r4232n4901K32187P1299o19920q52888q5624P13741M86133k37374
$$ 1938200 1843968 1789067 2021254 2092553 1472633 619745 534121 1247862 1733995 1496621
15223A496621k67881K70167L15280j72951k01392L67363N04495j33707n38891
$$ 1496621 1228740 1498907 1814187 1641236 1439844 1807207 2311702 2177995 1639104
15214A639104p3374M70974K65655k41155k57855M1433N8779j20792r0519l990
$$ 1639104 1565730 2036704 2302359 2061204 1803349 1844782 1903561 1782769 1692250 1688260
15204A688260j87515l34172J5138N25055M80109o3647l66494j40629J62284J80870
$$ 1688260 1500745 1166573 1181711 1706766 2186875 2123228 1756734 1616105 1778389 1959259
15194A959259O1853k3856j60274l16105k05969K35555N93650M48911p1170m30890
$$ 1959259 2021112 1997256 1836982 1520877 1314908 1550463 2144113 2593024 2521854 2090964
15184B090964l21550k407O5907j44652j87019J61017M63665K50745j88272k00898
$$ 2090964 1769414 1767007 1832914 1688262 1501243 1662260 2125925 2376670 2188398 1987500
15174A987500J74718K68154q5153k75087p106J75802j17040l99306j61373K31999
$$ 1987500 2162218 2430372 2345219 2070132 2063026 2238828 2121788 1722482 1561109 1793108
15164A793108J91516j11107j52410R568j4895j36990j7471J82783O3125k19895
$$ 1793108 1984624 1873517 1721107 1730675 1715780 1578790 1561319 1744102 1807227 1587332
15154A587332j72521J79629L67093K61671J12307k6748k26404k59464L2355K04151
$$ 1587332 1414811 1594440 1961533 2223204 2335511 2308763 2082359 1822895 1855250 2059401
15144B059401j53600n23595j62386N43420N43279j52748m59244j6537L03429n17
$$ 2059401 1905801 1382206 1219820 1763240 2306519 2153771 1694527 1677990 1981419 1980902
15134A980902k67583j8512J70419j26342k68527K32987O17073R5070o69610n42980
$$ 1980902 1713319 1694807 1865226 1738884 1470357 1703344 2320417 2415487 1745877 1202897
15124A202897K28997M60412m8483l48165J366L63524K48040k745l4769n5638k20072
$$ 1202897 1431894 1892306 1843823 1495658 1497024 1860548 2108588 2105843 2071074 2015436 1795364
15113A795364k21040R2917L23099J53719j34460j61225p818Q0952J43948K69113
$$ 1795364 1574324 1667241 1990340 2144059 2009599 1848374 1840556 1921508 2065456 2334569
15103B334569K62099l7131l55922l06733N0722L09818K73920J07607K632j7100
$$ 2334569 2596668 2559537 2203615 1896882 1947604 2257422 2531342 2638949 2641581 2624481
15093B624481L0429J47188K37785J31428j71047l93764k70349R6903L04871J35189
$$ 2624481 2654910 2802098 3039883 3171311 3000264 2606500 2336151 2433054 2737925 2873114
15083B873114j57358j90695J0067Q3244p5594j40480P9471K60677O2492k74896
$$ 2873114 2715756 2525061 2535128 2618372 2542778 2402298 2481769 2742446 2804938 2530042
15073B530042k58507Q3998K46352M8017j04952Q4591K94905Q8239l63562m61137
$$ 2530042 2271535 2355533 2601885 2649902 2544950 2629541 2924446 3012685 2649123 2187986
15063B187986j6307M59891M25803R166k16384n2907Q5217j17413l10594k7565
$$ 2187986 2171679 2631570 3057373 3066539 2850155 2797248 2882465 2765052 2454458 2426893
15053B426893M50605M05403j59129m01752N9667M87977J87229l50930k46188L14242
$$ 2426893 2877498 3282901 3123772 2722020 2781687 3269664 3456893 3105963 2859775 3174017
15043C174017L94387j36884m17585j9759M24765L10104q8680k58485k27158k20131
$$ 3174017 3568404 3431520 3013935 2994176 3418941 3729045 3640365 3381880 3154722 2934591
15033B934591j32016J47857L48903K35732K4736j6895R119k1011N7339K61017
$$ 2934591 2802575 2950432 3299335 3535067 3559803 3542908 3552027 3531016 3588355 3849372
15023C849372K13513j88133l78703K6243M86140L24746j80031k78418M0675J88119
$$ 3849372 4062885 3874752 3496049 3522292 4008432 4333178 4153147 3874729 3915404 4103523
15013D103523O4528P6773K00256M952l76927l00366K36787M64699J21475j14967
$$ 4103523 4168051 4244824 4445080 4450032 4073105 3772739 4009526 4474225 4595700 4480733
15003D480733J34237K56085k10945o26613k44697N17689P00198K26886j80169
$$ 4480733 4614970 4871055 4660110 4033497 3788800 4306489 5006687 5233573 5053404
14994E053404k07875j76830k07191l5315L03943L84251J22474m3258J01708K00684
$$ 5053404 4845529 4668699 4461508 4426193 4730136 5114387 5236861 5193603 5295311 5495995
14984E495995l3130l17800k48446J13618L85514L52557R5881j68118k15309K8225
$$ 5495995 5462865 5145065 4896619 5010237 5395751 5748308 5844189 5676071 5460762 5488987
14974E488987L30892L46478N2582k07859j99999o6659j6159l395R9850K26477
$$ 5488987 5819879 6166357 6218939 6011080 5811081 5744422 5728263 5724868 5824718 6051195
14964F051195K14698O1650q9568j27260k4075J84838L77918M02254K43962O2714
$$ 6051195 6265893 6327543 6237975 6110715 6086640 6271478 6649396 7051650 7295612 7358326
14954G358326r33L1192N1074j0434j36524k04898o8249K08693L01846M6248k20784
$$ 7358326 7357393 7388585 7439659 7429225 7292701 7087803 7019554 7228247 7530093 7576341 7355557
14943G355557p5823L15131L85889M2907j75605M8226L45160L14436J28277R9148
$$ 7355557 7279734 7594865 7980754 8023661 7848056 7896282 8241442 8555878 8684155 8783303
14933H783303J09434n1270j76367j5235J67609N056k57453j19611K70989K93323
$$ 8783303 8892737 8841467 8665100 8649865 8817474 8822530 8565077 8445466 8716455 9009778
14923I009778j18418l61446j56994P4861K7964j3642J59983J99530j55938m80954
$$ 9009778 8891360 8529914 8372920 8447781 8475745 8462103 8622086 8821616 8665678 8184724
14913H184724k79909J72370K07083k29373n20790k85921J53251K77361p061l63452
$$ 8184724 7904815 8077185 8284268 8054895 7534105 7248184 7401435 7678796 7671735 7308283
14903G308283m40733k05998N9112Q8210n0633q8724J1314K0153j14576j45803
$$ 7308283 6867550 6661552 6720664 6808874 6758241 6669517 6680831 6700984 6586408 6440605
14893F440605k220J4363k17804k92500J04727N61120M42680j65007n64202m06420
$$ 6440605 6438385 6452748 6234944 5942444 6047171 6608291 7050971 6885964 6321762 5915342
14883E915342l4168J23626K4721j55988k56200j38408J70292L43043J11518k77029
$$ 5915342 5881174 6004800 6029521 5873533 5617333 5478925 5649217 5992260 6103778 5826749
14873E826749l55948j30945n052o4671j7593J29299l243l90777m40638O4216M85596
$$ 5826749 5470801 5339856 5334804 5270133 5252540 5381839 5378596 4987819 4547181 4611397 5096993
14862E096993K52318k72467l86140p6773J36752P3068k6029p4951j97992k99925
$$ 5096993 5349311 5076844 4690704 4613931 4750683 4823751 4797722 4722771 4524779 4224854
14852D224854j43102J70980K84799J37090j1856p4896j96980l34950k64553m1014
$$ 4224854 4081752 4252732 4537531 4674621 4662765 4587869 4390889 4055939 3791386 3750372
14842C750372L0860n0131L8178K96724K83218j39386m51635k21879K27965L20062
$$ 3750372 3781232 3731101 3769279 4066003 4349221 4209835 3758200 3536321 3764286 4084348
14832D084348N3737j24450o3611l0393j67383k77842j91266n234J09451R9338
$$ 4084348 4138085 4013635 3950024 3919631 3752248 3474406 3283140 3277906 3387357 3486695
$$ [...]
##END NTUPLES=NMR SPECTRUM
##END=
