##TITLE=1H ikalashn
11P153_mk-TFA
26.7.2023
##JCAMPDX= 6.0         $$ Bruker NMR JCAMP-DX V2.0
##DATA TYPE= NMR SPECTRUM
##DATA CLASS= NTUPLES
##ORIGIN= UXNMR, Bruker Analytische Messtechnik GmbH
##OWNER= root
$$ TOPSPIN		Version 1.3
$$ 2023-07-26 15:38:37.406 +0400  Irina@DPX200
$$ Compression mode = diff/dup
##.OBSERVE FREQUENCY= 200.131300845
##.OBSERVE NUCLEUS= ^1H
##.ACQUISITION MODE= SIMULTANEOUS
##.ACQUISITION SCHEME= undefined
##.AVERAGES= 32
##.DIGITISER RES= 18
##SPECTROMETER/DATA SYSTEM= spect
##.PULSE SEQUENCE= zg
##.SOLVENT NAME= CDCl3
##.SHIFT REFERENCE= INTERNAL, CDCl3, 1, 16.97976
##AUDIT TRAIL= $$ (NUMBER, WHEN, WHO, WHERE, WHAT)
$$ ##TITLE= Audit trail, TOPSPIN		Version 1.3
$$ ##JCAMPDX= 5.01
$$ ##ORIGIN= Bruker BioSpin GmbH
$$ ##OWNER= Irina
$$ $$ F:/spectra/data/iren/nmr/1H/4/pdata/1/auditp.txt
$$ ##AUDIT TRAIL=  $$ (NUMBER, WHEN, WHO, WHERE, VERSION, WHAT)
(   1,<2023-07-26 15:38:18.296 +0400>,<Irina>,<DPX200>,<TOPSPIN 1.3>,
      <created by zg
	started at 2023-07-26 15:36:05.390 +0400,
	POWCHK disabled, PULCHK disabled
       configuration hash MD5:
       BE 6D 3F 07 2A EA 11 49 91 17 2B D3 AF B3 58 0D
       data hash MD5: 16K
       B1 6E 89 27 29 C3 32 F5 58 94 D8 98 4D 87 4D 96>)
(   2,<2023-07-26 15:38:18.515 +0400>,<Irina>,<DPX200>,<TOPSPIN 1.3>,
      <Start of raw data processing
       efp BC_mod = 2 LB = 0.05 FT_mod = 6 PKNL = 1 PHC0 = 204.0136 PHC1 = -0.33074 SI = 32K 
       data hash MD5: 32K
       23 B3 4B 5D A4 8E 6A 17 FC 8A AC 01 7A 20 AD 98>)
(   3,<2023-07-26 15:38:27.828 +0400>,<Irina>,<DPX200>,<TOPSPIN 1.3>,
      <pk fgphup PHC0 = -3.3 PHC1 = 0 
       data hash MD5: 32K
       F9 D8 62 1F 0E 29 1F BA 78 25 AC 3A 36 29 7C 2B>)
$$ ##END=
$$ 
$$ $$ hash MD5
$$ $$ A5 A6 C2 26 81 AA CD 57 A5 48 19 C5 FF FD CA 52
##$RELAX= 
##$RELAX= 
##$RELAX= 
##$RELAX= 
##$RELAX= 
##$RELAX= 
##$RELAX= 
##$RELAX= 
$$ Bruker specific parameters
$$ --------------------------
##$DU= <F:/spectra>
##$EXPNO= 4
##$NAME= <1H>
##$PROCNO= 1
##$TYPE= <nmr>
##$USER= <iren>
##$AMP= (0..31)
100 100 100 100 100 100 100 100 100 100 100 100 100 100 100 100 100 100 
100 100 100 100 100 100 100 100 100 100 100 100 100 100 
##$ANAVPT= -1
##$AQSEQ= 0
##$AQ_mod= 1
##$AUNM= <au_zg>
##$AUTOPOS= <>
##$BF1= 200.13
##$BF2= 200.13
##$BF3= 200.13
##$BF4= 200.13
##$BF5= 200.13
##$BF6= 200.13
##$BF7= 200.13
##$BF8= 200.13
##$BYTORDA= 1
##$CFDGTYP= 0
##$CFRGTYP= 5
##$CHEMSTR= <none>
##$CNST= (0..63)
1 1 145 1 1 1 1 1 1 1 1 1 1 1 1 1 1 1 1 1 1 1 1 1 1 1 1 1 1 1 1 1 1 1 
1 1 1 1 1 1 1 1 1 1 1 1 1 1 1 1 1 1 1 1 1 1 1 1 1 1 1 1 1 1 
##$CPDPRG= <>
##$CPDPRG1= <>
##$CPDPRG2= <>
##$CPDPRG3= <>
##$CPDPRG4= <mlev>
##$CPDPRG5= <mlev>
##$CPDPRG6= <mlev>
##$CPDPRG7= <mlev>
##$CPDPRG8= <mlev>
##$CPDPRGB= <>
##$CPDPRGT= <>
##$D= (0..63)
0 2 0 0 0 0 0 0 0 0.06 0 0.03 0 0 0 0 0.0002 0 0 0 0 0 0 0 0 0 0 0 0 0 
0 0 0 0 0 0 0 0 0 0 0 0 0 0 0 0 0 0 0 0 0 0 0 0 0 0 0 0 0 0 0 0 0 0 
##$DATE= 1690371495
##$DBL= (0..7)
120 120 120 120 120 120 120 120 
##$DBP= (0..7)
$$ [...]
0 0 2 0 0 0 0 0 0 0 0 0 0 0 0 0 
##$SW_h= 4194.63087248322
##$TD= 16384
##$TD0= 1
##$TE= 300
##$TE2= 300
##$TE3= 300
##$TEG= 300
##$TL= (0..7)
0 120 120 120 120 120 120 120 
##$TP= (0..7)
150 150 150 150 150 150 150 150 
##$TP07= 0
##$TPNAME0= <>
##$TPNAME1= <>
##$TPNAME2= <>
##$TPNAME3= <>
##$TPNAME4= <>
##$TPNAME5= <>
##$TPNAME6= <>
##$TPNAME7= <>
##$TPOAL= (0..7)
0.5 0.5 0.5 0.5 0.5 0.5 0.5 0.5 
##$TPOFFS= (0..7)
0 0 0 0 0 0 0 0 
##$TUNHIN= 0
##$TUNHOUT= 0
##$TUNXOUT= 0
##$USERA1= <user>
##$USERA2= <user>
##$USERA3= <user>
##$USERA4= <user>
##$USERA5= <user>
##$V9= 5
##$VALIST= <valist>
##$VCLIST= <CCCCCCCCCCCCCCC>
##$VD= 0
##$VDLIST= <DDDDDDDDDDDDDDD>
##$VPLIST= <PPPPPPPPPPPPPPP>
##$VTLIST= <TTTTTTTTTTTTTTT>
##$WBST= 1024
##$WBSW= 25
##$XGAIN= (0..3)
0 0 0 0 
##$XL= 0
##$YL= 0
##$YMAX_a= 741860
##$YMIN_a= -1200128
##$ZGOPTNS= <>
##$ZL1= 120
##$ZL2= 120
##$ZL3= 120
##$ZL4= 120
##$ABSF1= 0
##$ABSF2= 0
##$ABSG= 0
##$ABSL= 0
##$ALPHA= 0
##$AQORDER= 0
##$ASSFAC= 0
##$ASSFACI= 0
##$ASSFACX= 0
##$ASSWID= 0
##$AUNMP= <proc_1d>
##$AXLEFT= 0
##$AXRIGHT= 0
##$AXTYPE= 0
##$AXUNIT= <>
##$AZFE= 0.1
##$AZFW= 0.1
##$BCFW= 0
##$BC_mod= 2
##$BYTORDP= 0
##$COROFFS= 0
##$CY= 7568.61572265625
##$DATMOD= 1
##$DC= 0
##$DFILT= <>
##$DTYPP= 0
##$F1P= 12.6985496478733
##$F2P= 1.34767866218088
##$FCOR= 0.5
##$FTSIZE= 32768
##$FT_mod= 6
##$GAMMA= 0
##$GB= 0
##$INTBC= 0
##$INTSCL= 2.627456e-011
##$ISEN= 128
##$LB= 0.05
##$LEV0= 0
##$LPBIN= 0
##$MAXI= 10000
##$MC2= 0
##$MEAN= 0
##$ME_mod= 0
##$MI= 50
##$NCOEF= 0
##$NC_proc= -6
##$NLEV= 6
##$NOISF1= 8.587773
##$NOISF2= 6.764455
##$NSP= 0
##$NTH_PI= 0
##$NZP= 0
##$OFFSET= 16.97976
##$PC= 4
##$PHC0= 200.7136
##$PHC1= -0.33074
##$PH_mod= 1
##$PKNL= yes
##$PPARMOD= 0
##$PPDIAG= 0
##$PPIPTYP= 0
##$PPMPNUM= 100
##$PPRESOL= 1
##$PSCAL= 1
##$PSIGN= 0
##$REVERSE= no
##$SF= 200.13
##$SI= 32768
##$SIGF1= 15.25833
##$SIGF2= -3.509519
##$SINO= 10.81358
##$SIOLD= 32768
##$SREGLST= <1H.CDCl3>
##$SSB= 0
##$STSI= 32768
##$STSR= 0
##$SW_p= 4194.63087248321
##$SYMM= 0
##$S_DEV= 0
##$TDeff= 16384
##$TDoff= 0
##$TI= <>
##$TILT= no
##$TM1= 0
##$TM2= 0
##$TOPLEV= 0
##$USERP1= <user>
##$USERP2= <user>
##$USERP3= <user>
##$USERP4= <user>
##$USERP5= <user>
##$WDW= 1
##$XDIM= 32768
##$YMAX_p= 286579881
##$YMIN_p= -2389642
$$ End of Bruker specific parameters
$$ ---------------------------------
##NTUPLES= NMR SPECTRUM
##VAR_NAME=  FREQUENCY,     SPECTRUM/REAL,   SPECTRUM/IMAG
##SYMBOL=    X,             R,               I
##VAR_TYPE=  INDEPENDENT,   DEPENDENT,       DEPENDENT
##VAR_FORM=  AFFN,          ASDF,            ASDF
##VAR_DIM=   32768,         32768,           32768
##UNITS=     HZ,            ARBITRARY UNITS, ARBITRARY UNITS
##FACTOR=    0.128013882030189, 1,           1
##FIRST=     4194.63087248321, -2075069,     -85911
##LAST=      0,             -1859265,        -278553
##MIN=       0,             -2389642,        0
##MAX=       4194.63087248321, 286579881,    0
$$ Real data points
##PAGE= N=1
##DATA TABLE= (X++(R..R)), XYDATA
$$ [...]
20454A2333004R4228q5872j34342p0558p2316j38721j37301o6729k2725n647K1230
20443A1714251p45q9756r4188O7400J79855J6126k69257l26111j06516J19617
20433A1210676J85348J57609Q7910m5571j46536o8093R7886J00913o0802j24535
20423A1394805j0080N1146o2928j51298n7459O0237K7652n1784k7793K1826j0130
20412A1184194k0374P4675Q8913j31823l39955j94888J65255K67977J0289j88093
20402A0916170k7488K39201K07052j11420l48817k65363L3513K80389K89437O9050
20392A1281724j86066k48210q5340J02123J25358J3903q5320j15635j08135n6113
20382A0638289N9299J55780J17922j5772p7303j1105M6749j1184j00539r9819
$$ y = [12333004, 12427232, 12341360, 12207018, 12136460, 12064144, 11925423, 11788122, 11721393, 11698668, 11693021, 11714251, 11713506, 11623750, 11529562, 11596962, 11776817, 11792943, 11523686, 11197575, 11091059, 11210676, 11396024, 11553633, 11641543, 11595972, 11449436, 11381343, 11479229, 11580142, 11519340, 11394805, 11384725, 11435871, 11372943, 11221645, 11164186, 11224423, 11252075, 11200291, 11172498, 11194324, 11184194, 11163820, 11238495, 11327408, 11195585, 10855630, 10660742, 10825997, 11093974, 11104263, 10916170, 10888682, 11127883, 11334935, 11223515, 10874698, 10609335, 10642848, 10923237, 11212674, 11281724, 11095658, 10847448, 10762108, 10864231, 10989589, 11003492, 10918172, 10802537, 10694402, 10638289, 10697588, 10853368, 10971290, 10955518, 10878215, 10867110, 10913859, 10902675, 10802136, 10702317]
20372A0702317m8641n2296p5732q922J00622P9836q0911j65686m2604J32151J42689
20361A0682823J1608p8112n9849j8216p739J254J9950K0012r26l6134j03360j57259
20349A0274052o4528J76844L05680J14935j84239k08815K0435J00165j08397k37382
20339A0188750M962L48125L36600l5042l63069l73811j51656Q6086K02453J72233
20329A0415631Q1118N4419P9211R190j52573j74594K8810J75927K7389k00986
20319A0343542j68048L2268M4900j26558j31132J12029K65501J24389r6064j54997
20309A0245830j04360o0523R963J05982R1768m7919j24291o1895j4194l3383L4878
20298A0041856J67870P7424k52491l66178k7279K99579J27484k45414j96045J98231
$$ y = [10702317, 10653676, 10601380, 10525648, 10516726, 10617348, 10697184, 10616273, 10450587, 10407983, 10540134, 10682823, 10694431, 10616319, 10556470, 10538254, 10530515, 10531769, 10551719, 10571731, 10570805, 10534671, 10431311, 10274052, 10209524, 10386368, 10692048, 10806983, 10622744, 10413929, 10434364, 10534529, 10426132, 10188750, 10193712, 10541837, 10878437, 10843395, 10480326, 10106515, 9954859, 10040945, 10243398, 10415631, 10496749, 10551168, 10630379, 10639569, 10486996, 10312402, 10341212, 10517139, 10544528, 10343542, 10175494, 10207762, 10252662, 10126104, 9994972, 10107001, 10372502, 10496891, 10400827, 10245830, 10141470, 10080947, 10090910, 10196892, 10288660, 10240741, 10116450, 10054555, 10040361, 10006978, 10041856, 10209726, 10287150, 10034659, 9668481, 9641202, 9940781, 10068265, 9822851, 9626806, 9825037]
20288I825037K80484j08189l81316j59374J75009J44930j26751k48823j80615
20279I220392j19559o2464J02335K40605J13833j89241l04355q1380K37883L53744
20269I511793K14915l0353k11664k31321j20100k7761n7812j17504m1155J53589
20259I042627K64682J71609k1052j35762j12597j2065P8111R0835P288j12074
20249I261602j70372j39520p9307l6783J0108P9834J26200J00722K3869n8422
20239I117931j35822j85669j27370O0700K12247J21848j40901k38112j713K84532
20229H967671K38223p8479k33110m4106J67307P1829j85691k33480k7074J31872
20219H774962O1463r5230j38464m7552R0602J87894J53604k0527j47676l5877
$$ y = [9825037, 10105521, 9997332, 9616016, 9456642, 9631651, 9776581, 9649830, 9401007, 9220392, 9100833, 9038369, 9140704, 9381309, 9495142, 9305901, 9001546, 8920166, 9158049, 9511793, 9726708, 9696355, 9484691, 9253370, 9133270, 9105509, 9047697, 8930193, 8889038, 9042627, 9307309, 9478918, 9457866, 9322104, 9209507, 9197442, 9275553, 9366388, 9373676, 9261602, 9091230, 8951710, 8872403, 8835620, 8845728, 8925562, 9051762, 9152484, 9176353, 9117931, 8982109, 8796440, 8669070, 8729770, 8942017, 9063865, 8922964, 8684852, 8683139, 8967671, 9205894, 9127415, 8894305, 8850199, 9017506, 9089335, 8903644, 8670164, 8643090, 8774962, 8836425, 8741195, 8602731, 8555179, 8645781, 8833675, 8987279, 8966752, 8819076, 8783199]
20209H783199J77283J48250j34558k56288j029K56859J03887k36049k19637J51725
20199H773642L02833k4162l52431j88074K41123L41088J1337k80571k18457j4306
20189H592022K1861n8369j9528J46195K38461J72692M9312n7134j57544k00567
20179H727401r0601R6500J33858k0751j17559R219J60468Q4126j03387r7640R6660
20168H878294J85188P3284k2546J895k3162j52590j51303P1972K05224J4833k15918
20157H865171j14471J56930J63796p1371j23868R1437J83656j8607j68635j2738
20147H951300J76652R0632r4953p2874L9911n2359k38770j48797K00331L71797
20137I222870J53822j62108k32949o3115J49860K76809K48221M5066j75668j77430
$$ y = [8783199, 8960482, 9108732, 8974174, 8717886, 8716857, 8973716, 9077603, 8841554, 8621917, 8773642, 9076475, 9052313, 8699882, 8511808, 8752931, 9094019, 9105356, 8824785, 8606328, 8592022, 8613883, 8555514, 8535986, 8682181, 8920642, 9093334, 9142646, 9085512, 8927968, 8727401, 8636800, 8733300, 8867158, 8846407, 8728848, 8738067, 8898535, 8982661, 8879274, 8781634, 8878294, 9063482, 9136766, 9114220, 9116115, 9092953, 8940363, 8789060, 8861032, 9066256, 9081089, 8865171, 8750700, 8907630, 9071426, 9000055, 8876187, 8967624, 9151280, 9132673, 8964038, 8951300, 9127952, 9218584, 9123631, 9050757, 9090668, 9038309, 8799539, 8650742, 8851073, 9222870, 9376692, 9214584, 8981635, 8918520, 9068380, 9345189, 9593410, 9638476, 9462808, 9285378]
20127I285378J7696J18850O945q1058L3220J58147P7641n2960J8461J67294Q4410
20116I834024j59111j65995J48395L78725K19580j11711k37818j30877j9376P354
20106I763190L0647O4196N3475N5517J70151L03188K34455l7367k27546j32581
20096A0277325R7893J74743M2164r7368p2414P7124K05708K33868J70320M4370
20086A1153733r8078j59496o0327J16828J51934m2075k41701j60751J37671K68146
20076A1065884K7592l12454l57457r1163J58350J67153K9603n1661j2159N8028
20066A0681716L0240j27082k58543j52783J30740K19196q1515m10515k94345J29945
20056I867054K58368r0073l96496k26496J50932K32385J3413j32804p0655J1184
$$ y = [9285378, 9303074, 9421924, 9428869, 9347811, 9381031, 9539178, 9616819, 9563859, 9582320, 9749614, 9834024, 9674913, 9508918, 9657313, 10036038, 10255618, 10143907, 9906089, 9775212, 9755836, 9763190, 9793837, 9858033, 9911508, 9967025, 10137176, 10440364, 10674819, 10637452, 10409906, 10277325, 10375218, 10549961, 10592125, 10494757, 10422343, 10499467, 10705175, 10939043, 11109363, 11153733, 11055655, 10896159, 10835832, 10952660, 11104594, 11062519, 10820818, 10660067, 10797738, 11065884, 11093476, 10781022, 10423565, 10332402, 10490752, 10657905, 10687508, 10635847, 10623688, 10681716, 10711956, 10584874, 10326331, 10173548, 10304288, 10523484, 10441969, 10031454, 9737109, 9867054, 10125422, 10035349, 9638853, 9412357, 9563289, 9795674, 9809087, 9676283, 9605628, 9616812]
20046I616812l239m6738q8917j48876j45834k2918N5552p5989k52165j88608M3819
20035H742899J10851n5561j88141j42901n6090k0355K3139L3428j03132k47804
20025H096333j26551J62798K20088J6795k8651J75246J45292l21301o46781l30990
20015G362278K07352K74741k2130p4214J40710R3276k61765l35439P7831M00112
20005G862752J83345k11079k36939K6992J32860j8198j53526j16154N20Q5168
19995G555741R3780J69j31810j40371P456J24675Q0408j6153n0800r3990j72995
19984G256110j11161J53216L27812J59143j30673j52143N2692J08980o9391j70323
19974G424262k1681J45593R3633o6277q4887N8859J71129J16338m1035j26447
$$ y = [9616812, 9613573, 9566835, 9477918, 9329042, 9183208, 9160290, 9215842, 9139853, 8887688, 8699080, 8742899, 8853750, 8798189, 8610048, 8467147, 8411057, 8390702, 8413841, 8447269, 8344137, 8096333, 7969782, 8132580, 8352668, 8369463, 8340812, 8516058, 8661350, 8340049, 7693268, 7362278, 7569630, 7844371, 7822241, 7748027, 7888737, 7982013, 7720248, 7384809, 7462640, 7862752, 8046097, 7835018, 7598079, 7625071, 7757931, 7739733, 7586207, 7470053, 7470573, 7555741, 7649521, 7649690, 7517880, 7377509, 7384965, 7509640, 7590048, 7573895, 7523095, 7429105, 7256110, 7144949, 7298165, 7625977, 7785120, 7654447, 7502304, 7554996, 7663976, 7594585, 7424262, 7402581, 7548174, 7641807, 7575530, 7490643, 7549502, 7720631, 7836969, 7795934, 7669487]
19964G669487n1708N9400O560j71079j70235J27588L70316J87957k08308k74360
19954G545618N8097K74755O9345k19064j79778O9090J77138J26127J03716O1164
19944H086208j49803l42111j82649K06687L18541J8254k23971n6732K09158J04315
19934G987897k60506l79785j27839R5158M179j81512j36470Q1937J66580J0188
19924G259827k01356k64009j42660O7426K11695J50417q7256k55463j51730R8732
19914F685623J83059J0485k02296k58306j81617n6593R6394J95910R3398j62274
19904F403783k78830j18557P5094N9741k9705L1158J17364j5403k22199j47703
19894E874743J45867K19350l3527k10088o6084J20988P6220l6971n017K2404j23905
$$ y = [7669487, 7617779, 7677179, 7683739, 7512660, 7342425, 7470013, 7840329, 8028286, 7819978, 7545618, 7603715, 7878470, 7947815, 7728751, 7548973, 7618063, 7795201, 7921328, 8025044, 8086208, 7936405, 7594294, 7411645, 7618332, 7936873, 7955127, 7731156, 7674424, 7883582, 7987897, 7727391, 7347606, 7219767, 7314925, 7319104, 7137592, 7001122, 7083059, 7249639, 7259827, 7058471, 6794462, 6651802, 6719228, 6930923, 7081340, 6994084, 6738621, 6586891, 6685623, 6868682, 6879167, 6676871, 6418565, 6236948, 6180355, 6276749, 6472659, 6566057, 6403783, 6124953, 6006396, 6081490, 6141231, 6111526, 6142684, 6260048, 6244645, 6022446, 5874743, 6020610, 6239960, 6206433, 5996345, 5930261, 6051249, 6127469, 6090498, 6085481, 6107885, 5983980]
19883E983980k35223r7482M9090r2760k78156p7204L37274L77651k7608l21735
19873E617827k07521k0642l2344M299K76917M22997R0270l95837m50159q2681
19863E223126J75922Q2366p9393n2383N3216O7093M0180O4365P3329j0197j04367
19852E533257r4973j8275P005l7741n6847J1760R9009Q3408l1623p5123O5395
19841E485252K15757R6883k39069l97811j86193R6112J17614O189O4219K11066
19831E470019J29231j45108k37854m1337J39319J08577K5276J5630l7807j56805
19821E269141j27983P8273J40697r1256k76519j03498K02964K57911R7853j2683
19811E434900p8273k22052k72354j4503L00078K38338j01080k11032M348J07665
$$ y = [5983980, 5748757, 5651275, 5700365, 5607605, 5329449, 5252245, 5589519, 5967170, 5939562, 5617827, 5410306, 5389664, 5357320, 5361619, 5638536, 6061533, 6151803, 5755966, 5305807, 5223126, 5399048, 5481414, 5402021, 5349638, 5402854, 5469947, 5510127, 5574492, 5647821, 5637624, 5533257, 5438284, 5420009, 5427014, 5389273, 5332426, 5344186, 5443195, 5526603, 5494980, 5419857, 5485252, 5701009, 5797892, 5558823, 5161012, 4974819, 5070931, 5188545, 5194734, 5258953, 5470019, 5599250, 5454142, 5216288, 5174951, 5314270, 5422847, 5448123, 5463753, 5425946, 5269141, 5141158, 5219431, 5360128, 5268872, 4992353, 4888855, 5091819, 5349730, 5447583, 5434900, 5356627, 5134575, 4862221, 4847718, 5147796, 5386134, 5285054, 5074022, 5078370, 5186035]
19801E186035r7569k42128l4052K69076K91175N2642j88400k80901j74328R9491
19791D881041K78151P7782k94818k87461J42699L53990J0843l36228j44566K07839
19781D889272P5412l33367l08804J43505L29651N2983j19708R3118K20470p1670
19771D970862l65023k07782J41021J91893M98o0036K9171J1428j11185j10230
19761D490617K2307Q0071K6822K2097J11427J85630J95653J56253J7414k22761
19751E085530l73203k64900j4028J55665K14755K12899O1492k41596l70343p8620
19741D387651K95438K28396j61676k52364R2248K92988Q780k99599j36539K18004
19731D673327J94553j24439j65235J85678M06205J63366k15149k84793r7360J225
$$ y = [5186035, 5088466, 4846338, 4812286, 5081362, 5372537, 5425179, 5236779, 4955878, 4781550, 4881041, 5159192, 5236974, 4942156, 4654695, 4797394, 5151384, 5162227, 4825999, 4681433, 4889272, 4964684, 4631317, 4322513, 4466018, 4795669, 4848652, 4728944, 4822062, 5042532, 4970862, 4605839, 4398057, 4539078, 4730971, 4731469, 4671433, 4700604, 4712032, 4600847, 4490617, 4512924, 4592995, 4619817, 4641914, 4753341, 4938971, 5134624, 5290877, 5308291, 5085530, 4712327, 4447427, 4433399, 4589064, 4803819, 5016718, 5078210, 4836614, 4466271, 4387651, 4683089, 4911485, 4749809, 4497445, 4589693, 4882681, 4891461, 4591862, 4455323, 4673327, 4867880, 4743441, 4578206, 4763884, 5170089, 5333455, 5118306, 4833513, 4736153, 4737378]
19721D737378q2635j53586j03562l1038l895N1972J66140K10578R1211o2310m8036
19710D772217J10783J77892L5510j46483j55613k8849L3895k5517o7644N210J06600
19699D818001J08098J7750m4418M166J18337J58381K4414k06077l16467j88374
19689D493811M8586J76259J30233j283j19774j35541K6787K60716K58737p9565
19679E058966l55313j44305L22325M07321P703k86080j17371J22205K2583j51077
19669D886957M614K48560R6787k79122k79029J12166K79144p453k52309j08102
19659D702213R1411K858j27083J2450J74175R867k28080o7964L32299L80047R619
19648E291812k15454l1096J36987n6845k85803j19632K35631K59703n6768k21779
$$ y = [4737378, 4654743, 4501157, 4397595, 4366557, 4362662, 4414634, 4580774, 4791352, 4882563, 4820253, 4772217, 4883000, 5060892, 5096402, 4949919, 4794306, 4765457, 4799352, 4773835, 4706191, 4711401, 4818001, 4926099, 4943849, 4899431, 4903597, 5021934, 5180315, 5204729, 4998652, 4682185, 4493811, 4542397, 4718656, 4848889, 4847606, 4727832, 4592291, 4619078, 4879794, 5138531, 5058966, 4703653, 4559348, 4881673, 5288994, 5296697, 5010617, 4893246, 5015451, 5038034, 4886957, 4891571, 5140131, 5236918, 4957796, 4678767, 4790933, 5070077, 5062624, 4810315, 4702213, 4793624, 4796482, 4669399, 4681849, 4856024, 4865891, 4637811, 4569847, 4902146, 5282193, 5291812, 5076358, 5045262, 5182249, 5125404, 4839601, 4719969, 4955600, 5215303, 5158535, 4936756]
19638D936756j3130K31153J69589q2617k15999j59898m5139O1471J60557J88046
19628E230789R5270j7762l9522m2595j38899k12550n9511K21218K79013L0674
19618E346125j71887n6959J57434J21349r5446j40881M4412J55294K9461j17100
19608E271802o4208Q5384J16846L5304l452L3022L4164n1116j30662q0306J23544
19597E370322L55283M07217J84665j37152k51460o5069J89346K36984O1739j28569
19587F223306j43887K9119K21951K17981J86j47653L6432L74037M09749N2844
19577G274065k58046j87125L4024L9094q7856m1943J24387J19317k3630m314J55298
19566G143271J12535j40461j74105J34308K93128l0966m04741k60721K11362L59758
$$ y = [4936756, 4923626, 5154779, 5324368, 5241751, 5025752, 4865854, 4820715, 4882186, 5042743, 5230789, 5326059, 5308297, 5268775, 5226180, 5087281, 4874731, 4815220, 5036438, 5315451, 5346125, 5174238, 5117279, 5274713, 5396062, 5300616, 5159735, 5204147, 5359441, 5388902, 5271802, 5207594, 5292978, 5409824, 5445128, 5441676, 5474698, 5508862, 5457746, 5327084, 5246778, 5370322, 5725605, 6132822, 6317487, 6180335, 5928875, 5863806, 6053152, 6290136, 6351875, 6223306, 6079419, 6108538, 6330489, 6548470, 6548656, 6401003, 6437435, 6811472, 7221221, 7274065, 7016019, 6828894, 6862918, 6902012, 6814156, 6772213, 6896600, 7015917, 6992287, 6987973, 7143271, 7255806, 7115345, 6941240, 7075548, 7368676, 7337710, 6932969, 6672248, 6883610, 7243368]
19556G243368N8604j88167q7419P5597J7159j11351r6706n4450j46600k24744
19546F485291r4513Q7880M4124j43683j53335L5191J00995p9885k27632j23331
19536E931102M3272Q027j43071j63172p4259p6898j32142r119K43608K68397k9103
19525E866642k50994j02974J05021o4262m23936l91855Q1796L70425J06343k59086
19515E037120j70308J76154J88162j64089l40544j26154P8521m382p9356J21326
19505D716450K80829K0650l67392k99998J54307L42590M6241k04117j9548K38656
19495D908668J13122j74173j21847J89551K29212j14093l71148k30995O7873K01642
19485D697812J72056Q6345p0650k30324j71388Q8859J70122j07950l56306j74784
$$ y = [7243368, 7301972, 7113805, 7026386, 7101983, 7119142, 7007791, 6911085, 6856635, 6710035, 6485291, 6390778, 6478658, 6522782, 6379099, 6225764, 6260955, 6361950, 6282065, 6054433, 5931102, 5974374, 5982401, 5839330, 5676158, 5601899, 5525001, 5392859, 5383740, 5627348, 5895745, 5866642, 5615648, 5512674, 5617695, 5553433, 5129497, 4737642, 4819438, 5189863, 5296206, 5037120, 4866812, 5042966, 5231128, 5067039, 4726495, 4600341, 4678862, 4674480, 4595124, 4716450, 4997279, 5017929, 4650537, 4350539, 4504846, 4847436, 4893677, 4689560, 4670012, 4908668, 5021790, 4847617, 4725770, 4915321, 5144533, 5030440, 4659292, 4428297, 4496170, 4697812, 4869868, 4956213, 4885563, 4655239, 4483851, 4572710, 4742832, 4634882, 4278576, 4103792]
19475D103792J97576K37286n3980k06161o4903K9202r5071j32580J24745L56377
19465D496283J90141j95362l21824r6639J18592P0353q8796j17201l5587j8903
19455D001057q5235p2874Q4801K07797R0471j81971k85265o9083K20113K44533
19445D154344l160k36759k54718j01109R2060K15584J67265m9650k17854j27950
19435C638053R0327J19478n2988j13885L7251J00920r9144k72460j23143J51690
19425C476099J80921R709l2423Q3947O7763j51662k75819j19578R1652P0010j16391
19414C284228j57972P2427L57889L87822J11768j87038k12390k0867P0430m7679
19404C658618j30812j1142J01702j8119j97265j36413Q3396J46431L2643r562
$$ y = [4103792, 4301368, 4538654, 4484674, 4278513, 4213610, 4242812, 4147741, 4015161, 4139906, 4496283, 4686424, 4491062, 4169238, 4072599, 4191191, 4261544, 4172748, 4055547, 4019960, 4001057, 3915822, 3842948, 3927749, 4135546, 4226017, 4044046, 3758781, 3689698, 3909811, 4154344, 4151184, 3914425, 3659707, 3558598, 3650658, 3866242, 4033507, 3983857, 3766003, 3638053, 3728380, 3847858, 3794870, 3680985, 3718236, 3819156, 3720012, 3447552, 3324409, 3476099, 3657020, 3666729, 3634306, 3718253, 3786016, 3634354, 3358535, 3238957, 3330609, 3400619, 3284228, 3126256, 3198683, 3556572, 3944394, 4056162, 3869124, 3656734, 3635867, 3706297, 3658618, 3527806, 3516664, 3618366, 3600247, 3402982, 3266569, 3349965, 3496396, 3529039, 3519477]
19394C519477M8591M251j05123m44K80216L09086n1226l44946j87282J48089J61831
19383C782520j36136l19459k00098k162N4300Q523j6798L285L9633P4555Q6354
19372C374517O0066J8557n538J008M3930Q7351K1630j92915l57006k15595J48729
19361B984734L41724J66849j25734k12482p7645J12693K60809K90490J07715j84452
19351C664701k75165p2431J07243J8761j15659j385K00037J33507j42144k38489
19341C278976m0762J70833J71222J9964j37566k03589j05364R3247J43890n3274
19331C337577k11005o4699J64380J19058o3918J8005K96772L10389o201k16825
19321C683533j36862p6281j85521j74673P4045J98557j3017k08700o6712J62881
$$ y = [3519477, 3568068, 3572319, 3467196, 3466752, 3746968, 4056054, 4004828, 3659882, 3472600, 3620689, 3782520, 3646384, 3326925, 3126827, 3124665, 3178965, 3187488, 3170690, 3173975, 3213608, 3288163, 3374517, 3434583, 3453140, 3447602, 3448610, 3492540, 3579891, 3601521, 3408606, 3051600, 2836005, 2984734, 3326458, 3493307, 3367573, 3155091, 3077446, 3190139, 3450948, 3741438, 3849153, 3664701, 3389536, 3317105, 3424348, 3443109, 3327450, 3326065, 3526102, 3659609, 3517465, 3278976, 3238214, 3409047, 3580269, 3600233, 3462667, 3259078, 3153714, 3246961, 3390851, 3337577, 3126572, 3061873, 3226253, 3345311, 3281393, 3299398, 3596170, 3906559, 3900358, 3683533, 3546671, 3470390, 3284869, 3110196, 3184241, 3382798, 3369781, 3161081, 3094369, 3257250]
19311C257250J29560j2659O6959K65791K38088k5777k28167k08108k7174K02123
19301C657886K96757O0146l59088m67326j04955K20409O9440k29911j20868K69547
19291C292037L58670L7982k49621k56089j58535q7406K3525J23764Q1698J3531
19281C179556J10308K12844O2619j40389k4616K17281Q2915k95240k70850J74382
19271C308810K97363j49207m30668m5884M13687K42080k55095l50647n7868Q9751
19261C062322J4986M5425J57307O1017j20828j6481K43803J75978j81670k73584
19251C168275K9077K10878N554j77395r47K28561J18388j60735k06295k2470Q6886
19240C279777L0413l7634m0900k1486L0938J25320J39521j8045j92326j45612
$$ y = [3257250, 3386810, 3374151, 3441110, 3706901, 3944989, 3919212, 3691045, 3482937, 3455763, 3657886, 3954643, 4014789, 3655701, 3188375, 3083420, 3303829, 3373269, 3143358, 3022490, 3292037, 3650707, 3688689, 3439068, 3182979, 3024444, 2937038, 2960563, 3084327, 3166025, 3179556, 3289864, 3502708, 3565327, 3424938, 3400322, 3617603, 3700518, 3405278, 3134428, 3308810, 3606173, 3456966, 3026298, 2980414, 3394101, 3636181, 3381086, 3030439, 2972571, 3062322, 3077308, 3122733, 3280040, 3341057, 3220229, 3203748, 3447551, 3623529, 3441859, 3168275, 3197352, 3408230, 3413784, 3236389, 3235442, 3464003, 3582391, 3421656, 3215361, 3192891, 3279777, 3310190, 3272556, 3231656, 3210170, 3241108, 3366428, 3505949, 3487904, 3295578, 3149966]
19230C149966J05628K99910K52743K8947j81937k45718j56833k0719M3490K0893
19220C296370p022J1430N1533Q5622R9291M2006j01861j95456q1032J43735J88813
19209C533429j4595j80425p6555J35820J56100k0459j42072q2688L7032Q0953
19199C426540N3380Q945l4673n0922R451J24560J71206O4186j02022j30744K6820
19188C566727J67853Q3713j22760j36497J09057K89367J57825o9207o4319O6566
19178D048325k1404k75377k77557N0552K70291J16231j00775m5716J06425M3162
19168C914157j29718j23974K889Q64p7848Q055J98167K01526M126j17177o8807
19157C812260k5819m2403K1645J51730J48258J0431k5182Q8396J13949l3628j26388
$$ y = [3149966, 3255594, 3555504, 3808247, 3837194, 3655257, 3409539, 3252706, 3231987, 3275477, 3296370, 3289348, 3300778, 3352311, 3437933, 3537224, 3579230, 3477369, 3281913, 3200881, 3344616, 3533429, 3518834, 3338409, 3261854, 3397674, 3553774, 3533315, 3391243, 3308555, 3345587, 3426540, 3479920, 3488865, 3454192, 3403270, 3412721, 3537281, 3708487, 3772673, 3670651, 3539907, 3566727, 3734580, 3818293, 3695533, 3559036, 3668093, 3957460, 4115285, 4046078, 3981759, 4048325, 4026921, 3751544, 3473987, 3524539, 3794830, 3911061, 3810286, 3764570, 3870995, 3914157, 3784439, 3660465, 3663354, 3664218, 3586370, 3594425, 3792592, 3994118, 3998244, 3881067, 3812260, 3786441, 3744038, 3765683, 3917413, 4065671, 4076102, 4050920, 4139316, 4253265, 4219637, 4093249]
19146D093249l5642N1996l724n7236J4654Q4361N0373L4587R9558Q1276p4538
19135D338914j33629J4359R9521o5011j98844j5558K35501J48673j49764k04935
19125D069227J9766J35416J4697n2012O7563J24149k8279j68072j07886J3149
19115D087718L2233K7759Q3252Q9887n461l4863Q6524J55296K0897j16925k8213
19104D398104J48545J40600J492n337J26266J51111Q776r1259m8121j3803p8554
19093D737820j02836K718Q1757J329q2532M1023K64326K81843M8735j38909p8393
19082E056881N4338L00j67795j51773J03899K93815J69540j14677k14764m3602
19072D986162J53810J30848q9593k73593k19631M7672K75086K21257m8149k00988
$$ y = [4093249, 4057607, 4109603, 4105879, 4048643, 4063297, 4147658, 4198031, 4232618, 4332176, 4413452, 4338914, 4205285, 4219644, 4319165, 4254154, 4055310, 4039752, 4275253, 4423926, 4274162, 4069227, 4088993, 4224409, 4239106, 4187094, 4254657, 4378806, 4350527, 4182455, 4074569, 4087718, 4119951, 4147710, 4230962, 4320849, 4315388, 4280525, 4367049, 4522345, 4543242, 4426317, 4398104, 4546649, 4687249, 4688741, 4683404, 4809670, 4960781, 4969557, 4878298, 4830177, 4816374, 4737820, 4634984, 4637702, 4719459, 4720788, 4638256, 4679279, 4943605, 5225448, 5274183, 5135274, 5056881, 5111219, 5111519, 4943724, 4791951, 4895850, 5189665, 5359205, 5244528, 5029764, 4986162, 5139972, 5270820, 5181227, 4907634, 4688003, 4735675, 5010761, 5232018, 5183869, 4982881]
19062D982881n7331J65985J73265Q337o2949K5254J04988R4420N7032j8897j78792
19051E294193k60989o4445K30644K29705k9164q0371J80233K70449m1398k68881
19041E459976k7246K43775J3134l54626j57314L98243M45781j10690l96292K3399
19031E538140M61637K53090k22156k41735J38957L34221J82780n609r2310j74121
19021F172894j67440Q6261L74172L05272o1557k57127r0114J37900J52432L9458
19011F692151k3295j9422J5240O5477M2119j13784k20564o0237K02490J76112
19001F756287j33254k66344j1559K54823J57615j19944j80206k6210L1077q9804
18991F372481j57258k9458J50036J80305M0531j22601j42539J2702J76085J42785
$$ y = [4982881, 4925550, 5091535, 5264800, 5273137, 5210188, 5235442, 5340430, 5434850, 5491882, 5472985, 5294193, 5033204, 4968759, 5199403, 5429108, 5399944, 5319573, 5499806, 5770255, 5728857, 5459976, 5432730, 5676505, 5689639, 5335013, 5177699, 5575942, 6021723, 5911033, 5514741, 5538140, 5999777, 6252867, 6030711, 5788976, 5927933, 6262154, 6444934, 6439325, 6347015, 6172894, 6005454, 6091715, 6465887, 6771159, 6709602, 6452475, 6362361, 6500261, 6652693, 6692151, 6668856, 6649434, 6664674, 6730151, 6772270, 6658486, 6437922, 6377685, 6580175, 6756287, 6623033, 6356689, 6345130, 6599953, 6757568, 6637624, 6457418, 6431208, 6462285, 6372481, 6215223, 6185765, 6335801, 6516106, 6556637, 6434036, 6291497, 6304199, 6480284, 6623069]
18981F623069n9670j83510r7079N3015R7778P3228O9286M9971j1841j0163R0541
18970F694625J11004n7992k00161p1926J86417K41620P2411m1066J3390N6315
18960G004637k0687q7215m5059N841k3384n9001k7655J9764M4769J06591K10787
18949G129388K29049P7326j44028k71037k40615r3511P4721J41055N9782m5532
18939F916598k9491M8119J6857j02230j18865q874M0370k6280l3057P9927J15324
18928F898398j9425j13164k5167M3019p2941j36910J00650L75460K23816k73119
18918G000617n28160k59646J60161K82449J36377J4059o021o0189j80850k24142
18908F334655r1337J23623K28788J34924m1183r8728l615O4675j0348q8867r953
$$ y = [6623069, 6563399, 6379889, 6282810, 6335825, 6433603, 6506831, 6576117, 6626088, 6614247, 6604084, 6694625, 6805629, 6747637, 6547476, 6475550, 6661967, 6903587, 6975998, 6934932, 6948322, 7004637, 6983950, 6896735, 6851676, 6857517, 6834133, 6775132, 6747477, 6767241, 6812010, 6918601, 7129388, 7358437, 7435763, 7291735, 7020698, 6780083, 6686572, 6761293, 6902348, 6962130, 6916598, 6887107, 6935226, 6952083, 6849853, 6730988, 6722114, 6762484, 6736204, 6703147, 6783074, 6898398, 6878973, 6765809, 6740642, 6783661, 6710720, 6573810, 6674460, 7049920, 7273736, 7000617, 6472457, 6212811, 6372972, 6655421, 6791798, 6805857, 6799836, 6739647, 6558797, 6334655, 6243318, 6366941, 6595729, 6730653, 6689470, 6590742, 6587127, 6651802, 6641454, 6552587, 6542634]
18897F542634J20690J15691N9357J54546K82988J21866k62834l80860m3530K89222
18887F999770J66436j96518k77997j2674K11573J73985L7286q191L3520J04599
18877G231789J72777J60886L3252p0478j8784N6967l5226j66386n8313J93842
18867G500326J90255j15568k68499l279L24580K81582r200j30539k0156M0558
18857G790060m9236r1569K8827J74262J98422J13346j5323j36133j66444o5992
18847G780220N1706N7435J4251M8105Q2246l0307j60954l7104K58717L08824m88
18836H372651k52037j31675Q4926J6629j67411l9156L19855L75318k7963l96574
18826H154563l10325R509J15997q638n9253L6685N7686p5803j61384o5044P6156
$$ y = [6542634, 6663324, 6779015, 6838372, 6992918, 7275906, 7397772, 7134938, 6754078, 6710548, 6999770, 7166206, 6969688, 6691691, 6679017, 6890590, 7064575, 7101861, 7093670, 7127190, 7231789, 7404566, 7565452, 7598704, 7528226, 7509442, 7566409, 7531183, 7364797, 7306484, 7500326, 7690581, 7575013, 7306514, 7303235, 7627815, 7909397, 7900197, 7769658, 7749502, 7790060, 7740824, 7649255, 7678082, 7852344, 8050766, 8164112, 8148789, 8012656, 7846212, 7780220, 7831926, 7889361, 7903612, 7951717, 8033963, 8003656, 7842702, 7805598, 8064315, 8373139, 8372651, 8120614, 7988939, 8073865, 8090494, 7923083, 7883927, 8203782, 8579100, 8551137, 8154563, 7844238, 7853747, 7969744, 7961106, 7901853, 7938538, 7996224, 7920421, 7759037, 7693993, 7770149]
18815G770149J12639J10541J67053J82090J8306k16726k65066o9268J53497J93763
18805H156978N0961j51262k80963k09664R0579L93723L77181N4997j65451l8825
18795H278254J44190K3527k09170r1272L08091M04931J0162l25419j50513J91305
18785H584086J39941j87133k41343L6979J74957J161j09610M9490J46192p3171
18775H521549k91138j35443J80588J90341q2727j88531L3298K43372J40546j48107
18765H463748l16295k63008j16441l7929q0293j41420n6549J62962K55175M1808
18755G911758k46668k31105O4838K22718L3985k11780j78109M8552J47573L2770
18745G594532j00902r6719P889J04484J31070P8407j1728o6330o2764n2701o3475
$$ y = [7770149, 7882788, 7993329, 8160382, 8342472, 8360778, 8144052, 7878986, 7809718, 7963215, 8156978, 8207939, 8056677, 7775714, 7566050, 7656629, 8050352, 8427533, 8482530, 8317079, 8278254, 8422444, 8445971, 8236801, 8145529, 8453620, 8858551, 8868713, 8543294, 8392781, 8584086, 8724027, 8536894, 8295551, 8332530, 8507487, 8508648, 8399038, 8448528, 8594720, 8521549, 8230411, 8094968, 8275556, 8465897, 8383170, 8194639, 8227937, 8471309, 8611855, 8463748, 8147453, 7884445, 7768004, 7730075, 7649782, 7508362, 7451813, 7614775, 7869950, 7911758, 7665090, 7433985, 7498823, 7721541, 7755526, 7543746, 7365637, 7414189, 7561762, 7594532, 7493630, 7396911, 7404800, 7509284, 7640354, 7718761, 7707033, 7640703, 7577939, 7525238, 7461763]
18734G461763m8612J4819O6335N3104n502p6267j23287n5340J56737K92501Q2712
18723G818963l12611l66880O3532M18870K20180j72018j10468K75933K67828k42376
18713G860953n15654j43782K88978J67179j71643n8608L56344L59905j27628m23712
18703G592332j81844J30791O8409j23981l3562K21169K47899J4158j91769k25266
18693G518336j51598q968J70499K34597R8145o5461p6639l3383p2680n9396J34229
18682G687681K50496N342l26693k29292K10457L71476O8124j81020l9971J23223
18672G939823n8721l01374j94899Q1278J12483l6280l0365Q3901L6458o5020P4903
18661G642187K79745J08620l08275l47378J02951M11674J92865j36230j11248
$$ y = [7461763, 7413151, 7427970, 7494305, 7547409, 7541907, 7465640, 7342353, 7287013, 7443750, 7736251, 7818963, 7506352, 7139472, 7203004, 7621874, 7842054, 7670036, 7559568, 7835501, 8103329, 7860953, 7345299, 7201517, 7490495, 7657674, 7486031, 7427423, 7783767, 8143672, 8016044, 7592332, 7410488, 7541279, 7609688, 7485707, 7452145, 7673314, 7921213, 7935371, 7743602, 7518336, 7366738, 7357770, 7528269, 7762866, 7861011, 7795550, 7718911, 7685528, 7612848, 7553452, 7687681, 7938177, 7943519, 7616826, 7387534, 7597991, 7969467, 8037591, 7856571, 7816600, 7939823, 7881102, 7579728, 7384829, 7466107, 7578590, 7542310, 7511945, 7595846, 7632304, 7567284, 7642187, 7921932, 8030552, 7722277, 7374899, 7477850, 7889524, 8082389, 7946159, 7834911]
18652G834911O8742K6069j07102j3801J65489P6661j95691k58055o1593O6670
18642G602300o451o2398M2263J61443J32363m837j06121o7149J02750K14225L7844
18631H046232l18848l87742M0108N00092M27564l9079k67985l3836K66656K70363
18621H503525N1611j67598k82403k14747M9278K71857J89187m8053o7823R0394
18611H375228L8605k21097k22570J35706L26940O6447j76247K3186L00171J33249
18601H779618k38032k08894J72669L01012K927k45605j10742J77368K93899K30240
18591I154460J09139k2555r9613n0856K6225j4603p5708L5215J95831J10155j33359
18580I234331j08575K41314M17608J02382l37809l84572q0043J33383O6461o7891
$$ y = [7834911, 7903653, 7929722, 7822620, 7808819, 7974308, 8050969, 7855278, 7597223, 7535630, 7602300, 7595849, 7533451, 7575714, 7737157, 7869520, 7864683, 7758562, 7691413, 7794163, 8008388, 8046232, 7727384, 7339642, 7379750, 7879842, 8307406, 8268327, 8000342, 7966506, 8233162, 8503525, 8555136, 8387538, 8105135, 7890388, 7939666, 8211523, 8400710, 8352657, 8284834, 8375228, 8413833, 8192736, 7970166, 8105872, 8432812, 8499259, 8323012, 8346198, 8646369, 8779618, 8541586, 8332692, 8505361, 8806373, 8809300, 8563695, 8452953, 8630321, 8924220, 9154460, 9263599, 9241044, 9141431, 9090575, 9116800, 9102197, 9026489, 9061704, 9257535, 9367690, 9234331, 9125756, 9367070, 9784678, 9887060, 9549251, 9164679, 9084636, 9218019, 9284480, 9216589]
18570I216589n5927N9092J15609N0834m5150l8288O5860Q6820o7313j81614j4813
18559I191699K56148K17080j23871k68836J7643L06815J51919k20335k71839L2450
18549I288873K35881J21389k3649P4871K66276K36934m1668k93183k75848m0744
18539I549132J39336Q6108o5024n0442J30250J97204K5496j45681r6658K7489
18529I797210N108n0155R2644L03461K41198o0382j82724L2748K29344R1884j81951
18518A0318385k15066n822J44975J17670P9867J41597J77314O4353r0753r4861
18508A0637659M9876J39032L7047j47567k05978q0658J02170K10127K15785J47015
18498A1104508M6321m884N4280J45933J22239q442p5065j7786J8994l6227k7519
$$ y = [9216589, 9160662, 9219754, 9335363, 9386197, 9341047, 9302759, 9368619, 9455439, 9388126, 9206512, 9191699, 9447847, 9664927, 9541056, 9272220, 9289863, 9596678, 9748597, 9528262, 9256423, 9288873, 9524754, 9646143, 9622494, 9697365, 9963641, 10200575, 10158907, 9865724, 9589876, 9549132, 9688468, 9774576, 9709552, 9659110, 9789360, 9986564, 10012060, 9866379, 9769721, 9797210, 9802318, 9752163, 9844807, 10148268, 10389466, 10329084, 10146360, 10179108, 10408452, 10500336, 10318385, 10103319, 10097497, 10242472, 10360142, 10440009, 10581606, 10758920, 10823273, 10732520, 10637659, 10687535, 10826567, 10863614, 10716047, 10510069, 10429411, 10531581, 10741708, 10957493, 11104508, 11150829, 11145945, 11200225, 11346158, 11468397, 11459955, 11384890, 11367104, 11386098, 11349871, 11322352]
18487A1322352J39722K65798J51048m5961l2758J49116J97911L9934q2739k2985
18477A2081438Q3539J01671Q7031R8507O8039k2561m2012Q1729K14030J95301
18467A2946712M8857q0803r2147K1292J69877J96487M1357j14497l8048K11237
18457A3310324L23883J67539l6668l8594J32632K75892K67731J20305o2566j23141
18447A4337337J3173K00822K26035R8551L874j1307m8255o2712J04575L52440
18437A5214533L45109M1600j67992l9641J68498J48325L754k2656L5115M9853
18427A5776498J13057L05233M03381K01839p8842r2223R9745J83722J25607J29591
18417A7167608J92239J27420l5778q5993q667M3641Q7949K31176L39913K10863
$$ y = [11322352, 11462074, 11727872, 11878920, 11832959, 11800201, 11949317, 12147228, 12187162, 12104423, 12081438, 12164977, 12266648, 12353679, 12452186, 12520225, 12497664, 12455652, 12537381, 12751411, 12946712, 12995569, 12914766, 12822619, 12843911, 13013788, 13210275, 13251632, 13137135, 13099087, 13310324, 13634207, 13801746, 13765078, 13726484, 13859116, 14135008, 14402739, 14523044, 14460478, 14337337, 14350510, 14551332, 14777367, 14875918, 14879792, 14868485, 14820230, 14757518, 14862093, 15214533, 15559642, 15601242, 15433250, 15393609, 15562107, 15710432, 15714186, 15691530, 15726645, 15776498, 15889555, 16194788, 16598169, 16800008, 16721166, 16628943, 16728688, 16912410, 17038017, 17167608, 17359847, 17487267, 17451489, 17365496, 17356829, 17400470, 17488419, 17719595, 18059508, 18270371]
18407A8270371o875j0905J11857M8300j01394N1901M10261M14179j0372k25682
18397A8951641J06924M54298K78932j07107j07419J99581K96947J20415O2579
18388B0256791K29251L00357J27581m0002J666J40630K03693J74348R5371Q409
18378B1498095J9414J91914L72137L48591J71462P6313J12670J11702K1593q308
18368B2915583P5864J23697N9791L2891J59121L08469K97881J67267J13603K15871
18358B4470038L46019L38211J76060N340j7515J15625K65073K98506K14264J15398
18348B6327019J10943K27446L46374K70765k0370k35971r1947K61751M05848K59563
18338B7861421J73120L13163L73639J42775n6777J13265L85899K84761q2377j77040
$$ y = [18270371, 18263496, 18252591, 18364448, 18412748, 18311354, 18363255, 18773516, 19187695, 19177323, 18951641, 19058565, 19512863, 19791795, 19684688, 19577269, 19776850, 20073797, 20194212, 20256791, 20486042, 20786399, 20913980, 20873978, 20875644, 21016274, 21219967, 21394315, 21489686, 21498095, 21517509, 21709423, 22081560, 22430151, 22601613, 22677926, 22790596, 22902298, 22923891, 22915583, 22991447, 23115144, 23174935, 23207826, 23366947, 23675416, 23973297, 24140564, 24254167, 24470038, 24816057, 25154268, 25330328, 25335668, 25318153, 25433778, 25698851, 25997357, 26211621, 26327019, 26437962, 26665408, 27011782, 27282547, 27262177, 27026206, 26934259, 27196010, 27601858, 27861421, 28034541, 28347704, 28721343, 28864118, 28807341, 28920606, 29306505, 29591266, 29508889, 29331849]
18328B9331849J24322L92897L57565K19463J71715J07973k2176j3131K12076L82429
18318C1264982K92465J37373J86159L63800M06498K52215N9222k9727K4731J85441
18308C3143159L30194L32626K25788J53845J41043R8468O3032J66449L31558L09420
18298C5295582J05021L9243K48565M43474L47597Q6065o2277l5201Q0498K28117
18288C6776684L14335K29391R1883J67325L91037L59599N728j73977J17394M55150
18278C8734549L67008Q4642P7493K24709J10224j36448l0016L74176N13419K39714
18268D0559470P746O8067J42144M9355K3851J88433K89179K08559K06051L66486
18258D2109341L36489l8409l00001l2117M54581N51785J96275j47525j57776P1227
$$ y = [29331849, 29456171, 29849068, 30206633, 30426096, 30597811, 30705784, 30683608, 30670477, 30882553, 31264982, 31557447, 31694820, 31880979, 32244779, 32651277, 32903492, 32962714, 32932987, 32957718, 33143159, 33473353, 33805979, 34031767, 34185612, 34326655, 34425123, 34488155, 34654604, 34986162, 35295582, 35400603, 35439846, 35688411, 36131885, 36479482, 36565547, 36503270, 36468069, 36548567, 36776684, 37091019, 37320410, 37412293, 37579618, 37970655, 38330254, 38335982, 38162005, 38279399, 38734549, 39101557, 39186199, 39263692, 39488401, 39598625, 39462177, 39432161, 39806337, 40319756, 40559470, 40567216, 40635283, 40777427, 40826782, 40850633, 41039066, 41328245, 41536804, 41742855, 42109341, 42445830, 42407421, 42107420, 42075303, 42529884, 43081669, 43277944, 43130419, 42972643, 43043870]
18248D3043870K89860L18949J33841n0054O0868M07293N51914K92295j0958M953
18238D5042831J58142J12472q297J18238L72673L61322J09133M1732K86785M93445
18228D7088476M10182K05375J11549J20953J45692J74517J83937J51353J79288
18219D8771322L41537M47960K95614R1643J97084M75439M21232Q631j72900J61476
18209E1039038N21011M35866J85871K48818M62822L43066m5792j80713O6291K79306
18199E3355584K20191J40930K55464L84653L30124K17212K28433K86312K36402
18190E5655305J23204O5466L8025j3299R512K06632M47336M89514K91674N5781
18180E7369150j6769R2942K51530L06426K22405J25144J48678K36275K21570J20240
$$ y = [43043870, 43333730, 43652679, 43786520, 43736466, 43797334, 44204627, 44756541, 45048836, 45037878, 45042831, 45200973, 45313445, 45305148, 45423386, 45796059, 46157381, 46266514, 46308246, 46595031, 47088476, 47498658, 47704033, 47815582, 47936535, 48082227, 48256744, 48440681, 48592034, 48771322, 49112859, 49560819, 49856433, 49948076, 50145160, 50620599, 51041831, 51050462, 50877562, 51039038, 51560049, 51995915, 52181786, 52430604, 52893426, 53236492, 53190700, 53009987, 53076278, 53355584, 53575775, 53716705, 53972169, 54356822, 54686946, 54904158, 55132591, 55418903, 55655305, 55778509, 55843975, 55882000, 55868701, 55878213, 56084845, 56532181, 57021695, 57313369, 57369150, 57352381, 57445323, 57696853, 58003279, 58225684, 58350828, 58499506, 58735781, 58957351, 59077591]
18170E9077591J35223K93410L28786J06586q3228O0483L38855L26396M6218o1722
18160F0568598J46955L00473J41912n4307L6091K47409K23882N626q7118k088
18150F1527433K6257o2384q5146j1025k1589j08774j2833K89006M11532J19008
18140F2071485k62689k92394l1638J17780K2473r7452j01028p7127o8218J5198
18130F1296390J40846J13542j01808k64083j99039n4762o1087j96097k59916j70422
18120F0243564k5575O4173P2541K4130l6074o5386p4082j10358j61312j48753
18110E9782868o5867j4786m6613q0772o6904r5414k20639k97242j67409O6667
18100E8793889J45508n116k05561k77250k01280l9182J24307J56750j1187k19945
$$ y = [59077591, 59212814, 59506224, 59835010, 59941596, 59858368, 59918851, 60257706, 60584102, 60630320, 60568598, 60715553, 61016026, 61157938, 61103631, 61139722, 61387131, 61611013, 61616639, 61529521, 61527433, 61553690, 61491306, 61406160, 61395135, 61373546, 61264772, 61251939, 61540945, 61952477, 62071485, 61808796, 61516402, 61484764, 61602544, 61625017, 61527565, 61426537, 61349410, 61281192, 61296390, 61437236, 61550778, 61448970, 61184887, 60985848, 60931086, 60869999, 60673902, 60413986, 60243564, 60217989, 60282162, 60354703, 60378833, 60342759, 60277373, 60203291, 60092933, 59931621, 59782868, 59717001, 59702215, 59655602, 59574830, 59507926, 59412512, 59191873, 58894631, 58727222, 58793889, 58939397, 58934281, 58728720, 58451470, 58250190, 58211008, 58335315, 58492065, 58480878, 58260933]
18090E8260933k18970k0352Q7252m5363k14372j89406m1870K7482J210k4265n4055
18079E7568224j00323l0070K01382L06398K4751l58799l06903J44917L59673M6423
18069E7855673k81484j05152L13050M00943J72874Q6489K21238K22725P410r0162
18059E8803604N6744J57470O6931L5445J93590K87408J88475J81919M12000N06028
18049F0889614J79027j92397j04365K88441M64986L61759L17162L70642K52046
18040F2826915N350j3854J96894K31011k309p4557K42967N77202N32271K36269
18030F4758159M0075M1114J57483L32023M29046K66014l2220o4011K47824M75339
18020F6650846L49645J72465K50309L67062K31486L7818R6310K59700K41388J90119
$$ y = [58260933, 58041963, 58021611, 58108863, 58063500, 57849128, 57659722, 57617852, 57645334, 57646544, 57622279, 57568224, 57467901, 57437831, 57639213, 57945611, 57970362, 57611563, 57304660, 57449577, 57809250, 57855673, 57574189, 57469037, 57782087, 58183030, 58355904, 58442393, 58663631, 58886356, 58893766, 58803604, 58860348, 59017818, 59084749, 59120194, 59313784, 59601192, 59789667, 59971586, 60383586, 60889614, 61068641, 60876244, 60771879, 61060320, 61525306, 61887065, 62204227, 62574869, 62826915, 62832265, 62818411, 63015305, 63246316, 63244007, 63169450, 63412417, 63989619, 64521890, 64758159, 64798234, 64839348, 64996831, 65328854, 65757900, 66023914, 65991694, 65927683, 66175507, 66650846, 67000491, 67172956, 67423265, 67790327, 68021813, 68059631, 68155941, 68415641, 68657029, 68847148]
18010F8847148L75961N74069L92921K2850q347K87342M06727K38366J94436M06515
18000G1737988M87018K55016N9520J51044L04221L14925L34808M45739M27046
17991G4517325K39858K21322M62530N21338J63698j23948J24085N47458N02734
17982G7176400P9661q5569J78995M21337L65047K47862K86340L35033K47483J65904
17972G9418493K44746L70523L50222J99415R5330J42096K65236L00443J88358
17963H1574862Q3877J65532L32806L17322J48094J67726M25734M78560J16120
17954H3810633j54144J43550O00708M99210r175j04136L81398P06911M46607J17509
17944H6439071K24708M43188K95946L4744J73306N56231O00987K45637j0154Q0241
$$ y = [68847148, 69223109, 69797178, 70190099, 70212949, 70204602, 70491944, 70898671, 71137037, 71331473, 71737988, 72225006, 72480022, 72539542, 72690586, 72994807, 73309732, 73644540, 74090279, 74517325, 74757183, 74978505, 75441035, 75962373, 76126071, 76002123, 76126208, 76673666, 77176400, 77256061, 77170492, 77349487, 77770824, 78135871, 78383733, 78670073, 79005106, 79252589, 79418493, 79663239, 80033762, 80383984, 80583399, 80678729, 80820825, 81086061, 81386504, 81574862, 81658739, 81824271, 82157077, 82474399, 82622493, 82790219, 83215953, 83694513, 83810633, 83656489, 83800039, 84400747, 84899957, 84890782, 84786646, 85168044, 85874955, 86321562, 86439071, 86663779, 87106967, 87402913, 87437657, 87610963, 88167194, 88768181, 89013818, 89003664, 89083905]
17934H9083905K56817L10099L43396M05511L48403J83850J63746L42011M27261
17925I1864999K64081J22874K64687M98975M75087K25658R9270K36932M14588
17916I4467151M09677K75576J88948K13105L06732M30869N34142N20313L56894
17907I7703407J82286J86084L70182N23155M70918K81983J68638K32871L77161
17898A00496685M47515M00569L17821K92725L30628L69112L91657M69995O34575
17889A04151282P49794O44191L72470K01779K82455M75575N83104N87705N51317
17880A08599672M55781L19721L08767N01941O81028O10382M17752M07514N81125
17871A12883683O73932O20722O12451O77449O04608L77598L00057N19450P61359
$$ y = [89083905, 89340722, 89650821, 89994217, 90399728, 90748131, 90931981, 91095727, 91437738, 91864999, 92129080, 92251954, 92516641, 93015616, 93490703, 93716361, 93815631, 94052563, 94467151, 94876828, 95152404, 95341352, 95554457, 95861189, 96292058, 96826200, 97346513, 97703407, 97885693, 98071777, 98441959, 98965114, 99436032, 99718015, 99886653, 100119524, 100496685, 100944200, 101344769, 101662590, 101955315, 102285943, 102655055, 103046712, 103516707, 104151282, 104901076, 105545267, 105917737, 106119516, 106401971, 106877546, 107460650, 108048355, 108599672, 109055453, 109375174, 109683941, 110185882, 110866910, 111477292, 111895044, 112302558, 112883683, 113557615, 114178337, 114790788, 115468237, 116072845, 116450443, 116750500, 117269950, 118031309]
17862A18031309P42802N67584M99077N82968O98465P68870P44883N91256M35702
17853A23662916M90454O97295P44121N73720N15865P20608Q72338P45438O11788
17844A29634543P22921Q15700O09481M00960N84098Q98326Q15984M57445M10298
17835A35349756P46060R37074P49048N23779N06240N48251N84625P56612R28738
17826A41630183P44517L42040L28237P90181J038918O91644L07598M65023Q50878
17817A47189219Q73004O39634O39478Q43007Q40040O21455N42006O50962O78542
17808A53517347N98602O40517P98828Q46276P85459Q05211Q49072P14324N26146
17799A60081782O09836R13698J058691R60322Q98955R55504R00554P09473O65894
$$ y = [118031309, 118774111, 119341695, 119840772, 120423740, 121122205, 121891075, 122635958, 123227214, 123662916, 124153370, 124850665, 125594786, 126168506, 126684371, 127404979, 128277317, 129022755, 129634543, 130357464, 131173164, 131782645, 132183605, 132767703, 133666029, 134482013, 134939458, 135349756, 136095816, 137032890, 137781938, 138305717, 138811957, 139360208, 139944833, 140701445, 141630183, 142374700, 142716740, 143044977, 143835158, 144874076, 145565720, 145873318, 146338341, 147189219, 148062223, 148701857, 149341335, 150184342, 151024382, 151645837, 152187843, 152838805, 153517347, 154115949, 154756466, 155555294, 156401570, 157187029, 157992240, 158841312, 159555636, 160081782, 160691618, 161605316, 162664007, 163624329, 164523284, 165478788, 166379342, 167088815, 167754709]
17790A67754709Q35675R31075Q38946Q08313R55949J057227J005618J005025J104213
17781A76296750J036682P78270P50783J123930J400482J139020O78612O34862
17773A83839391R89088J223239J151391J064222J139193J219338J187686J143431
17765A92956979J158640J179231J188381J206864J166636J041447J015496J221994
17757B02135668J421024J304007J033451J044645J332838J426738J151316R14217
17749B11763904J033371J248481J215348J092112J219079J484600J477557J156299
17741B21690751R20660J007268J194862J207968J106700J114256J266732J413023
17733B30922220J444486J375489J268913J205304J270991J453601J575233J455411
$$ y = [167754709, 168590384, 169521459, 170360405, 171168718, 172124667, 173181894, 174187512, 175192537, 176296750, 177333432, 178111702, 178862485, 179986415, 181386897, 182525917, 183204529, 183839391, 184828479, 186051718, 187203109, 188267331, 189406524, 190625862, 191813548, 192956979, 194115619, 195294850, 196483231, 197690095, 198856731, 199898178, 200913674, 202135668, 203556692, 204860699, 205894150, 206938795, 208271633, 209698371, 210849687, 211763904, 212797275, 214045756, 215261104, 216353216, 217572295, 219056895, 220534452, 221690751, 222611411, 223618679, 224813541, 226021509, 227128209, 228242465, 229509197, 230922220, 232366706, 233742195, 235011108, 236216412, 237487403, 238941004, 240516237, 241971648]
17725B41971648J163412J005126J189806J560086J737726J547240J227381J161541
17717B52563966J422403J679911J611631J313505J163866J305720J468403J393716
17709B63923121J227170J256461J403501J321684R92791Q33118J055254J301291
17701B73314391J199408R58347R87751J167809J045990O69363N86261R11718J036573
17692B81877611N88305J08137K56023P64514Q39257L83811J05608L81201P02401
17683B86006868N01821j4612k51357p9044J33374J49233Q6398M7200p5449l16817
17673B86187615m62742l48536j60200k06383m57283n60741l67381j95915l87795
17664B83040639p71404q74353o23598m69099p02382j013726r90094p62940p75134
$$ y = [241971648, 243135060, 244140186, 245329992, 246890078, 248627804, 250175044, 251402425, 252563966, 253986369, 255666280, 257277911, 258591416, 259755282, 261061002, 262529405, 263923121, 265150291, 266406752, 267810253, 269131937, 270124728, 270957846, 272013100, 273314391, 274513799, 275472146, 276459897, 277627706, 278673696, 279343059, 279929320, 280841038, 281877611, 282465916, 282574053, 282830076, 283594590, 284433847, 284817658, 284923266, 285304467, 286006868, 286508689, 286494077, 286242720, 286163676, 286297050, 286446283, 286532681, 286579881, 286504432, 286187615, 285724873, 285376337, 285216137, 285009754, 284552471, 283991730, 283624349, 283428434, 283040639, 282269235, 281394882, 280771284, 280302185, 279599803, 278586077, 277595983, 276833043, 276057909]
17655B76057909j068561j249920j144843j046607j206259j453166j514347j419153
17647B65955053j365965j410634j510852j695325j951377k086444j952518j723254
17639B52258684j706377j919830k079775k008314j840705j780186j829083j862039
17631B37232375j845782j860166j940316k007804j985840j915107j887677j888063
17623B21901620j797977j596944j453822j516129j683635j731488j615743j493666
17615B09012216j453950j415385j331742j308753j418275j536408j488126j277781
17607A97781796j085327j074223j240402j405516j364920j112817q85597q81019
17599A88731975j000315j021950r48912r56438j052504j073659j001529r68463
$$ y = [276057909, 274989348, 273739428, 272594585, 271547978, 270341719, 268888553, 267374206, 265955053, 264589088, 263178454, 261667602, 259972277, 258020900, 255934456, 253981938, 252258684, 250552307, 248632477, 246552702, 244544388, 242703683, 240923497, 239094414, 237232375, 235386593, 233526427, 231586111, 229578307, 227592467, 225677360, 223789683, 221901620, 220103643, 218506699, 217052877, 215536748, 213853113, 212121625, 210505882, 209012216, 207558266, 206142881, 204811139, 203502386, 202084111, 200547703, 199059577, 197781796, 196696469, 195622246, 194381844, 192976328, 191611408, 190498591, 189612994, 188731975, 187731660, 186709710, 185760798, 184804360, 183751856, 182678197, 181676668, 180708205]
17591A80708205r40810p58678n34254n89794q88822r92171p68975o49780q78292
17582A73706629j034557p41654l68199m56150q26491r04397o66475n73888p28689
17573A67406129q00931p16297p17324p62841n73095k94419l79643p28055p34908
17564A61698616l60697k95352p49893r76297n01686J168k13678p33956o95216
17555A57173009j92730l0858l71655o01709m39512k66495l11086l22741j99565
17546A54436658k11110l97489m01918j37790k2337k73061n19321m18660j63085
17537A51891887m9002p394Q3255M5231k37505m67231l50962p5340J8925m8110
17527A50803754q7204j50261l22869l83002j41758J13853L1631j67354m2038K48249
$$ y = [180708205, 179767395, 179008717, 178474463, 177884669, 176995847, 176003676, 175234701, 174584921, 173706629, 172672072, 171930418, 171562219, 171106069, 170279578, 169375181, 168708706, 168134818, 167406129, 166605198, 165888901, 165171577, 164408736, 163835641, 163541222, 163161579, 162433524, 161698616, 161337919, 161042567, 160292674, 159316377, 158814691, 158815859, 158602181, 157868225, 157173009, 156980279, 156949421, 156577766, 155976057, 155536545, 155270050, 154958964, 154636223, 154436658, 154225548, 153828059, 153426141, 153288351, 153266014, 152992953, 152473632, 152054972, 151891887, 151842885, 151835491, 151918746, 151963977, 151726472, 151259241, 150908279, 150832939, 150851864, 150803754, 150716550, 150566289, 150243420, 149860418, 149718660, 149832513, 149864144, 149696790, 149654752, 149903001]
17517A49903001J61964k42319l09620J04836L19406o3010m62103k49375K45548
17508A49408328L18438J9010p3310Q4652Q051l16648l12294J54843M34822J34132
17498A49860024k20173o1472K73321J43311k85321l06278J51442M12204J30931
17489A50097989k53670l07971j88031j58016j05303Q5728J60496o2626k68823
17480A48999773j44120L6862j45062m86755m52621q4212M1605k36790m21677k13517
17470A46893486Q704j41042m31367m59492l14903l37324m91920m72074k75696
17461A43978372k10833l65533m89145m37209l70495m22071m81209m44241m18622
17452A40339014n04006n76395m96174l86651m68228o77730p06031m59903k60111
$$ y = [149903001, 150064965, 149822646, 149513026, 149617862, 149937268, 149874258, 149412155, 149162780, 149408328, 149726766, 149745776, 149672466, 149757118, 149765169, 149448521, 149136227, 149291070, 149725892, 149860024, 149639851, 149578379, 149851700, 149995011, 149709690, 149403412, 149554854, 149967058, 150097989, 149844319, 149536348, 149348317, 149190301, 149084998, 149170726, 149331222, 149268596, 148999773, 148855653, 148892515, 148747453, 148260698, 147808077, 147723865, 147765470, 147528680, 147107003, 146893486, 146902190, 146761148, 146329781, 145870289, 145555386, 145218062, 144726142, 144254068, 143978372, 143767539, 143402006, 142912861, 142475652, 142105157, 141683086, 141201877, 140757636, 140339014, 139835008, 139258613, 138762439, 138375788, 137907560, 137229830, 136523799, 136063896, 135803785]
17443A35803785m22611p85956q90899o05989l12022l62352o04570o65898n35667
17434A30617821n27182p12541p84520n85324m14261n72061q67408q93653o40423
17425A24620448m82550o02057p59613p12936n78251o05827p74689q28139o64925
17416A18611461m98033n58101p66468q45582p19054o16125p04926q13287p06490
17407A12383395m98257m94988o89511p58936o06317n28338o98633q53783p41012
17398A06513620n52542n88768p51376p46786n99232n61013o45331o56385n99806
17389A00812381o52618p70279p35769n86440n75255o94566o72386m90258m47064
17380I5187746o06238o53522m75437m03767o30136q23892o66421l79002l31842
$$ y = [135803785, 135381174, 134595218, 133704319, 133098330, 132786308, 132423956, 131819386, 131153488, 130617821, 130090639, 129378098, 128593578, 128008254, 127593993, 127021932, 126154524, 125260871, 124620448, 124137898, 123535841, 122776228, 122063292, 121485041, 120879214, 120104525, 119276386, 118611461, 118113428, 117555327, 116788859, 115943277, 115224223, 114608098, 113903172, 113089885, 112383395, 111885138, 111390150, 110700639, 109941703, 109335386, 108807048, 108108415, 107254632, 106513620, 105961078, 105372310, 104620934, 103874148, 103274916, 102713903, 102068572, 101412187, 100812381, 100159763, 99389484, 98653715, 98067275, 97492020, 96797454, 96125068, 95634810, 95187746, 94581508, 93927986, 93452549, 93048782, 92418646, 91594754, 90928333, 90549331, 90217489]
17371I0217489m49835m34489l27363l94437o02829o58178m98010l56877l60301
17362H6135170l90006l52368k93908k49080k13629k44165l66313m45923l75200
17353H3204578k93394l71102m87084m16550k36602k03376l05632l19794k62599
17344H0308445l65989n85740n84111l03968j26713k79980m81759m14928k18350
17335G6946907k12475l89339m84319l95908k59151j95596k07735k59832l08706
17326G4233846l12560l00241l40364l92270l36726k02457j64307k47711k66253
17317G1670957j49108p5482j55525k48103k52916k93076m11711m00449j86062
17308F9498525o9059k50245m24729k51809L8589p653l12209l95752j67519j9853
$$ y = [90217489, 89767654, 89333165, 89005802, 88611365, 88008536, 87350358, 86852348, 86495471, 86135170, 85745164, 85392796, 85098888, 84849808, 84636179, 84392014, 84025701, 83579778, 83204578, 82911184, 82540082, 82052998, 81636448, 81399846, 81196470, 80890838, 80571044, 80308445, 79942456, 79356716, 78772605, 78468637, 78341924, 78061944, 77580185, 77165257, 76946907, 76734432, 76345093, 75860774, 75464866, 75205715, 75010119, 74802384, 74542552, 74233846, 73921286, 73621045, 73280681, 72888411, 72551685, 72349228, 72184921, 71937210, 71670957, 71521849, 71446367, 71290842, 71042739, 70789823, 70496747, 70085036, 69684587, 69498525, 69429466, 69179221, 68754492, 68502683, 68541272, 68533619, 68221410, 67825658, 67658139, 67638286]
17298F7638286j33543k45863k01154j99669l26987l27371q7431Q3177o3245l10278
17288F5825922l53901k59318k34250k35615j35880m1709j04764k07988j71455
17279F4081042r7333j73544k92558k28892p5807j18820l34156l95800j84989N1859
17269F2231002Q5446n8270k64756m41529m46459k14557J9921m2670k79054k66763
17259F0322311K9956J42482j46766l94210j83367J70516Q2427l86036o15778l52772
17249E8668763o879L5380q6252q0676M824m6765k12490k84454k06355j07050o9901
17238E7608145p6099j28460k37741l07054k13867k0221O0670n5174k13789k44664
17228E6171746j63484q2164l2940P134o521j44338l46158m27689k89587n2419
$$ y = [67638286, 67504743, 67258880, 67057726, 66858057, 66531070, 66203699, 66116268, 66199445, 66136200, 65825922, 65472021, 65212703, 64978453, 64742838, 64606958, 64565249, 64460485, 64252497, 64081042, 63983709, 63810165, 63517607, 63288715, 63212908, 63094088, 62759932, 62364132, 62179143, 62231002, 62316448, 62258178, 61993422, 61551893, 61105434, 60890877, 60910798, 60868128, 60589074, 60322311, 60352267, 60494749, 60347983, 59953773, 59770406, 59940922, 60023349, 59637313, 59021535, 58668763, 58661884, 58697264, 58611012, 58530336, 58535160, 58488395, 58275905, 57991451, 57785096, 57678046, 57608145, 57532046, 57403586, 57165845, 56858791, 56644924, 56624703, 56685373, 56630199, 56416410, 56171746, 56008262, 55926098, 55893158, 55900292, 55893771, 55749433, 55403275, 54975586, 54685999, 54633580]
17218E4633580O8278j1107j78243k63253k01247o7176J0956l5628j63255k56828
17208E3536077k37105j41503q6217j30020j91340j41966J1265R7433j2643k12896
17198E2491085k71079j38019l0352j31536l16551l19690j25918j384r8067k27007
17188E0831482j56211K0833K0356j98491l68811l06560j52027j26670k17406k46361
17178D9100134j51848m8594n3305j71736l28796m10971l22224j09664J2080j00919
17168D7414157k92265k81080o2814O6432o2108k54351k74565j99927k37756l32289
17158D5483434k48203j3591M1361k12521m41045k96747N7691J52301j39061m44607
17148D3939012m31375k24909j44202k21989k27041q0139J3131j09014l06717l32927
$$ y = [54633580, 54701858, 54690751, 54512508, 54249255, 54048008, 53980832, 53991788, 53956160, 53792905, 53536077, 53298972, 53157469, 53071252, 52941232, 52749892, 52607926, 52619191, 52716624, 52703981, 52491085, 52220006, 52081987, 52051635, 51920099, 51603548, 51283858, 51157940, 51156556, 51058489, 50831482, 50675271, 50696104, 50716460, 50517969, 50149158, 49842598, 49690571, 49563901, 49346495, 49100134, 48948286, 48899692, 48846387, 48674651, 48345855, 47934884, 47612660, 47502996, 47515076, 47414157, 47121892, 46840812, 46777998, 46844430, 46782322, 46527971, 46253406, 46053479, 45815723, 45483434, 45235231, 45221640, 45263001, 45050480, 44609435, 44312688, 44370379, 44522680, 44383619, 43939012, 43507637, 43282728, 43138526, 42916537, 42689496, 42609357, 42622488, 42513474, 42206757, 41873830]
17138D1873830j69803l2390q3441k66942m19642m45298l55052k16092j10254j00898
17128C9674018j84468k73270k60010j28414K61k7902k07127l24589j99083M1552
17118C8110968O3052k36487n43589n18753k38649n4074r9062j97236k28787k86633
17108C5770750l94671l72944j55293J1403q2638k59928k28900n9599p0615l11945
17098C3845620m87865m04493j94838m4478L0380M4415n5435k21777k65547j32710
17088C2113272l1342j30128l05781l53077k80332k14544j63062p3864j1204n7063
17078C0492875j32157j27460j25503k55295l93785k85219L9584K28144O2622k56016
17068B9247790l78128k14622J2581L6182j90483m30159l82067n0246J85723K6091
$$ y = [41873830, 41704027, 41671637, 41588196, 41321254, 40901612, 40456314, 40101262, 39885170, 39774916, 39674018, 39489550, 39216280, 38956270, 38827856, 38828117, 38800215, 38593088, 38268499, 38069416, 38110968, 38174020, 37937533, 37393944, 36875191, 36636542, 36582468, 36483406, 36286170, 36057383, 35770750, 35376079, 35003135, 34847842, 34859245, 34776607, 34516679, 34287779, 34228180, 34157565, 33845620, 33357755, 32953262, 32758424, 32713946, 32744326, 32788741, 32733306, 32511529, 32245982, 32113272, 32081930, 31951802, 31646021, 31292944, 31012612, 30798068, 30635006, 30561142, 30549938, 30492875, 30360718, 30233258, 30107755, 29852460, 29458675, 29173456, 29213040, 29441184, 29503806, 29247790, 28869662, 28655040, 28667621, 28703803, 28513320, 28083161, 27701094, 27650848, 27836571, 27862662]
17058B7862662l13010l68799r2035Q9522q0072l28160l15388j31259n8367r2564
17048B6172530l8789O7212Q401j83046k09524J3030J76105K5155k59188l30643
17038B5441243j70943p5226j95081l32520k55572m2460M3315n7346j30402m0998
17028B4184010M3135p0056k39166j57786J53115L04258P7382k46931k80138n7050
17018B3710773O1118q5048k75896k61862p7713N8784L0780p6511j10843m2386
17008B2931196j696r8162k33944k19138p6885m5852k01651k95301j33827Q7819
16998B1712559P8267r5890j47656m7898k6973j42737j94942r3163J3503K7782
16988B1082852K2502R090j00565k26006j45071R8342J57687q7505l11722k51343
$$ y = [27862662, 27549652, 27180853, 27088818, 27178340, 27098268, 26770108, 26454720, 26323461, 26265094, 26172530, 26133741, 26200953, 26209354, 26026308, 25816784, 25829814, 26005919, 26031074, 25771886, 25441243, 25270300, 25195074, 24999993, 24667473, 24411901, 24369441, 24412756, 24355410, 24225008, 24184010, 24227145, 24157089, 23917923, 23760137, 23913252, 24217510, 24294892, 24047961, 23767823, 23710773, 23771891, 23686843, 23410947, 23149085, 23071372, 23130156, 23160936, 23084425, 22973582, 22931196, 22929500, 22831338, 22597394, 22378256, 22301371, 22255519, 22053868, 21758567, 21624740, 21712559, 21790826, 21694936, 21547280, 21499382, 21472409, 21329672, 21134730, 21041567, 21055070, 21082852, 21105354, 21114444, 21013879, 20787873, 20642802, 20741144, 20898831, 20811326, 20499604, 20248261]
16978B0248261q1393l3550L107J65107K32080j3872l06887k55491r77l118k69659
16967A9683608l46565q1882J43117N8676j09058q6134M0159Q6044Q1324P5131
16957A9544420m2449k71292l51312j51538O2046K9335r5044m8821P2574K8699
16947A8776618r2798l8408J07674L3963k28799l00190n6152J75247J32591l6368
16937A8473378r9434p5020o2556k9709L2348j727j42777j71604R513J52092M0462
16926A8124966j41398j24456j5193p0311j89299q2053J50156J12296j80773k36739
16916A7347196J11582L58378R8038l02888k62470J07084J96543j39542l91980
16907A7121941k02819J52383K60203J32787K2800j5392p9389j29203m9569Q4152
$$ y = [20248261, 20166868, 20133318, 20136425, 20301532, 20533612, 20519740, 20212853, 19957362, 19956385, 19953267, 19683608, 19337043, 19255161, 19398278, 19456954, 19347896, 19261762, 19301921, 19387965, 19469289, 19544420, 19501971, 19230679, 18879367, 18727829, 18789875, 18819210, 18724166, 18675345, 18747919, 18776618, 18683820, 18645412, 18753086, 18787049, 18558250, 18258060, 18201908, 18377155, 18509746, 18473378, 18373944, 18298924, 18236368, 18206659, 18239007, 18237280, 18094503, 17922899, 17932412, 18084504, 18124966, 17983568, 17859112, 17843919, 17773608, 17584309, 17502256, 17652412, 17764708, 17583935, 17347196, 17458778, 17817156, 17915194, 17612306, 17349836, 17456920, 17653463, 17513921, 17121941, 16919122, 17071505, 17331708, 17464495, 17487295, 17471903, 17392514, 17263311, 17213742, 17297894]
16897A7297894O6224j23392k63895j83880L0737J64171J27353L4955L1389P2926
16887A7254482k7074k74209l54635l4237L88063L58337j58550n53309l86178L7919
16877A6250609J85907N0794j3162M4380k5576k11367k10990J2741J31373Q508
16867A6223217q7748R369O8936r5365k58999j57376P0976J26475O708q6376j09718
16856A5710099j38055j12871M5713J82451Q2042j57179k25541n7363R3703M5746
16846A5468745r2500j33027l9893R3022J49551O6171q4930j28567j9469N2229
16836A5331332n7859j94033j43581N056L2194p206R2253K28328R0161k57217l49294
16825A4770134l0963K43672P0252l12961m10791j69158O8110J08516N6809K1257
$$ y = [17297894, 17364118, 17240726, 16976831, 16792951, 16823688, 16987859, 17115212, 17150167, 17181556, 17254482, 17227408, 16953199, 16598564, 16564327, 16952390, 17310727, 17152177, 16598868, 16212690, 16250609, 16436516, 16487310, 16474148, 16518528, 16492952, 16281585, 16070595, 16083336, 16214709, 16223217, 16135469, 16144838, 16213774, 16118409, 15859410, 15702034, 15773010, 15899485, 15906193, 15819817, 15710099, 15572044, 15459173, 15504886, 15687337, 15769379, 15612200, 15386659, 15329296, 15422999, 15468745, 15376245, 15243218, 15203325, 15296347, 15445898, 15512069, 15427139, 15298572, 15279103, 15331332, 15273473, 15079440, 14935859, 14940915, 14973109, 14965903, 15058156, 15286484, 15376645, 15119428, 14770134, 14739171, 14982843, 15053095, 14740134, 14329343, 14160185, 14228295, 14336811, 14393620, 14414877]
16815A4414877P480N2166J69360J98999j1562k96478l29963j08675K3920r5201
16805A4024923k01784m7693J73125J12871j63224k28818O6188L17243J08655l59136
16795A3802350m82037o7031L84493L49569l4227k42013j35497o4175k16909l14326
16785A2980197j11587J65810J76080p370n4649Q1771J32655l2285k23157k29976
16775A2877489o8807J11209J88111J11974o0999j78531j64274j34839k00247k36999
16765A2244087p5298J61309J81308k2298j40717j9491J29015Q6330o2978j30980
16755A2350287j13060j00522p9008N453R8781J13231O2512J0439k3474k5449K6009
16744A2325199N9684n0467k52912k98440q2828J64219J93663P2503J2332K2321
$$ y = [14414877, 14422357, 14474523, 14643883, 14842882, 14831320, 14534842, 14204879, 14096204, 14120124, 14024923, 13823139, 13775446, 13948571, 14061442, 13898218, 13669400, 13735588, 14052831, 14161486, 13802350, 13320313, 13253282, 13637775, 13987344, 13953117, 13711104, 13575607, 13511432, 13294523, 12980197, 12868610, 13034420, 13210500, 13203130, 13148481, 13230252, 13362907, 13330622, 13107465, 12877489, 12808682, 12919891, 13108002, 13219976, 13158977, 12980446, 12816172, 12681333, 12481086, 12244087, 12168789, 12330098, 12511406, 12489108, 12348391, 12328900, 12457915, 12544245, 12481267, 12350287, 12237227, 12136705, 12057697, 12063150, 12161931, 12275162, 12337674, 12348113, 12324639, 12299190, 12325199, 12384883, 12334416, 12081504, 11783064, 11700236, 11864455, 12058118, 12130621, 12142953, 12165274]
16734A2165274k6585j09515q8575J4084M5179k517N294O5234K4025j15740j42382
16723A1833776J6001J34582L8782r7519j6210J96627K06763o9046l14980k52983
16713A1675793k4128M4065p2065q9587R4979K08710M3951j59605o6359J85961
16703A1841715J59857j77204l61950j47882J29814J18482l5100n0759k2966j40972
16693A1313035k11647K4241L16683K21213j31513j94784R0983K05070n2902k33909
16683A1346470l5762K02118J38305q237L8881O1265j88826m00235j68104K66816
16673A1252691L52257Q1305q4613K035O7908M262k8126l6635j67116k62241l9228
16662A1142499K94215K35893j53176k72565J6084J54887j01818k23619J37933
$$ y = [12165274, 12138689, 12029174, 11940599, 11954683, 11999862, 11997345, 12002639, 12067873, 12091898, 11976158, 11833776, 11849777, 11984359, 12023141, 11925622, 11909412, 12106039, 12312802, 12243756, 11928776, 11675793, 11651665, 11695730, 11623665, 11534078, 11629057, 11837767, 11881718, 11722113, 11655754, 11841715, 12001572, 11824368, 11462418, 11314536, 11444350, 11562832, 11527732, 11476973, 11454007, 11313035, 11101388, 11125629, 11442312, 11663525, 11532012, 11337228, 11428211, 11633281, 11580379, 11346470, 11310708, 11512826, 11651131, 11642894, 11681775, 11743040, 11554214, 11153979, 10985875, 11252691, 11604948, 11686253, 11601640, 11603675, 11671583, 11675845, 11647719, 11611084, 11443968, 11181727, 11142499, 11436714, 11672607, 11519431, 11246866, 11262950, 11417837, 11316019, 11092400, 11230333]
16653A1230333M63634K14364k60554l33306r7567k3519m7153J75323M18386J81565
16643A1921506l28972m11028k3682J59313p7508j77879J16138K88209K0700k00073
16633A1286724K1721K41067k7535l88213k12579K57926K98642r8595k70589j2578
16623A1095991J74645K0938j04712O9213K32006O4506k10542k17991r676R8811
16613A1213189K7051m5807m280R6831J55382J03230m2017j36842o0508O8445K6674
16602A1401348j35821j24021J18772K67605J10949j14341j08453L5749M3120p8009
16592A1416898r0785O2439J92699J57809N126j37002j46116L4777K64958K51814
16582A2012617p7185l73439k76303P8146K32530L8230j85154j35434J04003K60555
$$ y = [11230333, 11693967, 11908331, 11647777, 11314471, 11216904, 11193385, 11146232, 11321555, 11739941, 11921506, 11592534, 11181506, 11157824, 11317137, 11239629, 11061750, 11177888, 11466097, 11486797, 11286724, 11308445, 11549512, 11521977, 11133764, 10921185, 11179111, 11477753, 11379158, 11108569, 11095991, 11270636, 11291574, 11186862, 11256075, 11488081, 11552587, 11342045, 11124054, 11114378, 11213189, 11240240, 11194433, 11190153, 11286984, 11442366, 11545596, 11503579, 11366737, 11306229, 11374674, 11401348, 11265527, 11141506, 11260278, 11527883, 11638832, 11524491, 11416038, 11451787, 11494907, 11416898, 11326113, 11388552, 11581251, 11739060, 11744186, 11607184, 11461068, 11495845, 11760803, 12012617, 11935432, 11561993, 11285690, 11363836, 11596366, 11634596, 11449442, 11314008, 11418011, 11678566]
16572A1678566K15470M2084j38394k24431j55529L3036K05534K18470K8822k45337
16562A1658291l62974j66290J93114L61734K03080m1856j17462p1948m2831L4540
16552A1647398K24767L11249Q5493k27669k45883l6053J0308j35783j00402J88659
16542A1722084L09955M9126k25896j72815O891O983m7387P4505K03212P7177j12957
16531A1890878j4838K31263J81833j47955k74429l0380J74744K3689k45064k70844
16521A1518897r8074M681j4410j7274K4254K2830j1400K7594J44740K05221J11920
16510A1918979o5261j64996j14116j0895J384o0703l4753J24436K29924J27768
16500A1951767n4810j00391k7965j1973o1147l0879Q7248J48599J14710P5398
$$ y = [11678566, 11894036, 11936120, 11797726, 11573295, 11417766, 11450802, 11656336, 11874806, 11903628, 11658291, 11295317, 11129027, 11322141, 11683875, 11886955, 11845099, 11727637, 11655689, 11612858, 11647398, 11872165, 12183414, 12268907, 12041238, 11795355, 11759302, 11769610, 11633827, 11533425, 11722084, 12032039, 12081165, 11855269, 11682454, 11689345, 11696328, 11648941, 11723446, 11926658, 12003835, 11890878, 11876040, 12107303, 12289136, 12141181, 11866752, 11836372, 12011116, 12034805, 11789741, 11518897, 11420823, 11425504, 11411094, 11393820, 11418074, 11440904, 11429504, 11457098, 11601838, 11807059, 11918979, 11853718, 11688722, 11574606, 11563711, 11565095, 11504392, 11469639, 11594075, 11823999, 11951767, 11896957, 11796566, 11768601, 11756628, 11695481, 11664602, 11751850, 11900449, 12015159, 12090557]
16490A2090557K3815j17726k48703j71697M4363J01351o0027j55755k3816J34193
16480A1616555J12805j3722j18219k08945k29989k6635K88313L14035k8658k58790
16470A1446750m0905K66849J96850p3877r0881P3090K2556j65163p0863K19932
16460A1784338J69021k41700l62181O3232M16148J84421k18666j55020K17569
16451A1857162K67188p8701k88391j03461J43712J31265k3583o7380J4251P9083
16441A1931145N9357m862k8109N5135J78199J52668o2733k11624p1306J76932
16431A2174802J86179l1819j52378p3352k9377j28183j63382k5214O5392n6282
16421A1766386j90259j10917M4376K4487j02077r7679q54n7121k55050k95789
$$ y = [12090557, 12114372, 11996646, 11747943, 11576246, 11620609, 11721960, 11661933, 11506178, 11482362, 11616555, 11729360, 11715638, 11597419, 11388474, 11158485, 11131850, 11420163, 11734198, 11705540, 11446750, 11405845, 11672694, 11869544, 11795667, 11704786, 11777876, 11800432, 11635269, 11564406, 11784338, 11953359, 11711659, 11349478, 11412710, 11828858, 12013279, 11794613, 11639593, 11857162, 12124350, 12045649, 11757258, 11653797, 11797509, 11928774, 11905191, 11837811, 11852062, 11931145, 11990502, 11985640, 11957531, 12012666, 12190865, 12343533, 12280800, 12069176, 11997870, 12174802, 12360981, 12329162, 12176784, 12103432, 12074055, 11945872, 11782490, 11757276, 11822668, 11766386, 11576127, 11465210, 11509586, 11534073, 11431996, 11334317, 11333463, 11276342, 11021292, 10725503]
16411A0725503p2697J39082Q9588j05139j82897j01470j3131r114o0788j28125
16401A0280812j72546j26450N712P5596k2561j45478p8806R3920N4427k40126
16391I724500l92230j33860J74429M55m88479n07175K34341R65288P97440p5608
16381A0299101o55471m87726j15250r2714j96172O868L12516K02501k43199m02701
16371H627753o3115K74311J80207j18207j93805n5451Q131o2308j01958o7912
16361H427646n1984n1106r496l393j14337k02701r3127Q3299M8430j53044j91037
16350G689150Q813J22754n0786k61977k04678K3685J09729m854r8457k6136J17942
16339G425185J63428M4102j53268k37326q7027J56929K05257M464j66353j02031
$$ y = [10725503, 10652806, 10791888, 10881476, 10776337, 10593440, 10491970, 10478839, 10469725, 10408937, 10280812, 10108266, 9981816, 9987528, 10063124, 10040563, 9895085, 9816279, 9910199, 9964626, 9724500, 9332270, 9198410, 9372839, 9373294, 8884815, 8377640, 8611981, 9577269, 10374709, 10299101, 9643630, 9155904, 9040654, 8947940, 8751768, 8758636, 9071152, 9273653, 9030454, 8627753, 8564638, 8838949, 9019156, 8900949, 8707144, 8651693, 8659824, 8597516, 8495558, 8427646, 8375662, 8324556, 8315060, 8311667, 8197330, 7994629, 7901502, 7984801, 8033231, 7880187, 7689150, 7697963, 7820717, 7769931, 7507954, 7303276, 7326961, 7436690, 7431836, 7333379, 7307243, 7425185, 7588613, 7632715, 7479447, 7242121, 7155094, 7312023, 7517280, 7521744, 7355391, 7253360]
16329G253360L2288m080j41301j58774o1554p978M472O8357R4772m3345j89438
16318F846779j09679N1145k9050k21172o4799L93961M93928m2986n85091m91415
16308F241621m0838R5071q7342p1395K03337K66426m571j60059J8564J48610m7263
16297F562161k39569q2051J65659P6798k16609k51362Q704J57216K4295j08353
16287F096889k4718J02811N4547p8581p4411O6294J30448j5870k61669l58744
16277E636996j72211J48348K90511J40380n8293l2437J27469J11230j21426k59560
16267E811007r7726J70657K33046M7064j76224k37502q9596J55183K61623N8441
16257F135973l08132m59638k40409P8130J85298J29806J28774J66569P5177r6684
$$ y = [7253360, 7285648, 7281568, 7140267, 6981493, 6919939, 6911961, 6916433, 6984790, 7079562, 7036217, 6846779, 6737100, 6788245, 6759195, 6538023, 6473224, 6867185, 7361113, 7318127, 6733036, 6241621, 6200783, 6295854, 6208512, 6137117, 6340454, 6606880, 6602309, 6442250, 6460814, 6609424, 6562161, 6322592, 6240541, 6406200, 6482998, 6266389, 6015027, 6023731, 6180947, 6205242, 6096889, 6072171, 6174982, 6229529, 6150948, 6076537, 6142831, 6273279, 6257409, 5995740, 5636996, 5464785, 5613133, 5903644, 6044024, 5985731, 5953294, 6080763, 6191993, 6070567, 5811007, 5713281, 5883938, 6116984, 6164048, 5987824, 5750322, 5660726, 5815909, 6077532, 6135973, 5827841, 5368203, 5127794, 5205924, 5391222, 5521028, 5649802, 5816371, 5891548, 5794864]
16247E794864j21470K3981J19720O7847J743k0322j22775l01730l06969k6884
16237E108005K53033K15835l7936j61052o1519L3158l1253j31866r4523O0760
16227E152642J73542J43343J9491p4201q5603q6882j32610j17653O4287K41576
16217E297932J14292k33756l04210J06269M89670K95058k39532m19740j22077
16208D983906R7971n1539j73375P4768L68558K48242j38147k87682r5866R5280
16198E122116P2527l5633p0458k2509Q0611J84363J43603q9834k82243k00341
16188D902202K243N499j40581r2984J77681K97785J05920p7301N262J25911r734
16177E301903k39459k05964N7413J85732M5029j13776p0482Q4199J49174P8942
$$ y = [5794864, 5673394, 5697375, 5817095, 5884942, 5886685, 5866363, 5743588, 5441858, 5134889, 5108005, 5361038, 5576873, 5538937, 5377885, 5316366, 5349524, 5318271, 5186405, 5091882, 5152642, 5326184, 5469527, 5489018, 5414817, 5329214, 5242332, 5109722, 4992069, 5056356, 5297932, 5412224, 5178468, 4874258, 4980527, 5470197, 5765255, 5525723, 5105983, 4983906, 5081877, 5030338, 4856963, 4931731, 5300289, 5548531, 5410384, 5122702, 5026836, 5122116, 5194643, 5159010, 5088552, 5066043, 5146654, 5331017, 5474620, 5384786, 5102543, 4902202, 4904445, 4909944, 4769363, 4676379, 4854060, 5151845, 5257765, 5180464, 5185726, 5311637, 5301903, 5062444, 4856480, 4913893, 5099625, 5144654, 5030878, 4960396, 5044595, 5193769, 5272711]
16167E272711l7745j19411j30999p3972J157K4295k3278r7997j43896j17834k360
16156D550671J47541K06969J04326p5675j72799j17615K8368J61489K07611J44295
16146E185181K0901o6577p7694p7199j31028j93541j67407m6310P6782J32247
16136D655355J38738J43003J44817R9387j5910j39569j56490l7010P8044K1413
16126D931778j64490k44236q4337J72569K93874K23039P6759m1923j21047j69073
16116D872913j63332p9566N7288J52812J05007n6758j44230l6683J10656N7002
16106D875109j47391k04109j5554J70242J52327M1571q702n7118j57236j56862
16096D492277K2288J44905R410j74751j02323J14447J34623m3378j20924k6597
$$ y = [5272711, 5234966, 5115555, 4984556, 4910584, 4911741, 4936036, 4912758, 4814761, 4670865, 4553031, 4550671, 4698212, 4905181, 5009507, 4933832, 4761033, 4643418, 4671786, 4833275, 5040886, 5185181, 5206082, 5139505, 5061811, 4984612, 4853584, 4660043, 4492636, 4446326, 4523108, 4655355, 4794093, 4937096, 5081913, 5181300, 5165390, 5025821, 4869331, 4832321, 4910365, 4931778, 4767288, 4523052, 4438715, 4611284, 4905158, 5128197, 5204956, 5163033, 5041986, 4872913, 4709581, 4630015, 4687303, 4840115, 4945122, 4888364, 4744134, 4707451, 4818107, 4875109, 4727718, 4523609, 4508055, 4678297, 4830624, 4872195, 4863493, 4806375, 4649139, 4492277, 4514565, 4659470, 4668880, 4494129, 4391806, 4506253, 4640876, 4597498, 4476574, 4449977]
16086D449977K7992j0099K5217J22663P1546j11740j62406m3544n788q3269j0811
16075D269738K12516K00378j36630l06549O214L71823K57999j48951k87246q8567
16065D350725N9793L2741O4443J91820J52398j11853l08218k44678n6961R1830
16055D222040J95088K12873M0771k20006k67543j2003K64133K81236Q4229j08045
16045D692773j68377q8932N7458J08212m1319k27031j73835Q2046J91351R817
16035D442163j64236m1549K19889K62955M2450j63900j60983k3775Q8041J15592
16025D616647Q4376K3560n9717j58897k23316j62503L1658J96008J61961R679
16015D519456j2477J40001K09745J0990k75248l33083j21179J10736J50882K9468
$$ y = [4449977, 4477969, 4467870, 4493087, 4615750, 4687296, 4575556, 4413150, 4369606, 4363818, 4280549, 4269738, 4482254, 4682632, 4546002, 4239453, 4245667, 4617490, 4875489, 4726538, 4439292, 4350725, 4410518, 4443259, 4507702, 4699522, 4851920, 4740067, 4431849, 4187171, 4130210, 4222040, 4417128, 4630001, 4670772, 4450766, 4183223, 4171220, 4435353, 4716589, 4800818, 4692773, 4524396, 4435464, 4492922, 4601134, 4559815, 4332784, 4158949, 4240995, 4432346, 4442163, 4277927, 4236378, 4456267, 4719222, 4761672, 4597772, 4436789, 4413014, 4501055, 4616647, 4701023, 4724583, 4664866, 4505969, 4282653, 4120150, 4151808, 4347816, 4509777, 4519456, 4506979, 4646980, 4856725, 4867715, 4592467, 4259384, 4138205, 4248941, 4399823, 4429291]
16005D429291q4225q4960k1249j5152q8564j07038K7157J79314J34254p0516j60854
15994D137458j4976J66642J63030J3719j09248j32964o7214P2173J91068J36404
15984D556092o7623j73142n8549N9157l4855j82063r2095J70645K57444N7818
15974D492829j49812j13095P7704J74928R2063n9011j28086n0193J08133J86143
15964D631603Q1874j19544k37012j99077p7935N1844J70768K29986J38657r9635
15954D571529l04832k57648N3589L45904K81669j32549m61738l09423J69136M34964
15944D390601K57134l6529r0877N606q534j04429q2081L1368M2568m7934o4960
15933D291933J7675O3718M3132M1172M2492k4568q0683j2538O8059q730j19141
$$ y = [4429291, 4345066, 4260106, 4238857, 4223705, 4135141, 4028103, 4055260, 4234574, 4368828, 4298312, 4137458, 4122482, 4289124, 4452154, 4465873, 4356625, 4223661, 4156447, 4228620, 4419688, 4556092, 4488469, 4315327, 4256778, 4315935, 4281080, 4099017, 4006922, 4177567, 4435011, 4492829, 4343017, 4229922, 4307626, 4482554, 4574617, 4515606, 4387520, 4337327, 4445460, 4631603, 4713477, 4593933, 4356921, 4157844, 4079909, 4131753, 4302521, 4532507, 4671164, 4571529, 4266697, 4009049, 4062638, 4408542, 4690211, 4557662, 4095924, 3786501, 3955637, 4390601, 4647735, 4611206, 4520329, 4525935, 4517401, 4412972, 4330891, 4362259, 4404827, 4356893, 4291933, 4309608, 4373326, 4416458, 4457630, 4500122, 4475554, 4394871, 4382333, 4450392, 4441662, 4322521]
15922D322521k6901J42556M8146k42400k71551N8247K67594N4994k16674j20794
15912D015738J58791J72529p6620k10846r0090Q0632J56016J76783J40799n487
15902D518245j57683j37406Q444N6085m3990j15804o8091n173P288M4858J21208
15891D227981J02335o0482j79943o0880K09837L37123J66365j33345k67168j54059
15881D187764M79q704j19118j24469N689J02674P4937P078l6629r1621j30582
15870C867498n6943O8229M8722j04152j38425P571P6733k6951j8996K25997L27785
15859D277068R678l21340j53885K52297K26698k26146m21778r0591K44329J58442
15849C954772p0575n5583P3538L1196q7734o3401K853p3486j46980O748K33468
$$ y = [4322521, 4295620, 4438176, 4486322, 4243922, 3972371, 4030618, 4298212, 4353206, 4136532, 4015738, 4174529, 4347058, 4270438, 4059592, 3969502, 4050134, 4206150, 4382933, 4523732, 4518245, 4360562, 4223156, 4231600, 4287685, 4243695, 4127891, 4059800, 4054627, 4061915, 4106773, 4227981, 4330316, 4269834, 4089891, 4029011, 4238848, 4575971, 4742336, 4608991, 4341823, 4187764, 4188243, 4179539, 4060421, 3935952, 3941641, 4044315, 4119252, 4126330, 4089701, 3998080, 3867498, 3810555, 3878784, 3927506, 3823354, 3684929, 3692500, 3769233, 3742282, 3723286, 3949283, 4277068, 4286746, 3965406, 3811521, 4063818, 4290516, 4064370, 3642592, 3552001, 3796330, 3954772, 3884197, 3828614, 3902152, 3933348, 3845614, 3782213, 3785066, 3711580, 3564600, 3571348, 3804816]
15838C804816K16332P005o9435M3034Q2744n0039j35601k1852J33388J26453M574
15827D141419l7696N3676J27798L7386j47470j93610j3033J67521R2249j29891
15817D098349j56721O2769J99205O0165j32343j45522q9564j31613j62873m7117
15807C554735P0808L4910M155J48098K66603J28536n2311K8242J51912q3506m55455
15796C796727l50455J91852M25640O2698k63779m5041K96104J66507k11962k40614
15786C827677M1514J14666p6403q6138J66476K17944j18182l73948j44332K96214
15776C865488M28801K01844l8280j02529j02941j46930j77896j13525L6238J90746
15766D041016K43203J29392o8268j56707n7920P6672O5013o9772j58038j12281
$$ y = [3804816, 4021148, 4028153, 3958718, 4001752, 4084496, 4034457, 3898856, 3877004, 4010392, 4136845, 4141419, 4103723, 4157399, 4285197, 4322583, 4175113, 3981503, 3968470, 4135991, 4228240, 4098349, 3941628, 4004397, 4203602, 4263767, 4131424, 3985902, 3896338, 3764725, 3601852, 3554735, 3625543, 3660453, 3664608, 3812706, 4079309, 4207845, 4155534, 4183776, 4335688, 4252182, 3796727, 3446272, 3638124, 4063764, 4126462, 3862683, 3817642, 4113746, 4280253, 4068291, 3827677, 3869191, 3983857, 3907454, 3821316, 3987792, 4205736, 4087554, 3713606, 3569274, 3865488, 4294289, 4496133, 4457853, 4355324, 4252383, 4105453, 3927557, 3814032, 3850270, 4041016, 4284219, 4413611, 4345343, 4188636, 4130716, 4207388, 4272401, 4202629, 4044591, 3932310]
15756C932310r53O1240K3163o4308q4248J0363R6116L6244o6136K1112K47335
15745D212238K57777o2537l22790j74582J46233J99899L8805L7620J67410L6240
15735D536313l28127l80974N3225M05778K19720j58773j94097R462M3808l4548
15725D171787P5945K21459L7489k71526j70030K37251K85205j17072k83912O5853
15715D252449K86696p9688m62905j95042L57023L91328l7548j92985J09888L07655
15705D736871R1202j78122j64528j5362M4975L9137o249j52666k64551r3026K34958
15694D272639K88788K5542j03637Q6566J98919l5430k73706j63882N8383L1684
15684D385866q6740L8394K55196J69021j48165k56669o0556J06368P5933K8598
$$ y = [3932310, 3931357, 3992597, 4015760, 3951452, 3867204, 3877567, 3973683, 4009927, 3943791, 3964903, 4212238, 4470015, 4407478, 4084688, 3910106, 4056339, 4256238, 4295043, 4332663, 4500073, 4536313, 4208186, 3827212, 3880437, 4286215, 4505935, 4347162, 4153065, 4162527, 4206335, 4171787, 4247732, 4469191, 4506680, 4235154, 4065124, 4302375, 4587580, 4470508, 4186596, 4252449, 4539145, 4459457, 3996552, 3801510, 4158533, 4549861, 4512313, 4319328, 4429216, 4736871, 4828073, 4649951, 4485423, 4470061, 4515036, 4554173, 4547924, 4395258, 4130707, 4037681, 4272639, 4561427, 4586969, 4483332, 4569898, 4768817, 4733387, 4459681, 4295799, 4354182, 4385866, 4299126, 4337520, 4592716, 4761737, 4613572, 4356903, 4296347, 4402715, 4478648, 4507246]
15674D507246M9642k2125j91647j78681J21347L81721K74816p2746k73380j80261
15664D415932n53K6572q5284j23161L4846K26859J85483p6901k23877n0999J95994
15653D524911J74916l5551q0090Q9278J40938q0358k80496j61872J28513K22969
15643D643158M4669j36469j02613N3477J03801J608p3984R926J21306M0558j74367
15632D531070k10835L1164K30961R9312j72430k00198R769J17104R854p5718q000
15621D362053N2191J832k2893N1020P5191j4278m1448O7639Q8482j15622k84818
15610D219349j36489J67736K54828Q8628n1342m6820n0948j35657j53856k2252
15600D133177J13988J06149J1786k4946K3827P9285Q2132L3062l7783q6105p3826
$$ y = [4507246, 4556888, 4534763, 4343116, 4164435, 4285782, 4667503, 4942319, 4869573, 4596193, 4415932, 4415379, 4441951, 4356667, 4233506, 4268352, 4495211, 4680694, 4603793, 4379916, 4328917, 4524911, 4699827, 4664276, 4584186, 4673464, 4814402, 4734044, 4453548, 4291676, 4420189, 4643158, 4687827, 4551358, 4448745, 4502222, 4606023, 4607631, 4533647, 4543573, 4664879, 4705437, 4531070, 4320235, 4351399, 4582360, 4681672, 4509242, 4309044, 4318813, 4435917, 4445771, 4370053, 4362053, 4414244, 4416076, 4393183, 4444203, 4519394, 4505116, 4463668, 4531307, 4619789, 4504167, 4219349, 4082860, 4250596, 4505424, 4594052, 4542710, 4495890, 4444942, 4309285, 4155429, 4133177, 4247165, 4353314, 4365100, 4340154, 4363981, 4443266, 4525398, 4558460, 4520677, 4434572, 4360746]
15589D360746j4311K2726j5960q5027n6844J29602L23440K59379j05457m37218
15579D381076l75694N18K66304K07295L4965j4543j0286r3890j75794j09320J6018
15568D126649K6490j7857N9230J93518J41003j10766k72228j52974R1082K01300
15558D285447J35327L7467O310M913l2896q1045m2407R0201J47574j7313k52856
15547D280722k32955P0059K75448J20594j44071j42281N8468J08308l8994j06344
15537D248954p946L9310m4863o5390M0894N1114j20721k10336m2128J42291P5714
15526D106893q9749n8187J02961R8652q2293j69073p1794K0911K0751O6702J91060
15515D136834J82297o1711l08750l19292j83871j04837l0563J87638L91097K52167
$$ y = [4360746, 4346435, 4369161, 4353201, 4268174, 4211330, 4340932, 4664372, 4923751, 4818294, 4381076, 4005382, 4005900, 4272204, 4479499, 4514464, 4499921, 4489635, 4395745, 4219951, 4110631, 4126649, 4153139, 4135282, 4194512, 4388030, 4529033, 4418267, 4146039, 3993065, 4084147, 4285447, 4420774, 4458241, 4464551, 4469464, 4436568, 4355523, 4313116, 4403317, 4550891, 4533578, 4280722, 4047767, 4117826, 4393274, 4513868, 4369797, 4227516, 4285984, 4394292, 4355298, 4248954, 4241008, 4280318, 4235455, 4170065, 4210959, 4262073, 4141352, 3931016, 3888888, 4031179, 4106893, 4017144, 3958957, 4061918, 4160570, 4078277, 3909204, 3837410, 3858321, 3879072, 3945774, 4136834, 4319131, 4257420, 3948670, 3629378, 3445507, 3340670, 3310107, 3497745, 3888842, 4141009]
15505D141009j56844l28903l1755K98164J75351j97213k40594R4471K52718n4490
15495C951914m16690l69792l5316J93392K42481K56590J92882m4996k54009j60862
15485C555594J06781K01758J12160R0538J16931n0813l05326k35149J60227L56835
15475D109536R5868k34066k48535r8406m4106J4098J93096K51666R943k24535
15465C824559j29093O4731j0466j73687k4238K75656K17178j58962k73726N0982
15455C662934L24719K02025m1992p6614j4851n1407o6158O4681J40465j6165j90391
15444C937246j21145M0684J788j49496r6780J45387K30958J8883k39369k82342
15434C485814j25436P8730K19027K13605M8287j07928m2813J64611J75593j16508
$$ y = [4141009, 3984165, 3655262, 3623507, 3921671, 4097022, 3899809, 3659215, 3753686, 4006404, 3951914, 3535224, 3165432, 3130116, 3323508, 3565989, 3822579, 4015461, 3970465, 3716456, 3555594, 3662375, 3864133, 3976293, 4066831, 4183762, 4132949, 3827623, 3592474, 3752701, 4109536, 4205404, 3971338, 3722803, 3624397, 3580291, 3594389, 3787485, 4039151, 4049094, 3824559, 3695466, 3760197, 3749731, 3576044, 3551806, 3827462, 4044640, 3885678, 3611952, 3662934, 3987653, 4189678, 4147686, 4071072, 4056221, 4004814, 3938656, 4003337, 4143802, 4127637, 3937246, 3816101, 3856785, 3858573, 3709077, 3612297, 3757684, 3988642, 4007525, 3768156, 3485814, 3360378, 3439108, 3658135, 3871740, 3920027, 3812099, 3769286, 3933897, 4109490, 3992982]
15424C992982l54372j92955J66102K20314j10552l50378j45977K32791L00764
15415C758719M5346j15493K4963K12831J71101k7395j61236j84502j66611r7072
15405C460651M7661J72012J80487J27006R0505K1047j24962k22370j41470K8674
15395C639241J08570Q3686N3013L0809j2593k1679M4282R5040O2609K1422k949
15384D101451j18595k67637j59015K07715L29365n8347m17162j77951K81405J96583
15374C917812l02332l94095M4641K80895M7767o1748J86034J67540l59724o02595
15364B924195n8517M88182K27856k81147r1546M69119L98101k00895l33383J05413
15354C647378K02283k67785m19975J28135N31453J72495k98147j28932K61888
$$ y = [3992982, 3638610, 3445655, 3611757, 3832071, 3721519, 3371141, 3225164, 3457955, 3758719, 3804065, 3688572, 3713535, 3926366, 4097467, 4070072, 3908836, 3724334, 3557723, 3460651, 3508312, 3680324, 3860811, 3987817, 4078322, 4099369, 3974407, 3752037, 3610567, 3639241, 3747811, 3831497, 3884510, 3915319, 3902726, 3881047, 3925329, 4020369, 4082978, 4104400, 4101451, 3982856, 3715219, 3556204, 3763919, 4093284, 4034937, 3617775, 3439824, 3721229, 3917812, 3615480, 3221385, 3266026, 3546921, 3594688, 3532940, 3718974, 3886514, 3526790, 2924195, 2865678, 3353860, 3581716, 3300569, 3209023, 3678142, 4076243, 3875348, 3541965, 3647378, 3849661, 3581876, 3161901, 3290036, 3821489, 3993984, 3695837, 3566905, 3828793]
15345C828793P9828m60164n06130N0747M68697L06836n3298q9394J77890L18572
15335D122377N5333l85714m62079K6088N35883M00305j86011l69966O1008L08684
15325D105908j49254o48684l48982M42557P51966L55028j21148k85288l27182
15316C774921l41924j19408K86731M55252K35400l7404r2558k1229N8071J57494
15306D355346J74500k8517k33512o4408L45615M33159P2369k20675j36761o881
15296D690235r7466j03926K08233M16092P7232m49396m62773L7016L93405K76902
15286D985554K8107o747N0855l7835j97917j88484K5975K31172K13995j1264j97834
15275D895577j21304J27742K24049M7139j45080j11114L1133O6423N5242J44337
$$ y = [3828793, 3908621, 3448457, 2942327, 2993074, 3461771, 3768607, 3715309, 3625915, 3803805, 4122377, 4177710, 3791996, 3329917, 3356005, 3891888, 4292193, 4106182, 3736216, 3797224, 4105908, 3956654, 3307970, 2958988, 3401545, 4153511, 4508539, 4387391, 4102103, 3774921, 3432997, 3313589, 3600320, 4055572, 4290972, 4253568, 4161010, 4139781, 4197852, 4355346, 4529846, 4501329, 4267817, 4203409, 4549024, 4982183, 5054552, 4833877, 4697116, 4690235, 4592769, 4488843, 4697076, 5113168, 5190400, 4741004, 4278231, 4315247, 4708652, 4985554, 5013661, 5006914, 5057769, 5019934, 4822017, 4633533, 4659508, 4890680, 5104675, 5093411, 4895577, 4774273, 4902015, 5126064, 5173203, 5028123, 4917009, 4948142, 5014565, 5069807, 5214144]
15265E214144K02011K3305k24920j88993Q3147J78562j8368j43554M0457K74153
15255E439944K49423O7163k5455n6694j65783k36764n9251K52458L44567J15765
15245E925373j54173j94691l7799J21084J61405P2232r4296k22291j92855k1610
15235E362379J30475J33073K1887p2264q0494n0684p0602j51004j89764r1841
15225D941161O8211R6727m7955j52106m1508J27260O9760j88912l29484k10239
15215D332915n6388p7864j54919q7167N7213Q6210K9602O2078J62395J38144k8418
15204D463801j39176j07890n9815n4737Q975J21057Q0292j52931k94521j40630
15194C724425J00568J30150K251m3152p431m9326j10082j4956J22285K3706k24672
$$ y = [5214144, 5416155, 5439460, 5214540, 5025547, 5108694, 5287256, 5268888, 5125334, 5165791, 5439944, 5689367, 5756530, 5731075, 5674381, 5508598, 5271834, 5212583, 5465041, 5809608, 5925373, 5771200, 5576509, 5538710, 5659794, 5821199, 5893431, 5799135, 5576844, 5383989, 5362379, 5492854, 5625927, 5647814, 5575550, 5495056, 5444372, 5373770, 5222766, 5033002, 4941161, 5009372, 5106099, 5058144, 4906038, 4864530, 4991790, 5061550, 4872638, 4543154, 4332915, 4276527, 4198663, 4043744, 3956577, 4013790, 4100000, 4129602, 4191680, 4354075, 4492219, 4463801, 4324625, 4216735, 4156920, 4102183, 4111158, 4232215, 4312507, 4159576, 3865055, 3724425, 3824993, 3955143, 3957394, 3914242, 3906811, 3857485, 3747403, 3732447, 3854732, 3878438, 3653766]
15183C653766k25361O6836K12609R913j34121J17372M10948K36934k22529l50315
15173C776052n6743J20928q9215k93142j29724J38715R5658j30653r1472K34423
15163C574827L82819J03826k73044l15001n1244J46789R4308l4181l4830L2679
15153C626948j8685j78140k02924N2076L74184L92575M3826k97847k56219P4492
15143C610286K61659J11675j08567j07449J2055j4002j35053q0055J26310J37905
15133C814764j28646k81159n4640K31206J69308p4782o5172J43326J13940j64482
15123C703663k07925J18656L16887Q0729j78174l7358K14701R5915k28022k42294
15113C636778L4860J28054o1368j52447k196J00437K7640R512J15082J03153m6933
$$ y = [3653766, 3428405, 3495241, 3707850, 3717763, 3583642, 3701014, 4111962, 4348896, 4126367, 3776052, 3719309, 3840237, 3751022, 3457880, 3328156, 3466871, 3562529, 3431876, 3340404, 3574827, 3957646, 4061472, 3788428, 3473427, 3422183, 3568972, 3663280, 3629099, 3594269, 3626948, 3608263, 3430123, 3227199, 3279275, 3653459, 4046034, 4089860, 3792013, 3535794, 3610286, 3871945, 3983620, 3875053, 3767604, 3779659, 3765657, 3630604, 3550549, 3676859, 3814764, 3686118, 3404959, 3350319, 3581525, 3750833, 3676051, 3610879, 3754205, 3868145, 3703663, 3495738, 3614394, 3931281, 4012010, 3833836, 3796478, 4011179, 4107094, 3879072, 3636778, 3671638, 3799692, 3738324, 3585877, 3583681, 3684118, 3711758, 3721270, 3836352, 3939505, 3892572]
15102C892572k2856J95618J89041j40603k74572N3357K98177k8963m72005l18429
15092C371337K23660L57475j4307k08791N2646K52518N0761j53066Q406K09198
15082D149837K7884l01489k84823K8073J86020P9914J8068J37305K09859O9651
15072D320299j34943j91109o8874J30887K74319K28479j2979k41367k45564q0699
15062C978449N5752J36441K44183K77950O2158k47391k57469N5621K29215J4315
15052D549224j95988J7068L76943K94158j98203m47892j46085K48590K38798j7684
15042D718929o6446J26217K15442N2502j74552k91699k80244j15464J87975L82079
15032D754739K02462j78045k84449k0200J81378N0320r9336O2687K87397J58351
$$ y = [3892572, 3869716, 4065334, 4254375, 4113772, 3839200, 3892557, 4190734, 4161771, 3689766, 3371337, 3594997, 3952472, 3938165, 3729374, 3782020, 4034538, 4085299, 3932233, 3940639, 4149837, 4177721, 3876232, 3591409, 3619482, 3805502, 3885416, 3903484, 4040789, 4250648, 4320299, 4185356, 3994247, 3925373, 4056260, 4330579, 4559058, 4546079, 4304712, 4059148, 3978449, 4034201, 4170642, 4414825, 4692775, 4754933, 4507542, 4250073, 4305694, 4534909, 4549224, 4353236, 4370304, 4747247, 5041405, 4843202, 4395310, 4249225, 4497815, 4736613, 4718929, 4652483, 4778700, 4994142, 5046644, 4872092, 4580393, 4300149, 4184685, 4372660, 4754739, 4957201, 4779156, 4494707, 4474507, 4655885, 4706205, 4606869, 4669556, 4956953, 5115304]
15022E115304j81133k40702J5671J39715l3853j47148K3904J89229P2420j17554
15012D835853p8130O5560K0103j39365j09424J04427K01706Q7725j8604J1186
15002D981037M9575J0302l343N3629N3201m4020o9455M9745J05482n9797k35136
14991D891220j26413J64692K55958N0012j31102n0350J00595M7809j06178o1544
14981E034699J52127J78631r4266l09060j65514J11167J25272o8408r2031R3552
14971D966169J19058j32939k72442l2332K67651K30485M461l6975M5479n1319
14961E107296k09038m0041L38805L55844p3931l30130q1312J57189r3798m24911
14951D705973k04486L31185M19233j1046k64315k1577K20274M4180k37919j82259
$$ y = [5115304, 4934171, 4693469, 4709140, 4848855, 4815002, 4667854, 4691758, 4880987, 4953407, 4835853, 4757723, 4823283, 4843386, 4704021, 4594597, 4699024, 4900730, 4988455, 4969851, 4981037, 5030612, 5040914, 5037571, 5091200, 5144401, 5100381, 5030926, 5080671, 5186153, 5126356, 4891220, 4764807, 4929499, 5185457, 5235469, 5104367, 5054017, 5154612, 5202421, 5096243, 5034699, 5186826, 5365457, 5271191, 4962131, 4796617, 4907784, 5033056, 4964648, 4872617, 4966169, 5085227, 4952288, 4679846, 4647514, 4915165, 5145650, 5150111, 5113136, 5158615, 5107296, 4898258, 4858217, 5197022, 5552866, 5478935, 5148805, 5067493, 5224682, 5130884, 4705973, 4501487, 4832672, 5251905, 5240859, 4976544, 4954967, 5175241, 5219421, 4981502, 4799243]
14941D799243P8705J56348M7914J3004P1214M9535l6417l2258L3788J4698n8708
14930E137066n1326r611o9176j48802n4558J48955J90765J7798j36578j34460
14920D890073r2297j08089j10969o2433n0126q6120m7193Q5003J51135Q7237M5324
14909D701545J16978J55927K9200j47899j94804j22074m4286J6392Q0344R6505
14899D687828L4292k3662j3542L080k1961k5464O385m3302j90736k28018k5852
$$ y = [4799243, 4877948, 5034296, 5082210, 5095214, 5166428, 5215963, 5179546, 5147288, 5181076, 5195774, 5137066, 5085740, 5076129, 5006953, 4858151, 4803593, 4952548, 5143313, 5161111, 5024533, 4890073, 4797776, 4689687, 4578718, 4516285, 4466159, 4380039, 4332846, 4417849, 4568984, 4656221, 4701545, 4818523, 4974450, 5003650, 4855751, 4660947, 4538873, 4494587, 4510979, 4591323, 4687828, 4722120, 4698458, 4684916, 4687996, 4666035, 4640571, 4646956, 4603654, 4412918, 4184900, 4159048]
$$ [...]
##END NTUPLES=NMR SPECTRUM
##END=
