##TITLE=1H ikalashn
T-M
16.12.2024
##JCAMPDX= 6.0         $$ Bruker NMR JCAMP-DX V2.0
##DATA TYPE= NMR FID
##DATA CLASS= NTUPLES
##ORIGIN= UXNMR, Bruker Analytische Messtechnik GmbH
##OWNER= root
$$ TOPSPIN		Version 1.3
$$ 2024-12-16 15:59:52.828 +0400  Irina@DPX200
$$ Compression mode = diff/dup
##.OBSERVE FREQUENCY= 200.131300845
##.OBSERVE NUCLEUS= ^1H
##.DELAY= (6, 6)
##.ACQUISITION MODE= SIMULTANEOUS
##.ACQUISITION SCHEME= undefined
##.AVERAGES= 16
##.DIGITISER RES= 18
##SPECTROMETER/DATA SYSTEM= spect
##.PULSE SEQUENCE= zg
##.SOLVENT NAME= CDCl3
##.SHIFT REFERENCE= INTERNAL, CDCl3, 1, 17.49637
##AUDIT TRAIL= $$ (NUMBER, WHEN, WHO, WHERE, WHAT)
$$ ##TITLE= Audit trail, TOPSPIN		Version 1.3
$$ ##JCAMPDX= 5.01
$$ ##ORIGIN= Bruker BioSpin GmbH
$$ ##OWNER= Irina
$$ $$ F:/spectra/data/iren/nmr/1H/4/audita.txt
$$ ##AUDIT TRAIL=  $$ (NUMBER, WHEN, WHO, WHERE, VERSION, WHAT)
(   1,<2024-12-16 15:59:36.546 +0400>,<Irina>,<DPX200>,<TOPSPIN 1.3>,
      <created by zg
	started at 2024-12-16 15:58:28.234 +0400,
	POWCHK disabled, PULCHK disabled
       terminated by command 'halt'
       configuration hash MD5:
       BE 6D 3F 07 2A EA 11 49 91 17 2B D3 AF B3 58 0D
       data hash MD5: 16K
       F4 3B 71 10 45 5C C0 DA 5C 2C 30 66 14 A4 0B D9>)
$$ ##END=
$$ 
$$ $$ hash MD5
$$ $$ E5 45 5F 6F F9 99 17 22 4A 56 8B F4 DE F7 84 9E
##$RELAX= 
##$RELAX= 
##$RELAX= 
##$RELAX= 
##$RELAX= 
##$RELAX= 
##$RELAX= 
##$RELAX= 
##$RELAX= 
$$ Bruker specific parameters
$$ --------------------------
##$DU= <F:/spectra>
##$EXPNO= 4
##$NAME= <1H>
##$PROCNO= 1
##$TYPE= <nmr>
##$USER= <iren>
##$AMP= (0..31)
100 100 100 100 100 100 100 100 100 100 100 100 100 100 100 100 100 100 
100 100 100 100 100 100 100 100 100 100 100 100 100 100 
##$ANAVPT= -1
##$AQSEQ= 0
##$AQ_mod= 1
##$AUNM= <au_zg>
##$AUTOPOS= <>
##$BF1= 200.13
##$BF2= 200.13
##$BF3= 200.13
##$BF4= 200.13
##$BF5= 200.13
##$BF6= 200.13
##$BF7= 200.13
##$BF8= 200.13
##$BYTORDA= 1
##$CFDGTYP= 0
##$CFRGTYP= 5
##$CHEMSTR= <none>
##$CNST= (0..63)
1 1 145 1 1 1 1 1 1 1 1 1 1 1 1 1 1 1 1 1 1 1 1 1 1 1 1 1 1 1 1 1 1 1 
1 1 1 1 1 1 1 1 1 1 1 1 1 1 1 1 1 1 1 1 1 1 1 1 1 1 1 1 1 1 
##$CPDPRG= <>
##$CPDPRG1= <>
##$CPDPRG2= <>
##$CPDPRG3= <>
##$CPDPRG4= <mlev>
##$CPDPRG5= <mlev>
##$CPDPRG6= <mlev>
##$CPDPRG7= <mlev>
##$CPDPRG8= <mlev>
##$CPDPRGB= <>
##$CPDPRGT= <>
##$D= (0..63)
0 2 0 0 0 0 0 0 0 0.06 0 0.03 0 0 0 0 0.0002 0 0 0 0 0 0 0 0 0 0 0 0 0 
0 0 0 0 0 0 0 0 0 0 0 0 0 0 0 0 0 0 0 0 0 0 0 0 0 0 0 0 0 0 0 0 0 0 
##$DATE= 1734350373
##$DBL= (0..7)
120 120 120 120 120 120 120 120 
##$DBP= (0..7)
150 150 150 150 150 150 150 150 
##$DBP07= 0
##$DBPNAM0= <>
##$DBPNAM1= <>
##$DBPNAM2= <>
##$DBPNAM3= <>
##$DBPNAM4= <>
##$DBPNAM5= <>
##$DBPNAM6= <>
##$DBPNAM7= <>
##$DBPOAL= (0..7)
0.5 0.5 0.5 0.5 0.5 0.5 0.5 0.5 
##$DBPOFFS= (0..7)
0 0 0 0 0 0 0 0 
##$DE= 6
##$DECBNUC= <off>
##$DECIM= 32
##$DECNUC= <off>
##$DECSTAT= 4
##$DIGMOD= 1
##$DIGTYP= 9
##$DL= (0..7)
0 120 120 120 120 120 120 120 
##$DP= (0..7)
150 150 150 150 150 150 150 150 
$$ [...]
##$SW= 21.9926040160658
##$SWIBOX= (0..15)
0 0 2 0 0 0 0 0 0 0 0 0 0 0 0 0 
##$SW_h= 4401.40845070422
##$TD= 16384
##$TD0= 1
##$TE= 300
##$TE2= 300
##$TE3= 300
##$TEG= 300
##$TL= (0..7)
0 120 120 120 120 120 120 120 
##$TP= (0..7)
150 150 150 150 150 150 150 150 
##$TP07= 0
##$TPNAME0= <>
##$TPNAME1= <>
##$TPNAME2= <>
##$TPNAME3= <>
##$TPNAME4= <>
##$TPNAME5= <>
##$TPNAME6= <>
##$TPNAME7= <>
##$TPOAL= (0..7)
0.5 0.5 0.5 0.5 0.5 0.5 0.5 0.5 
##$TPOFFS= (0..7)
0 0 0 0 0 0 0 0 
##$TUNHIN= 0
##$TUNHOUT= 0
##$TUNXOUT= 0
##$USERA1= <user>
##$USERA2= <user>
##$USERA3= <user>
##$USERA4= <user>
##$USERA5= <user>
##$V9= 5
##$VALIST= <valist>
##$VCLIST= <CCCCCCCCCCCCCCC>
##$VD= 0
##$VDLIST= <DDDDDDDDDDDDDDD>
##$VPLIST= <PPPPPPPPPPPPPPP>
##$VTLIST= <TTTTTTTTTTTTTTT>
##$WBST= 1024
##$WBSW= 25
##$XGAIN= (0..3)
0 0 0 0 
##$XL= 0
##$YL= 0
##$YMAX_a= 2082575
##$YMIN_a= -1541860
##$ZGOPTNS= <>
##$ZL1= 120
##$ZL2= 120
##$ZL3= 120
##$ZL4= 120
##$ABSF1= 10
##$ABSF2= 0
##$ABSG= 5
##$ABSL= 3
##$ALPHA= 0
##$AQORDER= 0
##$ASSFAC= 0
##$ASSFACI= 0
##$ASSFACX= 0
##$ASSWID= 0
##$AUNMP= <proc_1d>
##$AXLEFT= 0
##$AXRIGHT= 0
##$AXTYPE= 0
##$AXUNIT= <>
##$AZFE= 0.1
##$AZFW= 0.1
##$BCFW= 1
##$BC_mod= 2
##$BYTORDP= 1
##$COROFFS= 0
##$CY= 7568.61572265625
##$DATMOD= 1
##$DC= 2
##$DFILT= <>
##$DTYPP= 0
##$F1P= 17.9538593292236
##$F2P= -4.03888763876832
##$FCOR= 0.5
##$FTSIZE= 32768
##$FT_mod= 4
##$GAMMA= 1
##$GB= 1
##$INTBC= 1
##$INTSCL= 1
##$ISEN= 128
##$LB= 0.02
##$LEV0= 0
##$LPBIN= 0
##$MAXI= 945.577
##$MC2= 0
##$MEAN= 0
##$ME_mod= 0
##$MI= -402.1523
##$NCOEF= 0
##$NC_proc= 0
##$NLEV= 6
##$NOISF1= 8.587773
##$NOISF2= 6.764455
##$NSP= 1
##$NTH_PI= 0
##$NZP= 0
##$OFFSET= 17.49637
##$PC= 1
##$PHC0= 144.7557
##$PHC1= -21.10259
##$PH_mod= 0
##$PKNL= yes
##$PPARMOD= 0
##$PPDIAG= 0
##$PPIPTYP= 0
##$PPMPNUM= 100
##$PPRESOL= 1
##$PSCAL= 0
##$PSIGN= 0
##$REVERSE= no
##$SF= 200.13
##$SI= 32768
##$SIGF1= 18.5376
##$SIGF2= -6.396296
##$SINO= 400
##$SIOLD= 32768
##$SREGLST= <1H.CDCl3>
##$SSB= 3
##$STSI= 0
##$STSR= 0
##$SW_p= 4401.40845070422
##$SYMM= 0
##$S_DEV= 0
##$TDeff= 0
##$TDoff= 0
##$TI= <>
##$TILT= no
##$TM1= 0
##$TM2= 0
##$TOPLEV= 0
##$USERP1= <user>
##$USERP2= <user>
##$USERP3= <user>
##$USERP4= <user>
##$USERP5= <user>
##$WDW= 1
##$XDIM= 8192
##$YMAX_p= 0
##$YMIN_p= 0
$$ End of Bruker specific parameters
$$ ---------------------------------
##NTUPLES= NMR FID
##VAR_NAME=  TIME,          FID/REAL,        FID/IMAG
##SYMBOL=    X,             R,               I
##VAR_TYPE=  INDEPENDENT,   DEPENDENT,       DEPENDENT
##VAR_FORM=  AFFN,          ASDF,            ASDF
##VAR_DIM=   8192,          8192,            8192
##UNITS=     SECONDS,       ARBITRARY UNITS, ARBITRARY UNITS
##FACTOR=    0.0002272,     1,               1
##FIRST=     0,             0,               0
##LAST=      1.8609952,     -21,             100
##MIN=       0,             -1541860,        -1541860
##MAX=       1.8609952,     2082575,         2082575
$$ Real data points
##PAGE= N=1
##DATA TABLE= (X++(R..R)), XYDATA
$$ [...]
1875d25N59K34j387K86J969r77j537J787P44k172m40K392K14j370K86K62j127
1892g02K85J013n74l15J361j267j588J894J338k307m44K471k2k532N82J624p50
1909F7k99Q59o72p75J409j7j498O54J651j362q80J851r03j816J900J938k079j601
1927a573J536N24j424P86P38o77M12O05k019l76K812M01k795O27J557j361q73
1944a100K024O0j764Q64R48j708l34J675l77r83J286j79j832J038J656j774q36
1961a336K549L87l279O53K149r99q34J558k09j032O61J06j608J181K151k236j567
1978a705K261M08j868M91K061j548j223J561k6j598R74J291r94n34R35o30q01
1995i45J857O0k227J085K297k178k134K343J457k002k20J041p70k27J138q30o56
$$ y = [-425, 134, 368, -1019, -733, 1236, 259, -1278, 509, 1253, -919, -1359, 1033, 1247, -123, 163, 425, -702, -417, 596, 22, -293, 1068, -199, -1787, 107, 1445, -862, -1306, 1165, 1143, -1389, -807, 817, 67, -232, 627, -45, -820, 589, 572, -926, -272, 1379, 17, -863, 988, 85, -1731, 169, 2107, 28, -1573, -37, 487, -937, -151, 587, -90, 322, 927, -1092, -1468, 1344, 1745, -1050, -423, 1134, -227, -1100, 924, 984, -780, 84, 1032, -676, -1010, 665, 288, -695, 591, 412, -1420, -382, 1274, -500, -1336, 1213, 1600, -1679, -1026, 1123, 124, -710, 848, 639, -393, 268, 374, -1234, -53, 2098, -138, -1705, 556, 964, -904, -413, 1648, 100, -1123, 438, 412, -1186, -212, 1079, 85, -449, 486, -144, -945, 912, 972, -1255, -170, 2127, -51, -2185, 158, 1615, -387, -607, 434, -336, -563, 575, -255, -911]
2012i11J809K42k260j18K163r41r65J735M78k302K66J978p91j475J458N31j370
2029d73K51M48j076J051J249j847r99K033P53k512j66K550l55j795N13Q17p26
2046b84J51P76j034J06J392j006j349J114J293j494k62J485p31j462J450R89j617
2063d83k02J538n07r84N51M0j91P02N39j935m1K019k89j943R43J711j121j334
2081i87J097Q2m68Q60n3j252M62J019r26o15J099M87j519M49Q57j104l34J627
2099G81J25j888L17J583p49q23R61j8m36N83k39j125O60J267o72j377J044J088
2117A082j526l76J024kn37M44J01p90L96J141q92q15J055J66j021Q75K70j191
2135e96K93J442o78j837J275R23j058o16J140j52n73P99n13p68Q16J097j278o61
$$ y = [-911, 898, 1140, -1120, -1238, 925, -16, -981, 754, 1232, -1070, -804, 1174, 383, -1092, 366, 897, -473, -222, 226, -850, 201, 1450, -397, -1396, 637, 1390, -1122, -1288, 1262, 907, -888, -375, 442, -284, -133, 643, -391, -285, 1107, 101, -1248, -134, 1159, -335, -597, 888, 157, -1305, 145, 1134, -483, -685, 853, 346, -638, -87, -47, -238, 464, 1003, -932, -973, 1046, 757, -1186, -243, 1468, 347, -987, 110, 192, -276, 584, 531, -721, -259, 760, -166, -781, 318, 805, -714, -265, 592, -512, -846, 781, 906, -982, -665, 918, 169, -654, 307, 289, -147, 436, 197, -928, -268, 999, 327, -1050, -6, 1082, -444, -820, 204, 202, -335, 109, 210, -580, -184, 957, 65, -750, 305, 471, -550, 325, 595, -596, -303, 1139, 461, -1376, -101, 822, -236, -852, 288, 136, -437, 362, -151, -919, -103, 994, -284, -945]
2153i45J442L27j702P10Q43r36l69J238n73j065J265Q65j625l91J546k70r73Q11
2171A98q6r13P46J240j553r63J993K55j714L05J202q05m12J123q58r50J843O59
2189A310k082k55K113n92j253J176J1j397J037J050j523q82K086J65k263O85J287
2206F73j010j72J512j047j240K044L52j947J31K235j361j409J685K69j479P07
2222e7R49j483j57J927p93j912J522J356j677l06J563p43j065J593q7j830J198
2239bJ397j593r84J899K58j665Q62N37j272R7J863j238j752K006Q00j991J7J377
2257F16q74n28J417j65j671J389J311j855q70J757K93j505P16R21j743L44J766
2274A319j373j152J751K28j683O55J168q36q34J394l74j585J303J198j490q02
$$ y = [-945, 497, 824, -878, -168, 675, -261, -630, 608, 35, -1030, 235, 1100, -525, -916, 630, 360, -613, 198, 112, -801, -55, 1185, -368, -1331, 662, 917, -797, -492, 710, -95, -507, 616, -242, -1192, 651, 1310, -772, -1027, 1086, 494, -759, 417, 428, -969, 68, 1118, -405, -1287, 799, 964, -1299, -614, 673, -337, -509, 1003, -44, -1284, 760, 1112, -835, -704, 1531, 170, -1239, 446, 715, -764, -57, 892, -591, -748, 1179, 386, -1526, -4, 1352, -325, -631, 932, 189, -876, 717, 630, -1200, -2, 1395, -198, -1182, 717, 975, -690, 172, 709, -563, -466, 1397, 159, -1593, 413, 1213, -778, -761, 616, -258, -786, 631, 466, -1205, 184, 1495, -360, -1230, 527, 820, -685, 31, 952, -791, -447, 1319, -54, -1206, 545, 773, -910, -255, 913, 77, -757, 637, 263, -1322, -19, 1179, -311, -1113]
2290a113K125o15j382J199N64j337J34J312r77m80J386K15k060N18J613j207n91
2307f96J394l99j250J178O63j701J37J711n72j452J011N06r32L62P19j003l31
2324f55J374P9j599N92J006j220%J128k42j247J083M63j205n7J230q08n75Q76
2342B23M70j253O28O24p42o78J115K65j186L57Q74j242j33J365k71p40K78M40
2360C94q14J43J018r73p94J181L99j269L21R61l90o73R30j5r85L64R16q76o76
2379h38J138K36p92M79J3o73l4J499p15j306J080N95r68j60R66n07n27P38K5o72
2399d23K23R22n79m01N04j88p28R12M54j184m93J599J4j309J97J011o51l32R24
2418D72m86p15R39J87j037M37R59r34n89J163r6j317R78J194j128r88J291L87
$$ y = [-1113, 1012, 397, -985, 214, 778, -559, -425, 887, -90, -570, 816, 1031, -1029, -511, 1102, -105, -696, 698, 299, -951, 227, 890, -811, -674, 1037, 465, -987, 24, 530, -402, -40, 679, -324, -655, 719, 798, -801, -209, 797, -423, -423, 705, 463, -784, 299, 762, -443, -500, 730, -78, -653, 223, 693, -560, 68, 692, -50, -728, 387, 652, -534, -177, 697, -545, -678, 687, 416, -324, -46, 394, -420, -277, 741, -232, -1026, 155, 554, -715, -394, 567, 177, -496, 434, 419, -566, -202, 714, -162, -838, 300, 536, -256, 223, 236, -437, -471, 1028, 313, -993, 87, 682, -286, -446, 520, 13, -514, 224, 249, -423, -200, 722, 143, -258, 246, 58, -670, 242, 696, -488, -981, 618, 632, -677, -480, 531, -120, -452, 472, -14, -729, 210, 397, -640, -203, 756, -178, -767, 396, 300, -1017, -39, 1155, 27, -961, 330, 717]
2436G17j007M03L46p29L0O52o29n20J030N54j597J85J498j036r45J607M96j859
2454h04J19J132m58k86J094n76r48J034L92j579J34J899r25j118J451K62j989
2471a166L78J782o58j224R80M69r99K94M35q13O06J489j707j392J880J154k398
2488h90j07J885m95j361J162N52j449N36J230j047p23R31j59p79J431M05j994
2505h72L5K238j311j749J851J286j829n74J431m53n12R18p7r48J108Q5j728K93
2523h08K395r41j889J227J167j920n72J985k68q91P77P2j117L43R71p80n2J082
2541G81p24j385J522R10j768l79K535n20k302P68J064m29J08J15q38Q8J068p37
2559a23j224J546J360j671q62J500j07j369R70J008j122l72J026m98p51J095j40
$$ y = [717, -290, 113, 459, -270, -240, 412, -217, -737, 293, 847, -750, -565, 933, -103, -1048, 559, 1055, -804, -685, 447, -11, -297, 797, 221, -727, 307, 699, -880, -746, 1153, 228, -890, 561, 823, -1166, -788, 994, 336, -888, 92, 561, -438, -144, 291, -522, 84, 1573, -134, -1526, 354, 1508, -890, -997, 888, 393, -968, 194, 746, -703, -167, 1063, 16, -707, 224, 65, -714, 717, 1122, -872, -837, 1401, 90, -1659, 192, 1478, -351, -925, 506, 53, -459, 459, 382, -566, 542, 627, -1101, -808, 1587, 646, -1243, -16, 1151, -769, -1341, 644, 376, -515, 262, 334, -783, -440, 531, -249, -301, 781, 57, -1328, 194, 1104, -664, -1043, 1492, 972, -1330, -562, 502, 73, 181, 296, -542, -454, 614, -123, -1347, 199, 1559, -112, -974, 526, 419, -950, 20, 1028, -94, -466, 560, 62, -689, 406, 266]
2576B66o74O13L46j360P1J584j07j695P66J057j317r46J697K87n30J64N0p54L56
2595a26Q54j100j5J368j59j821N92J261o66p52J194k33j190M67N44n57j21J189
2613G29m61q04N31rn06R67O67j387o86J534K52j718K74J325j53o62j2k14Q5P11
2633D63o8p68J86P28q25o73J082N00p13kM82n63o31Q69Q41j062J2O18k65n31K96
2654b4k04J82O16j21j213N8J537l43j292P42Q29j006m99P58Mj22L58k04m22J47
2674b19P79o01l18P96K1q42N82K49p84j89J240k9j155K5J146p16n69O08j61K8
2694a09M18o67m21J035O71p46j176J512N84j589k10J200j37o12O56k30n60L58
2712b3N88p47j63R65n46p47Q04J69q45M28R49r80r58J278N18r90q6P56j98m36
$$ y = [266, -408, 205, 551, -809, -738, 846, 739, -956, -190, 867, -450, -1396, 301, 588, 58, 222, 272, -482, -126, 728, -372, -387, 981, 822, -999, -407, 854, 188, -564, 630, 397, -793, -326, 218, -339, -460, 729, 268, -536, -5, -14, -520, 447, 1114, -273, -959, 575, 827, -891, -617, 708, 555, -107, -119, -333, -248, 463, 395, -373, -187, 541, -284, -957, 125, 625, -88, -90, 392, -171, -802, 67, 908, -154, -142, 476, 211, -320, -24, -228, -46, 570, 449, -764, -706, 831, 488, -804, -62, 767, -239, -738, 20, 24, -98, 260, 56, -366, -219, 560, -41, -359, 437, 458, -384, 198, 447, -337, -526, 714, 685, -470, -445, 701, -15, -584, 24, -137, -109, 309, -358, -779, 256, 927, 181, -995, 517, 1101, -488, -698, 502, 365, -247, 409, 179, -381, -23, 565, -182, -345, 620, 74, -673, 131, 300, -545, -117, 832, -148, -1106, 172, 690, -300, -386, 370, 172, -264]
2732b64M86j94n77J084L43j508j98J700p17r10P48N18q86N2P42n97l34R93Q4j167
2752f02M54N30m92k87J116m83j005J232L29j245r5J301m90j042Q00N19q79J30
2770b09O69q11m7J250n04j144P54Q88j144l96R79o8p94O35M96j154L20J308j006
2789B2q19J088K42j072O07N65r18n7J149o25j065Q73Q61j234l12J071m53k88R77
2808F12m73q69P67Q09j002l17J082r1r79N32N87j334J82J085p70n28R45L60j082
2827d84K55R72q17n87Q20J95q31L69P99j190j55J164j97p02L62N76p90Q8O49m61
2847C5n56R39kj090J83J086m48n39O01j62l90N85L74j154J17R16k88o91L86L97
2867B99n72K12M58l79k47O97k64o34L31P30o49k93L98J07m81L34K27n88P8N80
$$ y = [-264, 222, 28, -549, 535, 878, -630, -828, 872, 155, -755, -7, 511, -375, -323, 419, -178, -512, 481, 565, -602, -148, 382, -110, -397, 719, 236, -769, 463, 792, -453, -548, 753, 263, -779, 21, 540, -339, -209, 460, -351, -398, 852, 348, -796, -42, 846, -298, -694, 285, 217, -577, 58, 554, -600, -280, 1028, 22, -797, 291, 533, -539, 68, 633, -285, -342, 807, 182, -883, -10, 851, -383, -695, 376, -77, -365, 612, 139, -730, 37, 846, -156, -473, 609, 518, -461, 71, 658, -676, -494, 591, -179, -707, 238, 598, -484, -229, 743, -74, -661, 159, 354, -477, -108, 691, -499, -654, 510, 313, -389, -27, 549, -241, -153, 496, 35, -521, 418, 416, -674, -491, 595, 147, -392, 209, 47, -343, 242, 616, -538, -421, 495, 207, -484, -98, 299, -273, -61, 397, 18, -229, 468, 204, -430, -99, 631, -18, -311, 87, 194, -287, 47, 274, -314, -236, 344]
2887C44l14n15N17L69q00J98M39j53j82J95J8l47mQ28n95l95N22J36m41L15J40
2908B75l63j36N73m30m37O34L20o35m9M81j05j52J41J15m62J72N64l74n32M63
2928F3J53l03M0J40j80j71N03Km93J86N29n53k80O10j28l81J58K17l30J36L99
2949C17l51l39L41K99o49K38P89o36l84O14j40q4P9O3k49M6L91j69o43M34M08
2970C75m62jM55j59n34N51J33p61K49M66J3p33N66n2l03L22L02r13P4R59m27n98
2992d78L73M21o38J15L34n9n40O25O1m62QM95k84j55L92m6n92M88K63o28J4O75
3014C82m9p41K86P53q96j39R28n16l61M20J25l60J31M40n35j3Q20k82j180O18
3034a69Q03q31j43P02k26m99N74J33r13L48O33l72l16N34Q6q74N34O19r13m21
$$ y = [344, 30, -485, 32, 401, -399, -201, 238, 85, -97, 98, 116, -231, -235, 593, -2, -397, 125, 261, -180, 135, 275, -88, -224, 349, -81, -518, 116, 436, -199, -248, 233, 128, -24, 117, 232, -230, -58, 506, 132, -400, 63, 216, -87, -47, 93, -87, -258, 245, 247, -246, -60, 469, -84, -364, 246, 118, -263, -105, 112, -218, -82, 317, -34, -373, -32, 267, -382, -144, 645, 9, -375, 239, 99, 15, 94, 157, -92, -46, 345, 176, -467, -33, 375, -87, -88, 367, 208, -326, 225, 358, -403, -154, 312, 325, -408, 158, 106, -197, 125, 427, -486, -412, 547, 120, -478, -105, 316, -322, -207, 127, 68, -472, 153, 214, -248, -240, 255, -29, -184, 208, 162, -430, 58, 321, -307, -293, 382, 333, -408, -122, 631, -265, -404, 524, 8, -353, 67, 192, -168, -37, 403, -132, -145, 675, 393, -787, -169, 634, -197, -340, 362, 136, -363, 211, 344, -569, -221, 412, 40, -276, 258, 344, -530, 4, 623, -290, -711]
3054g11J213k43o46L41M42m91O7L73m82k14P41j40q09P09N15r47l18R28J4j013
3074f71M83P10o80j91M01j23l89P91K60j114N62M00n49j40O48l1q13N52K26o54
3094c22k48R17K34q45O6K00l22L32M19n04l63Q19o4r01K68Q45m93l61O03o1p49
3115e30N52M50n67j96O35k90l18K59Q4m92O35M48j144k19R28J50p77L06P53p46
3135g9k76L67J4n9J70J6m60M86K05n75j08N08L57r31J71M35N3m44K03M78n64%
3157c3M4k82J34L37j16j22M12k42m48L19O69p38n61N19M41k83n27O10K30k09J6
3178A70l58k80N76K10l60J1M47m51m87M61j5p9pM45j33n59J49K76o2J30Qq0k36
3201b24M82l25j97M89J88q35K21K61O0l75n2N67n3n10K86j95L2M76k71j34J81
$$ y = [-711, 502, 259, -387, -46, 396, -95, -28, 345, -137, -351, 390, 250, -559, 150, 665, -282, -600, 328, 342, -671, -188, 522, -158, -349, 52, -71, -460, 331, 591, -523, 39, 439, -110, -250, 398, 367, -446, 106, 332, -322, -570, 347, 581, -264, -198, 2, -320, 12, 431, -73, -436, 383, 319, -582, -314, 531, 38, -323, 280, 219, -530, 22, 472, -95, -291, 344, 54, -264, -5, 79, -413, 222, 670, -474, -693, 235, 385, -392, -86, 667, -79, -355, 12, 26, -33, 137, 153, -307, 179, 384, -191, -299, 209, 566, -365, -194, 241, 294, -150, 53, 531, -33, -33, 11, -271, -137, 200, 84, -38, 374, 132, -316, 3, 672, -66, -627, -108, 333, 50, -477, 133, 363, 154, 170, -188, -468, 108, 318, -42, -31, 416, -35, -522, -61, -76, -155, -162, 283, 150, -409, -260, 16, -46, 84, 92, 12, -224, 258, -67, -264, 225, 413, -422, -201, 60, 120, -255, -307, 260, 207, -303, -17, -212, -180, 296, 25, -109, 72]
3222G2J81k27l76L59L99n63O1M44k65m62L71K29k03O7p0qj67K75j87k47Q26l28
3244A81n91l9Q09On93K23K46j63m09L48o4JJ64kk04K2J29j89J04K79j40n53M82
3267D7L70n71q2M66P4l51NO6J86k89J12r7J4M58l01o98Q86K06q29l3P31k08n16
3290c54L04L22l93K5K58k25n42Q15k28k89L85K10n10k13R55j86o59L46N52n59
3310A4n63P14L1j60K1M6k52J51M96n66j63N13J49r03M44L79n65j71P84k69n03
3331c73M55L38o61J39L77N0m08K75j35l03J81L21k36l45M88N8o17K06N80m86j74
3352b70K95R0l35N34L5q05N08M62o60l24N65J72k20R3J41k90l05N38O1p36L70
3373h1L14m85J38K74j59j99M85O1n36P4M77l64l45M84J63k77j57K88l17MM05m33
$$ y = [72, 253, 26, -350, 9, 408, -155, -94, 350, 85, -377, -6, 223, 20, 87, 17, 9, -158, 117, -70, -317, 509, 181, -410, -449, 360, 366, -227, -4, 242, 79, -330, 18, -46, -45, 119, 117, -87, -65, 64, -125, -21, 258, 118, -435, 47, 417, -154, -236, 230, 304, -47, -42, 24, 210, -79, 33, -64, -50, 408, 107, -591, 295, 501, -328, -361, 370, 162, -354, -50, 272, -121, -96, 162, -63, -605, 210, -18, -307, 78, 288, -222, -435, 520, 334, -325, 21, 573, 14, -549, 165, 196, 36, 57, 103, -149, 2, 498, -68, -231, 282, 431, -472, -28, 351, -214, -385, 399, 130, -373, 82, 420, -241, -102, 275, 325, -83, 192, 57, -246, -65, 256, 20, -325, 163, 221, -396, -190, 390, -96, -270, 25, 115, -220, 314, 349, -456, 52, 514, -146, -470, 95, 267, 47, 140, 281, -9, -314, 224, 285, -451, -81, 233, -252, -114, 160, 1, -198, 287, 348, -188, -114, 363, -1, -346, 138, 301, 24, -133, 155, -162, -158, 247, -186]
3395a86j7L35P9m97J22K72Q3o43N99j08k29L85K52o61j36M44N1k06R1P0l03K76
3417G3K45l74k54L53K05l90p5M87j73k72L19p1l49K80J14k22j15L78p2m61L40
3438c4K59l07j02M34j60r8N8K25l90jM44l40j38L33j15k27n1K52k86J37L98k29
3460F2l41L52Rm8k12L56k94j20M64m9k62mK87j80j11L6M13l77K7K23l54K3L79
3483B79k6l41o4M67k31k28Q3j4k42L75R9l79J76J06J10n11M45P1k71K2J03K5m42
3506c88K79O7rJ39Mj02j21K02J63n32J65L25k43M4K53k18%N8J33l22p9M74k36
3529E6l35L37j10k63L55K16l11j67M55j39k68J52P5l4j80K21r3k34L40K12m58
3550a73O6M5n8j06L23R2k35K73K8m61j44N58k1m08J54L37l03k57O23l55q9K44
$$ y = [-186, -203, 132, 211, -286, -164, 108, 191, -452, 147, 39, -190, 195, 447, -214, -350, 94, 145, -61, 30, 100, -203, 73, 318, -56, -310, 43, 248, -142, -217, 270, 97, -175, 144, 73, -276, 4, 118, -104, -219, 159, 87, -374, -34, 225, -82, -184, 250, 90, -8, 50, 275, -115, -116, 328, -12, -150, 183, 68, -159, -210, 42, -244, -107, 291, 62, -279, 73, 82, 34, -178, 178, -116, -236, 228, 179, -83, -87, 200, 20, -91, -55, 358, -19, 8, 231, -123, -100, 279, 253, -88, -152, 315, 84, -144, -61, -75, -317, 58, 157, -222, -46, 60, 170, -341, 104, 175, -96, -74, 29, 54, -388, -109, -42, -51, 88, 92, -10, -131, 71, 234, -298, -133, 192, -51, -7, 246, 28, 28, 86, 219, -103, -182, 292, 56, -279, 58, -52, -315, 40, 256, -55, -222, 233, 94, -174, -22, 53, 19, -161, 60, -33, -267, 73, 285, -173, -107, -62, -120, -226, 97, 189, -46, 227, 255, -206, -350, 208, 187, -221, -67, 270, -33, -290, 333, -22, -111, 133]
3572A33j0m13L75K2m4k10K31Q9l40L32J94m72J78J44r8j88J87J30l90J46K42k31
3594Gn6J58j96o4K80N5k33k80M15J82m08K48K03m03j49N65k91m22O45K8n94O9
3616b41K09k2k09N44l18k8J3L21k36j85N27j82l10J09K55l77J20K27k75j43M18
3637B17j6l09P3Q6nq1O4K71l44J57P6j51k17K29o9k62M29Jm08J79L53j26j67K30
3661B10j94k52Q9M17m02N2M45k68j49J15J32m88P8M04M8m15L21o2k41K32J57j83
3683D6k21L62j44k89L11J35k95j6K43p0l68K66J44nk37K15M0l76L04R2j64Q7R9
3706A59r2k03K30j30J02j9L11m46p4O7J48k2k38L52k35J32p0lk34K87J10k99n7
3729b24M05k18k47L89l4j45L0K20j32j71J21J73k88M1L53k32r7K79j45l30L79
$$ y = [133, 123, -290, 85, 107, 63, -147, 84, 173, -167, 165, 359, -113, 65, 209, 111, -77, 110, 240, -150, -4, 238, 7, -49, 109, -87, -151, 129, 184, -49, -329, 86, 268, -140, 108, 311, -92, -241, 324, 33, -389, 256, 284, -310, -241, -32, -54, -263, 281, -37, -65, -52, 269, 33, -152, 375, 193, -117, -8, 247, -130, -10, 217, -58, -201, 217, 201, -108, -35, 51, 46, -35, 29, 300, -44, 113, 189, 38, -179, 50, -19, -281, 148, 149, -259, -80, 273, 147, -20, 210, 16, -236, -147, 270, -132, -80, 365, 97, -52, 63, 195, -293, -215, 189, 237, -178, 143, 81, -160, 72, 229, 46, -175, 187, 43, -246, 65, 200, -95, -111, 132, 62, -306, -40, 104, 99, -138, 77, 117, -259, 45, 137, -27, 60, 159, 67, -136, 94, -36, 66, 47, 358, -88, -162, -95, 53, 31, -207, 145, -90, 42, -28, -31, -265, 22, 132, -167, -224, 181, -37, -284, 105, 71, -74, -44, 176, 44, -127, -6, 167, -121, -80, 273, 41, -56, 223, 78, -252, 127]
3750A27j56l12L85l5j72L1P0K77l38j00J24L74l89J0k45J83J64J22k59P5M16k65
3772H7j94J36J05o3k89K30L11m03n2P3J27k4L2o9M3R8j12k56L56O5l05j30L40
3795A06Kk30P6J04L6j70Qj01J11J61k40j08J11J7O9m05P43k25p0k38N46j72k68
3818a37J82J71j24p4j5L1P3p5j0q4K14J88n96j5M77j88QO2L6k73O1J23jq7J36
3843H3J66m97L03Kl49J41K89M8k28P2J66l89L3K35L8m49L35K88n37K58N1k49K77
3866H7l6j26J7J10K35l05j03L16l13P8j05M13k1k60K14l12n1K78P2l05L7K71m31
3889b40k14M49j15J21K92j26j31k69K01J77L3R6l53j06L24k45M3J07J16r3k03
3910a36J39K23k26l2Q7p9J11k6j6k37L16j01p8j35K55Rl91K81K94l17n2Q2L7j6
$$ y = [127, -29, -341, 44, 9, -163, -132, -62, 215, -123, -223, -99, 275, -114, -104, -349, -166, -2, 120, -139, -64, 352, 87, -107, 29, 134, 71, -218, 12, 323, -80, -132, -59, 68, 44, 76, 7, 50, 148, 36, -220, 136, 201, -104, -234, 106, 108, -122, -46, 58, 94, -76, -68, -169, -58, 103, -137, -245, -134, -117, -48, -453, 290, 65, -5, -243, 303, 131, -137, 45, 216, 92, 18, 3, 34, 107, 32, 22, -62, 152, 340, -256, -271, 206, 18, 26, 88, 124, -149, -88, 35, 34, -53, 83, 249, -248, 55, 57, -292, -151, 138, 186, -42, 30, 196, -193, -160, 75, 113, -336, -1, 287, -250, 8, 59, -190, 87, 51, -75, -58, 52, 287, -18, -121, 195, -118, -40, -145, 268, 247, -13, 201, -111, -162, 116, 188, -117, -80, 191, -240, -454, -5, -120, 1, 293, 167, 36, -233, -32, 145, 178, 274, -79, -185, 139, -106, -63, 44, 160, 67, -136, 3, 226, 0, -32, 55, -24, 87, 61, 45, -192, 124, 23, -55, -190, 65, 74, -317, -36, 258, -59, -111, -29, 8, -8]
3934hp7J93k14L23j49n9J8J08J94m19J25N8j79r6L97k45q6M6J60J4l00M25l33
3957a04j41L56Jr8J0MM0j2J65k92o3Q3J29j86j6J34J06ol0r0l8K58k24J22n25
3982d17L28L18k29K9K35k75L8N3J04j69jM4K9j55m4L54m38J63J20j61P0L23k56
4005F3k48n8K22j72n6J28Q5Q3q3rL1k2k8q9j20L85Oj68j44K19L5k31J88l1J5q0
4031g9P0J67j58m8P4N7j97K11K6m3P1L9k21J71J46l24J13j32o7j48K91J44l30
4054a67J32p1%K3M4J8M2o0J12j27p0j06L70j77k2J36m9n1O0k52L64j58l7j27O7
4079a06J39Q3j70L53l3l83K49l8m0n3J37k63K08m8O6k31J12j70K57o4k0L0j18
4102a03Q3J0Qj04J0K02m02J98N8L9O4P9j70j26K20J29j55m06M44M5k59L10j30
$$ y = [-8, -85, 108, -106, 217, 68, 9, 27, 135, 329, -90, 35, 93, -86, -182, 215, -30, -116, -70, 90, 104, -196, 229, -104, -245, 111, 112, 14, 24, 28, 68, 56, 221, -71, -134, -51, 78, -108, -124, 10, 116, 110, 80, -10, -48, 210, -14, 108, -417, -89, 229, 0, 29, 264, -11, 27, 80, 184, 15, 14, 58, 87, -68, -112, 242, -196, -33, 87, -74, -4, 319, 63, -185, -243, -21, -193, -249, -121, -36, 47, -36, -45, -14, -36, -64, -153, -273, 112, 118, -50, -194, 25, 60, -171, 17, -14, 1, -79, -9, 158, 0, -48, 26, 83, -114, 97, 123, 80, 151, 190, -31, 140, 286, -38, 75, -57, -124, -272, 19, 163, -167, -35, -106, -106, -83, -39, -21, 21, -39, 73, -54, -124, -230, 140, -37, -59, 77, 28, -23, 37, -215, 149, -9, -46, -173, -106, 33, 116, -54, 299, 266, -117, 132, 94, 54, 1, 138, -125, 83, 35, 101, -130, -18, -188, 69, 5, -15, 15, -103, -20, -10, -2, -106, -96, 106, -296, -98, -40, -1, 63, 142, -28, -154, 66, 195, 40, -366, 78, 123, -136, 174, 44]
4125D4j53J4J83r4m3P7J14l61L36Q5k33p4K94k03r4L05k31m9N1rJ13j15J51M7
4149A55j68J40j2j51n3K16j02j31K55R3l35j5J43K4k04P0K01r7j39L28k75k29
4171b86N37k54k13J16K07j23k97M20j41J14j33K36k96J35N2p2PqR8j17o8O5K16
4194A95l89M06k98j83L59N5k21J51p0O1o3P7n1k42K13L26m05j9J93J39m33K43
4216D4L5k32J94kk43K04Q3k3N4k15Q8J33j95J62k62J14K64p2k6O6j55l1n7K50
4240A78l49O1l0K37n1k51K11M4k58J91L51j14l00J37o3p6k7J98j19R8nO5q9nR7
4265A31l32L24k09R0l3L3j21N4j85L69j27j95J74RJ34k26J17J7O3k04K46j73j15
4288a59J59l3J80j66qJ32j99J62N5k53J35p2J38j86L03k02M5m6Jj5k2m7J64j05
$$ y = [44, -109, -95, 88, -6, -49, 28, 142, -219, 117, 202, -31, -105, 189, -14, -108, 197, -34, -83, -32, -41, 72, -43, 108, 155, -13, 127, 115, -36, -89, 127, 25, -106, 149, 242, -93, -108, 35, 59, -145, -75, 126, 29, -110, 218, -57, -286, 251, -3, -216, -100, 107, -16, -313, 107, -34, 80, -53, 183, -113, 22, 74, 2, 9, 1, 99, -18, -86, -21, 195, -194, 212, -86, -269, 90, 145, -76, 75, 5, 66, 3, 80, 29, -213, 0, 326, -79, -98, 95, 234, -199, 44, 79, -153, 41, 39, -204, 0, 83, 60, 114, -101, -13, 120, -75, 87, -175, -61, 203, 131, 105, 171, 16, -15, -72, 178, -171, -110, -140, 97, 46, -205, 6, 50, -208, -17, 334, 220, -80, 57, -6, -82, -109, 89, -30, 68, 63, 128, 39, 34, 131, -201, 123, -86, 4, -29, 4, -117, -63, -248, 121, -6, -201, -27, -18, 116, -110, 7, 24, 87, -117, 129, -44, -159, 0, -33, 147, -19, -27, 105, -94, 68, 123, -130, 5, -67, 71, -115, 188, -14, 31, -15, -14, -29, -51, -98, 66, -39]
4312c9J12j95j8K73M9k01j23K34l09O5L8M05k32J7m0pM4j16J4Q4j45N2J9O2R3
4337A36j81j96L49J03k65K27o8j74j33K17r8K08j18o9q6K83j99J57j57J48O6l27
4359a77n2K87J26q8k44L08l88K65r3r2N8J62J42k19j40K36k06q2M41l06m7O3J18
4382G2j61j00L12m4m1q1J52m4N7L9q3k52L76k61k14L90J6n7k56K50K2j57J21P8
4406A34j78J75r5m1l02K79K34l27K14J9j44j11K70j24J5n6q7kJ23O6l64J97J98
4429I3J14l73J09K41l32K29M3k06LpP3R6j47J04o5Q4lM8j06P1J62k25Q5J6J61
4454B68k82K5J98j35j83J03N8j42j72J44J61o0o1J8q9J96O7j38J0J29l49N6J08
4477g0N2n6p0K94k28J44r4k0R9O1N3k57K26k41q3K08q9J05k3k1J86k28L4j07L80
$$ y = [-39, 73, -122, -140, 133, 182, -19, -142, 92, -217, -152, -114, 291, 59, 76, 36, 29, 73, -43, -29, 55, -90, -38, -19, 43, 136, -45, -241, 108, 211, -54, 173, 105, -69, -202, 15, -83, 125, 7, -62, -148, 135, -64, 93, -64, 84, 150, -177, -229, 58, 184, 96, -148, 160, -228, 37, -56, -148, -90, 72, 214, -5, -145, 91, -115, -197, 244, -62, -109, -46, 72, -89, -189, 123, 79, 38, -43, 109, 65, 122, 161, 78, -174, 202, -59, -273, 117, 133, 76, -180, 70, 92, -65, 56, 134, -44, 131, 36, -5, -307, -28, 206, -121, 93, 112, -32, -143, 127, 3, 18, -38, -125, -127, -4, 62, -302, -105, 93, 207, -166, -57, 184, -148, 81, 124, -82, -79, -86, -13, 83, -64, 40, -25, 59, 56, 104, -2, 69, 231, 6, 91, 107, 268, -14, 11, 209, 74, -109, -6, 52, -90, -262, -118, 43, -17, -78, -60, -149, 47, 114, -24, -14, 115, -234, -178, -70, -18, -74, -144, 150, -78, 66, -28, -48, 51, 112, 165, -92, 134, -107, -190, 18, -71, 34, 11, -10, 176, -52, -18, -125, 255]
4502B55j44k7k8l27K04r8R6J90k4j94j49J44K34k40k04J85J60o7m8j74M13j57
4524@M0k0j10J31Rj01n0J82q6k53K98k11m9K68j8j2j32K49lj66J16o4q0K6O1P5
4550A00k09L83M1j95r9J02l6j21j07K18J6j42o5M5r8L23m8r9j0Q0k12q1K28j2
4574BL9J27Mk01p5J07J65l38K10l4o8R8J45k80q8K73K24l41n8k1K17m6j22J58
4598I7o7j13P4k91P3M63k41Qo4K53j12k27J38P5j15K85j01j40j31K78l0j49m7
4621h4P4m7K7K4J62l70K68Q1m41K00K54p7k68K43n2p6L2J81k36K19o7J1j49M16
4645C25k26j20p0J44j99k17L58K43l63J22O6n0k32J43J67k68J52j49Q6M3L05k07
4667E3l44L71Q5l38Q2K05j13k16K0L86k76L43j62j63P8J85k32jJ92j7k65R5J4
$$ y = [255, 111, 84, 56, -271, -67, -165, -69, 121, 97, -97, -246, -102, 132, -108, -312, -127, 33, -34, -82, -256, 157, 0, 40, 20, -90, 41, 50, -51, -101, 81, -5, -258, 40, -171, -220, 48, 30, 18, -114, 135, 132, -34, 82, 18, -62, -36, 25, 100, -109, 274, 315, 120, 21, 123, 87, -34, -141, 77, 93, -49, -114, -69, -167, 156, 108, 9, -1, 79, -133, -214, 14, 2, 41, 168, 172, -29, -104, 3, 168, -170, 40, 6, -62, 36, 181, -99, -187, 86, 310, -31, -89, -110, 107, 61, -61, 97, 30, -83, -9, -300, -227, 236, -5, 3, -61, 192, 80, -147, -9, 66, -49, 236, 135, -5, -136, 142, 112, -37, -84, -10, -57, -30, -6, 156, -214, 54, 135, -306, -106, 148, 71, -197, 46, -6, -82, -50, 131, -105, 114, 47, 58, -91, 325, 99, -21, -91, 53, -146, -363, -5, 238, -125, -3, 63, 13, -219, -76, 91, -177, -25, -174, -88, -45, 260, 53, -291, 80, 165, -173, -91, 114, 1, -215, -195, 191, -85, 258, 96, -67, 11, 196, -36, -37, 155, 138, -127, -32, -18]
4690a8l59L93M8j80K45k43J04k27L07L3k5j26K40k18l2j72L55m5j85J40J50l00
4712a15r6M28l96qK16q0r7K87q3k7j42J76k93K52J52ol23N1K11k30J0L4J07k31
4736b03L70j44j50q5K54j24L0O0K30l56P8P8K28j13l5r7j06J45Q3k39q3M11k32
4759@r3NJ0p5J38K35j35O0l3j76R7P0M3n5j84P4k38J25k10N06j74j14J03J47r5
4784C1L1l8j55NJ60r4O0J25L7j56PO4k39J08K51j30q6N8P0j60k9R1j9L18l74K01
4810A37j31pO8k7k00J71K8p0j77J61J35j3l00J50q0L23L0j21j1K3p5p1k0L0K9
4835a8J01j02L4j44K37k46J55j0J60m0k97L23k31J6J87P4k84N4P6K02j99J42k50
4858f0j71J60J96Ql70K79k4q5J69J65j51k61K02n5j65J83J75p0l14O1J86j01K5
$$ y = [-18, -377, 16, 64, -116, 129, -114, -10, -237, 70, 103, 78, -48, 192, -26, -58, -230, 125, 80, -105, 35, 185, -115, -211, 217, -179, -187, 29, -51, -148, 139, 56, 29, -113, 63, -230, 22, 174, 168, -155, -104, 107, -123, -113, -79, 28, -203, 167, 23, -127, -212, 42, -82, -52, 8, 238, -118, -40, 38, 266, 153, 118, 21, -85, 60, 143, -96, -179, 232, 0, -93, -88, -78, -153, -15, 220, 85, 145, 112, -64, 33, 103, 146, 91, -93, -19, -257, -132, -342, 164, -10, -124, -21, 126, 31, 62, 24, -131, -126, 34, -60, 0, 125, 162, 6, 13, 77, -162, -54, 197, 67, -19, 39, 109, -51, -80, 11, -8, 310, -64, 137, 6, -1, 67, 40, -160, 11, 39, -31, -208, -47, 88, 75, -225, -75, -155, 168, 198, 77, 66, 89, 14, -57, -77, -47, -18, 83, -19, 15, -129, 108, -138, 17, 7, 167, 127, -170, 153, -78, -62, 125, 199, -85, -31, 45, 247, 48, 190, -60, -231, -71, 125, 133, -237, 42, 18, -67, 102, 267, 116, -145, 57, 2, -163, 20, 195, 125, -189, -128, 58, -43, -18]
4881a8M1N9j75J25p4Rn3K40k10j3o5J29j99L47P3j45lq8M7l7J01J30k94j01J83
4906Ij6j49k0J51j04L39q9p9p4r3m0N6J97Qj32k2J54j08q3kK05k28K69l8l0k25
4932a44M7P2R9Rn4j19K35j72j29L06o5J06m87J69J57P4l3j56J30k14j7K43k07
4955a50J53K14j85L2K5J83m18J48J14j30K4O1j74j27L02J7j07J95J0k03j3J62
4977A33j91p6L2O3L6k17J78P3p8l1J22j32O7K22l78K78Q1j42K2k34N59l77j03
5000i3J38J28k62J51r6R1k35K42lk37L06k7j64M8LJ6m2Q4Q9j37o8K28pj04q0J6
5026a5J76j27o1kj8M5M6l36M43r0j80J28J17o3n8p6o6N8J16J38j76pNj18J10K01
5052A90j15J14j10m5K03j32J85j29k39q8J21P7j38K7J66L5ml7j20L6m3j7J32l46
$$ y = [-18, 23, 82, -93, 32, -42, -33, -86, 154, -56, -69, -134, -5, -204, 143, 216, 71, 68, -20, 27, -10, 91, 221, -73, -174, 9, -7, -156, -176, -25, -129, 210, 121, 42, -32, -125, -165, -109, 88, 96, -36, -58, 96, -12, -95, -97, 108, -120, 149, 111, 81, -144, -97, -25, 74, 83, 29, -90, 145, -27, -156, 150, 85, 191, -296, -127, 30, 104, 71, -85, 45, -169, -186, 57, -150, 3, 217, 32, 64, 89, 272, -146, 2, 116, -14, 10, 71, -103, -230, 72, 89, -18, 177, 187, -16, -29, 133, -58, -134, -102, -39, -3, -220, -42, 31, -47, -78, 44, -88, -21, 201, -177, 101, 182, 40, 62, -172, 387, 10, -93, 45, 173, -89, 62, -34, 57, -178, 64, 61, -176, 130, 103, -61, -13, -10, 6, -36, 48, 137, 0, -68, 160, 153, 49, -31, -15, 161, 34, -27, -29, -47, -2, 44, -292, 151, 61, -119, 9, 126, 63, 5, -71, -137, -79, 37, 175, -1, -8, -3, -121, -11, 190, 75, 189, 79, 34, 237, 105, 290, 161, -78, -166, -45, 32, -106, -79, 87, 122, 118, 81, -39, -3, -46, -63, 69, -277]
5076b77K82j01L0J90k33l6L47j49L0j17J65p1j44P3r8O5J31O4k10K0J00Oj69Q6
5100a6JK45k13o0J07N0j91m3M1J69j19j5j7k0J07j92J86j64K02j7q7L18j89l65
5124b82M50j27j65O7J67O4j27L5j32j37K41r1K3M9J04j25P1k2O9l02K2K18j22
5147e2Q6P2l12K11%Q4j63J35J5k26J92K05l43j20L21M8k68K30j00Jk5P5p3m7J44
5172I0K1j65K17j13j9k29J90P3j45kK1R0J02k82J78OO6l0j00j95K22J11k71K8
5196a36L37j08l31J89Q8k61M13J05k79J23k73L0J34Nl3j32K16J08j12r8K41p0
5218A56j50N3J76k42j04J04qKl7J85j61j6J8K06j93l2R8j9J7j69Q3q4Q0J00k26
5243a63L00m2K3j36L33l98R1K78j40k25J12J46k39j36K51M2j27N5J28Kj99l2K79
$$ y = [-277, 5, -96, -66, 124, -109, -145, 202, 53, 83, -34, 131, 60, -84, -11, -109, -44, 87, 151, -59, -39, 61, 67, -102, -16, -15, 230, 17, -43, 64, 114, -77, -120, -79, 90, -29, -44, -61, -81, 26, -166, 20, -144, 58, 41, -46, 272, 83, -282, 168, 41, -124, -57, 110, 174, 47, 82, -50, -187, 54, -37, -14, 35, 139, 14, 85, 63, 132, -170, -148, 70, -52, 34, 106, -206, 5, 5, 89, -74, 61, 76, -150, 42, 247, -96, -216, 105, 153, -115, 115, 15, 16, -9, 66, -7, -54, 90, 111, -54, 163, 50, 31, -198, -8, 65, -80, -82, -61, 29, 131, -151, 27, 33, 99, 69, -31, -226, -4, 107, -164, -136, 201, 93, -238, -49, 39, -222, 191, 296, 17, 140, -133, -103, 31, 36, 3, -129, 87, 195, 83, -15, 226, 156, 6, 59, 235, -7, -111, -7, -15, -13, -50, 135, -26, -42, -24, 182, -11, -43, 55, 36, 53, -116, -33, -117, -37, 63, -163, 137, 95, 118, -18, 315, -83, 8, 286, 146, -79, 33, 179, -60, -196, 55, 97, -30, 25, 153, 155, -44, -76, 203]
5266B03m6j03O4j47J87p8k51K86L3j31p8K58mk25o3J62J1j21R3j10m8O7J36k48
5290a53O4N3O1Q5k67J45J43l23K60Om3n0J44j36N8J12j17J09j25P9j78n5K06K8
5314A06n0j89L2k9M0J3R5J2J60j11j80K25j88o6J09j5J8rr7L62k48N0J00j51j02
5339a13K15j55n6j91K62k15L02K03j59q0j07l6N3k9KO8K44q9m8j38M8m6K05Q7
5363B27k90J35m4L7l3J59k43Q0o2r2O3LM1l0p0P7K48j35j81J43j22K00lj75L1
5388c6J87o6j40K22l47K29l6p1J84k96K53j21j36J27P7k03L12q2l2j68k1J44L0
5411A0r9J13n3J98j31L1J13k2j59j77K17j06on1K04p3j23nP5j01L9M7Q3%K29o6
5437A87r6o5J40j7k38j33K92o1j7J20m0j31M4q1N2OJ30j53j06J56J28k86J98o
$$ y = [203, 157, 54, 118, -29, 158, 80, -171, 115, 148, 17, -61, 197, 193, -32, -95, 67, 78, -43, 50, -60, -108, -41, 95, -153, -89, -36, 25, 110, -157, -12, 131, -192, 68, 74, 31, -19, 125, -11, 47, 159, 42, 151, 26, 105, -73, -128, 78, 106, 56, -133, -101, -130, -90, -77, 18, 30, 190, 79, -101, 124, -64, -130, -21, -36, -18, -27, -124, 238, -10, 40, 140, -11, -113, 102, -53, -109, -300, -38, -253, 49, 252, 93, 13, -94, -130, -77, -106, -104, -36, 208, 119, 71, -67, -19, -65, 140, 227, -63, 72, 28, 65, 32, 191, -52, 28, -34, -126, -63, -60, -19, -49, -119, -42, 206, 71, -110, 33, -89, 111, 108, -67, -36, 151, 85, -55, 167, -180, 49, 13, -58, 126, -170, 83, -38, -174, -47, 30, -173, 139, 57, 25, -143, -164, -20, 10, -89, 24, -29, 169, 38, 69, 182, 160, 1, -176, 41, -65, -71, -122, 82, 9, -114, -119, -44, -145, -106, -59, 24, 24, 253, 187, 91, 26, 166, 149, -89, -222, 70, 9, -8, 112, 72, -59, -15, -96, -44, -38, 92, -61, -167, -11, 117, -169, 29, 23]
5461B3R7p2N9n6L2jQ9M2j06l5K1j07K19r9k02K26k3pj4j02LO4P5K8j89J05M8o1
5489E7k20K59j5j56K05j41k03K30J80j30j01N1J44m13K98J90l73K19r6J28j61
5510d8o1J87l02J42K51j88r8K12j21J3j31K77k16Q8J98p2k00RK69j39k63j1L45
5533A41l15J58L8%J24l9m5k92K08R3j36Q9m3P6k02J20J19j0j78J34K3pj26K1n
5558e4o4J67M2j55N9k6o8J83o1k7j57M20k68K00k29l6J20k07L87j31pm0j88J67
5582B7J86j87r2KK05k30k9J32N7j63K16j33N6o7Om9J7J72l9l65J64J98J47l07
5606g6NP8R7Q5p4k73J72p9J26J21j55o0p5K31k32K14l0J4k4Oj67J98j47rK8n7
5632h3Q5n7J62p5N7j65o7J15O2P1m00K51j2Rj12k5K65k43J88l3O3Qj17J22j18
$$ y = [23, 120, 48, 107, 51, 83, 82, 171, 213, 107, 72, 93, -14, 205, 106, -96, 130, 107, 100, 86, -16, -13, 51, 126, 154, -35, 70, 118, 57, -163, 96, 81, -75, 130, -11, -214, 16, 196, 66, -35, 16, 160, -253, 45, 235, -138, 81, -15, 113, -48, -109, 78, -224, -82, 169, -19, -117, 95, -26, -13, -144, 133, -83, 5, 203, 131, -69, -60, 209, 70, -193, -204, 141, -174, -16, 22, 22, 146, 107, 62, -230, -22, 71, -65, 24, -19, 57, -145, -25, 94, 84, -94, 40, 63, 56, -70, -49, -54, -118, 49, 91, -64, -5, -31, -99, 84, 23, -4, -161, 259, -9, 191, -38, -74, 46, -161, 226, 95, 88, 48, -140, 27, 213, 26, -66, -64, 141, -89, -118, 14, 71, -92, 124, -9, 47, -20, -14, -63, -46, 126, 87, -278, -114, 84, 231, -76, -71, 7, 104, 189, 115, -158, 14, -65, 61, 182, 27, -33, -108, 123, -109, 105, 75, 89, 65, 71, -96, 102, -45, -54, -26, -83, 2, -55, 107, 32, 89, -76, -143, -28, 34, 105, -295, -44, -56, -47, -159, -184, 81, -162, 26, -7, 56, 64, -53, 69, -49]
5657d9q2J09M1R0j02j83RK58m6K4n0N1n4j36Q0m8J26K51j96j68J37j1Lq4NR3K0
5684H8j58J79j89J50Kj05J10n7o1J69m5j69J13q9j92K34l5j23K45j56K25j94r8
5707a56l0P9J72r4n5J70j8J3o4k1k1q3k7J44J2rJ47j74j69K54J6j38l3k8K3k9
5733a19J21K5n0J09r4R1m8P1j65O6K2j9p7j6K30k0k01n4M9J58m7K2r1N2R0k60
5759a55R7o6N2J20j00J5K24j08J8r9j00R9m0J05k12K69j78M6NK79k74J62j57j98
5783a96K51j33P9J31j30Q5J37l80L63k8m14J27J71nL8j08l3n4mL0p7J39R6j15
5807c0o9J12J54N0k81N6r3n0J91j52n5J89r1j44J59O2J17p5P6k42J76L6Ok16L4
5832h0J00L1q8K9r1J74j1j0J69j55j09J1J02k66M5K36o7L9j56j4K60k53J83j10
$$ y = [-49, -131, -22, 19, 109, 7, -176, -167, 91, 45, 69, 19, 70, 16, -120, -40, -88, 38, 289, 93, -75, 62, 51, 54, -30, -25, 68, 88, -70, 109, -80, 70, 72, -33, 77, 20, -41, 128, 83, -86, 27, -62, -254, -20, -55, -178, 67, -89, 136, -58, -156, -186, -107, 65, -29, -84, 86, 68, 81, 17, -4, -25, -108, -135, 9, 21, 12, 159, -15, -184, 70, 86, -52, -85, -113, -90, -119, 2, 27, -23, 86, -8, 83, 35, 106, -59, 7, 29, 10, -67, -83, 147, 127, -74, -128, -79, 79, 32, 54, -37, 15, 105, -155, -58, -124, -72, 48, -52, -37, 187, 79, 97, -2, -102, -3, -43, 62, -150, 119, -59, -13, -8, 271, -3, 159, 2, -196, 55, -78, 1, 132, 2, 87, 224, -156, 207, 179, -235, -108, 63, 58, 96, -12, -45, -99, -103, -73, -150, -11, 85, -30, -99, 13, 167, 217, -64, -8, -101, -151, 40, -112, -167, 22, -69, -213, -54, 8, 125, 50, 126, -116, 60, 96, 102, -114, -80, 20, 51, -37, -8, -99, 75, 64, 54, 223, 68, -41, -30, 72, -194, -149, 87, 20, 59, -97, -111, 149, -104, 79, -31]
5856c1J21pj06J29k31K86j61o8J8J5J61q1J35k27O2j5j88J87N4n2j4P1J12k21
5880e1L6j1J88j66Nj1p0J45l08J58L24j81n0l9J94j75j75K39j37N6J08q5Q5p5
5904Dj1L1j26K51j79N4o7J67r7j15Q8N6j34L2KM4M4L9j42J40k56J52K64j26j12
5929Ck68P1K56l3j09N3J3K11l38K40rl2j04m4J67J1q8r5J10R2j21p3K2q3J0L27
5955A89k25O5L0j67K30j4j05RJ69m55M9K13j56M8pJ07o3l9J63Q9k61K10l1k6J00
5980A22j97J83j05o6J97j32r3L8P6K95k49LM9K4j78q4n4K08j49L0J52J78j80L7
6004A05j27p6j00L09k37J66j4k2L0L3r0J67l29K01j73J61J08k05J10j7j39J4L12
6027A87j90k5Q3J2j54R6k8l7K06j96Q0J52rk14J13k34J05J20r3J22j62q2J07O1
$$ y = [-31, 90, 83, -23, 106, -125, 161, 0, -68, -50, -35, 126, 45, 180, -47, 15, 0, -188, -1, 53, 1, -13, 58, 170, -51, -15, -26, 162, -4, 1, -10, -80, 65, -243, -85, 239, 58, 8, -31, 163, -12, -187, 52, -85, -29, 79, -6, 79, 4, -7, 24, -102, 149, -30, 24, -43, 124, 27, -88, 0, 56, -78, -46, -44, 0, 44, 83, -59, 81, -175, -23, 241, 115, 3, -265, -194, 62, 29, -80, -27, -14, 197, -141, 99, 90, 58, -46, -90, 77, 88, 0, -95, 15, 107, -14, -87, -65, -148, -138, 189, -36, 29, 59, -108, 122, 108, 3, 12, 181, -274, -225, -12, -168, -120, -127, -20, -83, -122, 41, 130, -131, 79, 48, 22, 122, -75, 108, 3, -63, 134, 2, -91, -53, 23, 318, 69, 72, 121, 145, -33, -117, -171, 37, -112, -82, 70, 248, 68, 105, -22, -98, -198, 111, -126, 40, 26, 4, 34, 67, -23, 144, -185, 16, -157, 4, 112, -93, 17, 0, -139, -125, 187, -3, -28, 55, 67, -87, 9, -19, -56, 150, -46, 34, 186, 177, -37, 76, -158, -53, 67, -26, 96, -66, -148, -41, 20]
6051B0M8L6q7M4l5L7j43K03k9k64n0K33J32r8n8J6j94K65J38j95j57J33J27j53
6075c1q4K08l03P9K40j26J17k65K51N9m1l2J15j60j05J14r8N7q3J41p7OM5k3j07
6100a03K56rk43L55l38J56j41rJ27n4K2P4Oj06Mk3k11J72%k0J19n8Q0j72R9J8
6126Ak84L30J5J17q7Q8l30K21r4r5p2J28J72j82p9K52k09J72j88J5K9l2O6N2j05
6151i9Q3j19Q6L08j41j31j50K79l64L89o3Oj91J24p9K09j45n2nQ1M4p8m3K11p3
6176H7J3j67J1R0j57J23j30J55j15O8J95l26N6O5n2Q9rj4K84m16J30j48K07k2
6200A7k03J96k0N1J0j14N9k1M7j17k3O3Q1j5l1j10L0J1J94k64O0J4MJ56j1k49
6226a85P8J5J97L5m4k19J80M5l8K8J10p5j82l9R4N5j73J05l0j6p2R2J40q4n8j09
$$ y = [20, 68, 104, 17, 61, 26, 63, -80, 123, 94, -170, -220, 13, 145, 47, -11, 5, -189, 76, 214, 19, -138, -5, 122, -31, -115, 93, -210, -131, 109, -17, 100, -165, 86, 145, 104, 72, 187, 27, -78, 36, -62, -5, -88, 53, -24, -18, 27, 4, -103, 153, 144, -99, 256, -82, 74, -67, -76, 51, -3, 19, 93, 99, -7, -3, -26, -237, -65, -65, -85, 34, -24, 56, -116, -17, 1, -283, 47, 62, 179, 92, 180, -150, 71, -23, -118, -190, -62, 110, -72, -151, 101, -108, 64, -124, -109, -80, -112, -46, 6, -99, -16, -135, -49, 259, 118, -13, -163, 116, -248, 141, 78, 84, -107, 17, -62, 147, 2, -50, -55, 26, 70, -8, -51, 160, 87, 100, -67, -56, 34, -123, 0, -130, 25, -90, -22, 173, -153, -97, -32, -84, 5, -4, -18, 266, -150, -20, -168, 39, 17, -186, 10, -10, 41, 51, -63, -4, -25, 22, -95, -118, -55, 26, 11, -20, -130, -100, -89, 105, -159, -99, -85, -81, 75, 64, -185, -107, -92, 105, 140, 96, -123, 57, 102, 64, 92, 202, 127, -55, -94, 0, 55, -118, -13, -43, -59, -131, -39, 101, 17, -41, -150]
6252a50J84j17J29J20k53K28j42k22Q0L3J10j0n6R2k56N06k53j05K58j27N1j80
6274h0j5K2J06k08K72j91K80j68j45J15J02j44K58j28j12J32j33j5O9j1n9J12
6296E9j94O3K88k21j64J60J46m4k4j19L6k35L88O7k76ML2J02j16J4K24k33K1j1
6320c3K0j4j72K62q8k39K78k0m2J37j5p6k8J06k2K5N5o8j31K10j02j10Q0J06r6
6345B3j88J84J17k6j84m4o1K44j19P1j9o9J35Q7j17J17k80j3J36RJ6q0J01j9m1
6370b0J4q6N0K11j92j25L56k50L8J00j72M9K24j54J5Q0P0k16J09j86j1K31j56
6393b1r9K02J42k52J55k0j98l6N8J76M1o5k6j42J3j7J28j28O5J68j51MR5j01j73
6418a82J7p3J52j58L11o5L3l30L42k26J20J69m49M71k80L80l23N2jJ1L7o7j6O2
$$ y = [-150, 34, -83, 46, 166, -87, 141, -1, -223, -143, -110, 0, -10, -66, 26, -230, 276, 23, -82, 176, 49, 100, -80, -95, -73, 33, -175, 97, -94, 186, 18, -127, -12, 90, -54, 204, 76, -36, 96, -37, -52, 17, 6, -53, 59, -135, -72, 216, -5, -169, -9, 137, 93, 69, -50, -14, -249, 139, 206, -70, -66, -34, 68, -48, -34, 190, -43, -22, -33, -13, -27, -199, 63, -25, -264, 14, -6, -48, 89, 74, -2, -30, 76, 54, 79, 134, 66, -65, 145, 43, -67, 13, 119, 23, -165, 19, 136, 110, -74, -118, -179, 65, -54, 17, -2, -71, 64, 151, 34, 151, -129, -142, -6, 3, 19, -61, 40, 21, -20, -6, -92, -42, 169, -23, -148, 208, -42, -4, 96, -76, -27, 197, 43, 58, 138, 208, -8, 101, -85, -96, 135, -21, -120, 82, 224, -28, 127, 107, -91, -127, -69, 107, 148, 83, 57, -85, -72, -89, 39, -89, -24, 144, -7, -3, 92, -9, -182, -165, -238, -86, -244, 67, 2, 35, -295, 47, -179, -59, 110, -339, 132, -148, 232, -91, -39, -40, -29, 8, -59, -75, -13]
6442a3J14j58J05J94j87R8j40m3k6K81j73lN6j58k34L77j71M0J45j45K10k95K80
6465A54j85N5J07j71J5J1O8k50Q8K38k02J17rj41J24m1k20O8J08L0J1k8K19j09
6489E7K27k85M2J00k37Q3j82J75K55m0l31K01j30J3j85J40J07qr4K88k50J04J7
6512F7K2j39o8NJ12k4P4O6j37q2Q3Q1j29MO8q6J08R6l7j71J22k04Q4j47K41p0
6538f1k35J56M4J62j49J10k39L08k34L33j15r8Q5j3n0j58J57L9j33k3MK25r1j22
6562i8Q3J9L1J40j39j42M4j69J55q2J20N2m0j35J65J1k33N16l45QP3J3j06J06
6586D7q6L35m18J10P5J22j12m0mJ5p2j5J40k34o4J24R5r3K68j92Q1p0j19J52k22
6611a77J44L9j07J77k8j3n8o4m4J83O7L4j66j16K32j81K20j14p3O1J12Rl82P8
$$ y = [-13, 101, -57, 48, 242, 55, 153, 13, -30, -56, 225, 52, 49, 105, -53, -287, 90, -81, -41, 104, -41, 169, -126, 154, -31, 24, 131, -40, -25, -14, 54, -196, -108, 130, -72, 45, 36, -105, 19, -22, -242, -174, -66, -36, -25, -53, 166, 57, 284, -1, 41, 141, -96, -13, -195, -20, 235, 195, -136, 65, -65, -52, -237, -97, 10, 2, -92, 196, -54, 50, 67, 89, -50, -118, -113, -1, -25, 49, 115, -22, -104, -21, 60, -69, -65, 3, -83, 25, 121, 84, -87, 35, -169, -85, -232, 9, -61, -296, -140, -96, 66, -83, 27, -212, 96, -138, 195, 80, -18, 67, 54, 4, -154, 3, 42, -91, -114, -110, 115, 24, -98, -15, 4, 35, 175, 36, -106, -62, -231, -76, -158, -38, 14, -26, -161, 4, 15, -218, 298, -47, -39, 34, 47, -59, 47, -39, 296, -122, -12, 63, 185, 73, 33, 29, 44, -28, -43, 97, -137, -201, -77, 18, -75, 193, 1, 82, 12, -107, 45, -177, -33, 6, -101, 76, 48, 35, -23, -87, -131, 52, 119, 153, -13, -129, 103, -78, 142, 28, -45, 16, 128, 137, -245, -167]
6635a67K53o4J5l7n0J41Q7k58m8J18MK2N0j0k4n7j19L3K23o6n1J42j22N5m6M0
6661F4j57l4K3K3J84n5j08N4k2K8j35J39Q9n8j20J37j29o8J92K15m92N5J85J63
6685A73l59M5K77j58N3m0J86j35M7k71J44l8l7O7O1K8p0J21q4m8M2R3q8r3J40
6710E6m6n3r6J47j58q8L29j15K8j59J68k9J12j41l4N1Q7j35j04K49m5J09j56j0
6734c3n1m6k2J49n4J15MJ22k36J96k95J27j62J9J25J04r0M6L6N6Lj39r7Q7K9N6
6760D9j00J14O6p8m05K66J52j10K7K3n7M1J49q2J71k70J42K3l8J9J4n3q7J22k17
6785a19K18k04J87K9j62K31k12OJ70l1j33J5K45Kk81No2JM8O8j38JL50l11ok2
6811a05J68j27L8J71Nj48J44M7j77J94l14K50q3k5p2Q5j06n7J05l9J84m34J94
$$ y = [-167, 86, 22, 37, 0, -50, 91, 178, -80, -128, -10, -6, 16, 66, 56, 32, -25, -144, -111, 112, 46, -5, 137, 15, 70, 24, 64, -93, -127, -104, -81, 103, 48, -60, -6, -28, 0, -135, 4, 93, 35, -85, 52, -77, -145, 47, 262, -230, -175, 10, 173, -186, -141, 136, -22, 31, -9, 177, 42, 89, -182, -38, -76, -113, -46, 15, 43, -27, 94, 10, -38, 4, 97, 9, -84, 56, 10, -43, -139, 8, -150, -238, 91, -24, 4, -155, 13, -16, 96, -45, -79, -28, 59, -76, -180, 69, 24, 133, -23, -33, -84, -130, -152, -3, -57, 58, 62, 184, -52, 144, -151, -24, -186, -167, -42, 62, -28, 18, 54, 110, 113, -26, -123, -36, -7, 49, -51, 63, 129, 51, -354, -88, 64, -46, -19, 4, -53, -12, 137, 55, 226, -44, 98, 121, 83, 102, 116, 63, -24, 98, -119, 99, -105, 82, 111, -51, 180, -32, -26, 144, 113, -20, -5, 240, 242, -39, -34, -96, -95, -47, 21, -117, -116, 234, -77, -83, -105, 63, -64, -26, 145, 150, 2, 146, 193, 16, 210, -104, 146, 63, 38, -34, 51, -55, -112, -7, -46, 138, -296, -102]
6834a02J25m5Lr3J62j58J74ml3j29J52l9J12k07J65Op3K50j85j35K17k52J0o3
6858a42K30k68j54L16j22J67j51P1J44k3j50K7K2m8P5K20l67R2P4j75J77n3j5
6881e3J44o5P6j1k10J36k0L3J45m18K06N6m7n4J54J3j52K11l7j22J47k43J43m8
6905a6p9O5M6P2r9n9J77m9L1L0l07J50J39r2o7RPj64K51lj28O2J5q4J96j72O1
6932hj29R1n8N3K9r8P2k24K38L7K1M0r8j12R7O7K15j28k85J85r8K32k76M4J27
6957C4r8Q5p6J03l07J93M7k19P9J62J8M2Q0k94K90k95L2J56j13P1J08R7j57N4
6981I2Kj7q1m5J15p2k3j1m3K3m7K6j36K84n7p2K32n8n0Ol45K48o0K25j02j14J94
7008A14r9n8J99k42Q6M8O3rj58J84j80O2j12J11k9PM2j09J58j47K17n1jq7j83
$$ y = [-102, 23, -22, -19, -112, 50, -108, 66, 62, 29, -100, 52, 13, 125, -82, 83, 89, 16, 266, 81, -54, 163, -89, -79, -142, 88, -180, -334, -18, -140, 27, -124, -53, 91, 68, -82, -55, -33, -81, -6, 214, -153, -61, 13, -162, 15, -38, -53, 91, 26, 102, 91, -119, 17, -3, 30, 175, -243, -37, 19, -28, -82, 72, 85, -67, 144, 107, -15, 132, -111, 32, -16, -95, -30, 16, 88, -11, -70, 107, 58, 89, 119, -188, -38, 101, 9, -58, -49, -42, -206, 45, 42, -86, -24, -9, -93, 103, -69, -8, -137, -46, -104, -51, -22, -120, -48, -272, -34, 3, 24, 64, -34, -146, -49, 18, 233, 105, -180, 5, -93, 139, -137, -93, 34, -64, 21, -55, 48, -259, -66, -19, -238, -159, 3, 21, 63, 143, -151, 139, -156, -124, 32, -81, -10, 98, 195, 38, 92, 94, 77, -4, -49, 66, -6, -29, -40, -83, -60, -107, -81, -217, 67, 10, -62, 170, 112, 62, 68, -277, -29, -89, 136, 34, -80, 114, 15, -43, 156, -86, 0, 48, 111, 102, -56, 128, -52, 10, -102, 9, -20, -13, 29, -80, 78, -69, 148, 97, 96, 9, -174]
7033a74Q7J09R0j74P2l8J90l47R1M6O0NJ57j80O7K9J54j44j16j9O2N6n1J49k85
7058a04J86l8J24k65K96k33r6Q4L22k2l85K15q3l1o4K49k28J53k26j1L64p5r8
7081C4l5j21K16P5k30K50j29j9k41J60J73k18O7oK22k24J16n7k25L16L3k09M1
7104a1K03L8j60j7J47l03J13J20L8o7j16L6M0kj46K0K34j06j8j59J58L8k80M80
7128B80j70j30j9K29k65J31r6m8J1O3P7j84J64L5k8J91j34j2P6l30K47J6n4O5
7152A15r8q4P9J81l4j22l2q9N9N0R7P6k04j24M4RnJ77k44nJ96j24K13j35Mj26
7178a26kJ43J0J8o1jq0p6K53k3Nr1M4j11N3j00J39o6M1L4j13J32o0oL7K98k38
7205E3k1q7Q4l8m8j14O3q3J33q9PR7K31j82j38K16J4j98L56k48K5J10k21m9j7
$$ y = [-174, -87, 22, 112, -62, 10, -28, 162, -185, -94, -48, 12, 17, 174, -6, 61, 90, 244, 100, -16, -35, 27, 83, 32, 181, -104, 82, 44, 168, -97, 199, -34, -130, -46, 276, 254, -131, 84, 1, -30, -94, 155, -73, 80, -146, -157, 207, 132, 34, -1, -122, 94, 169, -61, 189, 60, 41, -200, -40, 133, -85, -18, -24, 198, -26, 90, 33, -192, 124, 157, -52, -11, 192, 230, 70, 53, 200, -103, 10, 130, 168, 101, -15, 21, 61, 59, -87, -67, 167, 61, 43, -116, 42, 80, -200, 280, 110, -20, -39, 190, -75, 56, -40, -88, -77, -14, 63, -121, 43, 78, 50, 241, 107, 95, 171, -159, 88, 104, 50, 115, 17, -67, 12, 193, 159, 37, 5, -84, -25, 25, 122, 198, -6, -130, -86, -77, -82, 95, -149, -154, 42, -82, 131, -4, 0, -126, -128, 15, 25, 43, -18, -19, -99, -175, 78, 55, 60, -31, 13, -98, -45, -145, -6, -72, -31, 3, -110, 22, -38, -44, -7, 291, 53, 32, -55, 29, -9, -57, -171, -108, -191, -58, -147, -140, -43, 188, 6, -132, 84, 98, -100, 256, 8, 33, 143, -78, -127, -144]
7230a44J85j07K37l14K04n1lL3q6j38L61k85m3m6K1K22J09l3j49j3k4j14J46j09
7254a41J70jj47J03l5J77j30K6l2J36Nj12l8m4N8J13j6j5M3j28j15M7K84k80o4
7279a36M9J75k35m5J17J15o7j17J42l3j14K9R4O9N7m1j88J35p7M7J10j62J83q3
7303B4j3K04k40n8J34P4l7m9n9Q7j85K99l2K6l23M98m63J60j78J25M1l8p0M8O1
7328C6q4l6q5J60J12j5J7j26J32r1k3nqM9k02J78jJ40l13O0K91l1j93M4k6o5P2
7355a3P1j72J69P1j22j45K59q3m8J24M5j96Q9L6j13r0J99o3k43J83k6j39J92J49
7379A34j59Nj8J84Lj57j85L49k26K3p4J0J73J70j10m3J7P0j96J15r2m9o7L9N4
7404c0J3J37P6l80J04L02k32K76k59J54k95N3L86l97J55r7k8J25K1l8J7J49j55
$$ y = [-144, 41, -66, 171, -143, 61, 10, 7, 40, -46, -184, 177, -108, -151, -197, -176, 46, 155, 122, -27, -40, -64, -178, -32, -141, 29, 28, -119, -16, -51, 126, -4, 22, -10, 126, 131, 19, -19, -63, -5, 108, 92, 77, 120, -8, -123, -76, 208, -72, -136, -87, 88, -147, -192, -75, 40, -27, -144, -2, -35, -149, -120, -26, 43, 100, 59, -129, 6, -71, -24, 86, -76, 107, 24, 11, 215, -25, -83, 51, 125, 88, 39, -20, 67, -118, 181, 149, 175, -148, 350, -113, 47, -131, -6, 35, -3, -73, -25, 36, -48, -84, -169, -9, 103, 88, 105, -21, 111, 20, -3, -8, -16, 33, -169, 9, 8, 148, -165, -105, 186, 155, -38, 6, -20, -85, -13, 58, -114, 55, 126, 4, -141, 118, 35, -13, 111, 156, -40, 49, 85, -28, -118, 81, 18, -225, -42, -68, -207, -15, 134, -25, -20, -38, 146, 149, -8, -193, 156, -70, -47, -121, -111, 62, 232, 122, 79, 96, 166, -30, 85, -7, -56, -123, -84, -30, -17, 120, 196, -184, -80, 222, -10, 266, 7, 161, -134, -81, 305, -92, 63, -34, -62, 63, 84, 46, 63, 212, 57]
7427E7o1LK15o4j89K1K68k89kj65J54J05n0L1m0K50j52j76j75K48N4M1j90J52
7451D6Q6j58N6j2k11J34qJ90o2p5Q9M0J6j49n9R3J5p8lj3K42k19L9J14p8m9j7
7478c1K09l14J85O9J26m52K75j4k67K41o3K02k03K37k25k38L34j33P5J12j21K43
7500B47k31J57j63p9KPN2l8O2m7Q4k0l1N4L4L7j10k57J77M00m03q4P1J32m7O3
7526F9O6m4j96J54j85J56n5r9J27Q6k02J9R6M4lJ84k54J27k72K65J1k03M3P1j7
7551a2Q2j30k0K8k4L0qJ29k13J17N4j67M0J10J5Jo8P5j34J63J1R9k9j35k03J95
7577Fo8J17p8n5j12M13q2m4j54J17j08j4J08j09J74p6J30M9j91J58k41jNj65K71
7602E0m9j6J23j15J50n5j70j12K30Q8o0j82j31M24k53J43j58K76o4Q8k04L7q2
$$ y = [57, -4, -1, 214, 150, -39, -18, 250, -39, -41, -206, -52, 53, 3, 34, -6, 244, 92, -84, -259, -11, 43, 84, -106, 46, 132, -26, 30, 18, -193, -59, -67, 123, 61, -14, 75, 115, 131, -18, -77, 16, 31, -47, -50, -63, 179, -40, -1, 113, 35, -14, -31, 178, -136, 49, 118, 244, -208, 67, 53, -214, 27, -36, 166, -37, 200, -25, -263, 71, -62, 13, 125, 4, 247, 16, 173, 10, -69, -67, -60, -8, -46, 16, -31, 53, 33, 2, 56, 90, 127, 17, -240, -63, 337, -66, -150, -79, 53, 6, 69, 135, 91, -105, 49, -136, 20, -35, -134, -7, 79, -123, -104, -8, 36, 33, 217, -37, 90, -182, 83, 94, -109, -66, 5, -12, 70, -60, -80, -52, -76, -46, -54, 75, -138, -21, 33, -134, -94, 16, 31, 32, -36, 39, -95, 68, 79, 178, 149, 14, -189, 6, -62, 55, -23, -78, -190, 223, 141, 97, -57, 60, -48, -62, 46, -63, 111, 35, 165, 214, 23, 181, -60, -61, -56, -221, 50, 1, -15, 108, -7, 143, 88, -82, -194, 36, 124, 64, -118, -249, 175, -78, 65, -93, 183, 119, 207, 3, 40, -42]
7625d2n1L01m1r7j29K1m7M3n2K08n1q0o6J08j12P2K8J06L7k09J11j15K2K58l77
7650a54J62m7K27J6j67j58R9n1Q1%j76O0J06m4J21j54J84L9p6k17K48n1m0O7j06
7675c1KJ05m1J08q4J2q7p1J23j34j29K23J27j27P8r3q2j7M0J80j20r8j02J85J44
7700A11j83J35m8J14lp2n5j28J51p5K2Q2j12n0O4R7j09Q2K0n3n0R4pN7J02o3o2
7727F1r5J37j54J7R4j30O9o5M7K2k38J78J82l29M32k64J9J5K7J06l45L12o2k9
7751GO0j18j49K87K11k14j81J20J30k45Q0Q7k06J03J33j54J31j06oK0N8l5Q1K8
7775A22k6j62l9K04j78k6J75j34M26k19j77q2J27m6J20N2j60J66njl22N3J47N3
7799F8Q0k01J46j27J79k86J02J16j84K2P2m7n3J09Q4R5J6l07n0K57j9j57Q2n2
$$ y = [-42, -93, 208, 167, 70, -59, -38, -85, -42, -94, 114, 63, -17, -83, 25, -87, -15, 13, 119, 156, -53, 58, -57, -35, 223, -154, 8, -39, 188, 204, 37, -121, -22, -73, 8, 8, -168, -108, -2, -46, 75, -79, 105, 144, 68, -149, 99, 48, 8, 75, -31, -29, 76, 35, 143, 59, 71, -16, -87, 36, -98, -227, -4, 123, -4, 74, -19, -101, -118, -78, 102, -18, -116, -218, -33, 111, -72, 63, 15, 129, 126, 54, -1, -129, 22, -53, -31, 51, -61, -111, -47, 50, -59, 23, 43, -10, -60, 34, 27, 84, 186, 123, 61, -34, 103, -51, -34, 60, -70, -1, -66, -19, 3, -235, -57, 125, -204, 228, -36, -17, -2, 25, 131, -214, 98, 36, 7, 67, -51, -200, 87, 298, 84, -97, 23, 153, -92, -12, 75, -131, -28, 105, -49, 82, -24, -30, -10, 48, 13, 94, 122, 96, -66, -105, 99, -79, -105, 70, -64, 362, 143, -34, -116, 11, -35, 85, 137, -23, 143, 138, 137, -185, -132, 15, 68, 148, -53, 93, -34, 145, -141, -39, 77, -107, -85, -13, -60, -113, -4, 80, 175, 191, -116, -166, 91, 72, -85, -3, -55]
7823e5Q5o5j46K49j18K30k86M6J0j26J62Q2j61J43n5j47J23J1J45J2q0kj57J31
7847C1qK09j38j04J02j28j86J43l0J02k34K45j26J98N5l56J36J06J04q9j62J14
7869a6n2r2l6K15N4j84M67l66J0J43k27R9J87k74j04J31M0R8j33JJ28j78R3R7
7893A01l18M98l31K5j3J44j20l5R8J51k35K01j52or1J2K60J5l11j22K47n6J41
7916A03K3q8l2O7k7Kj12J1q9K92k41J07l3J13p4R9P8k05L07l24Q6M2r3r6n4N7
7942h1J14j12M2l0m3Q4l5j2J41j23P3m6n5j3K5P2j02J12j49K98k0M5k45K3J08
7967G1o0l1j23l6K15J79k06p1M7r5o5J98k4M4k86K75J06OK2j23L9j11M9p5J62
7992A07q7q8J39K7j58N5n0J0R1n5J2J01j18Lm1j25O8m7J00N8O3k63J08O6L0J35
$$ y = [-55, 30, -35, -181, 68, -50, 180, -106, -60, -50, -176, -14, 68, -93, 50, -5, -152, -29, -18, 127, 139, 59, 57, -100, 31, 23, 232, 94, -10, 92, -36, -222, -79, -109, -7, -241, 4, -122, 76, 131, -225, -89, 17, 121, 32, -130, -16, -68, -160, -196, 19, 73, -111, 356, -10, 0, 143, -84, 15, 202, -72, -176, -45, -5, 93, -40, -39, 89, -89, 4, 101, -217, 281, -50, -25, -38, 106, -14, -49, 49, 200, -35, 166, 14, 8, -83, -71, 189, 204, -107, -229, 18, -38, 103, 126, 38, 6, 73, 46, 48, -64, -53, -142, 150, -91, 16, -17, 96, 22, 121, 199, -6, 301, -23, 63, 105, 12, -84, -138, -81, 33, -79, -37, -67, -110, -26, -61, -73, 68, -55, 18, -28, -83, -96, -71, 1, -101, 11, -138, 160, 140, 185, -60, -37, 71, 11, -20, -143, -179, 36, 215, 9, -62, -15, -110, -175, 23, -1, 43, -243, 32, 138, 144, 166, 43, 82, -29, 20, -55, 107, 20, -68, 71, 98, -60, -5, -55, -45, 46, -9, 3, 104, -14, -11, -52, -177, -109, -156, -56, 2, 65, -198, -90, -24, 6, 141]
8018A41k04j8Q7p0j2P1J24R7k56OJ94j19j83J62P5n1l3J81l18K6o9K71n6j13Q8
8043B1p3j47M38k38l3L5K35j69k27P6K16j95JN6o2J3j15J93N3m9m2N6M1j36J03
8068E1n1J9p9k4J2Q2k21J93K17k47o7K02l28K77N1j75N8P8p6j18L2J42N9N2%j49
8094a0P4o9R7r3k9K7j57J02q0J06M8M7j50J72j76L4J26j44K15k09K70j87m4r1
8118a21J32j27J24j61J26k97M38j80Q6M3QN9j55l7J89j21R2j51K02J7j30K3O4
8141A23j81J58J25l15N2%J03k56J19J65oj80J92j44n4K88k13o7J67P6k59Q3o4
8164h8J80k09l9J98L06l88N7j53J45O5Nl37K05n9J3K1m4J34j24K09q1N2J43l23
8188a12L8N2J
$$ y = [141, -63, -81, 6, -64, -76, -5, 119, 216, -40, -34, 160, 41, -142, 20, 95, 44, 11, 192, -126, -100, -169, 102, 46, -67, 21, -52, -199, 239, 1, -32, 3, 238, 69, -158, -82, 134, -61, -60, -4, -66, -53, -168, 25, 78, 29, -13, 43, 84, -52, 51, 0, 19, -60, -84, -72, 10, -211, -18, 199, -48, -115, 87, -241, 36, 87, -88, -30, 48, -28, -146, -114, 28, 87, 139, 139, -10, 64, -5, 92, -1, -30, -3, -160, -58, -138, -32, 16, 63, -87, 85, -91, -57, 69, -75, 140, -69, 201, 14, -30, -121, 11, -116, 8, -153, -27, -324, 114, -66, 20, 63, 71, 130, -25, -62, 127, 6, 98, -53, 149, 166, 36, 59, 123, -58, 100, 225, -90, -38, -38, 65, -191, -72, 93, 87, -93, 99, -45, -99, 189, -24, -91, 76, 152, -107, -24, -88, 92, -117, -156, 42, 348, -40, 17, -136, 9, 74, 79, -258, -53, -112, -99, -78, -122, 12, -112, 97, 16, 68, 211, -112, -74, -22, -21]
8191b1
$$ Imaginary data points
##PAGE= N=2
##DATA TABLE= (X++(I..I)), XYDATA
0@%%%%%%j6J6%J6l2L2m8O4q0J12j44J76k08K40k88L52m16M95n90O86p94R22j058
29e63J213j396J588j796K038k306K595k918L270l656M081m540N047n601O201o862
45c605P586q366R222j0169J1203j2340J3599j4990J6537j8272K0227k2446K4991
58A3177k7947L1433l5609M0720m7152N5518o6897Q3370j09446J57111k72116J054781
70H76943J205632k220609j403826M78126J468861N73760m68873r55796j51565
79e97347N04641K70002j49173K64872J77367n87114o94445K78698Q17081N45261
89H29843k03153r14415p71241N52129J209586J72952r16375n64652K19904M58224
99G2802K82701o0508l35672j39667M5856j37494N1956O42340L02580p42340p34762
$$ y = [0, 0, 0, 0, 0, 0, 0, -16, 0, 0, 16, -16, 16, -32, 32, -48, 64, -80, 96, -112, 128, -160, 192, -224, 271, -319, 367, -427, 495, -563, 650, -746, 842, -954, 1084, -1222, 1373, -1545, 1725, -1931, 2150, -2390, 2657, -2944, 3257, -3605, 3981, -4385, 4837, -5332, 5871, -6469, 7130, -7860, 8677, -9595, 10632, -11814, 13177, -14770, 16663, -18946, 21774, -25378, 30140, -36757, 46613, -62833, 94278, -177838, 876943, 2082575, -138034, -1541860, -1063734, 405127, 978887, 510014, -445782, -597347, -92706, 177296, 28123, 292995, 470362, -116752, -811197, -532499, 284582, 829843, 626690, -287725, -1058966, -506837, 702749, 875701, -40674, -605326, -385422, 72802, 355503, 294995, -40677, -180344, -134488, -271982, -220026, 422314, 724894, -17446, -752208]
110g52208K98741O98115J97754k84848l59044n7396L29686J58312l16512j15944
120b03344L84091P8253m73695j70302M15051L45397p8197l62319l62838J14424
130c13479N88015J76772n42449l03270M04731L13167k65811l38947N8262L74118
140A51109K45802l34121n72335J68459Q18541J63061p98251n39899L93903O58182
150C54451J77047l77642m95265j4004M56515J79043l21777j43353K56150Q5255
160A56420k23680r2231J50475J63453J8663k26614k79041J50838M70157N2396
170C40836m28158j86047K39896J68919q2621j13370j7187J05334J16003j09992
180C3613k00993J12137K51382j14153k96510N2395K81341P4377j42418j54851
$$ y = [-752208, -453467, 244648, 442402, 157554, -201490, -258886, 70800, 229112, -87400, -203344, 180747, 259000, -214695, -384997, 30054, 375451, 297254, -65065, -427903, -313479, 274536, 451308, -91141, -394411, 10320, 323487, 57676, -281271, -223009, 151109, 396911, 62790, -509545, -341086, 477455, 640516, -157735, -697634, -303731, 354451, 531498, 153856, -341409, -355413, 101102, 280145, -41632, -184985, 71165, 156420, -67260, -159491, -9016, 154437, 173100, -53514, -332555, -181717, 288440, 340836, -87322, -273369, -33473, 135446, 52825, -60545, -77732, 27602, 143605, 33613, -167380, -55243, 196139, 81986, -214524, -162129, 119212, 193589, 51171, -103680]
190a03680n0617J33369J61489j05622k01263J15841K48607p1450k52939l6836
200a63101J52976J20793n271j50018j15835J54892K00126j34024k25166J06529
210e8099J97433j05548j98059N1430K12599J20767j15529k96897j10149L11031
220H979L00137j71083l27266N322K13917J05751l2581j21911j19558O3680J56043
231H1430k4997r5534Q2979O7768j60162j27353J19306J65202K9668r4257j66549
242a22499m6372K14380J67398j74446k08302Q5522J41668k7880k9972M3388p642
253C5243l9999l1088n8349L8483J86541L1405k29687j05531J70404J24740n7911
264F4251q4958o5056p202J36890R6714j30255j13741R6829N7428r4083r596R2083
$$ y = [-103680, -154297, -20928, 140561, 34939, -166324, -50483, 198124, 126674, -126265, -163101, -10125, 110668, 105397, -44621, -160456, -5564, 194562, 60538, -164628, -58099, 139334, 33786, -164273, -112843, 99756, 220523, 104994, -191903, -302052, 8979, 309116, 138033, -189233, -183911, 30006, 135757, 103176, -18735, -138293, -74613, 81430, 56433, -39101, 43878, 111646, -48516, -175869, -56563, 108639, 138307, 44050, -122499, -168871, 45509, 212907, 38461, -169841, -84319, 57349, 29469, -503, 42885, 35243, -4756, -35844, -94193, -55710, 130831, 162236, -67451, -172982, -2578, 122162, 64251, -20707, -85763, -92965, 43925, 140639, 10384, -103357, -6528, 50900, -43183, -52779, 39304]
276C9304P417l8096j1075m7455L447J23563N913j73245j7860J78920L5546j23457
288a7078l0506L7986O664L1498l783r6441J5178J55184q446j67938r423J16029
300B8924L800m0949J2238k5720j0213Q6944J492j24189R155J22291k9970r7825
312f4022M7296O6971k9371j1979p067o4525K6282J16410l4641j23651M5416J01406
324F8525m8706n9844L4094l89j5858N0177p775p1988N1519Q6738q5866r6788Q0364
337a5797P7057m2497k2188K769l6284L2772P9634o0343j01672O2844Q2858n2974
349F179k8631N0892k0911m5953L8827J1205m2739M1479M5926q1833m1308R9540
361C2673L2650q4289k0294L2857o819L0763M8625o6137o9848P1361N1070p0640
$$ y = [39304, 46721, 8625, -2450, -49905, -46458, 77105, 83018, -90227, -108087, 70833, 106379, -17078, -47584, -9598, -2934, 28564, 24781, -71660, -56482, 98702, 90256, -77682, -87105, 28924, 32724, -8225, 4013, -21707, -31920, 55024, 56516, -67673, -58518, 63773, 33803, -64022, -16726, 50245, 20874, 8895, 1828, -62697, -36415, 79995, 45354, -78297, -32881, 68525, 19819, -40025, -5931, -6320, -22178, 27999, 20224, -51764, -245, 86493, 627, -96161, -15797, 61260, 18763, -3425, -656, -36940, -4168, 75466, 15123, -86549, -23705, 59153, 6179, -22452, 28440, 7529, -38424, 403, 11608, -31131, 10348, 56274, -25559, -66867, 32673, 65323, -18966, -39260, -6403, -13222, 17541, 66166, 29, -69819, 1542, 52612, -18028]
373a8028j6719O2297j3103l9652L2362O779l6348K8791K2488o9004r354R4252
385D4761Q334p9344J22L6310k0963N882L6482l6297l3761N8937K0670o3579J03
398b2343N1670k6833l6799L8907J5657k8579J7663J0857n4142M8O9949j0322o3727
411c7994J9852M3781k0303q141J7690k9765j7839N1035J1195m9401J0950M1537
423C2597l2694l1050L9393J2270l3694Q716J7438k7250N864M2826k4395n0387
435d0366K5882L4543k2627j979K5971k2131k4450L1369Q376l2632J4780L2882
447B9618l2366k7383L8061J9125k6684k400K108k6479J2626M8769j1189m3853
459b0047J0169J6092k3838P210L8650j5072l7677J2796J7792q828J4004J3476
$$ y = [-18028, -34747, 27550, 14447, -25205, 7157, 13936, -22412, 6379, 28867, -40137, -49491, 44761, 53095, -26249, -26127, 10183, -10780, -4898, 31584, -4713, -38474, 20463, 41133, -22446, -22343, 29327, 2494, -34305, 4602, 20259, -8320, 9343, 20200, -33942, -33894, 36055, 25733, -37994, -18142, 25639, 5336, -2805, 14885, -14880, -32719, 18316, 29511, -19890, -8940, 32597, -97, -31147, 8246, 20516, -13178, -4462, 12976, -14274, -8410, 34416, 10021, -40366, -14484, 20059, -2568, -4547, 21424, -707, -25157, 6212, 14588, -18044, -3264, 29618, -2748, -30131, 7930, 27055, 371, -2029, 79, -26400, -13774, 34995, 23806, -20047, -9878, 6214, -17624, -10414, 28236, 13164, -24513, -11717, 6075, -2753, 11251, 24727]
471B4727l8433k4235L8973K3056j7071L913J698l7990o211M7978J1845k9633M59
484i24L834k7103O933M4953k803l8244m380O321l357K8469K5542l7593l5532K5130
498h754J5557j7214J8509K6106l3656l2874K4642J9624o386J1859l602m2793l722
511c2704M8949J2999k3417l816j4215k7881L0814N3763k0386m5243R027R243j7851
524b0718K0681L6454k1750l4607N493L725L790L8246Q778n7385k6054L5750J6295
537H698Q88K5477j4670o4530j59O4287J4204l0999q133q264j3034L0638K9215
550C3618k9633k1921J9589o587j6702L5414K2799m0880j8065K6561q717j5737
562b0261M0181K0524m8508k6294K4558J4520R277J2925l2273l7475L5568L8225
$$ y = [24727, -13706, -37941, 1032, 24088, 7017, 10930, 12628, -25362, -31573, 16405, 28250, -1383, -924, 2910, -24193, -17260, 27693, 24890, -13354, -17734, -11413, -14770, 13699, 39241, 1648, -33884, -8754, 6803, -10411, 8098, 34204, 548, -32326, -7684, 11940, 5554, 17413, 13811, -28982, -32704, 16245, 29244, 5827, 2011, -12204, -40085, -9271, 44492, 24106, -21137, -12110, -2867, -20718, -37, 36417, 14667, -19940, -14447, -10722, -6932, 31314, 40092, -17293, -43347, -7597, 8698, 9586, 35063, 20393, -44137, -44296, 19991, 34195, 3196, -4937, -13201, -26235, 4403, 33618, 3985, -17936, 1653, -4934, -21636, 13778, 36577, -4303, -22368, 4193, -4524, -20261, 19920, 40444, -8064, -34358, -9800, 4720, 13997, 26922, -5351, -42826, -7258, 30967]
574C0967l1726j4881L6938o470m3213R026K6101p698J2435K3551l6744m1925K9889
587a3750L8012n425o071j5340l8296J7492O6618o362o0436J558K9397j7046k995
600a2644L6012m193l4326K101O731q166K7584K8005l9284m0496K0264K1084O686
613I358L0789o390p6270k4312P3802M6799k6373k7968k0741j8872L0843M7754
625C8419j6403l7394P397M912j5290J9274K4589k2687j3197K0240j5874k8721
637c4735L8465M4319l5000m6350R868K4883J9295J3631l0907m8552K0042N2407
649B7366o105k7233Q687k723k0995J5072K2504j6148k789K2977k1959m2613K2456
662b1503N3681P722k5403l2025k9051K0820O4370Q809n4348k1243J9186J747P630
$$ y = [30967, -759, -15640, 21298, 14828, -28385, -19359, 6742, -956, 11479, 35030, -1714, -43639, -13750, 24262, 18837, 12766, -2574, -40870, -23378, 43240, 36878, -23558, -22000, 7397, -9649, -12644, 23368, 19175, -15151, -13050, -6319, -14485, 13099, 41104, 1820, -38676, -18412, 2672, 9358, 40147, 33757, -42513, -66825, 6977, 53776, 27403, -565, -21306, -40178, -9335, 38419, 22016, -15378, -7981, -3069, -18359, 915, 25504, 2817, -10380, 9860, -6014, -34735, 3730, 48049, 13049, -33301, -23433, 1450, 20745, 34376, 3469, -45083, -25041, 27366, 21261, -5972, 2715, -8, -21003, -5931, 16573, 425, -2364, 20613, -1346, -43959, -21503, 32178, 39900, 14497, -17528, -46579, -25759, 38611, 47420, -6928, -28171, -8985, -7238, 392]
675C92K9260r603m2274k270K4680J723L435J5643j4790k9368M152J8682R930J6570
689B6162n832n0138j8455N4947M1259k4582l4287j4426o033K6470M7965k129n3095
702a2174k6323J7022K3840K0093J421k9310j6688K0761O304j8062J3891K9724
714C0499k0581m1737O126L2993J4476j967j6581k7195K306L4459J0471k0502j1583
727h816j411l86J7767J7522k1681k5481J6762J7241j6887n738K3442M456k2146
740e356j2109M879J3495K0307j092l0537j2993K0331J0933n141Q885J479k6255
753a3174r438K6575J2780j3555l882L013r715l633J1829M764n16K799j2036j5348
767a9537J6052K3208j1463j9766N749M558n250J3840J3318k1149k2062J3825K0145
$$ y = [392, 29652, 20049, -22225, -24495, 185, 1908, 5343, 20986, 6196, -23172, -19020, -338, 9592, 26162, 20330, -29808, -48263, 6684, 47943, 23361, -10926, -25352, -31385, -4915, 43050, 40921, -12174, -38497, -21475, 2365, 22458, 23879, -5431, -22119, -1358, 4946, -13116, 775, 30499, 9918, -31819, -25693, 7300, 21776, 19809, 3228, -23967, -21661, 12798, 23269, 2767, -8816, -10227, -10613, 7154, 24676, 2995, -22486, -5724, 11517, -5370, -11108, 12334, 16790, -5356, -17465, -12586, 909, 21216, 20124, -10413, -23406, -3075, 7858, 2717, 11602, 13081, -13174, -22612, 3963, 16743, 3188, -694, 2319, -7396, -11029, 800, 5564, 5048, 7847, -4189, -19537, -3485, 19723, 8260, -11506, -5757, -1199, -6449, 7391, 20709, -440, -22502, -8677, 11468]
780A1468J370n400j1882j2925J0655K0011p438j1954J1804J503k2021J58K4552
793I901K537j3542m82j891q392J1036J6485r802j3047M547M44k989J2752L149
807A0706j8717q31J8601n160j4576J1169Q603j5861l533J5233q51q034N210k440
821d81r969J0982J1566j3423o651J3199l444j2995J2298J1750j4774n347J3530
834F241m612j0609J1589O976j3666m47R769q652m574J5146J39j4589N502Q116
848F329j3189j390J8471l697j6841P974J0742j0720k191J1540o569q812J2437
861D084K595j3105N070J0721j2554o318J5847K36j4037O828P936j4017j300J7338
875I324l829j4221P403N587j0250M857J2252j0830r799J1772J749j0824R097R462
$$ y = [11468, 12838, 7438, -4444, -17369, -6714, 13297, 5859, -6095, 5709, 7212, -14809, -14651, 9901, 12438, -1104, -1586, -3477, -11869, -833, 15652, 5850, -7197, -2650, -2206, -5195, 7557, 10706, -8011, -8842, 9759, 4599, -9977, 1192, 9795, -6066, -9599, 5634, 4783, -3251, 1959, -481, -10450, 532, 12098, -1325, -7976, 5223, 1779, -11216, 1082, 12832, -1942, -7289, 6241, 1629, -8980, 2609, 9585, -4081, -4528, 5241, -3411, -7985, 7161, 7300, -7289, -1787, 6329, -6860, -8250, 10221, 6524, -10317, -2343, 8399, -2321, -4512, 7028, 459, -8353, 4084, 6679, -6426, -1356, 9365, -3189, -9507, 6340, 6576, -7461, -633, 7303, -6714, -8014, 9324, 5495, -8726, -1323, 4264, -5986, -1129, 11123, 293, -9506, 2266, 4015, -6809, 2288, 11750]
889A1750j5980o703J6752J283j2847O053M932j2260J697J4394o370j1087R334
902I48K893j0501O015J0623j2667p301J4630J145j2040O764P920j2465l196J3805
916F573j962j0271P343L240j1023K754J1549q050p591J0954R23j1753N492R970
930H148r935o119J1729J76r416O186N304j0729k26J1707m300q579Q372K759j0440
945e363L604R424q402o375J0534R58j0087M424P597q707l004R754k093q137O537
960F64M258r054J155R302n520p243Q743K972r049J747P411o513l706Q961n49r118
976e539M267O542o672k417P366k759o244O678L441q542J71Q340l613n973O467
991A513K469p501J441O607m380l492O363r46o792M846N730p067l393O794m89m996
$$ y = [11750, -4230, -10933, 5819, 7102, -5745, 308, 5240, -7020, -5323, 9071, 2701, -8386, 948, 3841, -6660, -645, 9978, -2689, -9990, 4640, 5785, -6255, 509, 8429, -4036, -7232, 6573, 4611, -5660, 1683, 4923, -6100, -3346, 8203, 153, -7438, 3516, 4439, -7314, -1822, 8148, -1787, -7906, 3823, 3999, -5417, 769, 6073, -4656, -4882, 6825, 2525, -6054, 2318, 5077, -5363, -1759, 7665, -737, -7112, 3422, 4380, -5707, -1283, 6314, -2393, -5397, 4357, 2264, -5873, 664, 4922, -4132, -2977, 6325, 805, -6438, 2305, 5277, -3772, -2025, 5386, -1127, -4833, 4128, 3579, -5539, -1272, 5270, -1402, -3819, 3547, 788, -5456, 1222, 4663, -3879, -3708, 4632, 1019, -4954, 1513, 3982, -3519, -2078, 4529, 149, -3343, 3020, 2074, -4718, 128, 5858, -1209, -4602, 2192, 1703, -3293]
1007c293M426K623p429k29P694k360n525N383J997o987J312O823l509l758M769
1022A937p20n792M937O488p201m850O092J227m599L756K796o963j142O718j651
1037A033m470N460J404q147N48Q306j345m936L191m49n693M914O951o029n470
1052d732N991O69n385M009M568o022k903N373j651l192O762J807j0388j024R342
1067C224n72m650L467K67o546K965O636m262k874N949k233p909N395Q017n008
1082A866m560L259k636k388R028K572j1126k409Q841p29m565M674R41o777K002
1097b007N045m961l44Q615l614j0854N275R126m343l402M070l824m679Q369L876
1112F348q340j059N687m663k883Q577J430q663J148M572n575K68R949k907j0690
$$ y = [-3293, 1133, 3756, -3673, -3902, 3792, 1432, -4093, 1290, 3287, -3700, -2388, 4435, 926, -2832, 1937, 1217, -4575, 362, 6850, -351, -5201, 891, 2118, -2481, 1275, 4071, -2892, -4034, 2684, 1033, -3437, 2023, 3427, -4720, -4172, 4134, 2789, -2147, 1044, 595, -5098, -184, 6767, 738, -4732, 1259, 1928, -3457, 552, 5120, -902, -3805, 1568, -83, -3275, 3487, 5294, -5094, -6118, 3224, 2652, -1998, 1469, 1736, -4810, -1845, 4791, 529, -2345, 3604, 1371, -6538, -1143, 6874, 1866, -2694, 565, -2071, -4459, 4569, 7141, -3985, -6394, 2447, 1718, -2847, 1827, 2768, -4009, -2007, 3038, -1923, -2267, 6348, 2734, -8120, -2845, 6281, 1938, -1464, 2606, -1218, -5897, 2472, 6348, -1992, -3051, 2636, -2027, -4910, 3667, 5097, -3566, -2418, 2154, -3421, -3153, 6796, 3889, -6801]
1127f801L866O877n043m30O514l394o403M500J937l636M921L672j0935m918J2542
1142C269M341r266j326L769l914J155P574l607p421N125L470o918J531Q277l119
1157B940o384K971o90l329Q544O157j2668q177J0572O517n048j108J6m936K365
1172b258O578l877m671P503P57r567J784R084l538n472M891J84n601M149O378
1187F324o321m201M986K4k886M834J071p639P4O797k787k728O487r98r691K535
1203d119R590k929n596K992J825l554J008R80k214M120N170q260q338Q888Q071
1218G634o061m644K467o79K29N080j192p969K470O876l041m607K581J298q24K762
1234B380j477n577L789Q152n838r790N261R114k008m502q01j486J086N287p86
$$ y = [-6801, -2935, 3942, -1101, -1531, 4983, 1589, -4814, -314, 1623, -2013, 2908, 6580, -4355, -9273, 3269, 7610, -1656, -2982, 787, -3127, -1972, 5602, 1995, -5426, -301, 3169, -3749, -2218, 6059, 2940, -3444, -473, -1163, -4492, 4052, 10209, -2459, -10636, -64, 6453, 1405, 297, 313, -4623, -2258, 4320, 443, -4228, 3275, 4032, -5535, -3751, 5333, 1795, -3677, 1214, 1398, -4203, -54, 6324, 3, -4198, 788, 812, -2074, 2760, 3831, -3808, -3734, 3063, 276, -2452, 4035, 3037, -6654, -4119, 5471, 2542, -3054, -62, 1763, -1791, -783, 197, -2017, 2103, 7273, -987, -9325, -437, 7634, 1573, -3071, -604, -1283, -1054, 4026, 2834, -5135, -2665, 4211, 1170, -3437, -856, 442, -382, 2380, 903, -4674, -885, 7267, 1429, -8361, -3100, 6014, 4006, -496, -1297, -2783, -1697, 3590, 2804]
1249B804n385J827K779l916r58N162m3m158J849J819m571j14N703o32m271J895
1265b10J912l052j59L400o48j816J422j046k152L598J701o095r37P755J364p804
1281b767j247N048R40k156o58p22N81L999j256n969J062P518K1n161j588m0j51
1298b546N297L202o664m347N536L562n159k305L828J949j167k083k652J389O713
1313D553j31q169j075P515O44n211k8K585q89N89K398k454l238K910J485k361
1329h77J057K102k888j812K426l60j265M258J367o747j965O536P25m725J000L711
1345B543j774k587P11L94J515L129l248n691L840N874m417m077M507K596l738
1360d23o68J863k532M05M128j701m281K842L125l184j231J887q52N70L874k676
$$ y = [2804, -2581, -754, 2025, -1891, -2849, 2313, 2270, -1888, -39, 1780, -2791, -2905, 2798, 2166, -2105, -210, 1702, -1350, -1509, 1891, 1243, -573, 849, -197, -2349, 1249, 2950, -3145, -4082, 3673, 5037, -2767, -4014, 1034, 1974, -182, -840, -1562, -981, 3018, 1762, -4207, -3145, 4373, 4394, -767, -2355, -2395, -2546, 2751, 5953, -711, -5058, 478, 4040, -1119, -3424, 404, 2353, 1186, -897, -3549, -2160, 4553, 4422, -3747, -4822, 2693, 3337, -1874, -1902, 683, -206, 383, 2781, 327, -2911, -1, 1484, -877, 180, 2282, -606, -2418, 8, -352, -1617, 2641, 4008, -2739, -4704, 1832, 2557, -2168, -1168, 2543, 769, -1818, -1107, -713, 802, 3931, 683, -5008, -1168, 4706, 289, -3788, 719, 3315, -423, -1091, 772, -1760, -1355, 2773, 1072, -3209, -367, 2758, -426, -1657, 230, -622, -52, 3822, 1146]
1376A146p085L856P685l325o026L409K970k975j025J105q06K554K179n210l975
1391e523O086L857n635j112M211j319k533K843L42m114K436M176l651l302L960
1406G22R63k690J200R38l213K318L242m959l256O706L352o880k136M602K3k219
1422a287J523J73j626K841O79n307J23O258r82m883J865K824l584L72L255k203
1438D1k592M186R21n182J45M548j038k278J877r22j565L314Q66n623J017O423
1454D138j932o001K327L953j964o81J039j435n40L504j392m313K608M187l238
1469B60k647K713l8j923K642O18l948N42M633j977m144K779K784k011p99R27j605
1486a194N86L299j901l991L078L563l798k681L626R43k118O26L34j919J183K731
$$ y = [1146, -5939, -2083, 5602, 2277, -3749, -340, 2630, -345, -1370, -265, -1071, 1483, 3662, -1548, -5523, 563, 4420, -1215, -2327, 1884, 565, -1968, 875, 1217, -2897, -461, 3715, 64, -3238, 722, 1685, -1005, 195, 1133, -2080, 238, 3480, -1479, -4735, 1971, 5323, -1557, -3693, 909, 932, -1287, 236, 409, -1217, 1624, 2303, -3004, -2881, 3377, 2395, -2488, -623, 2201, -1383, -1011, 2244, 41, -2551, 1635, 2556, -2626, -2481, 2067, 1029, -1249, 628, -294, -1859, 1455, 2321, -3302, -2285, 4138, 2206, -3795, -1468, 2485, 521, -160, 879, -556, -1096, 2408, 1016, -3297, -689, 3498, 260, -2387, 326, 288, -1635, 1007, 1625, -2323, -1781, 2852, 875, -3269, -490, 2294, 283, -516, 411, -1194, -608, 2691, 790, -3201, -123, 3440, -358, -3039, 587, 1530, -588, 38, 372, -1547, -364, 2367]
1502B367k891k121L530J040k763l18J956j037l90K318j016k708K299K507l207
1517d34j679L157N62k367M56L41q00J179J297k555j432L476Q64l376k92K840l06
1534I31j480P02O4j438J917R55k555p86K842K34k355M33J332r74R7R90j418j208
1552a717K683N28k755n43K822p3j753L92M41n77J205M98k252j52K794o6k795N25
1570g95J904r75o05J066o30q76J692M79k626J65K571o13k068Q46P82p26M17J070
1588A078j903m49K328j5k403Q51K037j242j377J448P6j002R11N61k149J22K759
1605A631j298j836J293J463k017j13J562q32p04J787m79j942J135K333j846j541
1621a404J810M11j432R55O47j884M4K459j122k232J955J159k024m48J654l08j065
$$ y = [2367, -524, -2645, 885, 1925, -838, -1156, 800, -237, -627, 1691, 675, -2033, 266, 2773, -434, -2113, 1044, 1606, -761, -305, 36, -764, 415, 1712, -843, -2275, 1201, 2065, -1311, -1603, 1237, 931, -549, 153, 217, -1221, 696, 1651, -904, -1690, 1152, 1386, -969, -536, 796, -178, -81, 909, -509, -1717, 966, 1494, -1261, -1804, 1018, 945, -808, -416, 25, -552, 653, 1151, -1101, -1253, 1541, 1475, -1320, -795, 1109, 134, -471, 595, -35, -911, 781, 1260, -1366, -1201, 1370, 757, -1311, -465, 317, -409, 8, 1078, -825, -1274, 1054, 1039, -1364, -513, 1524, 282, -1095, 353, 429, -573, 338, 899, -1250, -1128, 1631, 333, -1503, -210, 1253, -764, -877, 685, -147, -851, 936, 457, -1485, -350, 1983, 137, -1404, 406, 817, -615, 340, 987, -897, -853, 1606, 484, -1748, 207, 1366, -658, -1106, 548, 240, -825]
1638h25J874m09k449J446K174k182j188K315R4k077J380J021j947l3K121j145
1654A70j990K321J114k517j06K094r96j113J906R3k539J118J851j910o98K386
1670A184m49k276J379J519j931M6J750j077j674K499N58k689L00K152j464j249
1686a422K365p1k240J086J570j914n14K462q50j998J407J111j886L72K219j989
1702b92j373K453N28k175P11J649k136q47K599j01k154Q82J233j856j24K365r65
1719C97j822J953P30k680Q44K291j562j708K130J63j737J128J570k538o57K452
1735I54l77j332J113O10k182L98K189j264j634K037N74k348N09J894q97j388J853
1752G09j85j938J303J604j537o62J557j203o22K026O74l025J73K321r38j339J644
$$ y = [-825, 1049, 640, -1809, -363, 1811, -371, -1559, 756, 850, -1227, 153, 1174, -773, -806, 1315, 170, -1820, 501, 1615, -902, -1008, 1086, 90, -1023, 883, 976, -1563, -445, 1406, -504, -1202, 1184, 735, -1541, -162, 1357, -574, -528, 1222, 145, -1529, 970, 1528, -1161, -861, 1291, -173, -1422, 943, 872, -1368, -282, 1288, -626, -1140, 1322, 472, -1526, -119, 992, -894, -522, 1697, -292, -1665, 788, 1316, -859, -148, 1501, -635, -1482, 1117, 1016, -1138, -256, 977, -879, -1003, 1362, 397, -1425, 528, 1258, -1422, -578, 1713, 151, -1557, 573, 736, -1001, 127, 1697, -841, -1498, 954, 577, -755, 358, 968, -1214, -816, 1373, 109, -1525, 512, 1086, -1262, -753, 1141, 244, -1144, 709, 524, -1414, -111, 1493, -44, -706, 851, -352, -974, 1052, 1726, -1299, -1126, 1195, 257, -1082, 562]
1769E62L03j902N79J489j497n05J876k03j712P80J071j131R9J495j472j516K496
1786H12J004k318p53J646M8r87J048k9j597Q65R91j101k37J456n29j621J029J163
1804H90j480l6K044n61k397J056J295p99r3M61m69k21J140k37j514P00J125j360
1822d56m21J582k67j948J019J840j200j256R81L30l91R4J70p57J388O85j804j362
1840a773J874J296j681M2J126j134j193J921P96j809j6J084m11n07L18q8Q8R97
1858I30l93k171P58K488q22k348J449J478j281r05J009j31o66J151P8q14M6J73
1876B9o26j33J557n14j497J324J055k185n03K553K25j864j75J225j188L39J005
1893F27j41p84P73m52j212J214J725k261j150K678k5k503M45J995o31q28R76m26
$$ y = [562, 865, -1037, -458, 1031, -466, -971, 905, 702, -1010, -230, 841, -290, -191, 1304, -168, -1684, 812, 1816, -502, -1255, 391, 439, -548, 500, 471, -1126, -261, 730, -371, -608, 848, 319, -1302, -273, 890, -590, -626, 1418, 857, -1540, -484, 811, 12, -81, 380, -89, -310, 830, 593, -921, -221, 904, -456, -877, 705, 438, -1510, -491, 1349, 149, -1107, -126, 204, -187, -93, 77, -680, 708, 1393, -411, -1773, 101, 1397, -284, -242, 884, -250, -1443, 478, 1274, -535, -551, 533, 122, -385, -67, -155, -67, 930, 537, -1634, -876, 1612, 790, -1558, -109, 1369, 88, -817, 192, 61, -605, 546, 624, -190, -144, 29, -597, -730, 827, 313, -1184, 140, 1195, -990, -1493, 1060, 1285, -579, -754, 471, -717, -378, 627, 486, -298, 475, 23, -1189, 25, 1750, -511, -1661, 1017, 992, -1511, -1066, 929, 298, -530, 446, 20]
1911B0r67J326N50j713L41J665j141r78J471R2j784J131J964k131j693J822J162
1928A137j728M56Q90p63q0N52j281n95K557M61l003L24K428j182j313J771N14
1945A145k048L15J396j135o21J837P0j405N04M56j505N63J777j458j368K650K54
1962A427l158K52K757p43j375J078L63j194K97P07j096P28J643j634j717J792
1978A27J289k403L24K117j082j951J601R04j767M07J911j378j325J173P8p57J223
1995D91N01k059N92K241j894k086K364J865k185r40J427j1q77J260n18j080J502
2012E93N30k562J65K250l79j386J216Q27k388MK065k13j764J436O70j470l98J172
2030C68m21L2J260j258j615K111R34k209l10K335j28k116M09R81m17k27P58o24
$$ y = [20, -947, 379, 929, -784, -443, 1222, 81, -897, 574, 666, -1118, 13, 1977, -154, -1847, -25, 1137, -591, -135, 755, -8, -88, 464, -817, -1412, 1145, 1606, -1397, -1073, 1355, 173, -1140, 631, 1145, -903, -588, 808, -327, -948, 889, 959, -446, 58, 514, -991, -428, 1349, -109, -1477, 1173, 1427, -1731, -1479, 1278, 535, -840, 238, 601, -593, -296, 411, -685, 43, 1686, 52, -1665, 127, 1416, -987, -663, 1454, 372, -1579, 22, 926, -841, -434, 1477, 99, -1226, -53, 25, -732, 491, 992, -1067, -475, 1766, -128, -2214, 150, 2015, -170, -1110, 317, 306, -571, 689, 171, -909, 593, 1123, -1439, -1274, 976, 597, -789, 427, 1254, -1134, -1130, 935, 722, -1042, 394, 1064, -406, -804, 368, -53, -21, 1239, -19, -1634, 477, 1411, -798, -1108, 1227, 1099, -1017, -608, 373, -44, -271, 487, -137]
2048a37m67J220l48j421J091J516j395o86J192k93j452J203J304j473q03J510
2064E61n4j221M84N94l72L62M8j497n5K178j48k160P39J936j193j492J375P52
2082H37r25K34L08r62R8J299q26o99R39L07j179K09R59o84p60J348M23j784L3
2101h25J678n06j111Q29L72n20J62J84p77L28J228o95j563J394J031j602l05J184
2119D86L4r27N11R3p53K80R60m98r61P48N38j093O55M41q64j45J292m07j409P59
2139b60J448j356p27J274j51n44M39J38p16N55Q69j104j184J678M62j443l4J385
2157G29p99p42J205n1j242Q74J370j850m60J628l3j049N65M65j074K79J088j144
2175b41j073K155J63j829o5J738n10j007J046m15q51J222R78k166l37K190l51
$$ y = [-137, -604, 616, 268, -1153, -62, 1454, 59, -627, 565, 272, -1180, 23, 1327, -146, -949, 561, 507, -714, -230, 364, -8, 354, 402, -1095, -1150, 1028, 880, -1280, -541, 1395, 202, -1290, 85, 837, -88, 146, 454, -508, -410, 889, 63, -636, 303, 610, -569, -360, 599, -85, -845, 503, 926, -858, -825, 853, 347, -764, 65, 437, -83, 79, 263, -514, -186, 1042, 347, -1216, 178, 1209, -393, -698, 486, 520, -407, 104, 197, -556, -276, 684, 186, -775, -27, 511, -582, 73, 514, -350, -495, 797, 390, -1019, -260, 1188, -168, -895, 379, 228, -316, 123, 261, -455, 100, 969, -135, -1319, 359, 821, -622, -656, 729, -70, -812, 393, 342, -900, -26, 1344, -506, -966, 662, 629, -420, 145, 610, -464, -185, 903, -241, -1314, 841, 1004, -825, -890, 848, 338, -669, 377, -38, -889, 333, 1311, -855, -1192, 998, 647]
2192F47j382Q35P62j638M54J267j148q14J804K55k046M70J608r78p41J277m05
2209B27j659J879O05j906j23K081n64j863J485Q83j526P9J373j142p16K159m76
2226G96j993R64J517j639p14J758j56j596J280O20j904P31J945j580j320J900
2242F09N00j624K79J063j246k27J979r19j929J736J090j507p52J709m24j124R23
2259A36L23j704R65J748j662j100J844L21j674O34Q62j497M4J814o43j583J583
2276D11P74j951k8J802p79j043J384M7j535Q95J159j395r33K130j06j862Q81J062
2294I13j122o27J563q28o90J373L40j935M28J737p84j109J047L47j467Q69R67
2311A022j771l04J849j75j723Q05J183j131l47J125p47p04J485L31j806L10J682
$$ y = [647, -735, 100, 862, -776, -322, 945, -203, -1017, 787, 1042, -1004, -534, 1074, 96, -645, 632, 227, -1432, 447, 1052, -854, -977, 1104, 540, -1323, 162, 1045, -481, -402, 971, -171, -887, 1272, 796, -1197, -233, 1284, -355, -1069, 689, 533, -1063, 217, 837, -1067, -336, 1609, 29, -1291, 609, 1109, -515, -236, 827, -419, -646, 1333, 414, -1515, 221, 1311, -196, -948, 761, 337, -787, 136, 459, -1245, -280, 1468, -194, -1294, 550, 871, -803, -169, 693, -804, -760, 1054, 411, -1172, 411, 1185, -766, -794, 1008, 229, -814, 570, 617, -918, -23, 1136, -259, -1192, 938, 832, -1030, -149, 913, -209, -836, 727, -101, -791, 582, 922, -1013, -585, 1152, 368, -741, 306, 653, -814, 55, 1022, -749, -1053, 796, 621, -1102, -297, 886, -245, -592, 533, -214, -918, 567, 898, -908, -598, 1084]
2328A084q92r37J325m2j260P18J102j336m90J207l25j009J031O03j299L6J041
2345E57o57r52J156N68j323J75J060p83n25J142L10j189J91P89n71l53R93o84
2363i6n74Q96N35j337r4J285k69r72P13M09j044J78J012n73p34Q98J81q39K72
2382a53O61r49K40J039m15j413R07J034j089l31P60O3q86L93P15q46m7J080m42
2401C21p63L51K75p17O81Q16j287n58J384J14j107n7J179n18p74P89R8q79P82
2420A30O49j087r7J056n94q78R78L85j179M79J134j018j248J625M05r74J72N99
2438E37n90n11J091l07p46R54K77j279J34J298o68j292J472P17j688k26J217l92
2456bm79R37l20o42N98O16j329j86J793k90j538R78M91j499O6K000n97j384R37
$$ y = [1084, 192, -745, 580, 538, -722, -4, 1098, -238, -728, 479, 154, -855, 176, 779, -520, -484, 557, -100, -1052, 104, 672, -651, -476, 584, -199, -724, 418, 728, -461, -270, 519, -52, -405, 588, -96, -670, 226, 761, -576, -670, 615, 346, -626, 87, 496, -548, -370, 642, 69, -665, 233, 414, -425, -153, 508, -441, -201, 838, 423, -990, -83, 951, -138, -469, 291, 354, -532, -139, 576, -270, -317, 763, 321, -442, -91, 184, -533, 148, 964, -323, -881, 503, 617, -490, -547, 632, 114, -660, 129, 227, -652, 130, 779, -308, -405, 651, 57, -821, 157, 542, -637, -158, 976, -42, -1290, 335, 740, -234, -62, 537, -53, -564, 527, 220, -526, 428, 705, -574, -440, 858, 190, -1102, 370, 1087, -601, -827, 390, -2, -481, 456, 136, -506, 92, 708, -621, -807, 986, 696, -842, 136, 627, -872, -806, 1194, 597, -787, 150]
2475A50P56j335k50J048q02L0J195q95j460J872J248j971n55J853r4j648Q46Q19
2493H07j225J38J165j169m72R03L28j002R55P31k002J58J597n99j791J445J510
2510A477j736r96J523J94r09P17J26j018N08R39j581p7K284n00k247R64J616j760
2528d76q49K013J93j496N33M23r89L58R35o81o41J344m17j325J092J202j805m03
2546i89K026o4k460P76J923q62o23M37l93j35R81k71j595J595J291j982j272K008
2564C91M61j449N44J064j070m84R18j20r62P01O29j088M78N28q50m47J916j85
2582I75k186O61J600j016j346J530P62j014j49K38n65R7J009p99n00J447P1k044
2600a229N93J826p50r70Q85J75j263L91J053p83n32J061Rj180M41K22l04O16M13
$$ y = [150, 906, -429, -679, 369, -433, -403, 792, -103, -1563, 309, 1557, -414, -969, 884, 790, -858, -12, 807, -418, -280, 885, -284, -756, 147, 475, -527, 428, 1159, -843, -685, 912, 313, -1478, -33, 1477, -259, -1255, 268, 462, -447, 270, 396, -622, -114, 825, -756, -833, 1451, 951, -1296, -332, 1284, -476, -1325, 688, 881, -615, -82, 341, -648, -290, 645, -36, -677, 667, 250, -1075, 17, 1219, -586, -989, 1037, 973, -1487, -711, 1212, 350, -273, 164, -229, -364, 617, 346, -1249, 346, 1637, -345, -1617, 391, 852, -597, -53, 1011, -59, -543, 375, 255, -707, -6, 623, -465, 13, 541, -309, -756, 1160, 975, -1211, -550, 1050, 34, -1312, 218, 980, -34, -183, 55, -510, -413, 596, -203, -703, 744, 815, -1229, -636, 1190, 440, -530, 355, 530, -733, -342, 711, -72, -604, 457, 466, -714, -273, -51, -355, 261, 674]
2619F74j096r03J632N64j425l55J782l34j159K56M17k6N71k05r29K97P51l56q26
2638f70P49O78j151J6P64n15n65Q12P16p81n90P56n4o80J69N74j54K66l3j186
2658h79O03J197m91j114M40R22q22n44O23M10l41o7J49m42Q1O26m09m80O69M34
2678E65j106J32J037r13o9J027P4j342J27Q14lr36P35K21k69l6n4o16N75J234
2698A197j095q77R53N01j198j30J040r3q76L80L22n13K60J007r43k99R18l28o96
2717d70M51O85j064J82J006p52j141J135R80j289n15J041K8o22N83k37m17O95
2735B79M64j247k86J683l34j110M80J045j030l81R63m74o74J082J38j117J40J046
2753F67n22n45J146l99j037Q35O68j345j34J250j13j220N31P40q26J53O62l84
$$ y = [674, -422, -1325, 307, 871, -554, -909, 873, 539, -620, -364, 53, 27, 598, 393, -536, -239, 512, 156, -670, 79, 757, -394, -378, 386, -129, -694, 118, 834, 53, -537, 219, 165, -515, -346, 228, 74, 340, 307, -879, -276, 921, 430, -684, -244, 678, -144, -688, -65, 345, 4, -63, 86, -356, -275, 351, -58, -538, 131, 565, -541, -409, 628, -285, -354, 673, 747, -595, -468, 346, 343, -593, 142, 363, 94, 58, 4, -612, -37, 1197, 102, -775, 178, 679, -519, -649, 391, 298, -578, -198, 124, -389, -129, 878, -65, -364, 554, 226, -470, -19, 666, -398, -216, 790, 38, -1103, 32, 1012, -277, -792, 249, 277, -345, 238, 1, -416, 279, 743, -504, -790, 893, 559, -551, -71, 974, -56, -437, 526, 52, -622, 460, 598, -519, -379, 667, 145, -400, 746, 347, -690, 145, 813, -532, -666, 584, 471, -749, -218, 522, -304, -151, 511, 127]
2771A27p31J100m0j343O48J249j078n17R44N2r75N11N17j029J72J254q22r00J080
2790B19K40p11P4O75n67m15J184l37j249R13Q22j025m35R73l39n48N58K67p58
2809d59j76J371r27o28J130L24r95K20O50q12k73J171l65r40P77N45r32j93J052
2828E40k60p77P04J41p97K11Q28q21n50J086L12j091L45N67p36M2O81n79m14J117
2848E49%r49J51R44n93o08P69J90r11M39N27q20j72J079l91q33M52N84n84j73
2868c50L99k02l73Q30K36j060K02P61m18n22P51L3p69M96L45k95l90O30r3p08
2888d97N64K47o50J47K43j3j57K33Q2o78L48N99m65m66P17J45q47L20K37j18j64
2909a73N47k11m59M62L90o34k66M82r7j74j21M23n20L23N43o65k12L94M61p44
$$ y = [127, -604, 496, 456, -887, -239, 1010, -68, -585, 359, 411, -564, -53, 464, -565, -393, 861, 39, -861, 219, 459, -252, -178, 497, -70, -485, 699, 362, -887, 26, 848, -177, -612, 361, 22, -526, 32, 299, -459, -635, 736, -191, -819, 311, 635, -360, -140, 510, -302, -575, 596, 231, -709, 68, 613, -319, -512, 540, 280, -497, 207, 348, -449, -238, 590, -231, -781, 305, 617, -474, -129, 438, -298, -256, 425, -154, -568, 549, 549, -400, -249, 695, 102, -506, 263, 453, -458, -19, 508, -312, -484, 595, 204, -629, -177, 407, -177, -350, 49, -153, -526, 304, 540, -520, -318, 443, 25, -497, 254, 287, -482, 14, 359, 64, -326, 304, 211, -497, 67, 314, -336, -189, 54, 41, -116, 117, 199, -479, -131, 468, 3, -463, 254, 399, -448, -128, 109, -9, -173, 374, 163, -296, 166, 556, -78, -344, 138, 41, -133, -254, 169, -351, -28, 515, -150, -362, 32, 493, -251]
2929b51J35M05j67l01L22Pn71J88P44n15k70L52Q3m14J77L56n61J1L09J0l26L13
2951C6K77l87j74O42l05n25M59K78n03J79L58l95j80M85p6n99L58M23m51l17O38
2972B21j20n18L73M20o38OP79l43o40M39L95n28q9L98j27k15N44j49q24O43L94
2993D21m36j34L43j4o44N61M29p94k70P56l1n10K96J78m17K00N14o60k87Q94K18
3014F13r40J59N37m82l36O02N1o36L71L05m83j00P47m35k31O93L4j032M09R32
3034G78q56m40Q15J40q56J97N79m05j94P14l82m67O03Q9r09P20M51p34k84O43
3054B02Q3p11K57P49o39j87O33k01m09L78L07p61J5Q10m70p68J127J85r72L88
3074A6P24q35m06P11q3n56M98M74p93K00M83m27m47R01j49q26L47P37p54j96Q15
$$ y = [-251, -116, 289, 122, -179, 143, 150, -421, -233, 511, -4, -274, 78, 161, -253, -76, 280, -281, -270, 39, 49, -277, 36, 313, -74, -248, 394, 89, -436, 23, 301, -202, -23, 335, -60, -240, 245, 169, -430, -72, 351, -100, -417, 221, 101, -417, -44, 376, -262, -256, 523, 180, -460, -21, 374, -154, -243, 155, 28, -187, 357, 208, -616, 27, 421, -15, -149, 194, 180, -464, 97, 526, -268, -538, 218, 187, -323, -27, 151, -266, -66, 448, -212, -499, 395, 613, -327, -168, 369, -113, -449, 153, 204, -432, -61, 244, -239, -339, 408, -27, -258, 435, 469, -563, -154, 778, -78, -518, 297, 437, -419, -222, 357, -48, -242, 472, 90, -377, 226, 315, -594, 126, 577, -157, -441, 202, 285, -426, -169, 580, -59, -246, 387, 186, -223, 155, 462, -299, -284, 526, 56, -712, 415, 600, -372, 16, 740, -95, -501, 210, 127, -429, 69, 543, -250, -50, 433, 6, -441, 460, 311, -515, -168, 569, -185, -381, 434]
3095D34L4p68K4L43j58J41M95m51m78Q61mj006K48Q45n99n80O10K40o43K19O87
3116D94n22l83L76J59n32M08K89m26m3P69q07m81R62J46o08K18K16m37j97M53
3136E4J07l12J43J32l18K79J00l57j40P06R3p26j25P93k60l69M34J28n21j16M64
3157A89l16J70J86L1k96L22l33k54J02P50n17o20O23L53n86o2L42K9K27l67k07
3178b34O0K23M90p18J97J81j82k84J04N66n25n0L05J18n98o2N63J35m2m30J04
3199g9qL6jq7L73J26m81l87O71J58m59m8N92l17m78K76P9J5M3J20k54J28J63l36
3223a55k91N53J0j11l04P54n00k83L60L53l99k93L34N0j09r6K55k05J99K10q07
3244d75K14P70k81n05J99L10l44l19N58j23P6N3j07k60J86J70j4k31L72j23m43
$$ y = [434, 468, -300, -276, 67, -91, 50, 545, 94, -384, 477, 473, -533, -285, 560, -39, -619, -9, 231, -412, -193, 494, -28, -411, -35, 124, -408, 0, 289, -137, -180, 589, -218, -699, 263, 409, -199, 19, 235, -202, -399, 54, 161, -151, -8, 124, -194, 85, 185, -172, -312, 394, 487, -239, -364, 429, 169, -200, 234, 362, -159, -275, 189, -127, 43, 229, 260, -36, 286, -47, -301, -199, 551, 34, -586, 37, 390, -196, -258, 84, 113, 340, -27, -234, -174, 49, 539, -179, 18, 199, 17, -267, -163, 403, -122, -172, 133, 251, -347, -409, 154, 289, 247, -183, -79, -87, -51, -52, -139, 234, 360, -121, -508, 163, 321, -138, -186, 406, 89, -389, -113, -34, -19, 24, 144, -110, 18, 181, -155, -446, 107, 117, 6, -298, 456, -44, -327, 33, 386, -13, -306, 28, 78, -31, -127, 128, -77, 122, 332, -475, -261, 509, 228, -277, -78, 232, -112, -431, 127, 4, 80, 133, 26, -234, -48, 122, 108, -123, 249, 126, -317]
3265c17K87M00n64k29O42O1o71L9P48l97m8J81j06l16L54J99p49N10N40o12l39
3286c87O79Jo77Q5O43m51k51O47l37k83M78K90n53O2L99o50j84O32K09o03J67
3307h4N82n15k76L96K87o71K13K30K7l32M95l88j97N48r3m94L6P97n61j29M03
3328B74N5n31L79J01n72l3O63m11k86M81J1k31J52M39n79r3L79M0m05K4N48l14
3350I1k65P0K90m97K98o8r1L9M67m36j57M08J68n97J22N94m02k48K95qj88J56
3372D1K75n48o3K22o1n4M30m9n94J51O57n12l81M55K72k88j64K39L9m27O35k14
3394F1k65K31L35n18O0L19j36l79L14K65o11K48O61m19m45K11R9m7r7P1k12M2
3416b12N65l47j65J83J81m73q3N20Pk61R2O5k95J58L21l71k15N22j79j53M9L88
$$ y = [-317, -30, 370, -194, -423, 219, 280, -391, -352, 396, -1, -49, 132, 26, -290, 64, 263, -486, 24, 564, -48, -387, 292, 293, -384, -299, 344, -107, -358, 289, -48, -331, 147, 437, -116, -54, 345, -305, -489, 143, 352, -251, -84, 498, -17, -293, 103, 390, -281, -68, 162, 189, -143, 352, -36, -233, 315, 222, -272, -236, 561, 0, -129, 274, 329, -202, 177, 278, -294, -327, 336, -75, -361, 120, 131, -100, 52, 491, -88, -181, 198, 238, -167, -143, 405, 91, -174, -104, 186, -311, -13, -81, -172, -133, 334, -102, -259, 149, 317, -280, -158, 436, 34, -214, 81, 73, -115, 41, 316, -232, -295, -73, -134, -188, 242, 193, -401, -250, 407, -105, -486, -31, 241, -47, -211, 28, 67, -360, 275, 61, -204, 27, 362, -156, -96, 223, 87, -292, 22, 287, -324, -76, 585, 166, -279, -68, 31, -16, -113, -42, -254, -212, 353, 6, -159, 24, 205, -268, -351, 169, 176, -85, 7, 72, -223, -65, 256, -115, -330, 192, 13, -140, -91, 297]
3438B97k05l38M09j91k07J13K74r4q5M7N2j56J25J16l08jK59j25j23L33k71j11
3460a90K3MK53k95K92j61J19k32L08j89r1M10j19j53J95j27j18k6J05r0J48J85
3482B51Ln14j09P96l41MJ0k27J40J2j8j6j13K24n8j74J54K16l44K40oj93l6L52
3506B53k8k60j3J90j10j93K22q3r2J08J65k13j49K69l8j50K94k10k64J82J34J62
3528A76l92L93j13j55M7J77k45NJ85J53m73j9M10l19J1K44k53j39L73P2l11j6
3550a89K92J36m58L84J06m73R1M25k72l72M24R2l11r9N91m44j14M99j39l74J55
3571e0K85l85k03O05l20j13K80q4l77K78L05k23o5L28r8j25j87K42o4j50K62j95
3593e4k10N61k82k06J36K94j76j98K47j38o1j4K83k91n0K60k36j90M60Q7l31J71
$$ y = [297, 92, -246, 163, -28, -235, -122, 152, 58, -27, 20, 72, -84, 41, 157, -151, -152, 107, -18, -141, 192, -79, -190, -167, -163, 90, -205, 87, -74, 45, -187, 121, -68, -159, 251, 132, -21, 174, 47, -71, -97, 8, -82, 66, 251, 254, -260, -369, 427, 86, 90, 100, -127, 13, 25, 7, -9, -122, 102, 44, -130, 24, 240, -104, 136, 130, -63, -99, 253, 225, -35, -48, 142, 32, -161, 61, -22, -114, -6, 159, -54, -203, 66, 28, -122, 172, -38, -302, -120, 14, 176, -216, 177, 64, -91, -44, 133, -112, -107, 78, 231, -242, -261, 149, -170, -159, 85, -168, -307, 66, 138, -173, -189, 103, 239, -219, 165, 271, -202, -111, 314, 42, -330, 94, 186, -125, -224, 367, -77, -191, 308, 169, -205, -50, 235, -150, -353, 252, -68, -181, 99, 15, -362, -84, 221, -2, -67, 261, 163, 38, -149, 93, 29, -121, 141, -54, -264, 297, 15, -191, -55, 239, 63, -135, 112, -26, -87, -101, 182, -109, -159, 101, -135, -325, 135, 222, -109, 62]
3615F2J63k49n21Q88k64k44J13K20j99l0L4K53l02K03j4l31J01L64k42k44J88
3636e1N11n46j16K65nk09K50J00k24O9J69k14j49N10j91l83J45K83m77J09K92
3657A38j10m10K86L47l09r3K83p2k93M51j83k94L35K05k40k02M71k29l25J41M62
3678C59j01k58J66l38j9J76K52m05K8J43l8%J64o1l50K37K38j33j65M00j13r6
3700H6j68N9P0jK6q4k0l2K81l13O2K12m16J02J83q0m0m0L71k96J21o8O4N9j65
3725b7M8mj04K60k25j03K26R8k75j0L75k86r9J68O5j13p2J66j67o8J43j04oL32
3749B18j16p7k7J30J11k21j28L51k67j98K17J49j49K1k16N5J33L48m42q4J35L2
3771b5k90J92K23Jl84K47J22k55K38J23k33N7k2K19l37p3K20n4k1K49j50k19J91
$$ y = [62, 225, -24, -545, 343, 79, -165, -52, 168, -31, -61, -27, 226, -76, 127, 113, -218, -117, 247, 5, -239, -51, 460, -86, -202, 63, 58, -151, 99, 199, -25, 44, 213, -1, -150, 360, 169, -214, -69, 214, -263, -154, 138, 28, -382, -96, 251, -58, -151, 132, 60, -233, 218, 35, -259, 76, 281, 41, -161, 310, 81, -244, -103, 359, 258, 0, 166, -172, -191, -15, 237, -168, -140, 3, -35, -35, 129, 68, -282, -45, 193, 60, -105, 295, 182, 86, -82, -23, 47, 46, 72, -12, -32, -64, 217, -96, -34, 178, -238, -136, 47, -33, -73, -113, 258, -38, 83, 15, 79, 138, -27, 21, 17, -87, 173, -52, -155, 71, 169, -106, -116, 259, -27, -126, 42, 107, -6, -78, 88, -79, -147, -4, -108, -114, 218, 102, 25, -2, 128, 239, 18, -110, 241, -26, -224, -7, 142, -7, 14, -202, -147, -14, 334, -108, -192, -57, -25, -315, -123, 100, 101, -283, -36, 86, -169, 69, 192, -41, 16, -6, 213, -124, -197, 23, -31, -52, 197, 47, -172, 19]
3794A9Kk22L33Lo7l00J74J32k56K10J1j72j69L96j58Qq3J74j04q3M35j82l55K21
3818c3K40q8j86k0k7J24Kj94J8L54q6k61L9K20k02J5K13O2l14j58K68J91k09j1
3842d3J3j53R5L02k83J5K50k64j10J64k5n2J30J6L47k90l5O4j78NP6l4p5K95j84
3867D6j16j6K96j77k59K95M3l65K37J75j47j85K44p5j52J80Oj53J68Qq3j40L38
3890A68j08k64K12rk5k31K02J15n2j97K73k37K23m8j12m5L75k99j7R9K13j86l12
3913b62L12j87j34K62K27m17M8L92k82j26K71J38m01J18J4j91L9J22J11j40J40
3934E4L2Rk21J33k1m3L26J45m35p2K44k14l05K65K64k63P3K11k19pJ36J5j19J11
3958I9j67L1j53L13n1r3m7J70k35J2L00k22j2Q7J15l30J43M8k31J49M2nk58K78
$$ y = [19, 21, -201, 132, 135, 68, -232, -58, 74, -182, 28, 39, -133, -302, 94, -64, -56, -139, 35, -69, -152, 283, 101, -254, -33, 207, 119, -67, -87, -114, 10, 12, -182, -164, 190, 104, -157, -118, 102, -100, -85, 128, 190, -124, -282, -14, 177, -32, -43, -30, -183, -88, 214, -69, -54, 196, -68, -178, -14, -39, -91, 39, 55, 402, 112, 77, 141, -37, -32, 44, 10, -65, 230, 46, -70, -86, 210, 33, -226, 69, 112, -253, -16, 159, 12, -173, 71, -4, -156, 24, 30, -123, 45, 53, -30, -170, 168, 60, -204, 8, -1, -26, -257, -55, 60, 8, -189, 84, -153, 70, 22, -90, -135, 240, -59, -76, 23, 236, 50, -262, 50, -137, -271, -9, 218, -199, -151, 241, -41, -167, 104, 242, -159, -41, -27, -218, -179, -57, 54, -86, 54, 86, 95, -126, 7, -14, -57, 269, 414, -21, -93, 151, -63, -368, -103, 161, -102, -29, 182, -37, -44, 92, 107, -12, 99, -68, -37, -190, 123, 72, -21, -68, 102, -133, -121, 179, -43, -55, 32, 147, -183, -40, 8, -223, -74, -32, -37, -295, -17]
3982a7J33j92Q3R0j7j43Q3p3j65N4K04J6j83J61j19Q1n8p3K47k14M6PJ1J96k05
4007d7L0r4K03r0k70Q2L14M7k32K04j44j25J69p5J61m8o8mj18K54q4j08K70o7
4031A60n2j31K42k71j30K80l8j05N5J73p9k7k67L62j76j23K23Q6l39K76o6j56
4053a03J60J79k66L5K9o3r1q7K64o8j89K30j15M5K4J22j19P0J45k30L9J3M7j23
4077e2q0o7J95j28J55r4K4J15J77j89r1M1K0m7Q6n0J50m70L59j52J04j8J02p8
4101A2J17p6k20R4P7N2kj36K08j02k05J82JJ1M1J34l31lK99l3l90J45J62rk1j0
4127cj42J62J43P1l37r9K17O2j6P9j5o8k11L68k85Q4J31L4j97J3R3k27K06L3k07
4152a11J23J01p5j08lL76k15o9J67l58k5K49j81J57M4N1k78J05m5M4j91L08M6
$$ y = [-17, 116, -76, 7, 97, 80, -63, 20, -53, -218, -164, 40, 56, -127, 34, -85, -4, -62, -135, 112, -102, -56, -49, -38, 158, -47, -17, -111, 92, 2, -268, -186, 128, 175, -57, 147, 3, -122, 47, -28, 133, 85, 17, 13, -105, 149, 65, -43, 227, 160, 108, -23, 219, -52, -182, 98, 60, -45, 10, 183, 104, 77, -190, 172, -4, -127, 96, 182, -157, 119, 53, -103, 57, 236, -30, 5, 34, -29, -120, -207, 57, -11, -200, 30, -85, -40, -16, 106, -13, 57, 202, -28, 11, 24, 71, -52, -132, -199, -4, -132, 23, -71, -47, 68, 245, 56, -35, 6, 26, -21, 65, 15, 165, -305, 54, -98, 6, -12, 90, 12, 129, 53, -167, -73, 4, 56, 54, -82, 126, 24, -181, 1, 2, 13, 54, 188, -143, -146, 153, 120, -270, -125, 37, 28, 7, -3, -145, 17, 160, 231, -106, -205, 12, 74, 58, 137, 122, 54, -157, 211, -74, 10, 141, 175, -22, -9, 84, -143, 63, 96, -111, 12, 113, 38, -70, -73, 303, 88, 19, 186, -172, -197, 52, -129, 28, 72, 123, -155, -50, -95, -51, -242, 66, 112]
4175A12k09J86J22j36k24K35rj10j78K60j97j1J72J21n3Q5j62Q3J33j28j46j02
4197a56P5J32j72Q1R5k0j46N2J27j29K5R1j11qk1O8k04K42J30J0k38O3K7m9j69
4222b05J54M8p2K6J20l81M07K9j60qL5J17j52J66r6q8L2R3j27j24J56K00Mj94
4246b0PJ09p7J71k68J09M5j10l1l8J62Q0l03J60R3j82M3K30l36K7J04J65q6k81
4270b27L02n1j21K70k41r2L9l3O2J24m1J72k02J85O7l22kP8K3N7p0K5k28K35J29
4295A38P2j39Q5j93R3o2j05K09k40L45q3j86k6K8M0K24k14J2P7k7j80lL13r1j31
4320d4p1K28p9J5M4o8N5k0l6k2n7J67j30R9n0M5O5k35M33k28j72Q5P1k7p8R2r5
4347a3k6j17j26K21R8K20l82N6P5P1k97N6L30r8q0q5Q6j6M3J52j66j34K31j08
$$ y = [112, -97, 89, 211, 75, -149, 86, 77, -33, -211, 49, -148, -159, 13, 134, 81, 166, 4, 87, 220, 92, -54, -156, -81, 51, -121, -40, 55, 35, -111, -59, 68, -61, -36, 55, -56, -64, -85, -17, -221, 21, 151, 161, -77, -14, 13, -36, -205, -51, -3, -75, -49, 71, -310, 97, 126, -34, -42, -7, 110, -42, 124, 28, -60, -28, 65, -62, -186, -30, 170, 174, -20, -13, 96, 19, 190, -78, 31, 76, -34, -65, -103, 59, 139, -164, -4, 89, -93, -50, 180, -156, -129, -25, 140, 54, -227, 75, 24, -97, 173, -68, -160, -121, -154, -92, 32, -9, 163, -39, 146, 213, -109, -111, -33, -10, 47, -23, 2, -226, 9, 138, 210, 71, 156, -37, 56, -6, -111, 98, -142, 203, 120, -66, -92, -64, -24, 200, -14, -2, 75, 48, -132, -135, 178, 87, -44, -115, 113, 34, 49, 93, 25, 80, 60, 24, 2, -55, 112, -18, 81, 31, 76, 141, -94, 339, 111, -61, 24, 95, 68, -10, 82, -13, -39, -156, -282, -61, 37, 257, -125, -69, 6, 77, -220, -164, 166, 68, -12, -97, -11, -27, 16, 168, 2, -132, 99, -9]
4371iJ9j32K26Lj29n9J51o9j04K38k68J72J55rj15P6j78nJ89p5j1j67K20j12k05
4396a98K44K1l9j11J30n7j01J23J07q9j49L0J08k82L42j8j56n0K10j18j09J71
4418Iq8j76J60L28k43o7l8N5j60L98p0j16O9J41l31J2J88J42l12o0J12j28NL01
4442A31q5j23r7J30N6j46K47l56J57J24K1m28L11J64n0j98oL03j85oK57l54O6
4465f7K18j68q6k6P9J18m0J13k82k0L30O8l03J80p5j37O1q4J16N4K24j71j45j28
4489a71K87j58JJ08j05M8j43J84J41k79J57M6J37l63N5j68R3L58j99j64J77P0
4511A12j58K20j11J8k08K17m8k42Q9J25n8n0L1j77J83j2K66m14K74m0Q5n7j02
4534e7J60j43j0K94j01k28M59l48K0Mr2p7J95K6k84K98o8J13j10j86J90M5j47
$$ y = [-9, 10, -122, 104, 107, -22, -81, 70, 1, -103, 135, -133, 39, 194, 185, 70, 146, -32, -37, 152, 77, 66, -101, 119, 7, -198, 46, 67, 28, -83, 47, -10, -111, 12, 119, 30, -119, -89, 19, -263, 79, 61, -95, -145, 65, -53, -162, 9, -79, -255, -95, 233, -10, -77, -115, -60, -220, 178, 108, -8, 61, 202, -129, -117, 71, 213, -99, -159, -47, -175, -170, 131, 46, -77, -174, -44, 12, -134, 113, -243, -86, 38, 59, -369, -58, 106, 56, -142, -148, 155, -30, -36, 221, -133, -67, 151, -17, -103, -129, -50, 68, 28, 141, -141, -161, 169, 237, -66, 114, 39, -98, -37, -121, -5, 49, 273, 102, -43, -171, 116, -42, -41, 67, -38, 10, -133, 51, 192, -87, 70, 116, 253, -110, -55, -223, -130, 228, 29, -135, 42, 112, -46, 174, 63, 81, -127, 90, 42, -200, -111, 14, -44, -94, -63, -240, -57, -69, 197, -217, 57, 17, 102, 45, -57, 103, -40, -50, 244, 143, -85, 374, 26, 46, 50, -42, -119, 76, 102, -182, 116, 48, 161, 51, -135, 55, 100, -47]
4557d7JM5L6N6K22l78J95k32k3L1P6L01l64M7J60j04j00N4j6M2j48j30K38M7m6
4582c7q5J94j27L18k48m4km1j92J84K69J5j92j44O7K01k11P2M5o5J26Q2l11R0
4606c6K7P5l13N28k64n2nP9k74J92P7L1k0r5J97j36J18Lj05J12K3p8k28K51J34
4631B41j38k5j56K47j03n9nJ03n6Q2M0j72j04J34j97P5P1j0M6J0J06J7k63L36
4655B20l12j96M55k77j73L61k39P3M0J10k8o2K71k08j13J68J12j11l3jk4j14J1
4678g0J74j01k07K89n6j21K17j01j34p5L80o3l73K39k7j28K49M9j13K34q5j77
4700@q0M2K32k49j28M19l12j67O4L22j45n7k7J44j68J74k9j26Q8J38q2l42M48
4723A59l30L9J63M9k13K32lj26J11q6k8P6J23l2l8j55J50n1o0J66n9r4R2J77j44
$$ y = [-47, -46, -1, 35, 91, 313, -65, 130, -102, -125, -94, -18, 283, -81, -34, 126, 22, -78, -24, -40, 2, -146, -276, -38, 9, -37, -122, 72, -55, 263, 15, -29, -31, -72, -264, -80, 189, 204, 12, -132, -65, 136, -75, -3, 42, -23, 103, 185, -126, -36, -9, 66, -247, 281, 17, -35, -40, 39, -235, -43, 34, 65, 45, -50, 147, 11, 129, 132, 27, 139, 162, 84, -144, 107, 241, 103, 78, -78, 169, 66, 7, 2, 105, 49, 131, 171, -1, -105, 29, -168, -93, -22, -32, 14, 24, 130, 147, -116, 220, -92, -288, 167, -110, -283, 78, -161, -88, -48, 62, 34, -28, 243, 35, -78, 90, 202, 91, 58, 57, 33, -81, -70, 104, 3, -204, 85, 29, -92, 125, 24, -110, -185, 195, 132, -241, -2, -29, -157, 92, 141, 28, 262, 177, 0, -80, -38, 194, -55, -183, 236, -76, -243, -179, 143, -2, -59, -86, 58, -110, 64, 35, -91, -3, 135, 53, -289, 159, -171, -132, 31, 80, -133, 99, 96, -30, 81, -5, -33, 43, 166, 134, 96, -59, 91, 40, -20, 146, 87, -7, 85, 262, 118]
4748A18j20j5J96l15K33J32k85k08J78K27l53J27J02kM1O1n7k76n8J33K56Mo0
4771E9j91K66n1j6l16K80J70j69K1J59r8j44J28j63K65k41J94j69N3o1J42j41
4793b3M3O8n6k92K49j14l9j20L56j4j60K08j07QK18l6k14P8J72l04nO7pK5r3M2
4819e0J0J2J28J68k54k01K86j6q8K07j39j56m0K40j27j7M1K1J05j02L3j73K65
4842A53M1k20J8l1K85l44K86j04r8l9j02K52k09K24J50k53R1j14p1l4K9J71q6
4865er9J98k89J59R8K06k23j67K87j71Q4M8l2j35k5J40k19J43k5j66J15n3K10
4888G9J0M1o8K6n2O3O6k16J3J47j02q0k4P8k82L12L4M4k59K80j0j95K1oJj60K51
4915A2Nk93K10J61j91J5O4P2j28K27p2k51K19M2j51r4k1M6n1J85j18p5P0L46l08
$$ y = [118, -2, -17, 179, -136, 97, 229, -56, -264, -86, 141, -212, -85, 17, 15, 56, 117, 60, -216, -274, -141, 115, 119, 59, -132, 134, 83, 67, -249, 31, 201, 32, 53, 212, 114, -30, 98, -65, 200, -41, 153, -16, 37, -24, 118, -23, 20, 88, 32, -260, -11, -125, -164, -284, 72, 58, -102, 106, -1, 7, 225, 189, -25, 53, 225, -79, -84, -17, -24, 1, -92, -50, -40, -28, 100, 268, 14, -187, 99, 83, -5, 202, 63, -93, -133, 107, -20, -37, 4, 25, 130, 28, 61, -112, 153, 194, -26, -8, -39, 246, -98, 188, 84, -14, -53, -155, 97, -112, 112, 262, 9, 100, -14, -85, -119, -90, 81, -5, -104, 94, -195, -36, 62, 268, 45, -122, 165, -6, 78, 126, 94, -41, -66, 74, -145, -2, -27, -193, -78, -131, 79, 89, 130, 62, 88, 36, 99, 165, -51, -38, 109, 7, -73, -97, -19, -301, 11, 45, 89, -170, 110, 100, -95, -74, -80, -79, -239, 12, 17, -276, -66, 95, -96, -81, -17, 55, -73, 154, 82, -169, 50, 92, -59, -153, -174, -128, -179, 6, -112, -187, -117, 229, -79]
4940g9K6O3O1l66J74L41r8k02j3J25o8k7Q8Kk07K49l27K48n1K4n1J47p9L5j77
4965a62Q6J62j35Q7nl8Q4j52j11q0R7J70p4J48N5k36J84j36K15k00Q9o0K11l39
4989a40J61Q2j2J20j74j18J87P6O6l14J68o7k34K26J58n5j69L45o8k35n2Q3j27
5012i3j1K04k34J05M9M3j61N5K04j26k18M29j18k62L07k86J15p9Q1MPJ31k3k78
5036a55K15j74q8J34R8j7m2R8J62j95j09K2O3M6R2j29j83k0L38Q5k71J16o4r8
5060g6Jj9J55o8O8N7k3K9j83R2o9n3J48j89L2M7J6l4J11J68r1l8o4k01K53l7M3
5087G5k2k01M03k21L6k2k70J62j41L71j85k4J40k07n0L18P4k35n9N3K3j29K4k7
5111a14J52j54R7Q0K02j66l12K66P0j68n4j02J70J8k39n9M73j96J85j88J3J15
$$ y = [-79, -53, 10, 71, -295, -121, 220, 122, -80, -93, 32, -36, -63, 25, 27, -180, 69, -258, -10, -61, -37, -88, 59, -20, 15, -162, -76, 86, -49, 38, 33, -5, 79, -73, -184, -264, -167, 3, -71, 77, 132, -104, 80, -56, 159, -41, 48, -12, 199, -140, 21, 103, 91, 211, 37, -81, 106, 182, 248, -66, 102, 35, -199, 27, 185, 130, -39, 306, 238, 3, -49, 34, -93, -104, 100, -134, -29, 20, 63, -98, -43, 161, 35, -183, 246, 128, -134, 173, -113, 2, -77, 4, 8, 15, 146, 123, -155, 60, -114, -202, -68, 30, 13, -29, 69, 231, 36, -73, -51, 12, 58, 150, 21, -162, -182, 156, 241, -30, 86, 22, -76, -75, -94, 61, -7, 61, 118, 95, 124, -59, 33, -36, -89, 59, -130, -98, -51, -35, -69, 42, 210, 119, 81, 17, -184, 69, 32, 75, 53, -148, 255, 34, 70, 48, -222, -60, -201, 170, -15, -39, 101, -106, -156, 162, 236, 1, -58, -5, 18, -111, -87, -114, 38, -116, -19, 61, 263, 97, -215, 51, 121, -47, -101, -203, -33, -15, -254, -313, 160, -36, 149, -39, -26, 89]
5133H9k8o2r0O6J7k6J6J11o2J4l6J25Nk31o8p2K79P9Kj8k46J76j16k11M93j94
5159A2M1K0n8k01J07K02r3j96J35l5J59O3L1l74K30m2L5j36j53M46k35q0J70j34
5183h6J5J13R8j13m0R7l7j94J47j28N0J83J3j07J7m4P3j03MK41l46J51N1N3m8
5208F0j46K31k30J5m0J08j76K17J36l88K43K11r2j13K7r1k65Q7K21j57J13K17
5230A88j80M3m4r2k4J04L00k67k26M33l94J0K76j92J53l5J10r6j3K39k28k51J52
5253c4OJ42j99J74J80j41j56J6J1r4J40j15m2J79j05O0l2M9l1j58L26q6l05K88
$$ y = [89, 61, -1, -91, -25, -8, -34, -18, 93, 31, 45, 9, 134, 139, -92, -160, -232, 47, 126, 128, 110, -136, 40, -76, -287, 206, 12, 53, 73, 15, -186, -79, 123, 30, -166, -31, -66, 93, 156, 187, -187, 43, 1, 36, -100, -253, 193, -42, -122, 48, -86, -71, 42, 140, 27, -13, 84, 47, -147, 0, -128, -78, 105, 118, 11, 28, -16, 57, -46, -42, 199, -147, 4, 55, 108, 60, -86, 145, -85, -70, -110, -2, -178, 39, 175, -213, 30, 241, 149, 36, 63, -28, -293, -206, 15, -142, -29, 188, 8, 51, 7, -85, -109, -5, 295, 28, -198, 235, -159, -149, 127, -65, 88, 53, 163, 67, 54, 293, 65, -186, -34, -28, 114, -85, 89, 269, 128, -28, -12, -1, -95, 45, -70, -112, 67, -38, 22, -10, 39, 8, -150, 176, 90, -215, 73]
$$ [...]
8191A00
##END NTUPLES=NMR FID
##END=
