##TITLE=1H ikalashn
T-D
16.12.2024
##JCAMPDX= 6.0         $$ Bruker NMR JCAMP-DX V2.0
##DATA TYPE= NMR FID
##DATA CLASS= NTUPLES
##ORIGIN= UXNMR, Bruker Analytische Messtechnik GmbH
##OWNER= root
$$ TOPSPIN		Version 1.3
$$ 2024-12-16 16:06:37.390 +0400  Irina@DPX200
$$ Compression mode = diff/dup
##.OBSERVE FREQUENCY= 200.131300845
##.OBSERVE NUCLEUS= ^1H
##.DELAY= (6, 6)
##.ACQUISITION MODE= SIMULTANEOUS
##.ACQUISITION SCHEME= undefined
##.AVERAGES= 16
##.DIGITISER RES= 18
##SPECTROMETER/DATA SYSTEM= spect
##.PULSE SEQUENCE= zg
##.SOLVENT NAME= CDCl3
##.SHIFT REFERENCE= INTERNAL, CDCl3, 1, 17.49637
##AUDIT TRAIL= $$ (NUMBER, WHEN, WHO, WHERE, WHAT)
$$ ##TITLE= Audit trail, TOPSPIN		Version 1.3
$$ ##JCAMPDX= 5.01
$$ ##ORIGIN= Bruker BioSpin GmbH
$$ ##OWNER= Irina
$$ $$ F:/spectra/data/iren/nmr/1H/4/audita.txt
$$ ##AUDIT TRAIL=  $$ (NUMBER, WHEN, WHO, WHERE, VERSION, WHAT)
(   1,<2024-12-16 16:06:21.234 +0400>,<Irina>,<DPX200>,<TOPSPIN 1.3>,
      <created by zg
	started at 2024-12-16 16:05:12.453 +0400,
	POWCHK disabled, PULCHK disabled
       terminated by command 'halt'
       configuration hash MD5:
       BE 6D 3F 07 2A EA 11 49 91 17 2B D3 AF B3 58 0D
       data hash MD5: 16K
       1E 7E 35 F0 78 82 BA 66 DA CF 62 BB DC EE 26 72>)
$$ ##END=
$$ 
$$ $$ hash MD5
$$ $$ 40 F7 83 1D 09 8D EA FD D6 2B 77 65 EB F7 DE 6E
##$RELAX= 
##$RELAX= 
##$RELAX= 
##$RELAX= 
##$RELAX= 
##$RELAX= 
##$RELAX= 
##$RELAX= 
##$RELAX= 
$$ Bruker specific parameters
$$ --------------------------
##$DU= <F:/spectra>
##$EXPNO= 4
##$NAME= <1H>
##$PROCNO= 1
##$TYPE= <nmr>
##$USER= <iren>
##$AMP= (0..31)
100 100 100 100 100 100 100 100 100 100 100 100 100 100 100 100 100 100 
100 100 100 100 100 100 100 100 100 100 100 100 100 100 
##$ANAVPT= -1
##$AQSEQ= 0
##$AQ_mod= 1
##$AUNM= <au_zg>
##$AUTOPOS= <>
##$BF1= 200.13
##$BF2= 200.13
##$BF3= 200.13
##$BF4= 200.13
##$BF5= 200.13
##$BF6= 200.13
##$BF7= 200.13
##$BF8= 200.13
##$BYTORDA= 1
##$CFDGTYP= 0
##$CFRGTYP= 5
##$CHEMSTR= <none>
##$CNST= (0..63)
1 1 145 1 1 1 1 1 1 1 1 1 1 1 1 1 1 1 1 1 1 1 1 1 1 1 1 1 1 1 1 1 1 1 
1 1 1 1 1 1 1 1 1 1 1 1 1 1 1 1 1 1 1 1 1 1 1 1 1 1 1 1 1 1 
##$CPDPRG= <>
##$CPDPRG1= <>
##$CPDPRG2= <>
##$CPDPRG3= <>
##$CPDPRG4= <mlev>
##$CPDPRG5= <mlev>
##$CPDPRG6= <mlev>
##$CPDPRG7= <mlev>
##$CPDPRG8= <mlev>
##$CPDPRGB= <>
##$CPDPRGT= <>
##$D= (0..63)
0 2 0 0 0 0 0 0 0 0.06 0 0.03 0 0 0 0 0.0002 0 0 0 0 0 0 0 0 0 0 0 0 0 
0 0 0 0 0 0 0 0 0 0 0 0 0 0 0 0 0 0 0 0 0 0 0 0 0 0 0 0 0 0 0 0 0 0 
##$DATE= 1734350777
##$DBL= (0..7)
120 120 120 120 120 120 120 120 
##$DBP= (0..7)
150 150 150 150 150 150 150 150 
##$DBP07= 0
##$DBPNAM0= <>
##$DBPNAM1= <>
##$DBPNAM2= <>
##$DBPNAM3= <>
##$DBPNAM4= <>
##$DBPNAM5= <>
##$DBPNAM6= <>
##$DBPNAM7= <>
##$DBPOAL= (0..7)
0.5 0.5 0.5 0.5 0.5 0.5 0.5 0.5 
##$DBPOFFS= (0..7)
0 0 0 0 0 0 0 0 
##$DE= 6
##$DECBNUC= <off>
##$DECIM= 32
##$DECNUC= <off>
##$DECSTAT= 4
##$DIGMOD= 1
##$DIGTYP= 9
##$DL= (0..7)
0 120 120 120 120 120 120 120 
##$DP= (0..7)
150 150 150 150 150 150 150 150 
$$ [...]
##$SW= 21.9926040160658
##$SWIBOX= (0..15)
0 0 2 0 0 0 0 0 0 0 0 0 0 0 0 0 
##$SW_h= 4401.40845070422
##$TD= 16384
##$TD0= 1
##$TE= 300
##$TE2= 300
##$TE3= 300
##$TEG= 300
##$TL= (0..7)
0 120 120 120 120 120 120 120 
##$TP= (0..7)
150 150 150 150 150 150 150 150 
##$TP07= 0
##$TPNAME0= <>
##$TPNAME1= <>
##$TPNAME2= <>
##$TPNAME3= <>
##$TPNAME4= <>
##$TPNAME5= <>
##$TPNAME6= <>
##$TPNAME7= <>
##$TPOAL= (0..7)
0.5 0.5 0.5 0.5 0.5 0.5 0.5 0.5 
##$TPOFFS= (0..7)
0 0 0 0 0 0 0 0 
##$TUNHIN= 0
##$TUNHOUT= 0
##$TUNXOUT= 0
##$USERA1= <user>
##$USERA2= <user>
##$USERA3= <user>
##$USERA4= <user>
##$USERA5= <user>
##$V9= 5
##$VALIST= <valist>
##$VCLIST= <CCCCCCCCCCCCCCC>
##$VD= 0
##$VDLIST= <DDDDDDDDDDDDDDD>
##$VPLIST= <PPPPPPPPPPPPPPP>
##$VTLIST= <TTTTTTTTTTTTTTT>
##$WBST= 1024
##$WBSW= 25
##$XGAIN= (0..3)
0 0 0 0 
##$XL= 0
##$YL= 0
##$YMAX_a= 1001436
##$YMIN_a= -657305
##$ZGOPTNS= <>
##$ZL1= 120
##$ZL2= 120
##$ZL3= 120
##$ZL4= 120
##$ABSF1= 10
##$ABSF2= 0
##$ABSG= 5
##$ABSL= 3
##$ALPHA= 0
##$AQORDER= 0
##$ASSFAC= 0
##$ASSFACI= 0
##$ASSFACX= 0
##$ASSWID= 0
##$AUNMP= <proc_1d>
##$AXLEFT= 0
##$AXRIGHT= 0
##$AXTYPE= 0
##$AXUNIT= <>
##$AZFE= 0.1
##$AZFW= 0.1
##$BCFW= 1
##$BC_mod= 2
##$BYTORDP= 1
##$COROFFS= 0
##$CY= 7568.61572265625
##$DATMOD= 1
##$DC= 2
##$DFILT= <>
##$DTYPP= 0
##$F1P= 17.9538593292236
##$F2P= -4.03888763876832
##$FCOR= 0.5
##$FTSIZE= 32768
##$FT_mod= 4
##$GAMMA= 1
##$GB= 1
##$INTBC= 1
##$INTSCL= 1
##$ISEN= 128
##$LB= 0.02
##$LEV0= 0
##$LPBIN= 0
##$MAXI= 945.577
##$MC2= 0
##$MEAN= 0
##$ME_mod= 0
##$MI= -402.1523
##$NCOEF= 0
##$NC_proc= 0
##$NLEV= 6
##$NOISF1= 8.587773
##$NOISF2= 6.764455
##$NSP= 1
##$NTH_PI= 0
##$NZP= 0
##$OFFSET= 17.49637
##$PC= 1
##$PHC0= 144.7557
##$PHC1= -21.10259
##$PH_mod= 0
##$PKNL= yes
##$PPARMOD= 0
##$PPDIAG= 0
##$PPIPTYP= 0
##$PPMPNUM= 100
##$PPRESOL= 1
##$PSCAL= 0
##$PSIGN= 0
##$REVERSE= no
##$SF= 200.13
##$SI= 32768
##$SIGF1= 18.5376
##$SIGF2= -6.396296
##$SINO= 400
##$SIOLD= 32768
##$SREGLST= <1H.CDCl3>
##$SSB= 3
##$STSI= 0
##$STSR= 0
##$SW_p= 4401.40845070422
##$SYMM= 0
##$S_DEV= 0
##$TDeff= 0
##$TDoff= 0
##$TI= <>
##$TILT= no
##$TM1= 0
##$TM2= 0
##$TOPLEV= 0
##$USERP1= <user>
##$USERP2= <user>
##$USERP3= <user>
##$USERP4= <user>
##$USERP5= <user>
##$WDW= 1
##$XDIM= 8192
##$YMAX_p= 0
##$YMIN_p= 0
$$ End of Bruker specific parameters
$$ ---------------------------------
##NTUPLES= NMR FID
##VAR_NAME=  TIME,          FID/REAL,        FID/IMAG
##SYMBOL=    X,             R,               I
##VAR_TYPE=  INDEPENDENT,   DEPENDENT,       DEPENDENT
##VAR_FORM=  AFFN,          ASDF,            ASDF
##VAR_DIM=   8192,          8192,            8192
##UNITS=     SECONDS,       ARBITRARY UNITS, ARBITRARY UNITS
##FACTOR=    0.0002272,     1,               1
##FIRST=     0,             0,               0
##LAST=      1.8609952,     13,              -145
##MIN=       0,             -657305,         -657305
##MAX=       1.8609952,     1001436,         1001436
$$ Real data points
##PAGE= N=1
##DATA TABLE= (X++(R..R)), XYDATA
$$ [...]
$$ plain form
1714 191 51 -359 -168 613 -263 -143 438 200 -309 278 348 -383 -299 404 -161 -296 499 31 -550 24 324
1735 324 -47 -478 238 -40 -374 141 373 -381 -182 404 -206 -314 552 447 -230 104 324 -174 -253 383
1755 383 200 -314 149 304 -243 -179 375 -255 -516 174 109 -328 -62 220 -348 -69 506 112 -405 480 263
1776 263 -297 -12 462 -19 -52 197 104 -457 7 405 -337 -182 430 -339 -487 222 53 -737 -169 568 24
1797 24 -285 255 165 -287 128 396 -266 76 556 166 -213 272 113 -494 149 315 -173 -633 321 224 -325
1818 -325 -116 274 -377 -15 478 -90 -356 331 29 -362 140 559 -56 -269 552 51 -512 219 600 -216
1838 -216 -294 127 84 -158 348 -201 -494 222 643 -455 -682 89 41 -275 366 402 -620 -180 554 87 -442
1859 -442 409 210 -271 128 237 -361 -150 696 91 -687 -159 174 -244 -134 57 -241 -433 395 -54 -482
$$ packed form
1714A91j40m10J91P81q76J20N81k38n09N87P0p31Q4P03n65j35P95m68n81N74L00
1735C24l71m31P16k78l34N15K32p54J99N86o10j08Q66j05o77L34K20m98p9O36
1755C83j83n14M63J55n47O4N54o30k61O90o5m37K66K82n68K79N75l94n17Q85k17
1776B63n60K85M74m81l3K49r3n61M64L98p42J55O12p69j48P09j69p90N68P37n44
1797B4l09N40r0m52M15K68o62L42M80l90l79M85j59o07O43J66m88m60R54r7n49
1818c25K09L90o51L62M93n68k66O87l02l91N02M19o15k13Q21n01n63P31L81q16
1838b16p8M21m3k42N06n49k93P16M21j098k27P71m8l16O41L6j022M40P34m67n29
1859d42Q51j99m81L99J09n98K11Q46o05p78N28L33m18J10J91k98j92Q28m49m28
$$ plain form
1879 -482 -54 512 -405 -188 439 -80 -292 258 510 -283 -182 485 -95 -352 104 56 -227 51 392 -433
1899 -433 -202 239 -385 -474 559 357 -657 -208 456 -86 -100 297 293 96 242 304 -409 99 494 52 -491
1920 -491 127 306 -275 -105 185 -286 -207 267 -15 -616 -13 150 -118 -51 361 -403 -450 541 281 -619 15
1941 15 905 87 -304 192 236 -55 119 25 -332 -250 293 -119 -386 345 118 -496 -195 322 -107 -263 261
1962 261 202 -301 31 290 -115 -124 313 110 -132 531 -9 -384 170 613 -275 -248 540 106 -656 -353 75
1983 75 -180 -223 257 -343 -268 113 3 -377 190 472 -264 3 318 133 -207 316 631 -418 -66 156 56
2004 56 -75 154 -151 -429 116 237 -589 -207 440 42 -581 286 133 -117 37 182 158 -62 244 -129 -308
2025 -308 175 328 -342 25 312 78 -357 168 150 -442 -32 147 -202 -371 85 64 -172 42 278 -263 -38
$$ packed form
1879d82M28N66r17K17O27n19k12N50K52p93J01O67n80k57M56m8k83K78L41q25
1899d33K31M41o24q9J033k02j014M49O64n42j4L97mj97J46O2p13N08L95m42n43
1920d91O18J79n81J70K90m71P9M74k82o01O03J63k68O7M12p64m7R91k60r00O34
1941A5Q90q18l91M96M4k91J74r4l57Q2N43m12k67P31k27o14L01N17m29j56N24
1962B61n9n03L32K59m05rM37k03k42O63n40l75N54M43q88K7P88m34p62L03M28
1983G5k55m3M80o00P5L81j10l80N67K82p36K67L15j85l40N23L15j049L52K22j00
2004E6j31K29l05k78N45J21q26L82O47l98o23Q67j53k50J54J45k4k20L06l73j79
2025c08M83J53o70L67K87k34m35N25j8n92M10J79l49j69M56k1k36K14K36n41K25
$$ plain form
2046 -38 536 -20 -121 375 365 -86 -74 205 -60 47 293 223 -168 324 93 -609 -377 345 -216 -391 189
2067 189 36 -456 58 328 -187 -207 325 190 -226 244 224 -289 371 456 -243 -92 418 178 -414 -234 446
2088 446 63 -503 383 -191 -195 33 148 -436 -81 45 3 -322 281 129 -150 181 435 -25 -102 442 15
2109 15 -268 48 351 -471 13 -38 -174 -100 265 133 -473 -17 341 -226 -141 274 -61 -329 20 198 -255
2130 -255 203 358 -152 -111 462 160 -256 1 317 -163 55 208 -228 -333 260 215 -440 -187 116 -243 -46
2151 -46 105 -202 -374 105 380 -93 85 205 121 8 101 164 -95 -43 340 -14 -85 260 177 -548 30 310
2173 310 -260 -14 196 -415 -268 164 215 -391 -212 459 55 10 204 324 -277 304 346 -73 -92 419 -54
2194 -54 -190 268 123 -376 -58 270 -305 -2 183 -178 -525 36 203 -208 -202 310 -236 -176 176 182 -137 303
$$ packed form
2046c8N74n56j01M96j0m51J2K79k65J07K46p0l91M92k31p02K32P22n61j75N80
2067A89j53m92N14K70n15k0N32j35m16M70k0n13O60Q5o99J51N10k40n92J80O80
2088D46l83n66Q86n74mK28J15n84L55J26m2l25O03j52k79L31K54m60p7N44m27
2109A5k83L16L03q22M84n1j36P4L65j32o06M56L58n67Q5M15l35k68L49J78m53
2130b55M58J55n10M1N73l02m16K57L16m80K18J53m36j05N93m5o55K53L03l59J97
2151d6J51l07j72M79K75m73J78J20q4j13R3O3k59N2L83l54p1L45q3p25N78K80
2173C10n70K46K10o11J47M32N1o06J79O71m04m5J94J20o01N81M2m19j9N11m73
2194e4j36M58j45m99L18L28n75L03J85l61l47N61J67m11ON12n46O0L52Ol19M40
$$ plain form
2216 303 598 -39 -252 315 279 -270 74 19 -272 137 172 -302 -351 209 12 -155 218 291 -83 -30 181 29
2238 29 -246 335 281 -76 -74 494 -128 -61 222 161 -244 -8 187 -186 -105 116 160 -393 25 168 -196 -193 211
2261 211 -240 -143 283 234 -392 195 593 -238 -131 142 -137 -246 131 171 -256 223 219 -320 -13 121 -179 -298
2283 -298 -155 -200 -294 119 157 -61 -136 117 179 -230 113 305 -264 276 258 -28 -180 164 -3 -255 -147 145
2305 145 -111 -309 -126 3 -313 19 125 -300 -104 336 -86 -326 142 28 -320 -67 373 -24 -246 265
2325 265 237 -191 140 376 -132 -115 136 -55 -169 85 64 -346 -284 237 -66 -327 95 -169 -271 116 72 -190
2347 -190 -196 112 109 -175 170 330 -140 231 458 -268 -128 335 -53 -201 248 161 -3 -161 -9 -89 -385 68
2369 68 -117 -189 -46 182 -255 67 201 168 -320 87 235 -62 171 94 -126 -209 9 78 -267 -13 85 -69
$$ packed form
2216C03K95o37k13N67l6n49L44n5k91M09L5m74m9N60j97j67L73P3l74N3K11j52
2238B9k75N81n4l57KN68o22O7K83o1m05K36J95l73Q1K21M4n53M18J43l64LM04
2261B11m51R7M26m9o26N87L98q31J07K73k79j09L77M0m27M79mn39L07J34l00j19
2283b98J43m5r4M13L8k18p5K53O2m09L43J92n69N40j8k86j52L44j67k52J08K92
2305A45k56j98J83J29l16L32J06m25J96M40m22k40M68j14l48K53M40l97k22N11
2325B65k8m28L31K36n08J7K51j91j14K54k1m10O2N21l03k61M22k64j02L87m4k62
2347a90oL08lk84L45J60m70L71K27p26J40M63l88j48M49q7j64j58J52q0k96M53
2369F8j85p2J43K28m37L22J34l3m88M07J48k97K33p7k20q3K18O9l45K54R8j54
$$ plain form
2391 -69 -119 177 -10 -482 -109 128 70 -168 263 59 -211 169 -102 78 132 298 -7 -152 38 249 -207
2412 -207 3 322 -442 -244 481 -245 -330 134 -24 -313 -45 27 -240 -140 315 6 -204 150 130 -63 153
2433 153 178 101 -93 46 106 -339 78 267 -203 -50 247 -109 -259 131 82 -357 -161 153 -140 -427 55
2454 55 100 -43 43 319 -23 -78 242 4 -206 248 188 -66 -15 265 54 -119 45 -76 -200 -295 -81 -134 43
2477 43 171 -362 -359 291 29 -173 -66 246 -1 -124 296 298 -227 168 250 4 -35 100 -28 -316 69 159 -227
2500 -227 -69 233 -91 -159 15 8 -209 -196 -45 122 -181 225 218 -275 30 211 -27 8 312 42 -155 49
2522 49 235 -146 64 70 -95 -236 88 -81 61 70 34 -371 -28 98 96 -119 255 358 -55 240 144 105 97 215
2546 215 -132 126 -32 12 -199 -162 78 -253 -154 -148 -164 -410 36 68 -172 -79 198 -90 -156 163 91 133 197 194 -107
$$ packed form
2391f9n0K96j87m72L73K37n8k38M31k04k70L80k71J80N4J66l05j45J90K11m56
2412b07K10L19p64J98P25p26q5M64j58k89K68P2k67J00M55l09k10L54k0j93K16
2433A53K5p7j94J39O0m45M17J89m70J53K97l56j50L90m9m39J96L14k93k87M82
2454E5M5j43Q6K76l42n5L20k38k10M54o0k54N1K80k11j73J64j21j24r5K14n3J77
2477D3J28n33LO50k62k02J07L12k47j23M20Kn25L95Q2k46l9J35j28k88L85R0l86
2500b27J58L02l24o8J74pk17J3J51J67l03M06pm93L05J81k38L5L04k70j97K04
2522D9J86l81K10Oj65j41L24j69J42Rl6m05L43J26kk15L74J03m13K95r6l9qJ18
2546B15l47K58j58M4k11L7K40l31R9Oj6k46M46L2k40R3K77k88o6L19p2M2O4ll01
$$ plain form
2571 -107 -80 271 63 -146 168 177 -14 -79 115 -179 -123 143 115 -230 -270 -101 -343 30 -71 34 -179 126
2593 126 226 -292 -6 239 164 -337 116 220 41 181 67 -137 -81 200 -122 -178 34 -5 -280 -263 22 98
2615 98 -193 -111 -37 -66 0 199 -160 -107 119 12 232 307 221 -117 11 318 -70 -364 223 130 -155 -80 -210
2638 -210 -85 -167 8 -45 -371 69 27 -231 -229 90 79 -60 353 -15 -93 117 111 -48 155 234 123 -100 -187 187
2662 187 -153 54 -47 -231 -103 58 -49 -172 11 -26 -8 -55 -20 -42 -93 228 7 -136 55 100 -218 45
2684 45 283 115 32 105 -76 -157 -256 -54 -187 -121 -16 -262 117 24 -84 -113 41 358 184 -254 300 237 163
2707 163 -8 193 105 95 197 30 -118 -75 -3 -126 -80 -91 57 -238 -70 32 -212 -126 -66 -274 -132 -41 -28
2730 -28 79 52 206 -98 83 174 39 -173 111 232 6 -267 -97 29 -20 80 -108 -142 -158 -38 -122 -108 184
$$ packed form
2571a07K7L51k08k09L14Rj91o5J94k94N6K66k8l45m0J69k42L73j01J05k13L05
2593A26J00n18K86K45p5n01M53J04j79J40j14k04N6K81l22n6K12l9k75J7K85P6
2615I8k91Q2P4k9O6J99l59N3K26j07K20P5q6l38J28L07l88k94N87r3k85P5j30
2638b10J25q2J75n3l26M40m2k58KL19j1j39M13l68p8K10oj59K03P9j11k23q7L74
2662A87l40K07j01j84J28J61j07j23J83l7J8m7L5k2n1L21k21j43J91M5l18K63
2684D5K38j68q3P3j81q1r9K02j33O6J05k46L79r3j08k9J54L17j74m38N54o3p4
2707A63j71K01q8j0J02j67j48M3P2j23M6j1J48k95J68J02k44Q6O0k08J42R1J3
2730b8J07k7J54l04J81R1j35k12K84J21k26k73J70J26m9J00j88l4j6J20q4J4K92
$$ plain form
2753 184 225 -130 -87 180 -198 27 227 -38 -48 195 37 -103 273 -43 -93 -101 114 59 -190 129 -57 -187
2775 -187 -78 169 128 -319 -59 85 -172 253 35 40 103 30 53 -104 76 199 136 137 182 119 -102 -1 131 -57
2799 -57 73 294 -135 -255 -154 -213 -315 38 59 7 -225 110 -63 -222 226 225 -61 -1 174 -119 45 134 -46
2822 -46 25 124 315 -161 -243 218 -27 -92 75 -117 115 -267 103 -69 -158 125 31 36 135 63 -31 76 -17 -27 140
2847 140 119 157 -65 -46 192 -287 -19 -56 -95 -359 150 -52 -130 24 80 -59 124 -77 144 -73 -119 -2 -26
2870 -26 51 210 173 114 -52 34 -94 -137 26 55 -104 -37 44 -64 -127 60 -192 44 163 59 -336 -16 82 -203
2894 -203 -14 256 113 55 110 11 8 -229 -72 -181 43 87 -6 -192 135 105 51 70 97 -16 -240 -127 98 -150
2918 -150 -170 56 107 -131 -119 87 -184 31 29 -86 162 -21 119 -74 61 62 202 74 -49 -108 -101 83 -230
$$ packed form
2753A84M1l55M3K67l78K25K00k65j0K43j58j40L76l16n0qK15n5k49L19j86j30
2775a87J09K47m1m47K60J44k57M25k18NO3p3K3j57J80J23o3JM5o3k21J01J32j88
2799e7J30K21m29j20J01n9j02L53K1n2k32L35j73j59M48jk86O0J75k93J64Q9j80
2822d6P1R9J91m76q2M61k45o5J67j92K32l82L70j72q9K83r4NR9p2r4J07r3j0J67
2847A40k1L8k22J9K38m79K68l7l9k64N09k02p8J54N6j39J83k01K21k17m6J17k4
2870b6P7J59l7n9j66Q6j28m3J63K9j59O7Q1j08o3J87k52K36J19j04l95L20R8k85
2894b03J89K70j43n8N5r9lk37J57j09K24M4r3j86L27l0n4J9K7j13k24J13K25k48
2918a50k0K26N1k38J2K06k71K15kj15K48j83J40j93J35JJ40j28j23n9PJ84l13
$$ plain form
2941 -230 12 -63 120 42 96 69 -27 -8 38 10 71 -18 92 143 -121 114 110 94 239 247 -236 -67 98 62 -190 -167
2967 -167 -252 -58 49 -192 -40 -189 -45 70 115 316 -130 25 155 48 184 61 118 71 7 -204 85 -21
2989 -21 -172 92 42 -1 -51 -7 -164 -6 -189 -104 50 -101 -189 55 7 120 -82 16 -6 275 -187 106 -26
3012 -26 -125 98 152 -17 132 -47 -111 118 -27 17 13 -43 26 -193 -71 103 -232 -268 -147 -64 130 150 93 302
3036 302 -44 -97 201 76 -118 -75 80 71 255 -92 53 -46 -194 60 -15 -185 165 -30 -95 -13 -33 -54 83
3059 83 302 -197 125 108 -41 -14 4 206 -36 211 34 147 72 10 -82 -158 226 -66 57 -22 44 69 -41 68
3083 68 152 -109 17 128 -101 -91 71 74 -214 -88 135 88 81 -2 244 -22 154 -30 -108 -90 -256 128 -117 96
3107 96 112 -181 -124 194 -92 -4 51 -47 41 -54 31 7 -116 -17 -34 -91 118 -43 -330 7 -60 -18 -198 -219 -253 4
$$ packed form
2941b30K42p5J83p8N4k7r6J9M6k8O1q9J10N1k64K35mj6J45Qm83J69J65l6k52K3
2967a67q5J94J07k41J52j49J44J15M5K01m46J55J30j07J36j23N7m7o4k11K89j06
2989b1j51K64n0m3n0M4j57J58j83Q5J54j51q8K44m8J13k02R8k2K81m62K93j32
3012b6r9K23N4j69J49j79o4K29j45M4mn6O9k19J22J74l35l6J21Q3J94K0n7K09
3036C02l46n3K98j25j94M3J55rJ84l47J45r9j48K54p5j70L50j95o5Q2k0k1J37
3059H3K19m99L22j7j49K7J8K02k42K47j77J13p5o2r2p6L84k92J23p9O6K5j10J09
3083F8Q4k61J26J11k29J0J62Lk88J26K23m7pq3K46k66J76j84p8J8j66L84k45K13
3107I6J6k93N7L18k86Q8N5r8Q8r5Q5k4j23R9j7n7K09j61k87L37o7M2j80k1l4K57
$$ plain form
3133 4 -5 62 -206 48 -7 -205 177 -44 50 -218 15 74 -64 80 116 -4 36 88 -27 32 -141 12 -185 -147
3157 -147 13 -155 -69 -69 8 18 -48 -29 11 103 11 -124 -23 211 -69 -159 -192 166 -22 39 66 -23 -44 113 -75
3182 -75 -82 -156 120 8 38 74 19 -186 47 179 -71 -142 28 70 -89 7 15 -61 85 -49 21 140 15 45 -164
3207 -164 -152 69 -133 76 -219 144 -238 -68 205 -37 -145 -118 -60 -124 -22 48 -91 112 332 -65 -57 221
3229 221 209 -118 -83 207 -12 -120 43 9 45 5 166 -243 32 -20 -67 -6 85 -21 14 -89 156 -189 -30
3252 -30 27 47 -60 41 58 -33 179 35 14 1 -142 238 -293 5 -22 -34 -311 -41 -171 -141 64 -91 -104 -151
3276 -151 199 -213 -209 225 156 36 56 329 65 -16 95 -8 -209 -57 19 36 -164 201 3 -185 116 119 49
3299 49 170 110 17 86 122 37 -54 227 112 113 122 -27 -118 -180 260 -126 57 83 11 -65 -225 23 -162 -279 50
$$ packed form
3133DrO7k68K54n5j98L82k21R4k68K33N9j38J44L6j20M0N2j15N9j73J53j97L8
3157a47J60j68Q6%P7J0o6J9M0R2r2j35J01K34k80r0l3L58j88O1K7q9k1J57j88
3182g5pp4K76j12L0L6n5k05K33J32k50p1J70M2j59R6Qp6J46j34P0J19j25L0k09
3207a64J2K21k02K09k95L63l82J70K73k42j08K7N8o4J02P0j39K03K20l97QK78
3229B21j2l27L5K90k19j08J63l4L6m0J61m09K75n2m7O1R1j06L5j03K45l45J59
3252c0N7K0j07J01J7r1K12j44k1j3j43L80n31K98k7j2k77K70j30L0K05j55j3m7
3276a51L50m12MM34o9j20K0K73k64q1J11j03k01J52P6J7k00L65j98j88L01Lp0
3299D9J21o0r3O9L6q5r1K81j15JRj49r1o2M40l86J83K6p2p6j60K48j85j17L29
$$ plain form
3324 50 39 -104 42 206 -173 -172 56 125 -91 -56 32 -264 53 165 4 -24 293 -12 -44 -16 5 -124 -106 73
3348 73 -48 -268 47 43 -53 -182 169 30 -245 -75 -3 -311 -62 181 -97 -185 -105 13 -209 247 113 -89
3370 -89 -110 35 -68 -35 27 -205 -102 -54 -69 82 -182 -4 -40 -30 38 19 -161 -31 412 -181 -269 422 145 -22
3394 -22 160 61 -128 -142 95 102 43 194 256 -337 56 17 -32 -177 312 59 -198 70 116 -35 -142 -42 147
3417 147 -152 71 93 -112 -139 -55 19 48 30 -112 -214 63 282 -81 16 71 228 -104 209 230 -35 -137 94
3440 94 119 -95 -48 73 -43 218 7 -81 -106 309 41 -159 104 -15 2 126 142 -285 84 129 72 -92 73
3463 73 94 51 -94 -29 -108 -159 246 112 -126 -112 57 -122 -32 288 -94 -199 126 156 -65 -176 386 -65 -86
3486 -86 158 64 -172 76 226 -51 2 225 -95 -30 -13 61 -212 -65 153 25 -82 -15 268 -138 167 -52
$$ packed form
3324E0j1j43J46J64l79JK28O9k16L5Q8k96L17J12j61k8L17l05l2K8K1j29J8J79
3348G3j21k20L15mr6j29L51j39k75J70P2l08K49K43k78q8Q0J18k22M56j34k02
3370h9k1J45j03L3O2k32J03M8j5J51k64J78l6J0O8j9j80J30M43n93q8O91k77j67
3394b2J82r9j89j4K37Pn9J51O2n93L93l9m9j45M89k53k57K68M6j51j07J00J89
3417A47k99K23K2k05k7Q4P4K9j8j42j02K77K19l63R7N5J57l32L13K1k65j02K31
3440I4K5k14M7J21j16K61k11q8k5M15k68k00K63j19J7J24J6m27L69M5n7j64J65
3463G3K1m3j45O5p9n1M05j34k38J4J69j79R0L20l82j05L25L0k21j11N62m51k1
3486h6K44r4k36K48J50k77N3K23l20O5J7P4k73J47K18j28j07O7K83m06L05k19
$$ plain form
3508 -52 -230 -185 165 57 -110 -148 162 -303 -76 174 13 -267 29 6 -153 -16 20 -228 -2 116 30 -195
3530 -195 85 93 -207 74 209 22 85 263 -27 -45 71 125 -354 257 152 67 -49 3 104 -156 -34 267
3552 267 26 -101 86 47 -150 68 24 -117 69 33 -265 -164 223 56 -265 257 148 -226 -88 203 -151
3573 -151 -95 244 -37 -105 -160 109 57 -40 247 -44 -11 173 251 -295 -74 280 -65 -210 30 65 17 -3 81 11
3597 11 -53 190 192 -129 -91 161 -154 -193 270 -57 -183 -46 17 -13 -41 -44 -73 -56 74 203 -78 -17 -57 -97 -231
3622 -231 49 -191 -265 145 66 -295 102 447 -68 24 -53 256 105 -136 579 -30 -60 174 32 -36 183 252
3644 252 -364 -221 148 48 -98 109 -43 -1 18 10 -106 -5 235 -132 -256 183 144 -151 54 215 -169 -221
3666 -221 92 203 -226 -84 223 -96 -155 58 18 -69 116 25 -130 -32 -64 -137 67 329 17 -177 -139 -32 -291
$$ packed form
3508e2j78M5L50j08j67l8L10m65K27K50j61k80K96k3j59J37L6k48K26J18q6k25
3530a95K80Ql00K81J35j87O3J78k90j8J16N4m79O11j05q5j16N2J01k60J22L01
3552B67k41j27J87l9j97K18m4j41J86l6k98J01L87j67l21N22j09l74J38K91l54
3573a51N6L39k81o8n5K69n2r7K87k91L3J84P8n46K21L54l45j45K40L5m8k0Q4p0
3597A1o4K43Kl21L8K52l15l9M63l27j26J37O3l0k8lk9J7J30J29k81O1m0m0j34
3622b31K80k40p4M10p9l61L97L45n15R2p7L09j51k41P15o09l0K34j42o8K19O9
3644B52o16J43L69j00j46K07j52M2J9qj16J01K40l67j24M39l9k95K05J61l84n2
3666b21L13J11m29J42L07l19n9K13m0q7J85r1j55R8l2p3K04K62l12j94L8J07k59
$$ plain form
3689 -291 -14 167 -124 -38 61 167 -7 293 81 40 -33 285 92 -442 66 123 54 -1 220 -48 -257 94
3711 94 42 -155 -2 91 -86 -100 136 -155 -88 209 326 -175 109 27 -12 34 -67 105 -82 69 246 -104 -62
3734 -62 267 13 47 52 133 -109 9 234 39 -132 99 -57 -186 31 203 -26 190 315 -87 -192 56 166
3756 166 -10 12 31 -24 47 -29 64 -349 61 190 -226 -11 227 -91 -200 300 92 -338 23 305 -106 -192
3778 -192 85 6 24 90 29 -455 56 82 -113 -134 236 172 -130 33 175 -154 -40 234 98 -244 93 178 -21
3801 -21 73 -9 11 -329 183 42 -308 35 47 -117 -112 147 -77 84 105 178 266 -85 93 45 -53 146 56 -191
3825 -191 259 99 -42 -230 190 -103 -172 141 170 -199 -122 300 -56 -36 264 -121 -15 -60 12 -12 124 64 54
3848 54 -103 281 70 -178 138 43 -30 -74 118 54 -118 144 192 -210 -101 29 -164 -299 258 289 -236 -119
$$ packed form
3689b91K77J81k91Q6R9J06j74L00k12m1p3L18j93n34N08N7o9n5K21k68k09L51
3711I4n2j97J53R3j77j4K36k91O7K97J17n01K84q2l9M6j01J72j87J51J77l50M2
3734f2L29k54L4NQ1k42J18K25j95j71K31j56j29K17J72k29K16J25m02j05K48J10
3756A66j76K2J9n5P1p6R3m13M10J29m16K15K38l18j09N00k08m30L61K82m11q6
3778a92K77p9J8O6o1m84N11K6j95k1L70o4l02J63J42l29J14K74j36l42L37Q5j99
3801b1R4q2K0l40N12j41l50L43J2j64NK59k24J61K1P3Q8l51J78m8r8J99r0k47
3825a91M50j60j41j88M20k93o9L13K9l69P7M22l56K0L00l85J06m5P2k4J36o0j0
3848E4j57L84k11k48L16r5p3m4J92o4j72K62M8m02J09J30j93j35N57L1n25J17
$$ plain form
3870 -119 162 -134 6 92 39 -127 69 114 -50 -161 332 -134 137 216 -9 -276 -45 57 -114 -117 -129 51
3892 51 0 32 171 55 167 124 -106 -38 232 181 -84 -2 122 57 -69 145 -85 -231 104 186 -230 47 116
3915 116 -71 -103 218 -30 -126 47 -116 -93 -63 118 56 -49 148 -10 -283 205 319 -137 -130 127 -55 -169
3937 -169 163 329 -241 -84 150 -63 -150 36 -30 -119 -30 221 -9 -47 -2 -179 -192 -36 120 -150 -31 139
3959 139 -15 -117 -8 187 -97 83 79 -176 -208 149 27 -248 114 373 -291 -74 254 9 -335 115 135
3980 135 -90 -184 58 -145 89 57 22 -24 -39 20 -209 -51 128 -58 -83 30 140 -39 -117 1 -193 72 105
4003 105 1 -148 -42 -9 -174 120 278 -27 -131 -12 -115 -93 217 84 32 -74 298 56 -130 153 5
4024 5 -86 -78 -129 -166 -124 103 -173 -47 -49 138 -58 19 68 -15 -260 13 -68 -233 -45 -46 -20 -184 53 -46 -103 7
$$ packed form
3870a19K81k96J40Q6n3j66J96M5j64j11M93m66K71P9k25k67K31J02j71lj2J80
3892E1n1L2J39j16J12m3k30O8K70n1k65Q2J24o5j26K14k30j46L35Q2m16K77O9
3915A16j87l2L21k48r6J73j63K3L0J81o2j05J97j58k73M88J14m56PK57j82j14
3937a69L32J66n70J57K34k13q7J86o6q9Q9K51k30l8M5j77j3J56J56k70J19J70
3959A39j54j02J09J95k84J80mk55l2L57j22k75L62K59o64K17L28k45l44M50K0
3980A35k25r4K42k03K34l2l5m6j5N9k29J58J79j86k5J13J10j79p8J18j94K65L3
4003A05j04j49J06L3j65K94J58l05j04J19j03K2L10j33n2j06L72k42j86K83j48
4024Er1Qn1l7M2K27k76J26kJ87j96P7M9q3k45K73q1j65J88jK6j64K37r9n7J10
$$ plain form
4050 7 261 -185 81 223 -124 -69 367 72 -244 -304 141 44 -101 335 111 -126 137 -71 -159 9 161 33
4072 33 24 48 75 -299 14 22 -88 -68 234 -25 -157 30 -14 45 -47 103 25 -94 346 152 -23 29 253 100
4096 100 -153 185 -158 -178 280 189 -78 145 11 -68 -174 68 232 -214 -36 106 74 -224 192 -29 -33 169
4118 169 107 -43 -29 234 74 -209 274 42 3 67 49 -116 -101 47 109 -45 -49 243 -244 -270 84 52 -6 65
4142 65 -81 25 20 154 -197 -29 30 -97 17 165 31 -127 45 182 -15 -25 237 -140 -2 58 212 -8
4164 -8 -14 47 -149 -80 166 -62 -37 206 49 -61 -71 -10 3 -75 64 37 5 6 127 71 -112 -114 76 -137 -152 -55 0
4191 0 -114 241 102 -238 242 -58 -130 -34 77 48 63 102 -214 -186 -43 15 67 25 338 -14 -180 182 -105 -146
4215 -146 39 206 -128 7 138 67 -73 60 148 -191 -24 219 -77 -86 109 132 -52 80 12 -209 42 6
$$ packed form
4050GK54m46K66J42l47N5M36k95l16o0M45r7j45M36k24k37K63k08q8J68J52j28
4072C3rK4K7l74L13Qj10K0L02k59j32J87m4N9r2J50p8j19M40j94j75N2K24j53
4096A00k53L38l43k0M58r1k67K23j34p9j06K42J64m46J78J42l2k98M16k21mK02
4118A69o2j50J4K63j60k83M83k32l9O4j8j65J5J48O2j54mK92m87k6L54l2n8P1
4142F5j46J06nJ34l51J68N9j27J14J48j34j58J72J37j97j0K62l77J38O0J54k20
4164hoO1j96O9K46k28K5K43j57j10j0O1J3p8J39k7l2JJ21n6j83kJ90k13j5R7N5
4191@j14L55j39l40M80l00p2R6J11k9J5L9l16K8J43N8N2m2L13l52j66L62k87m1
4215a46J85J67l34J35J31p1j40J33Q8l39J67K43k96rJ95K3j84J32o8k21K51l6
$$ plain form
4237 6 -30 -211 62 5 -13 -30 -14 -236 -211 64 190 -14 196 193 39 -49 -21 -211 -97 93 180 -4 5 -77 70
4262 70 -26 151 219 -48 216 66 152 -99 96 -134 12 118 117 -90 54 87 -57 -177 -9 -27 -141 236 210
4285 210 -56 9 218 -132 -165 -5 213 -94 218 288 28 12 199 181 -12 222 157 24 24 243 -89 -143 176
4308 176 108 60 129 178 19 -141 104 39 -57 112 69 39 156 28 78 -145 -7 0 14 -83 -4 97 -75 162 121
4333 121 -50 -156 -53 -144 -36 251 39 -40 64 235 20 -194 34 -75 57 181 -180 -75 206 28 -193
4354 -193 -39 267 68 147 155 2 40 63 -20 52 206 -95 43 34 2 143 -98 32 68 -143 -83 92 33 -97
4378 -97 -9 363 22 -44 190 -139 6 189 -37 -7 217 -45 -166 -25 120 177 -67 106 -41 -29 -88 -125 11
4401 11 27 72 -163 -164 50 68 -173 -55 80 -44 -24 59 131 107 -93 115 160 6 255 98 -76 113 282 -63
$$ packed form
4237Fl6j81K73n7j8j7J6k22K5K75J26k04K10lj54q8K8j90J14J90Q7j84Rq2J47
4262G0r6J77O8k67K64j50Q6k51J95k30J46J06jk07J44L3j44j20J68j8j14L77k6
4285B10k66O5K09l50l3J60K18l07L12P0k60j6J87j8j93K34o5j33%K19l32n4L19
4308A76o8m8O9M9j59j60K45o5r6J69m3l0J17j28N0k23J38PJ4r7P9J01j72K37m1
4333A21j71j06J03r1J08K87k12p9J04J71k15k14K28j09J32J24l61J05K81j78k21
4354a93J54L06j99P9Qj53L8K3q3P2J54l01J38rl2J41k41J30L6k11O0J75n9j30
4378i7Q8L72l41o6K34l29J45J83k26L0K24k62j21J41J45N7k44J73j47J2n9l7J36
4401A1J6M5k35jK14J8k41J18J35j24K0Q3P2k4k00K08M5j54K49j57j74J89J69l45
$$ plain form
4425 -63 -41 137 22 -132 -22 -103 -45 -2 -134 -25 -120 1 12 -1 68 73 1 -89 173 162 -106 8 254 -3 -188
4450 -188 -91 -113 21 -59 -55 -43 -16 68 -183 13 -47 -112 17 69 10 -117 11 192 117 -54 -3 -66 -100 -36 105 0
4476 0 4 -6 -59 39 37 5 40 76 95 -99 -90 17 71 -36 -7 -28 -134 -104 80 -201 15 -219 -8 -88 -121 -35 -106 -53
4504 -53 -117 91 155 -47 69 -68 -61 -33 105 -50 90 -119 29 55 -11 66 53 34 4 66 -27 49 39 -165 -58
4529 -58 -44 -140 -70 -94 33 50 27 142 -31 -13 -34 -61 -209 -79 20 8 0 42 21 -2 -94 34 -42 -34 -117 -141 65 -212
4557 -212 11 68 -74 141 -98 170 81 -117 178 -128 -106 -48 106 -97 193 36 -103 31 -15 -163 -134 111
4579 111 76 140 -66 9 -177 195 23 148 -131 6 98 -160 -125 -190 38 -31 190 59 112 6 -66 7 -76 11
4603 11 17 -140 -49 52 61 -32 41 130 15 74 -1 1 -97 78 12 -114 33 208 215 36 171 190 172 72 -145 -229 -39
$$ packed form
4425f3K2J78j15j54J10q1N8M3j32J09r5J21J1j3O9Np2r0K62j1k68J14K46k57j85
4450a88R7k2J34q0MJ2K7Q4k51J96o0o5J29N2n9j27J28J81p5j71N1o3l4O4J41j05
4476@Mj0n3R8kl2L5L6J9j94RJ07N4j07K9k1j06L0J84k81K16k34K11q0l3Q6p1N3
4504e3o4K08O4k02J16j37PK8J38j55J40k09J48K6o6P7j3j9l0O2r3P6j0k04J07
4529e8J4r6P0k4J27J7k3J15j73J8k1k7j48J30R9j2qM2k1k3r2J28p6Qq3k4K06k77
4557b12K23N7j42K15k39K68q9j98K95l06K2N8J54k03K90j57j39J34m6j48K9K45
4579A11l5O4k06P5j86L72j72J25k79J37R2k58L5o5K28o9K21j31N3j06p2P3q3Q7
4603A1Oj57R1J01Rr3P3Q9j15N9p5Kr8J75o6j26J47J75Pj79J35J9j8j00k17q4J90
$$ plain form
4630 -39 -148 15 63 29 157 168 209 -120 -122 38 -82 -270 -14 -233 -112 139 37 27 -11 165 66 20 -34 -43 -43
4655 -43 68 193 -134 -72 -176 -184 100 -120 -61 32 -13 12 108 -32 -89 72 130 62 40 9 29 -26 245 23 -50 -147
4681 -147 -71 -30 76 -100 70 -45 18 0 -80 -58 74 -53 146 -31 31 88 54 225 -73 28 -76 169 -32
4704 -32 -141 -39 155 -56 -10 -36 -48 169 -62 116 -61 -8 79 -82 174 -109 -74 143 81 -4 18 -44 151 57
4728 57 73 -39 -115 -8 22 -99 96 1 -44 101 1 -124 107 10 11 -10 -39 3 32 78 -14 -89 122 -19 -90 19
4754 19 133 -21 -59 -128 -195 -55 -115 22 -5 6 159 -9 -45 193 137 -100 -161 -109 168 13 -89 132 132 82 -24
4779 -24 86 -118 -133 -190 7 39 60 19 99 125 76 -170 105 -51 220 -19 126 -46 157 -5 40 15 -156 -256
4803 -256 18 -93 -82 132 -157 162 100 12 90 200 80 -287 109 134 -140 141 -4 -100 -11 -122 43 283
$$ packed form
4630c9j09J63M8l4J28J1M1l29kJ60j20j88K56k19J21K51j02j0l8J76r9m6n4r%
4655d3J11J25l27O2j04qK84k20N9R3m5K5R6j40n7J61N8o8k2l1K0n5K71k22p3r7
4681a47P6M1J06j76J70j15O3j8q0K2J32j27J99j77O2N7l4J71k98J01j04K45k01
4704c2j09J02J94k11M6k6j2K17k31J78j77N3Q7j61K56k83L5K17o2q5K2o2J95r4
4728E7J6j12p6J07L0j21J95r5m5J45j00j25K31r7Jk1k9M2K9M6r2p5K11j41p1J09
4754A9J14j54l8o9o7J40o0J37k7J1J53j68l6K38n6k37o1N2K77j55j02K21%n0j06
4779b4J10k04j5n7J97L2K1m1Q0K6m9k46K75j56K71k39J45j72K03j62M5k5j71j00
4803b56K74j11J1K14k89L19o2q8P8J10j20l67L96K5k74K81j45r6Q9j11J65K40
$$ plain form
4825 283 21 -32 -13 -125 -118 39 -193 -46 41 111 138 51 -149 -26 67 64 116 185 11 -86 89 -101 -17 -43 193
4850 193 -234 -85 -109 -89 -8 -85 92 35 -152 44 6 255 -130 -88 141 156 -51 65 121 -82 121 -64 14
4873 14 13 155 120 68 -83 -49 176 -16 -65 -27 42 -49 -112 -64 -108 89 -6 11 -157 87 30 31 -67 177 -27 -68 -166
4900 -166 -19 -134 -196 -60 127 -170 -173 215 -59 21 165 36 -143 -112 5 -31 48 245 112 -19 -77 -146 -156
4923 -156 102 -158 1 -8 363 97 34 -220 -39 30 135 157 -2 -4 67 172 -39 8 -17 -161 206 2 84 53
4947 53 45 84 101 201 9 60 -167 161 -43 -9 161 215 -125 99 -6 -88 145 54 182 10 179 -22 175
4970 175 -96 -67 146 -122 -161 0 -110 82 -146 72 -13 57 -119 1 47 -48 91 -111 -40 -27 93 4 206
4993 206 91 222 -18 129 48 28 -98 -65 -124 -154 -190 196 -14 23 -225 89 198 31 89 -50 48 53 6 -60
$$ packed form
4825B83k62n3J9j12PJ57k32J47Q7P0K7q7k00J23R3lN2O9j74r7J75j90Q4k6K36
4850A93m27J49k4K0Q1p7J77n7j87J96l8K49l85M2K29J5k07J16N6k03K03j85P8
4873A4jJ42l5n2j51L4K25j92m9L8O9r1o3M8m4J97r5J7j68K44n7Jr8K44k04m1r8
4900a66J47j15o2J36J87k97lL88k74Q0J44j29j79L1J17l6P9J97j33j31n8o9j0
4923a56K58k60J59rL71k66o3k54J81O9J05K2j59kP1J05k11M7k5j44L67k04Q2l1
4947E3qL9J7J00j92N1k27L28k04L4J70N4l40K24j05q2K33r1J28j72J69k01J97
4970A75k71K9K13k68l9J61j10J92k28K18q5P0j76J20M6r5J39k02P1J3J20q9K02
4993B06j15J31k40J47q1k0j26L3n9l0l6L86k10L7k48L14J09j67N8j39R8Nm7o6
$$ plain form
5017 -60 -11 96 167 -138 98 21 124 61 254 -1 -163 -72 38 112 32 -74 119 -103 -130 -147 -1 97 -61 116
5041 116 169 -100 -43 -115 30 48 -112 -29 5 -4 -81 127 169 -161 -29 -77 -2 -109 110 85 -171 140 120 163 49
5066 49 -50 -30 -171 115 104 -180 235 3 -71 -64 45 18 29 29 105 106 -58 85 76 -27 -58 -96 -124 149 143 40 -227
5093 -227 -144 -119 -204 11 -127 -27 -74 264 238 39 -6 25 -144 -26 -42 59 -41 -26 163 60 -23 -3 -21 21
5117 21 110 24 32 63 188 -89 36 246 -30 158 66 217 -11 134 -357 61 116 51 -99 -103 135 161 -84 -22
5141 -22 58 10 86 235 -78 -108 240 170 79 -6 248 -30 203 243 81 -85 -171 131 110 162 14 -170 76 33
5165 33 229 -107 46 -14 -139 48 81 172 -183 124 48 -84 -97 173 45 20 82 -37 -205 27 -73 -88 -34
5188 -34 69 -55 -216 -54 -216 99 -108 39 -25 37 -49 -65 -49 128 9 -261 97 138 -13 56 177 13 -101
$$ packed form
5017f0M9J07P1l05K36p7J03o3J93k55j62R1J10P4q0j06J93k22k7j7J46R8j58J77
5041A16N3k69N7p2J45J8j60Q3L4rp7K08M2l30J32m8P5j07K19k5k56L11k0M3j14
5066D9r9K0j41K86j1k84M15k32p4PJ09k7J1%P6Jj64J43rj03l1l8k8K73oj03k67
5093b27Q3K5q5K15j38J00m7L38k6j99m5L1j69J18j6J01j00J5J89j03q3K0j8M2
5117B1Q9q6QL1J25k77J25K10k76J88r2J51k28J45m91M18N5o5j50mK38K6k45O2
5141b2Q0m8P6J49l13l0L48p0r1q5K54k78K33M0j62j66q6L02k1N2j48j84K46m3
5165C3J96l36J53o0j25J87L3R1l55L07p6j32j3K70j28k5O2j19j68K32j00j5N4
5188c4J03j24j61J62j62L15k07J47o4O2q6j6J6J77j19k70L58M1j51O9J21j64j14
$$ plain form
5211 -101 -84 -62 -86 80 138 34 -14 168 19 -21 -29 237 67 -63 45 7 117 27 -24 -125 18 -37 -9 89 46
5236 46 226 -28 92 -101 -31 19 -3 127 -81 218 178 65 -304 36 -35 -197 -39 66 54 81 -60 -108 -62
5259 -62 -82 -61 -32 43 57 -233 -96 131 -14 -149 144 112 -41 164 57 -101 -63 -168 248 100 70 89 37 -22
5283 -22 -36 -75 -18 167 -65 -1 -14 47 162 153 266 -121 -145 34 -39 -48 0 -84 48 -98 96 135 -49 -11 -93 37
5309 37 -102 32 134 -52 142 66 33 55 15 143 -145 -58 95 -114 218 78 15 34 167 65 4 175 167 -250
5333 -250 222 134 186 -124 -49 -74 -46 -125 -25 -103 -72 12 -33 -38 125 -86 -16 -36 25 -77 -72 160 -33 -38 24 55 -391
5360 -391 19 151 -97 93 -120 13 15 -60 138 -84 99 112 172 -25 35 203 -64 -130 259 -89 -190 -172 -132
5383 -132 -136 -108 56 -76 120 14 32 122 -81 156 96 -14 -55 -238 -201 105 -67 21 76 21 -52 -33 -43 174 -165
$$ packed form
5211a01J7K2k4J66N8j04m8J82j49m0qK66j70j30J08l8J10r0n1j01J43n5K8R8m3
5236D6J80k54J20j93P0N0k2J30k08K99m0j13l69L40p1j62J58J05j2K7j41m8M6
5259f2k0K1K9P5J4k90J37K27j45j35K93l2j53K05j07j58L8j05M16j48l0J9n2n9
5283b2j4l9N7J85k32O4j3O1J15rJ13l87k4J79p3rM8q4J32j46J94L9j84L8q2J30
5309C7j39J34J02j86J94p6l3K2m0J28k88Q7J53k09L32j40o3J9J33j02o1J71qm17
5333b50M72q8N2l10P5k5K8p9J00p8L1Q4m5nJ63k11P0k0O1j02NK32j93nO2L1m46
5360c91M10J32k48J90k13J33Kp5J98k22J83J3O0j97O0J68k67o6L89l48j01J8M0
5383a32mK8J64j32J96j06J8R0k03K37o0j10m1j83L7L06j72Q8N5n5p3J9j0K17l39
$$ plain form
5408 -165 32 116 -120 118 89 67 -109 -19 -33 -6 108 -19 -18 -35 208 41 -145 -33 161 -62 19 208 41
5431 41 -10 98 1 -77 -102 167 -82 -12 140 134 -206 208 65 110 73 291 110 -179 106 -31 -180 387 64
5454 64 -130 26 149 195 41 -9 52 -29 32 193 -190 37 -68 31 -35 -112 62 -218 25 55 81 -69 -48 -72
5478 -72 9 169 -55 -71 66 12 -67 -222 0 70 32 0 215 -46 -232 109 71 -49 -161 -4 -292 169 47
5501 47 -48 -296 -132 63 -281 -18 -6 -18 -170 74 55 -104 115 16 -63 -101 73 74 -18 13 -23 -212 -42 75
5525 75 -92 -37 66 -112 -20 -5 -65 -33 63 313 3 41 -39 131 -34 -5 -48 84 -42 214 -52 58 122 -44
5549 -44 114 -33 85 -159 -167 73 104 -59 -28 4 224 68 46 -36 -132 -95 -28 -99 -126 195 -10 -55 127 -78 -15
5574 -15 95 258 52 -105 240 1 -246 -34 51 11 -118 63 -68 27 37 47 52 162 50 -144 -108 -118 -106 -198
$$ packed form
5408a65J97Q4k36K38k9k2j76R0j4K7J14j27Jj7K43j67j86J12J94k23Q1J89j67
5431D1n1J08r7p8k5K69k49P0J52ol40M14j43M5l7K18j81k89K85j37j49N67l23
5454F4j94J56J23M6j54n0O1q1O1J61l83K27j05R9o6p7J74k80K43L0K6j50K1k4
5478g2Q1J60k24j6J37n4p9j55K22P0l8l2K15k61j86L41l8j20j12J57k88M61j22
5501D7r5k48J64J95l44K63J2j2j52K44j9j59K19r9p9l8J74Jr2L1l6j89J70J17
5525G5j67N5J03j78R2J5o0L2R6K50l10L8q0J70j65K9m3J32j26K56k66J10O4j66
5549d4J58j47J18k44qK40L1j63L1L2K20j56k2q2r6L7O7p1k7L21k05m5J82k05O3
5574a5J10J63k06j57L45k39k47K12Q5m0j29J81j31R5J0J0NJ10j12j94L6j0J2r2
$$ plain form
5598 -198 220 93 -19 68 -61 -116 -129 208 -164 72 51 -151 -66 -145 161 -174 45 116 33 31 112 94 6 149
5622 149 -17 -17 -140 -144 -21 70 -135 74 92 -96 117 116 17 109 128 -109 -122 191 -27 -234 85 73 -270 -134
5646 -134 115 -122 -21 -83 258 25 -28 47 -151 63 8 78 -64 161 123 -126 46 57 56 -49 16 131 20
5669 20 -155 -43 76 -1 -15 73 39 59 -108 -109 -88 36 -129 -78 32 183 -14 78 97 -52 -265 45 -20 -126
5693 -126 220 218 -109 35 -48 -85 -53 -34 -72 -19 51 -37 -182 53 -28 -90 -82 13 -17 -308 -78 65 53 -3 124 153
5719 153 -266 -131 -48 -110 -52 -86 -90 1 -10 -67 -21 6 49 -10 -79 140 20 -190 -74 -83 -60 109 16 126 -113 16
5745 16 158 146 47 115 143 -136 220 60 62 37 -72 -36 -80 93 -97 -265 28 -5 41 -161 -25 -30 63 36 -23 -146
5771 -146 65 52 -46 -204 113 45 -198 -48 223 76 84 118 165 -46 -9 -53 143 126 -45 33 -36 132 14 -90
$$ packed form
5598a98M18j27j12Q7j29n5j3L37l72K36k1k02Q5p9L06l35K19P1q3kQ1j8q8J43
5622A49j66%j23mJ23R1k05K09J8j88K13jr9R2J9k37j3L13k18k07L19j2l43J36
5646a34K49k37J01o2L41k33n3P5j98K14n5P0j42K25l8k49J72J1jj05O5J15j11
5669B0j75J12J19p7j4Q8l4K0j67jK1J24j65N1J10J51j97R2J9j49k13L10o5j06
5693a26L46kl27J44q3l7L2J9l8N3P0q8j45K35q1o2QR5l0k91K30J43j2n6J27K9
5719A53m19J35Q3o2N8l4mR1j1n7M6K7M3n9o9K19j20k10J16rK3J69r3J10k39J29
5745A6J42j2r9O8K8k79L56j60Kk5j09L6m4J73j90j68K93l3M6k02J36nR3k7n9j23
5771a46K11j3r8j58L17o8k43J50K71j47QL4M7k11L7m4J96j7j71P8o9J68j18j04
$$ plain form
5795 -90 63 -237 -137 -133 -165 -30 -174 -5 -34 154 -42 197 58 115 94 97 37 47 180 -91 -112 -9 -121 71
5819 71 250 -13 -181 -31 -55 -135 86 306 -37 -229 81 -112 -188 50 -137 23 -51 -67 28 -35 -94 195 -82
5842 -82 43 125 -49 4 -73 117 -122 -46 -38 -68 10 80 -123 79 4 -51 -237 -151 -31 119 -10 286 143 -30
5866 -30 -33 -98 129 -12 48 42 232 217 -71 40 74 -21 -8 -98 173 91 -149 71 187 38 1 264 42 69 32
5891 32 86 0 69 127 -72 -51 200 63 -47 -57 104 -11 11 131 -13 -239 -19 13 26 -98 -186 -246 205 182
5915 182 -23 -65 58 121 -188 -2 111 -197 51 -62 33 -29 271 -140 -152 -77 142 62 -33 167 92 32 -170
5938 -170 -87 35 -66 45 -173 -81 -71 -37 -57 91 -97 -170 -131 -18 -104 -73 242 116 95 -6 294 217 36 107
5962 107 -11 -103 19 154 159 -78 9 -118 -14 47 61 166 -213 145 60 -190 61 -225 -173 331 31 -65 -44
$$ packed form
5795i0J53l00J00Ml2J35j44J69k9J88j96K39j39N7k1Lo0J0J33k71k1J03j12J92
5819G1J79k63j68J50k4q0K21K20l43j92L10j93p6K38j87J60p4j6R5o3n9K89k77
5842h2J25Q2j74N3p7J90k39P6Ql0P8P0k03K02p5n5j86Q6J20J50j29K96j43j73
5866c0lo5K27j41O0oJ90j5k88J11L4r5J3r0K71q2k40K20J16j49l7K63k22K7l7
5891C2N4q6O9N8j99K1K51j37j10j0J61j15K2J20j44k26K20L2J3j24q8o0M51k3
5915A82k05m2J23O3l09J86J13l08K48j13R5o2L00m11j2P5K19q0r5K00p5o0k02
5938a70Q3J22j01J11k18R2J0L4k0J48j88p3L9J13q6L1L15j26k1j01L00p7j81P1
5962A07j18r2J22J35Nk37Q7j27J04O1J4J05l79L58q5k50K51k86N2N04l00r6K1
$$ plain form
5985 -44 1 104 124 -23 235 -225 3 206 -149 -225 151 43 -207 4 203 14 -166 260 -27 -97 32 -93
6007 -93 -17 -127 -24 -4 -34 -102 46 -233 -141 -188 -47 -41 158 -14 22 -129 193 -67 -209 -113 -28 71 -19 -45 -172
6032 -172 251 156 -104 -32 48 -80 -36 -98 118 130 11 -40 -44 37 305 23 104 18 35 28 -65 27 -17 169 -16 -151
6058 -151 -140 51 69 88 -76 -102 46 -338 237 153 -62 244 134 2 -20 123 -43 -126 -184 -2 269 -55 67
6081 67 9 59 182 95 -5 -168 -26 -14 -82 58 37 -349 15 118 190 -22 315 73 42 43 -53 43 -121 -124 -26
6106 -26 184 -9 76 2 -124 104 -16 -155 -18 10 -344 56 -323 -148 -67 88 -37 -62 43 71 -102 -66 107
6129 107 -87 -189 -103 27 78 -121 53 2 114 91 2 -44 -58 4 -8 8 147 -8 -156 -22 -383 57 -36 -53
6153 -53 -45 -271 -74 18 197 14 109 94 -70 -8 -110 40 -80 21 31 74 115 -17 173 68 122 -111 237 62
$$ packed form
5985d4M5J03K0j47K58m60K28K03l55p6L76j08k50K11J99j89j80M26k87p0J29j25
6007i3P6j10J03K0l0o8J48k79R2m7J41OJ99j72L6j51L22k60j42R6Q5R9r0k6j27
6032a72M23r5k60P2Q0j28M4o2K16J2j19n1mQ1K68k82Q1q6J7pr3R2m4J86j85j35
6058a51J1J91J8J9j64k6J48l84N75q4k15L06j10j32k2J43j66q3n8J82K71l24J22
6081F7n8N0J23q7j00j63J42J2o8J40k1l86L64J03P2k12L37k42l1Jr6R6j64lR8
6106b6K10j93Q5p4j26K28j20j39J37K8l54M00l79J75Q1J55j25k5J05K8j73L6J73
6129A07j94j02Q6J30N1j99J74n1J12k3q9m6j4O2j2J6J39j55j48J34l61M40r3j7
6153e3Qk26J97R2J79j83R5j5j64O2j02J50j20J01J0M3M1j32J90j05N4k33L48j75
$$ plain form
6177 62 -92 33 -69 45 -19 111 -1 6 112 -10 -135 -23 145 -21 -299 -8 35 -51 -27 24 -93 -99 44
6200 44 -170 -73 58 51 -107 159 202 -173 123 70 118 53 -89 -36 6 -68 86 -31 65 64 101 -2 10 90 52 -69
6226 -69 237 22 -172 -60 -216 115 12 18 22 15 13 19 181 84 65 236 131 49 9 -26 57 217 -171 -130 138 -44
6252 -44 55 56 11 25 43 -43 6 -170 11 -37 54 54 116 -1 -4 -73 -52 159 -85 75 -35 68 266 236 41 219
6278 219 -130 -14 120 -26 21 16 40 -13 -6 131 -39 -224 5 -86 -27 79 135 55 -92 -105 129 -182 239 -19
6302 -19 55 -7 3 38 17 -119 -127 -113 -117 0 -43 173 45 31 -149 9 -135 -71 46 180 -64 -11 -50 79 -98
6327 -98 45 -169 16 -75 48 -44 -160 -6 -26 -14 -14 190 112 -3 -75 -139 -100 66 122 34 -17 68 54 91 63 118
6353 118 159 103 41 96 81 -61 30 -13 -38 39 -40 -92 59 -33 11 -70 134 -160 -75 48 -196 62 -184 -100 116
$$ packed form
6177F2j54J25j02J14o4J30j12PJ06j22j25J12J68j66k78K91M3q6K4N1j17oJ43
6200D4k14R7J31pj58K66M3l75K96n3M8o5j42N3M2p4J54j17R6jL7j03J2Q0l8j21
6226f9L06k15j94J12j56L31j03OMpkOJ62r7j9J71j05q2m0l5Q3J60l88M1K68j82
6252d4R9Jm5J4J8q6M9j76J81m8R1%O2j17lo9K1K11k44J60j10J03J98l0j95J78
6278B19l49J16J34j46M7nK4n3PJ37j70j85K29r1N9J06N6q0j47j3K34l11M21k58
6302a9P4o2J0L5k1j36qJ4mJ17m3K16j28j4j80J58j44O4J17J34k44N3l9J29j77
6327i8J43k14J85r1J23r2j16J54k0J2%K04p8j15p2o4L9J66N6q8n1Q5j4L7k8N5
6353A18M1n6o2N5j5j42R1m3k5P7p9n2J51r2M4q1K04k94Q5J23k44K58k46Q4K16
$$ plain form
6378 116 -34 -121 91 -201 4 -7 -226 -73 51 66 105 67 160 -202 -100 -61 0 84 -63 54 292 -245 -23
6401 -23 59 -30 87 -109 -9 78 107 66 152 -97 52 158 2 80 -251 30 -123 32 -28 72 15 -166 40
6424 40 -94 -18 45 171 10 -54 60 -39 -155 -81 -53 -57 63 145 -201 68 43 -33 -34 -280 143 96 14 30 -208 -10
6450 -10 -78 -71 -197 -79 -9 -7 60 -132 55 -17 52 -10 172 -156 -31 226 -300 -14 105 -111 -142 2 123 -78
6474 -78 -186 -149 59 63 -204 89 -136 -35 21 111 -35 4 10 3 164 -14 191 38 -140 124 -77 151 97 -12
6498 -12 95 -35 125 185 91 -33 -29 43 132 -138 -108 95 -126 -36 32 80 -62 -223 104 -37 -28 242 -57 21 146
6523 146 22 28 27 162 -225 -197 154 6 -73 -29 -143 33 134 203 66 -84 64 -79 2 101 68 -38 68 -114
6547 -114 127 -159 -28 -139 13 -99 66 -149 -73 285 -30 -46 42 -56 -11 117 -67 33 -5 33 53 223 -9
$$ packed form
6378A16j50q7K12k92K05j1k19J53J24J5L9l8R3l62J02L9O1Q4j47J17K38n37K22
6401b3Q2q9J17j96J00Q7K9m1Q6k49J49J06j56P8l31K81j53J55o0J00n7j81K06
6424D0j34P6O3J26j61o4J14r9j16P4K8mJ20Q2l46K69k5p6jk46M23m7q2J6k38J98
6450a0o8Pj26J18P0KO7j92J87p2O9o2J82l28J25K57n26K86J19k16l1J44J21k01
6474g8j08L7K08Mk67K93k25J01N6R0j46L9OpJ61j78K05j53j78K64k01K28n4j09
6498a2J07j30J60O0r4j24MP2Q9k70L0K03k21R0O8M8j42j61L27j41RK70k99P8J25
6523A46j24OjJ35l87K8L51j48p9M4j14J76J01O9j37j50J48j43Q1R9l3j06J06j82
6547a14K41k86J31j11J52j12J65k15P6L58l15j6Q8r8M5J28j84J00l8L8K0J70k32
$$ plain form
6570 -9 -44 30 42 87 58 16 46 -136 13 -30 -3 99 -69 -114 -23 64 -68 105 -203 202 122 -220 4 105 168
6595 168 -73 -134 16 -22 -1 20 46 -15 32 246 -122 64 78 -62 3 -58 181 -86 -69 94 51 -15 33 -104 -9
6620 -9 109 103 -17 -17 65 -30 144 -131 19 -25 122 142 25 190 -91 -10 -196 95 -44 130 -73 51 19 -100
6644 -100 120 96 -3 -82 -48 29 -126 13 30 -63 -46 -30 -16 -54 -81 4 149 138 -97 97 -26 49 -131 189 -166
6669 -166 -165 2 -28 19 -248 -222 -39 116 -87 -32 82 38 -236 -161 181 -103 26 124 -284 -171 -28 -1 52 85
6693 85 -15 -143 -12 113 -112 80 -46 82 -45 -43 142 60 -140 176 -136 -13 45 -162 -22 9 24 -2 -64
6716 -64 323 7 -99 160 -177 -221 116 -166 61 89 124 127 -91 187 -144 -68 174 51 52 235 -70 91 -121
6739 -121 102 153 -45 73 -134 65 -172 158 -118 -125 -177 -8 9 296 198 -149 52 65 109 -39 -92 47 95
$$ packed form
6570il5P4J2M5k9m2L0j82J49m3K7J02j68m5R1Q7j32J73l08M05q0l42K24J01O3
6595A68k41o1J50l8K1K1K6o1M7K14l68J86J4j40O5o1K39k67J7J63m3o6M8j37R5
6620iJ18oj20%Q2r5J74k75J50m4J47K0j17J65k81Q1j86K91j39J74k03J24l2j19
6644a00K20k4r9p9L4P7j55J39J7r3J7J6J4l8k7Q5J45j1k35J94j23P5j80L20l55
6669a66JJ67l0M7k67K6J83J55k03N5J14m4k74P5L42k84J29R8m08J13J43K7N3L3
6693H5j00j28J31J25k25J92j26J28j27KJ85q2k00L16l12J23N8k07J40L1J5k6o2
6716f4L87l16j06K59l37m4L37k82K27K8L5Lk18K78l31P6K42j23JJ83l05J61k12
6739a21K23N1j98J18k07J99k37L30k76pn2J69J7K87r8l47K01J3M4j48n3J39M8
$$ plain form
6762 95 302 225 86 -63 -69 12 -152 -23 108 116 96 -49 158 153 -5 206 -155 -114 27 9 -199 -151 13 -58 -29
6787 -29 45 37 -273 -58 -171 15 -128 -41 56 178 90 -53 -30 -6 71 -208 -121 53 10 -308 47 -67 25 45 52
6812 52 127 66 130 -57 39 -153 195 16 129 175 60 202 53 31 21 78 209 -99 26 33 -119 -1 12 -86
6836 -86 -173 -157 208 -89 -120 125 -10 -296 -178 80 67 75 8 -97 16 -93 -185 -241 -35 71 45 -63 134 -53
6860 -53 -195 21 52 -145 71 1 -113 -194 -66 252 55 -115 -34 -73 -78 234 -78 -25 117 -125 -115 -160 -101 17
6884 17 -93 141 33 2 156 66 -2 24 146 -23 -145 -4 66 -25 -50 49 -11 89 56 -9 88 -27 271 -20
6908 -20 -176 45 39 -136 -80 126 -103 -15 90 -7 -207 197 -247 -97 149 -47 -100 21 8 254 -36 -105 -224
6931 -224 -15 -39 84 215 -134 119 24 -142 -6 -130 6 120 89 -118 -51 -96 9 94 147 -67 -24 -93 181
$$ packed form
6762I5K07p7j39j49oQ1j64J29J31Qk0j45K07nj58K11l61M1J41j8k08M8J64p1K9
6787b9P4ql10K15j13J86j43Q7R7J22q8j43K3K4P7k79Q7J74m3l18L55j14R2K0P
6812E2P5o1O4j87R6j92L48j79J13M6j15J42j49k2j0N7J31l08J25Pj52J18J3r8
6836h6q7J6L65k97l1K45j35k86J18K58j3Qo7j05J13j09r2n6K06J06k6j08J97j87
6860e3j42K16L1j97K16p0j14q1J28L18j97j70Q1l9nL12l12N3J42k42J0m5N9J18
6884A7j10K34j08l1J54r0o8K6J22j69j22J41P0r1k5R9o0J00l3o5R7j15K98k91
6908b0j56K21oj75N6K06k29Q8J05r7k00M04m44J50K46j96n3J21j3K46k90o9j19
6931b24K09k4J23J31l49K53r5j66J36j24J36J14l1k07O7m5J05Q5N3k14M3o9K74
$$ plain form
6954 181 62 -45 48 130 60 140 125 196 -87 300 168 -189 -189 -76 115 82 1 -125 -185 -85 -24 -28 -90 -245 121
6979 121 -146 55 -189 45 -78 58 -1 -178 -142 58 -113 -37 162 -214 -3 14 -97 -56 105 36 -228 -36
7001 -36 -258 -82 62 -122 -66 -354 212 71 -207 -3 70 -135 32 -74 -72 -187 -81 79 204 -69 24 0
7023 0 -36 144 -41 77 106 117 -58 -40 -27 22 0 104 -91 27 108 73 233 -37 -63 151 5 -87 146 -28
7047 -28 -99 -141 -16 -148 20 -17 -95 33 44 -91 -49 109 -46 -112 58 61 139 -42 93 37 70 202 -46 -76 -93
7072 -93 18 -265 -96 153 -100 -56 137 214 -194 -91 -176 -8 -32 102 118 9 -76 -43 -101 -84 -58 32 -49 -10 127
7097 127 90 0 114 -122 48 60 48 -214 -71 130 -14 -29 10 -89 -66 -29 102 103 3 98 -112 -83 46 205
7121 205 41 -103 -33 40 197 44 -128 68 64 -20 -21 -20 -32 71 -57 -6 -69 -92 174 -147 -33 -5 2 -167 -86 -101
$$ packed form
6954A81j19j07R3Q2p0Q0j5P1k83L87j32l57%J13J91l3q1j26o0J00O1mo2j55L66
6979A21k67K01k44K34j23J36n9j77L6K00j71P6J99l76K11J7j11M1J61o9k64J92
7001c6k22J76J44j84N6k88N66j41k78K04P3k05J67j06Kj15J06J60J25k73R3k4
7023@l6J80j85J18K9J1j75J8J3M9k2J04j95J18Q1l5J60k70k6K14j46r2K33j74
7047b8p1m2J25j32J68l7p8J28J1j35M2J58j55o6J70LP8j81J35n6L3J32k48l0j7
7072i3J11k83J69K49k53M4J93P7m08J03q5J68k4J34J6j09q5L3n8J7K6R0q1L9J37
7097A27l7r0J14k36J70J2j2k62J43K01j44j5L9r9K3L7J31Jj00R5k10K9J29J59
7121B05j64j44P0P3J57j53j72J96mq4jJj2J03j28N1o3k3K66l21J14K8Pj69Q1j5
$$ plain form
7147 -101 -34 -192 7 177 -74 286 148 104 -152 114 129 -159 -89 -30 279 -83 45 -112 -166 -10 -102 116
7169 116 -80 193 37 105 38 -87 111 53 -36 72 5 -73 96 -71 37 16 -76 151 42 116 17 55 58 169
7193 169 41 218 -22 -37 -157 -5 -130 -213 15 -163 -94 -33 -30 6 15 -26 -57 45 -194 -58 -75 -91 -116 -44 71
7218 71 88 6 -36 -57 152 56 60 -229 -22 -219 7 -17 126 76 -193 104 91 -76 94 38 141 93 -136 -15
7242 -15 118 -65 -89 45 -77 98 -43 -127 -35 -20 -25 -68 -107 95 -180 -158 120 0 84 -119 209 11 -263 134
7266 134 33 36 -174 149 -32 50 -86 -48 -128 194 159 224 -6 138 173 -51 32 118 140 27 101 38 -94 123
7290 123 -128 -56 -2 46 25 -60 33 4 46 70 -9 -188 -81 0 -24 3 -23 -60 -141 -36 127 -163 21 -103 60
7315 60 -72 -8 -94 60 -33 -167 74 -58 163 56 97 -79 37 -184 64 37 -24 27 92 2 70 146 70 -26 -84
$$ packed form
7147a01O7j58J99J70k51L60j38m4k56K66J5k88P0N9L09l62J28j57n4J56r2K18
7169A16j96K73j56O8o7j25J98n8q9J08o7p8J69j67J08k1r2K27j09P4r9L8LJ11
7193A69j28J77k40j5j20J52j25q3K28j78O9O1LL6Rm1l1J02k39J36j7j6k5P2J15
7218G1J7q2m2k1K09r6Mk89K07j97K26k4J43n0k69K97j3j67J70n6J03m8k29J21
7242a5J33j83k4J34j22J75j41q4R2J5nm3l9K02k75K2K78j20Q4k03L28j98k74L97
7266A34j01Lk10L23j81Q2j36L8q0L22l5O5k30J44L5k24Q3Q6K2j13P4o3j32K17
7290A23k51P2N4M8k1q5R3k9M2K4p9j79J07Q1k4K7k6l7q1J05J63k90J84j24J63
7315F0j32O4q6J54r3j34K41j32K21j07M1j76J16k21K48k7o1N1O5r0O8P6p6r6n8
$$ plain form
7340 -84 133 -9 -95 196 93 -168 35 -154 29 189 87 -110 22 68 -7 -78 -82 110 186 68 90 80 -66
7363 -66 -50 -29 -1 -105 10 -127 37 233 102 -197 30 -15 -15 -90 119 60 -37 -78 -16 -222 -13 53 -49 -120 84
7388 84 136 -249 -43 268 21 -31 -61 39 9 73 195 29 -194 25 136 36 -76 105 -30 53 133 152 -135
7411 -135 -19 26 -50 62 100 -203 31 24 -41 78 38 -47 75 -336 64 -31 146 44 112 103 55 14 144 40 -72
7436 -72 173 70 100 162 192 18 31 8 36 59 57 -72 -123 131 -57 -47 -39 -67 -143 -115 -89 15 6 107 -173 -151 20
7463 20 -48 39 -150 57 -124 37 -141 -42 -30 153 204 72 -16 -106 163 53 162 -161 -158 192 58 -28 121 -6
7487 -6 30 35 -137 -120 12 8 185 -93 -23 254 120 -44 -46 -41 -120 135 94 13 -191 170 103 -61 77 28 -45 -236
7513 -236 -54 -9 146 -123 214 -42 -179 -5 -60 -220 162 55 -105 -157 -29 -56 -73 -61 171 -15 150 -204
$$ packed form
7340h4K17j42q6K91j03k61K03j89J83J60j02j97J32M6p5p1mJ92P6j18K2j0j46
7363f6J6K1K8j04J15j37J64J96j31k99K27m5%p5K09n9r7m1O2k06K09O6j02p1K04
7388H4N2l85K06L11k47n2l0J00l0O4J22j66k23K19J11j00j12J81j35Q3Q0J9k87
7411a35J16M5p6J12L8l03K34po5J19m0q5J22m11M00r5J77j02O8rm8m1J30j04j12
7436g2K45j03L0O2L0j74J3k3K8K3kj29n1K54j88J0Qk8p6K8K6J04rJ01k80K2J71
7463B0o8Q7j89K07j81J61j78R9J2J83N1j32q8r0K69j10J09l23LL50j34q6J49j27
7487fL6Nj72J7J32mJ77k78P0K77j34j64kNp9K55m1q1k04L61o7j64J38m9p3j91
7513b36J82M5J55k69L37k56j37J74n5j60L82j07j60n2J28k7j7J2K32j86J65l54
$$ plain form
7535 -204 -104 -81 57 10 1 199 -32 -263 119 -18 -40 -89 120 61 -14 -11 69 44 -111 129 132 181 12 75 54 -131
7561 -131 87 -50 -25 -34 49 -15 173 68 -53 24 -6 121 -8 71 182 53 35 3 38 19 230 -49 159 -183
7585 -183 -66 -152 -50 141 16 8 3 -109 -84 -8 -21 -31 139 196 1 -2 77 -232 82 -18 129 58 -64 23 83
7610 83 -37 9 109 -109 32 157 181 146 -55 -9 -14 -87 79 102 -124 8 38 70 -66 15 -127 199 143 -117
7634 -117 42 172 214 131 -41 -51 8 -24 73 63 -92 114 81 83 133 18 48 -257 103 -105 -23 39 223 131 13
7659 13 -128 211 58 -29 19 -135 -102 7 -37 54 -220 3 -11 145 91 -19 35 -79 -50 10 -82 43 -59 -47
7683 -47 -34 146 268 57 -98 -285 25 106 75 7 44 -57 -140 -27 -58 105 -300 47 -25 -38 187 -292 -146
7706 -146 -235 -4 -175 42 74 -42 23 -168 129 -240 40 -27 -173 149 270 -14 -39 83 17 94 108 -40 -104
$$ packed form
7535b04J00K3J38m7rJ98k31k31L82j37k2m9K09n9p5LQ0k5j55K40LM9j69O3k1j85
7561a31K18j37K5rQ3o4J88j05j21P7l0J27j29P9J11j29j8l2L5j9K11k79K08l42
7585a83J17q6J02J91j25qnj12K5P6j3j0J70N7j95lP9l09L14j00J47p1j22Q7O0
7610H3j20M6J00k18J41J25K4l5k01M6np3J66K3k26J32L0L2j36Q1j42L26n6k60
7634a17J59J30M2q3j72j0N9l2R7j0j55K06l3KN0j15L0l05L60k08Q2O2J84r2j18
7659A3j41L39j53q7M8j54L3J09m4R1k74K23j4J56n4j10N4j14K9O0r2J25j02J2
7683d7J3J80J22k11j55j87L10Q1l1o8L7j01q3J13l1J63m05L47p2j3K25m79J46
7706a46q9K31j71K17L2j16O5j91K97l69K80o7j46L22J21k84k5J22o6P7J4j48o4
$$ plain form
7729 -104 117 125 52 16 -35 20 -25 -94 118 -32 118 -21 67 69 81 -5 -174 -267 -83 213 -74 -96 -38 -119 5 10
7755 10 -16 -146 12 121 -24 -44 -46 -54 -91 92 101 -120 146 -147 -16 154 22 -71 -184 -22 4 5 -111 226 -136
7780 -136 -58 35 59 177 189 -25 69 -29 -34 81 22 59 -72 -123 37 141 48 65 130 28 121 11 133 -18 -105
7805 -105 -16 -16 -84 153 -147 48 -64 -40 -50 -41 179 168 70 18 -116 148 21 32 156 93 -81 -124 -105 -129 199
7830 199 21 36 162 32 49 -34 51 1 -61 31 -123 114 296 -77 -134 134 -215 109 39 94 -72 126 1
7853 1 -71 -13 229 5 -81 -31 89 137 -9 33 144 182 142 82 -102 -17 -88 206 -177 32 110 -90 1 32 -58 -76
7879 -76 161 -19 -171 122 33 86 42 54 -81 -132 -158 -17 -92 112 20 123 181 71 73 -43 -16 145 98 35 213
7904 213 -127 20 -58 153 140 168 8 60 -26 47 -91 -89 73 -79 104 162 118 -63 -211 20 -153 -17 95
$$ packed form
7729a04K21Qp3l6n1N5m5o9K12j50J50j39Q8KJ2q6j69r3J84K96k87k2N8q1J24N
7755A0k6j30J58J09j45k0kql7J83Rk21K66k93J31J70j32r3j13J62K6Jj16L37l62
7780a36P8R3K4J18J2k14R4r8nJ15n9L7j31n1J60J04r3J7O5j02R3j10J22j51q7
7805a05Q9%o8K37l00J95j12K4j0RK20j1r8n2j34K64j27J1J24o3j74m3J9k4L28
7830A99j78J5J26j30J7q3Q5n0o2R2j54K37J82l73n7K68l49L24p0N5j66J98j25
7853Ap2N8K42k24q6N0J20M8j46M2J11L8m0o0j84Q5p1K94l83K09P8k00R1L1r0j8
7879g6K37j80j52K93q9N3m4J2j35n1k6J41p5K04r2J03N8j10Kj16K7J61m7o3J78
7904B13l40J47p8K11j3K8j60N2q6P3j38KJ62j52J83N8m4j81j48K31j73J36J12
$$ plain form
7927 95 154 -33 -36 -173 191 135 -62 80 -69 -17 99 76 149 64 -169 47 6 61 61 -76 117 -112 -145 24 168
7952 168 206 -32 231 82 26 -113 94 -115 -68 9 -89 -45 74 -277 -95 -84 110 2 1 -30 107 -176 -177 168
7976 168 -148 -63 -19 183 -122 -28 83 -150 112 23 -46 -65 96 95 91 119 98 190 276 140 61 -3 258 -31 -61 -81
8002 -81 -58 -91 70 12 -1 -131 -105 -199 -21 121 79 178 -32 23 102 -89 -72 152 -53 18 -238 50 15 -163 -114
8027 -114 8 -27 -100 -35 -171 90 25 -91 26 9 52 23 14 23 -92 85 117 267 -3 47 107 -40 241 107 -77
8052 -77 22 31 166 -67 -33 87 -128 -177 -300 -143 -170 81 306 -109 -72 -168 -65 -40 -45 -19 -89 -263 55 -140 51
8077 51 72 18 -61 -41 26 -191 32 114 -7 7 9 -151 -92 85 136 -52 -25 68 -242 -89 -39 -16 61 -1 -132 117
8103 117 -26 -71 13 40 -68 4 116 -85 -174 -48 -53 -214 9 38 -110 -47 -61 91 54 -11 -192 -134 82 -16 147
$$ packed form
7927I5N9j87lj37L64n6j97J42j49N2J16k3P3q5k33K16m1N5%j37J93k29l3J69J44
7952A68L8k38K63j49n6j39K07k09M7P7r8M4J19l51J82J1J94j08jl1J37k83jL45
7976A68l16Q5M4K02l05R4J11k33K62q9o9j9J61jmK8k1R2Q6j36p9o4K61k89l0k0
8002h1K3l3J61n8j3j30K6r4J78J42m2R9k10N5P9j91J7K24k05P1k56K88l5j78M9
8027a14J22l5p3O5j36K61o5j16J17j7M3k9rRj15J77L2J50k70N0O0j47K81j34j84
8052g7R9RJ35k33L4J20k15m9j23J57k7K51K25m15L7r6J03K5nK6p0j74L18j95J91
8077E1K1n4p9K0O7k17K23Q2j21J4Kj60N9J77N1j88K7R3l10J53N0K3P7o2j31K49
8103A17j43m5Q4K7j08P2J12k01q9J26nj61K23K9j48O3j4J52l7o5j81N8K16r8J63
$$ plain form
8128 147 -180 104 -244 99 47 -132 -87 -213 -33 62 109 -47 -25 18 -10 -34 33 55 26 80 -35 33 -170 -86 45
8153 45 -183 50 102 309 18 -103 35 3 21 -65 -197 -231 222 4 163 -48 84 145 19 -40 233 -139 70
8176 70 15 32 396 203 -28 -31 1 130 15 11 48 -70 169 61 13
$$ packed form
8128A47l27K84l48L43n2j79M5j26J80R5M7j56K2M3k8k4O7K2k9N4j15O8k03Q4J31
8153D5k28K33N2K07k91j21J38l2J8q6j32l4M53k18J59k11J32O1j26n9K73l72K09
8176G0n5J7L64j93k31lL2J29j15mL7j18K39j08m8
8191A3
$$ Imaginary data points
##PAGE= N=2
##DATA TABLE= (X++(I..I)), XYDATA
$$ plain form
0 0 0 0 0 0 0 0 0 0 0 11 -16 16 -16 16 -16 32 -32 48 -49 64 -80 96 -112 128 -160 177 -208 241 -274 320 -368
31 -368 417 -469 532 -601 676 -760 851 -950 1059 -1178 1309 -1450 1605 -1776 1961 -2164
47 -2164 2387 -2629 2895 -3190 3515 -3875 4275 -4728 5239 -5819 6491 -7272 8203 -9319
61 -9319 10702 -12460 14779 -17991 22761 -30580 45666 -85501 412464 1001436 31370 -657305
73 -657305 -530520 180569 452690 138437 -356424 -358482 -24726 200611 148412 149920 159828
84 159828 7480 -240379 -254467 -34792 202168 168741 -118062 -302141 -49685 331334
94 331334 342255 140 -238855 -197083 -27449 61877 26290 -21897 29656 56339 -37183
105 -37183 -59972 116116 203626 -13235 -277053 -250623 13966 216908 155562 -63510 -130834
$$ packed form
0@%%%%%%%%%J1k7L2l2L2l2M8o4Q0r7J13j44J76k08K40k88L37l85M49n15N94o88
31c68P85q86J001j133J277j436J611j801K009k237K487k759L055l381L737m125
47b164M551n016N524o085O705p390Q150r003R967j1058J2310j3763J5475j7522
61i319K0021k3162K7239l2770M0752n3341P6246j31167M97965N88972r70066o88675
73f57305J26785P11089K72121l14253m94861k058L33756K25337n2199J508R908
84A59828j52348k47859j4088K19675K36960l3427k86803j84079K52456L81019
94C31334J0921l42115k38995M1772J69634Q9326l5587m8187N1553K6683r3522
105c7183k2789J76088Q7510k16861k63818K6430K64589K02942o1346k19072o7324
$$ plain form
116 -130834 39021 157848 49700 -80975 -69390 -36035 -62808 -56686 31358 129676 134728
127 134728 2287 -129622 -56054 126879 98557 -139458 -233554 -44661 175953 168703 -31367
138 -31367 -150246 -2412 201748 109716 -189487 -258893 -6297 201863 120174 -90520 -144673
149 -144673 30224 208305 131811 -106398 -182784 -46705 55849 21076 -23940 -1822 43381
160 43381 55052 10513 -33386 122 40617 -32705 -127420 -72049 67892 103862 25992 -38439
172 -38439 -16359 57863 70559 -32530 -117467 -51326 53496 35131 -34719 -14772 61185 82919
184 82919 24627 -59172 -77631 -6619 39030 -19200 -69231 -11978 60139 52776 13812 -1559
196 -1559 433 1939 -22135 -64018 -46315 37746 63960 -3079 -31794 29250 70556 26563 -47221
$$ packed form
116a30834J69855J18827j08148j30675J1585L3355k6773O122Q8044R8318N052
127A34728j32441j31909P3568J82933k8322k38015r4096J88893K20614p250k00070
138c1367j18879J47834K04160r2032k99203o9406K52596K08160q1689k10694n4153
149a44673J74897J78081p6494k38209p6386J36079J02554l4773m5016K2118M5203
160D3381J1671m4539m3899L3508M0495p3322r4715N5371J39941L5970p7870o4431
172c8439K2080P4222J2696j03089q4937O6141J04822j8365o9850J9947P5957K1734
184H2919n8292q3799j8459P1012M5649n8230n0031N7253P2117p363l8964j5371
196a559J992J506k4074m1883J7703Q4061K6214o7039k8715O1044M1306m3993p3784
$$ plain form
209 -47221 -73518 -21636 43852 15107 -67084 -42496 79889 113610 7194 -89433 -71380 18475
221 18475 69322 9245 -92429 -80249 44528 110877 54719 -19203 -40821 -27308 882 14516
233 14516 -4761 -18882 -7415 -8224 -6775 43262 80020 21910 -67651 -78401 -17728 40018 39246
246 39246 -22494 -63427 -6485 73508 59304 -11036 -34423 -18296 -13536 -14260 -9471 1361 25649
259 25649 33439 -3370 -23471 19328 49635 4314 -52959 -55691 -18880 25867 44425 12473
271 12473 -22355 -3728 22796 5894 -12792 -4947 -11990 -33878 -24807 10786 39578 47258 13993
284 13993 -38703 -32476 29939 41903 -19188 -57968 -30486 18820 48501 35267 -11698 -27910
296 -27910 6739 19701 -14346 -30116 -11718 -3409 -3485 8111 15353 15449 19541 3760 -27510 -21071
$$ packed form
209d7221k6297N1882O5488k8745q2191K4588J22385L3721j06416r6627J8053Q9855
221A8475N0847o0077j01674J2180J24777O6349n6158p3922k1618J3513K8190J3634
233A4516j9277j4121J1467q09J449N0037L6758n8110q9561j0750O0673N7746p72
246C9246o1740m0933N6942P9993j4204p0340k3387J6127M760p24M789J0832K4288
259B5649P790l6809k0101M2799L0307m5321n7273k732L6811M4747J8558l1952
271A2473l4828J8627K6524j6902j8686P845p043k1888R071L5593K8792P680l3265
284A3993n2696O227O2415J1964o1091l8780K7482M9306K9681j3234m6965j6212
296b7910L4649J2962l4047j5770J8398Q309p6J1596P242R6M092j5781l1270O439
$$ plain form
310 -21071 11065 6302 -20192 -11719 14447 23060 19953 8218 -10594 -6850 8603 -10493 -36691
323 -36691 -13593 23366 18416 -3381 -5479 2820 14986 18398 -11345 -43707 -22799 18878 17313
336 17313 -2764 844 9481 10294 14171 5653 -15171 -14778 -2307 -10741 -12644 14950 26885 3537
350 3537 -9193 223 3837 2751 -3103 -24464 -29610 4768 27450 7950 -5956 6962 10637
363 10637 2029 -1740 -10857 -17025 -161 10803 -4920 -5435 20448 23595 -36 -9856 -7569 -9047
377 -9047 -2982 1054 -12484 -12715 12338 19275 1371 -997 6397 -4773 -14160 -7318 -5055 -3808
391 -3808 8723 8422 -4757 4918 23626 10576 -14287 -14486 -6172 -2735 4951 4147 -8374 -2226
405 -2226 18780 13291 -7293 -7931 -3824 -11041 -9237 487 -741 248 11151 7480 -3310 4736 11101
$$ packed form
310b1071L2136m763k6494Q473K6166Q613l107j1735j8812L744J5453j9096k6198
323c6691K3098L6959m950k1797k098Q299J2166L412k9743l2362K0908M1677j565
336A7313k0077L608Q637Q13L877q518k0824L93J2471q434j903K7594J1935k3348
350C537j2730R416L614j086n854k1361n146L4378K2682j9500j3906J2918L675
363A0637q608l769r117o168J6864J0964j5723n15K5883L147k3631r820K287j478
377i047O065M036j3538k31K5053O937j7904k368P394j1170r387O842K263J247
391c808J2531l01j3179R675J8708j3050k4863j99Q314L437P686q04j2521O148
405b226K1006n489k0584o38M107p217J804R724j228R89J0903l671j0790Q046O365
$$ plain form
420 11101 -6040 -16241 -5039 1157 1151 8003 7332 -1490 4326 11883 -2303 -13331 -3775 -1135 -10091
435 -10091 -5542 4129 3533 6552 10837 -2095 -12385 -733 5147 -6411 -8226 -242 -395 3524
449 3524 14674 10610 -2402 -1567 -354 -9303 -5790 6501 1490 -8999 -2342 6865 6916 8748 3854
464 3854 -13792 -16743 46 5329 -2151 -654 1939 -2278 3060 12998 6078 -5432 -4093 -5186
478 -5186 -8904 1480 11693 4142 -2538 1808 1549 -263 5785 2964 -12907 -13963 -1052 3123
492 3123 3588 8482 3084 -7649 -3292 5801 1940 -3046 -2761 -7774 -6362 8727 13972 1906 -2275
507 -2275 2776 -381 -3571 776 -1442 -7222 -869 4959 -590 -605 6443 2684 -4795 -2590 -2936 -7303
523 -7303 -1398 5590 -224 -2664 5835 5695 -2319 81 4615 -332 -4335 -3878 -5740 289 14031
$$ packed form
420A1101j7141j0201J1202O196oO852o71q822N816P557j4186j1028R556K640q956
435a0091M549R671n96L019M285j2932j0290J1652N880j1558j815P984j53L919
449C524J1150m064j3012Q35J213q949L513J2291n011j0489O657R207N1J832m894
464C854j7646k951J6789N283p480J497K593m217N338R938o920j1510J339j093
478e186l718J0384J0213p551o680M346k59j812O048k821j5871j056J2911M175
492C123M65M894n398j0733M357R093l861m986K85n013J412J5089N245j2066m181
507b275N051l157l190M347k218n780O353N828n549j5P048l759p479K205l46m367
523g303N905O988n814k440Q499j40q014K400M534m947m003M57j862O029J3742
$$ plain form
538 14031 11159 -6654 -10958 -1078 3958 5250 3209 -9397 -17023 -2613 13352 10625 1851 -3578
552 -3578 -8782 -5611 6350 6593 -2971 -3900 -539 -3175 1642 13126 10061 -4123 -8868 -6718 -3413
567 -3413 6143 10893 -1940 -13617 -6561 5704 11319 10566 -2239 -20056 -15034 8530 15754 2895
581 2895 -6224 -7078 -3240 7825 12812 1537 -8168 -4488 -1709 -2640 3917 7488 1086 -2421 -239
596 -239 -2661 -2522 6589 4614 -10052 -12162 1028 8165 6074 798 -5935 -5600 5593 7772 -5107
611 -5107 -8434 2305 5620 601 -231 -457 -532 7018 8557 -5264 -14011 -4236 6844 7132 2901 -4977
627 -4977 -9990 -881 10555 4919 -5452 -4160 -2223 -4952 -377 6888 4515 292 642 -2990 -4802
642 -4802 3965 9137 773 -7106 -7142 -3678 6445 16017 5364 -15110 -15187 3195 12581 7761 -3522
$$ packed form
538A4031k872j7813m304R880N036J292k041j2606p626J4410J5965k727q774n429
552c578n204L171J1961K43r564r29L361k636M817J1484l065j4184m745K150L305
567c413R556M750j2833j1677P056J2265N615p53j2805j7817N022K3564P224j2859
581B895r119q54L838J1065M987j1275r705L680K779r31O557L571o402l507K182
596b39k422J39R111j975j4666k110J3190P137k091n276o733L35J1193K179j2879
611e107l327J0739L315n019q32k26p5P550J539j3821q747R775J1080K88m231p878
627d977n013R109J1436n636j0371J292J937k729M575P265k373m223L50l632j812
642d802Q767N172q364p879l6L464J0123R572j0653k0474p7J8382R386m820j1283
$$ plain form
657 -3522 -14927 -12083 6660 16947 6378 -5312 -7686 -6918 -517 8894 6745 -2857 -4117 -1683
671 -1683 -2916 2480 12458 7456 -7971 -12692 -4762 5329 10967 4121 -11129 -12164 4125 12467
685 12467 3363 -5117 -6927 -6155 811 7825 2943 -4704 -1248 3196 624 183 3154 1204 -1325
700 -1325 -1157 -3841 -4051 5057 8987 -647 -6889 -1853 1337 539 1411 -754 -5505 -2602 3394 2438
716 2438 -525 592 -201 -1065 2708 2056 -4790 -3653 4786 4847 -1329 -1622 481 690 2765 2388 -4597
733 -4597 -6566 728 4071 1415 -62 -2087 -4582 -75 6231 1675 -4485 -2436 -206 -2241 747
748 747 5374 3343 -1201 -2251 -2513 194 6025 3846 -5486 -6415 1527 4284 1910 1022 -1867 -4424
764 -4424 -253 3932 -181 -4030 -1587 -239 201 2609 2178 -1600 -541 1908 -979 -2044 2731 3008
$$ packed form
657c522j1405K844J8743J0287j0569j1690k374P68O401R411k149r602j260K434
671a683j233N396R978n002j5427m721P930J0091N638o846j5250j035J6289Q342
685A2467r104q480j810P72O966P014m882p647L456M444k572m41K971j950k529
700a325J68k684k10R108L930r634o242N036L190p98Q72k165m751K903N996r56
716B438k963J117p93q64L773o52o846J137Q439O1o176k93K103K09K075l77o985
733d597j969P294L343k656j477k025k495M507O306m556o160K049K230k035K988
748G47M627k031m544j050k62K707N831k179r332r29P942K757k374q88k889k557
764d424M171M185m113l849K443J348M40K408m31l778J059K449k887j065M775K77
$$ plain form
780 3008 -2111 -1904 1341 1121 1127 2287 -544 -3621 -1187 411 -725 577 1596 -2013 -2808 2325 2780
797 2780 -2120 -2410 364 -150 401 2004 -408 -2289 1637 3359 517 -620 -76 -1977 -1035 2743
813 2743 1426 -2641 -985 1708 -278 -774 1137 -883 -2682 -170 1298 -297 320 576 -2032 -1083
829 -1083 3478 2413 -2041 -1757 514 -121 719 2488 -231 -2076 432 1817 -673 -446 301 -1482
845 -1482 -1396 877 133 -1610 631 1592 -1383 -1163 1363 388 -1295 392 703 -896 548 2302 -25
862 -25 -482 971 -284 -1363 1047 1800 -1658 -1823 824 524 -716 947 -20 -2495 -788 1590 -245
879 -245 -1232 768 -28 -985 1398 1673 -1028 -719 1304 59 -800 969 1001 -1445 359 1506 -426
896 -426 -866 599 -389 -1868 265 573 -1495 -541 1390 -124 -1551 506 652 -830 256 1165 -885
$$ packed form
780C008n119K07L245k20OJ160k831l077K434J598j136J302J019l609p95N133M55
797B780m900k90K774n14N51J603k412j881L926J722k842j137N44j901R42L778
813B743j317m067J656K693j986m96J911k020j799K512J468j595O17K56k608R49
829a083M561j065m454K84K271o35Q40J769k719j845K508J385k490K27P47j783
845a482Q6K273p44j743K241R61k975K20K526r75j683J687L11j599J444J754k327
862b5m57J453j255j079K410P53l458j65K647l00j240J663r67k475J707K378j835
879b45r87K000p96r57K383K75k701L09K023j245q59J769L2k446J804J147j932
896d26m40J465r88j479K133L08k068R54J931j514j427K057J46j482J086R09k050
$$ plain form
913 -885 -756 1811 1053 -362 573 675 -1284 -120 1780 -309 -1916 306 583 -706 328 869 -1375
930 -1375 -1394 959 555 -1231 -12 166 -1163 204 2084 187 -1072 676 594 -685 562 1259 -690
947 -690 -811 1186 317 -846 484 478 -1435 -554 659 -494 -1153 376 32 -1222 246 1078 -645 -876
965 -876 917 39 -928 810 1017 -633 9 1339 13 -509 885 213 -1399 -271 938 -420 -408
982 -408 628 -468 -1268 444 618 -1289 -732 529 -57 -324 979 416 -790 266 1245 -132 -318
999 -318 1000 -27 -777 655 763 -498 -290 648 -562 -908 665 185 -1407 -250 966 -600 -414
1016 -414 685 -44 -874 502 515 -851 -89 941 -118 -306 984 553 -715 439 745 -903 -636
1033 -636 660 -62 -906 223 243 -777 -423 572 -417 -720 738 126 -707 274 835 -212 -50 788 199
$$ packed form
913h85J29K567p58j415R35J02j959J164J900k089j607K222K77j289J034N41k244
930a375j9K353m04j786J219J78j329J367J880j897j259J748q2j279J247O97j949
947f90j21J997q69j163J330oj913Q81J213j153o59J529l44j254J468Q32j723k31
965h76J793q78r67J738K07j650O42J330j326n22J394o72j612J128J209j358J2
982d08J036j096q00J712J74j907N57J261n86k67J303n63j206J056R79j377j86
999c18J318j027p50J432J08j261K08R38j210l46J573m80j592J157J216j566J86
1016d14J099p29q30J376J3j366P62J030j059j88J290m31j268J154L06j648K67
1033f36J296p22q44J129K0j020L54R95r89l03J458o12q33R81N61j047J62Q38n89
$$ plain form
1052 199 -487 616 591 -757 -161 946 -390 -521 632 86 -711 -138 93 -899 -280 741 -282 -951
1070 -951 280 421 -530 -206 519 -72 -171 703 176 -796 545 790 -400 -254 713 -190 -481 316 2
1089 2 -853 -147 564 -369 -673 499 -6 -636 -66 246 -369 -78 744 -302 -547 693 702 -234 118 274
1109 274 -388 -333 312 90 -398 129 46 -834 -74 749 -284 -866 69 234 -232 328 382 -480 -526 831 398
1130 398 -267 181 230 -278 167 736 14 44 611 -16 -946 161 727 -384 -782 -169 63 -280 275 320
1150 320 -814 -88 496 -139 -453 278 194 -356 318 767 -211 -61 517 41 -670 33 392 -236 10 480
1170 480 -290 -677 184 -347 -663 34 382 -679 -636 613 244 -518 -156 587 -254 238 455 -191 -45 553
1190 553 261 -496 149 672 20 -551 -75 -410 -466 664 590 -1023 -898 400 313 -10 56 -407 -845 460
$$ packed form
1052A99o86J103k5j348N96J107j336j31J153n46p97N73K31r92O19J021j023o69
1070i51J231J41r51L24P25n91r9Q74n27r72J341K45j190J46R67r03k91P97l14
1089Bq55P06P11r33l04J172n05o30N70L12o15K91Q22j046k45J240Rr36L52J56
1109B74o62N5O45k22m88N27q3q80P60Q23j033n82R35J65m66N60N4q62m6J357m33
1130C98o65M48M9n08M45N69p22L0N67o27r30J107N66j111l98O13K32l43N55M5
1150C20j134P26N84o35l14P31q4n50O74M49r78J50N78m76p11P03L59o28K46M70
1170D80p70l87Q61n31l16O97L48j061M3J249l69p62L62P43q41M92K17o46J46N98
1190E53k92p57O45N23o52n71M76l35n6J130p4j613J25J298q7l23O6m63m38J305
$$ plain form
1210 460 771 -281 -439 684 287 -552 221 521 3 -159 121 -654 -286 877 602 -622 -859 39 -314
1229 -314 292 735 -323 -1095 -90 627 -180 178 406 -16 -344 486 308 -250 201 130 -518 -149 795 183
1249 183 -631 254 288 -532 -98 602 -109 -769 101 -56 -134 462 482 -808 -882 490 530 -244 396 170 -587
1270 -587 155 966 200 -547 282 522 -342 -399 -75 -154 70 526 -799 -1099 167 765 -449 -789 209 -6
1290 -6 -155 304 95 -498 405 761 -206 -413 455 326 -349 185 111 -558 115 804 -378 -908 -32 302 -90
1311 -90 -39 83 -101 -480 183 -25 -169 576 161 -760 -305 662 337 -432 227 434 -202 91 340 -497 -518
1332 -518 110 -117 -568 247 403 -498 -293 20 80 -83 670 -98 -1032 -103 1010 426 -348 -65 -206 -43
1352 -43 551 138 -442 -54 758 -88 -720 39 573 -184 -239 277 -465 -268 441 -106 -606 81 511 -125 -52
$$ packed form
1210D60L11j052j58J123l97q39P73L00n18j62K80p75L68J163k75j224k37Q98l53
1229c14O06M43j058p72J005P17q07L58K28m22l28Q30j78n58M51p1o48L69R44o12
1249A83q14Q85L4q20M34P00p11o60Q70j57p8N96K0j290p4J372M0p74O40k26p57
1270e87P42Q11p66p47Q29K40q64n7L24p9K24M56j325l00J266N98j214l40R98k15
1290fj49M59k09n93R03L56r67k07Q68j29o75N34p4o69O73O89j182n30Q76L34l92
1311i0N1J22j84l79O63k08j44P45m15r21M55R67l25p69O59K07o36K93K49q37k1
1332e18O28k27m51Q15J56r01K05L13O0j63P53p68r34R29J113n84p74K83j41J63
1352d3N94m13n80L88Q12q46o32P59N34p57n5N16p42J97P09n47n00O87M30o36P3
$$ plain form
1373 -52 263 -63 -1 672 218 -673 59 780 -138 -476 201 549 -149 -118 -186 -612 263 512 -425 -613 619
1394 619 294 -602 -417 352 137 -218 273 17 -213 268 324 -241 -12 264 91 -368 387 -75 -205 439
1414 439 410 -651 -626 539 174 -420 -427 -5 -55 -11 169 -312 -183 865 196 -553 76 574 94 -314 456
1435 456 -45 -211 -2 79 -669 86 603 6 -458 288 183 -231 54 170 -427 -88 816 -91 -589 -21
1455 -21 663 95 28 191 -169 244 570 -155 -582 370 869 -480 -559 55 96 -245 76 -171 -608 -37 259
1476 259 -367 -618 226 334 -67 -3 333 -258 152 702 -120 -539 390 553 -218 -283 384 -39 -329 182 -129
1497 -129 -394 380 434 -661 -200 579 100 -519 -103 226 -147 180 364 -420 -215 725 238 -556 -56 278
1517 278 -160 -87 308 -434 -700 549 154 -711 -154 647 -120 -513 83 -2 -164 430 81 -533 34 780
$$ packed form
1373e2L15l26O2O73m54q91P32P21r18l38O77L48o98L1o8m26Q75K49r37j88J232
1394F19l25q96J85P69k15l55M91k56k30M81N6n65K29K76j73m59P55m62j30O44
1414D39k9j061K5J165l65n94pM22n0M4J80m81J29J048o69p49O29M98m80m08P70
1435D56n01j66K09Q1p48P55N17n97m64P46j05m14K85J16n97L39R04r07m98N68
1455b1O84n68o7J63l60M13L26p25m27R52M99j349p9O14M1l41L21k47m37N71K96
1476B59o26k51Q44J08m01O4L36n91M10N50q22m19R29J63p71o5O67m23k90N11l11
1497a29k65P74N4j095M61P79m79o19M16L29l73L27J84p84K05R40m87p94N00L34
1517B78m38P3L95p42k66J249l95q65N57Q01p67l93N96q5j62N94l49o14N67P46
$$ plain form
1537 780 141 -412 40 387 -349 146 350 -191 -36 427 42 -866 144 583 -321 -341 504 -247 -338 242
1557 242 105 -676 180 735 -221 -426 401 97 -248 235 395 -226 43 590 -226 -508 687 231 -484 -56
1577 -56 299 -365 -145 279 -241 -675 318 277 -461 -339 495 -94 -300 292 84 -217 224 690 -269 -166 721
1598 721 -59 -411 162 390 -310 -170 505 -519 -477 366 308 -663 -74 357 -454 -513 456 172 -172 498 261
1619 261 -459 -68 701 -8 -254 283 256 -522 -15 274 -427 -158 285 107 -476 168 299 -225 -98 367
1639 367 -189 -375 362 34 -604 77 422 -114 169 338 64 -406 166 257 -228 -127 344 -421 -539 522
1659 522 -3 -485 -90 420 -459 -208 484 -90 -512 201 316 -626 39 263 -185 -136 286 288 -391 361 275
1680 275 -413 -215 398 -22 -331 256 277 -536 -142 470 -372 -513 187 -34 -689 44 439 -384 -110 401
$$ packed form
1537G80o39n53M52L47p36M95K04n41J55M63l85r08J010M39r04k0Q45p51r1N80
1557B42j37p81Q56N55r56k05Q27l04l45M83J60o21K69N47q16k82J195m56p15M28
1577e6L55o64K20M24n20m34R93m1p38J22Q34n89k06N92k08l01M41M66r59J03Q87
1598G21p80l52N73K28p00J40O75j024M2Q43n8r71N89M31q11n9R69k84l44O70k37
1619B61p20L91P69p09k46N37k7p78N07K89p01K69M43j78n83O44J31n24J27M65
1639C67n56j86P37l28o38O81L45n36K83J69k74m70N72R1m85J01M71p65j18J061
1659E22n25m82L95N10q79K51O92n74m22P13J15r42O65K24m48M9M22Ko79P52q6
1680B75o88J98O13m20l09N87K1q13L94O12q42j41P00k21o55P33L95q23K74N11
$$ plain form
1700 401 -251 -255 564 391 -494 59 426 -155 -215 539 259 -480 -107 402 -495 -178 224 -79 -378 236 -33
1721 -33 -435 23 514 -276 -398 599 418 -232 111 207 -322 115 453 45 -429 169 224 -346 57 335 -422
1742 -422 -434 148 -185 -361 -6 90 -363 -122 287 -170 -216 402 275 -270 96 447 -140 -32 465 -136 -321
1763 -321 368 314 -436 -271 -56 -252 -340 443 -155 -604 -52 225 -682 -229 313 117 -75 318 274 -385 228
1784 228 577 44 -349 115 129 -393 515 326 -504 -173 539 72 -666 172 301 -231 -58 166 -191 -65
1804 -65 415 4 -498 374 476 -377 -154 558 -56 -229 352 455 -674 -92 313 -168 -177 290 -67 -612 15
1825 15 80 -299 -25 265 -48 -525 290 210 -414 77 556 -308 -94 423 96 -126 360 246 -462 260 843
1846 843 -145 -579 305 236 -437 72 55 -539 -391 328 -74 -484 88 166 -370 149 392 -61 78 441 348
$$ packed form
1700D01o52mQ19j73q85N53L67n81o0P54k80p39L73N09q97L17M02l03k99O14k69
1721c3m02M58M91p90j22R97j81o50L43R6n29M37L38m08m74N98N5n70M03K78p57
1742d22j2N82l33j76L55R6m53K41M09m57m6O18j27n45L66L51n87J08M97o01j85
1763c21O89n4p50J65K15j96q8P83n98m49N52K77r07M53N42j96j92L93m4o59O13
1784B28L49n33l93M64J4n22R08j89q30L31P12m67p38Q38J29n32J73K24l57J26
1804f5M80m11n02Q72J02q53K23P12o14j73N81J03j129N82M05m81rM67l57n45O27
1825A5O5l79K74K90l13m77Q15q0o24M91M79q64K14N17l27k22M86j14p08P22N83
1846H43r88m34Q84o9o73N09j7n94J48P19m02m10N72P8n36N19K43m53J39L63r3
$$ plain form
1867 348 -410 95 584 105 -207 174 -299 -337 259 15 -501 -138 437 -128 -252 406 108 -366 259 435
1887 435 -167 -184 285 -23 -133 250 228 -90 146 292 -233 -322 533 -122 -174 246 517 -595 -361 318 -111
1908 -111 -337 282 270 -103 -113 121 -395 -46 690 239 -562 165 435 -135 57 475 184 -245 163 22 -332
1929 -332 -76 286 -122 -86 251 -275 -411 405 308 -524 -151 614 -88 -550 140 393 -72 241 438 -208 10
1950 10 465 -106 -113 235 411 -364 -124 348 -201 -401 357 346 -170 -48 20 -168 -434 253 -29 -315 234 65
1972 65 -274 82 648 -87 -165 539 400 -467 -159 371 147 -168 167 -269 -436 277 81 -282 -139 487 -363
1993 -363 -266 89 -98 -402 383 638 -469 -4 309 266 -66 296 74 -72 86 376 -484 -263 469 217
2013 217 -547 -181 273 -286 -188 138 -92 -212 12 -59 -456 146 635 -323 46 525 178 -415 281 430 -18
$$ packed form
1867C48p58N05M89m79l12L81m73l8N96k44n16L63N75n65j24O58k98m74O25J76
1887D35o02j7M69l08j10L83k2l18K36J46n25q9Q55o55n2M20K71j112K34O79m29
1908a11k26O19j2l73j0K34n16L49P36m51q01P27K70n70J92M18k91m29M08j41l54
1929c32K56L62m08L6L37n26j36Q16r7q32L73P65p02m62O90K53m65L13J97o46K18
1950A0M55n71pL48J76p75K40M72n49k00P58j1n16J22O8j88k66O87k82k86N49j69
1972F5l39L56N66p35p8P04j39q67L08N30k24l15L35m36j67P13j96l63J43O26q50
1993c63R7L55j87l04P85K55j107M65L13m3l32L62k22j46J58K90q60K21P32k52
2013B17p64L66M54n59R8L26k30j20K24p1l97O02M89r58L69M79l47n93O96J49m48
$$ plain form
2034 -18 1 342 19 -232 107 67 -351 265 171 -545 -241 174 -76 -537 251 294 -289 -344 368 -14 -9 406 96
2057 96 -104 289 282 -108 81 511 -34 -436 79 123 -686 -243 302 -115 -298 98 -106 -534 -35 219 -227
2078 -227 -68 352 -284 -115 463 368 -228 38 459 101 -183 207 -4 -286 420 124 -435 -209 62 -293
2098 -293 -390 189 58 -423 -79 285 -275 -319 352 217 -354 -6 218 -6 -132 132 92 17 427 -16 -282
2119 -282 -203 493 -350 -533 87 83 -294 -37 201 -585 -250 231 -392 -389 108 256 -102 128 322 -48 -122 165
2141 165 53 -145 143 421 -130 -55 507 -44 -564 -5 -18 -348 -27 350 -304 -301 104 2 -171 56 328
2162 328 -219 82 647 -137 -68 272 156 -199 173 375 -313 -154 155 -105 -383 218 -92 -244 -313 250 -213
2183 -213 -318 -88 11 -296 110 442 -292 75 695 38 -394 84 137 -258 -95 212 -315 -269 259 -7 -507
$$ packed form
2034a8J9L41l23k51L39m0m18O16r4p16L04M15k50m61P88M3n83n5P12l82NM15l10
2057I6k00L93pl90J89M30n45m02N15M4q09M43N45m17j83L96k04m28M99K54m46
2078b27J59M20o36J69N78r5n96K66M21l58k84L90k11k82P06k96n59K26K71l55
2098b93r7N79j31m81L44L64n60m4O71j35n71L48K24k24j26K64m0p5M10m43k66
2119b82P9O96q43j83O20ml77K57K38p86L35M81o23LM97J48l58K30J94l70p4K87
2141A65j12j98K88K78n51P5N62n51n20N59j3l30L21L77o54LM05j02j73K27K72
2162C28n47L01N65p84O9L40j16l55L72K02o88J59L09k60k78O01l10j52o9N63m63
2183b13j05K30R9l07M06L32p34L67O20o57m32M78N3l95J63L07n27M6N28k66n00
$$ plain form
2204 -507 91 334 -303 -299 4 -353 -380 110 161 -316 -76 291 -40 -270 204 195 -238 230 231 75 99 364 -100
2227 -100 -242 269 173 -362 -217 191 -267 -254 68 -23 -411 57 28 -222 -166 245 184 -176 50 149 -38 132
2249 132 199 -107 -68 432 176 -236 252 179 -97 -51 181 -167 -164 124 -32 -468 9 213 -193 -217 123 162 -234
2272 -234 85 230 -194 209 640 115 -103 278 95 -264 -113 140 -281 -128 344 -72 -231 34 159 -449
2292 -449 -184 240 -202 -338 58 70 -294 223 330 37 -27 379 -45 -213 300 370 -105 29 345 -114 -39
2313 -39 393 37 -172 -88 80 -243 -44 69 -166 -318 187 189 -324 188 298 -92 121 231 100 -146 366
2334 366 256 -177 120 179 -301 -143 86 19 -154 -33 368 -482 -153 68 82 52 -45 307 -197 46 421 -29
2356 -29 -75 197 162 -53 80 407 74 -219 318 297 -390 158 93 -295 -234 342 -104 -465 245 64 -294 -263
$$ packed form
2204e07N98K43o37ML03l57k7M90N1m77K40L67l31k30M74rm33M68Jj56K4K65m64
2227a00j42N11r6n35J45M08m58J3L22r1l88M68k9k50N6M11o1l60K26R9j87J70
2249A32O7l06L9N00k56m12M88p3k76M6K32l48LK88j56m36M77K04m06k4L40L9l96
2272b34L19J45m24M03M31n25k18L81j83l59J51K53m21J53M72m16j59K65J25o08
2292d49K65M24m42j36L96J2l64N17J07k93o4M06m24j68N13P0m75J34L16m59P5
2313c9M32l56k09Q4J68l23J99J13k35j52N05Kn13N12J10l90K13J10j31k46N12
2334C66j10m33K97N9m80J58K29o7j73J21M01q50L29K21J4l0r7L52n04K43L75m50
2356b9m6K72l5k15J33L27l33k93N37k1o87N48o5l88O1N76m46l61P10j81l58L1
$$ plain form
2378 -263 67 -15 -252 238 -1 -191 61 48 -170 -59 344 -93 -115 2 185 -227 -15 57 -435 -314 245
2399 245 36 -232 -24 85 -251 -47 186 -148 -151 293 215 -169 170 397 19 -4 284 166 -123 55 175
2420 175 -55 -49 220 -181 -283 203 -102 -213 -89 343 -72 -281 87 -119 -43 172 445 -22 19 369 -81
2441 -81 -21 315 32 -134 96 227 -165 -339 267 112 -343 -100 77 -275 -16 234 -18 -203 302 -163 -308
2462 -308 125 268 -66 -171 228 112 -346 166 245 -54 62 344 -366 -298 13 -147 -216 -113 29 -194 -116
2483 -116 -34 -35 -336 -86 144 -86 -168 186 -60 -116 51 21 -155 203 140 -83 137 141 -10 -298 104 232 -297
2506 -297 46 221 -91 -115 -79 24 -266 37 293 -104 -4 261 -210 -212 315 135 -63 37 230 7 215
2527 215 231 132 -298 55 -84 -228 -221 8 -28 -205 124 63 -333 -133 -128 -67 26 260 14 -408 -176 351 -27
$$ packed form
2378b63L30q2k37M90k39j90K52j3k18J11M03m37k2J17J83m12K12P2m92J21N59
2399B45k09k68K08J09l36K04K33l34lM44p8l84L39K27l78k3K88j18k89J78J20
2420A75k30OK69m01j02M86l05j11J24M32m15k09L68k06P6K15K73m67M1L50m50
2441h1O0L36k83j66K30J31l92j74O06j55m55K43J77l52K59K50k52j85N05m65j45
2462c08M33J43l34j05L99j16m58N12P9k99J16K82p10O8L11j60o9J03J42k23P8
2483a16Q2jl01K50K30k30q2L54k46n6J67l0j76L58o3k23K20Mj51k88M02J28n29
2506b97L43J75l12k4L6J03k90L03K56l97J00K65m71kN27j80j98J00J93k23K08
2527B15J6r9m30L53j39j44PK29l6j77L29o1l96K00NO1R3K34k46m22K32N27l78
$$ plain form
2550 -27 -97 180 -3 101 241 200 -368 183 122 -123 -352 62 -132 -68 129 -1 -75 97 218 -281 -193 202
2572 202 -4 -227 9 167 105 21 34 120 -224 220 250 -82 120 27 -1 -93 83 29 -189 143 150 -309 -183 59
2596 59 33 -247 38 228 -116 14 100 53 -118 222 136 -208 25 374 -1 -92 101 -161 -271 -104 65 -54
2618 -54 -164 51 -197 -15 -61 -110 -222 2 144 -149 -10 270 -175 -88 286 56 -279 -183 26 22 -146 68
2640 68 -43 -194 -40 -69 -322 -513 42 -135 -320 -30 -117 -294 -114 193 -145 -249 263 104 54 -25 111 -120
2662 -120 -60 117 -61 -118 287 210 -47 99 -23 -78 -130 98 -28 -258 -54 -86 -91 -114 186 -120 -241 141 131
2685 131 192 179 100 -88 -198 57 -20 -84 171 184 43 -134 -130 -48 -214 -9 -113 -106 18 102 8 145 -45 208
2709 208 -105 273 -51 -192 166 194 5 -95 73 47 -64 -39 230 -133 10 74 -258 -362 183 -76 -74 -192
$$ packed form
2550b7p0K77j83J04J40m1n68N51o1k45k29M14j94O4J97j30p4J72J21m99Q8L95
2572B02k06k23K36J58o2q4J3Q6l44M44L0l32K02r3k8r2J76n4k18L32Pm59J26K42
2596E9k6k80K85J90l44J30Q6m7j71L40q6l44K33L49l75r1J93k62j10J67J69j19
2618e4j10K15k48J82m6m9j12K24J42k93J39K80m45Q7L74k30l35R6K09mj68K14
2640F8j11j51J54k9k53j91N55j77j85K90q7j77J80L07l38j04N12j59n0p9J36k31
2662a20O0J77j78n7M05p7k57J46j22n5n2K28j26k30K04l2nk3L00l06j21L82j0
2685A31O1j3p9j88j10K55p7o4K55J3j41j77MQ2j66K05j04PJ24Q4r4J37j90K53
2709B08l13L78l24j41L58K8j89j00J68k6j11K5K69l63J43O4l32j04N45k59Kj18
$$ plain form
2731 -192 -271 -37 169 176 -36 -270 116 82 -334 -48 198 57 -142 26 73 -163 125 -73 -146 -146 24 118 -300
2754 -300 -210 -5 47 -306 -15 -106 -222 188 6 -18 92 245 -52 -101 187 -89 144 160 261 -261 -50 326
2776 326 10 -267 -150 365 -82 -140 179 -69 -221 20 -35 -114 -19 160 107 -37 -53 -85 11 293 100 -34 37
2799 37 48 -160 -150 155 54 -198 -172 6 -167 -91 27 -39 -75 -142 -187 -49 36 185 188 -22 143 -13 -33 145
2823 145 7 -56 56 306 119 -46 -12 -99 -42 111 177 -152 -94 162 183 15 -15 11 -239 75 80 -122 5 128
2847 128 44 46 -53 154 3 -57 61 -1 -26 -125 -144 -79 40 101 -33 -277 -31 96 -242 -56 -118 -139 -128 -158 144
2872 144 44 32 109 -82 -65 109 69 -59 67 -96 -47 49 3 5 -225 -99 -155 -297 -191 -71 198 -83 99
2895 99 -137 -218 79 30 18 -211 195 18 -74 146 0 8 22 241 -113 96 10 -131 -16 -69 -3 -264 -48 211
$$ packed form
2731a92p9K34K06Pk12k34L86l4m16K86K46j41j99J68M7k36K88j98p3%J70R4m18
2754c00R0K05N2l53K91r1j16M10j82k4J10J53k97m9K88k76K33J6J01n22K11L76
2776C26l16k77J17N15m47n8L19k48j52K41n5p9R5J79n3j44j6l2R6K82j93j34P1
2799C7J1k08J0L05j01k52K6J78j73P6J18o6l6o7m5J38Q5J49Lk10J65j56k0J78
2823A45j38o3J12K50j87j65L4q7N7J53O6l29N8K56K1j68l0K6k50L14Nk02J27J23
2847A28q4Kr9K07j51o0J18o2k5r9j9O5J19O1j34k44K46J27l38J86o2k1J1l0L02
2872A44j00j2P7j91J7J74m0j28J26j63M9R6m6Kk30J26n6j42J06J20K69k81J82
2895I9k36q1K97m9j2k29M06j77r2K20j46QJ4K19l54K09q6j41J15n3O6k61K16K59
$$ plain form
2919 211 -281 -243 103 -187 -200 40 61 -145 277 24 46 77 180 112 -26 165 59 -74 -50 -167 -15 -135
2941 -135 -69 12 -233 -19 -72 38 -171 175 106 -5 -123 -138 -164 31 63 81 -121 55 98 -119 -102 -51 193 46
2965 46 190 140 122 -325 -77 -82 10 80 21 -67 -57 -53 16 -107 37 -147 30 -3 63 154 19 -11 29 -50 -85 14 -38
2992 -38 -113 134 42 -135 -40 5 -53 13 155 -159 -81 148 -24 -44 -18 22 -202 -16 7 65 80 61 -23 102 194 216
3018 216 179 -139 94 -174 -57 51 -25 48 -60 -26 -145 85 -95 36 -253 -30 82 -100 104 -50 65
3039 65 68 177 -7 2 -161 -15 61 83 81 21 -105 135 -40 -247 -145 -196 44 -74 -70 80 -195 -31 149 -56
3063 -56 -233 23 -107 -17 67 182 -6 111 205 -13 52 265 95 -1 -3 96 36 -16 -106 -163 -91 -13 159 -235 -231 -85
3089 -85 -62 -95 -89 71 -125 -154 124 129 1 86 -113 -84 -14 82 -63 61 48 63 -1 67 -26 -125 -32 219 -181 -113 -134
$$ packed form
2919B11m92L8L46k90j3K40K1k06M22k53K2L1J03o8j38J91j06j33K4j17J52j20
2941a35O6Q1k45K14n3J10k09L46o9j11j18j5k6J95L2J8k02J76M3k17J7N1K44j47
2965D6J44n0j8m47K48nR2P0n9q8J0MO9j23J44j84J77l3O6R1j35l0M0p9l5R9n2
2992c8p5K47r2j77R5M5n8O6J42l14P8K29j72k0K6M0k24J86K3N8J5j9q4J25R2K2
3018B16l7l18K33k68J17J08p6P3j08L4j19K30j80J31k89K23J12j82K04j54J15
3039F5LJ09j84Rj63J46P6K2ko0j26K40j75k07J02n1K40j18MJ50k75J64J80k05
3063e6j77K56j30R0Q4J15j88J17R4k18O5K13j70r6kR9o0n2r0n7P2P8J72l94MJ46
3089h5K3l3OJ60j96k9K78Nj28Q5j99K9P0R6j45J24j3J5o4O8r3r9R3K51m00O8k1
$$ plain form
3116 -134 -10 -37 0 127 100 -21 175 -92 -53 81 8 -10 172 53 37 -74 84 20 -42 -58 26 -260 132 87
3140 87 -200 -301 -106 249 14 152 -18 0 28 -12 79 -9 222 136 20 19 87 67 -152 213 -13 78 -263 138
3164 138 107 -67 95 -25 17 52 -62 -197 -97 242 17 3 -116 139 -204 10 1 39 86 28 70 -53 -64 -263
3188 -263 32 -20 32 -157 -97 138 158 -85 -21 -283 -48 -227 -19 49 26 206 134 -34 107 59 142 -161 57
3211 57 286 -128 6 43 60 -176 123 99 -299 -7 -44 -92 47 216 -7 -100 -71 -66 -256 -165 123 146 -42 70
3235 70 34 78 -26 70 -89 -132 205 -153 -20 -114 99 61 -249 251 -58 -122 -194 78 -1 5 -11 -204 -188 14 -78
3260 -78 -42 153 -59 -9 -188 125 116 -90 58 72 -36 91 121 -198 -11 3 -217 -71 74 -25 -131 11 101
3283 101 22 -165 188 -32 -58 76 181 56 172 -84 -49 -6 1 140 -199 11 144 -196 -118 216 -26 -173
$$ packed form
3116a34J24k7L7J27k7j21J96k67L9J34p3j8J82j19j6j11J58o4o2j6Q4k86L92m5
3140H7k87j01J95L55k35J38j70J8K8m0R1q8K31q6j16jO8k0k19L65k26R1l41M01
3164A38l1j74J62j20M2L5j14j35J00L39k25j4j19K55l43K14rL8M7n8M2j23j1j99
3188b63K95n2N2j89O0K35K0k43O4k62K35j79K08O8k3J80p2j68J41m8Q3l03K18
3211E7K29m14J34L7J7k36K99k4l98K92l7m8J39J69k23r3K9Nj90R1K88K3j88J12
3235G0l6M4j04R6j59m3L37l58J33r4K13l8l10N00l09o4p2K72p9Oj6j93J6K02r2
3260g8L6J95k12N0j79L13rk06J48J4j08J27L0l19J87J4k20J46J45r9j06J42R0
3283A01p9j87L53k20k6J34J05j25J16k56L5M3PJ39l39K10J33l40P8L34k42j47
$$ plain form
3305 -173 -92 -89 -181 42 -11 57 -214 108 -113 -71 123 89 -179 57 263 158 -92 189 125 -77 76 139 -161
3328 -161 -113 -17 -56 -115 50 114 -77 -2 133 20 -151 -25 212 -15 64 -19 -183 -103 293 121 -254 125 160
3351 160 -325 79 29 -112 -240 16 96 -135 -110 198 -155 -173 37 27 -184 -148 123 -132 79 231 -41 -95
3373 -95 174 184 -18 -100 245 -15 -64 -23 -50 -349 -66 71 -154 34 229 -120 -70 144 32 -26 -208 295 -38
3396 -38 -13 1 129 -225 -37 149 -20 -83 205 43 -187 -83 -40 -32 195 49 -40 -211 75 -65 -173 161 235
3419 235 -90 36 305 169 -185 26 -170 -101 103 169 -126 -150 183 -167 -163 -84 66 133 -120 147 -70 -88 126
3442 126 -31 -204 -62 168 -40 -217 109 65 -98 22 -34 -142 -129 21 27 24 121 135 20 29 6 -18 -46 111 -58
3467 -58 -252 -113 170 -182 -243 -11 85 101 64 190 -53 94 193 -17 -25 201 46 -118 153 339 -146 -117 217
$$ packed form
3305a73Q1Lr2K23n3O8k71L22k21M2J94l4k68K36K06j05k50K81o4k02J53O3l00
3328a61M8R6l9n9J65O4j91P5J35j13j71J26K37k27P9q3j64Q0L96j72l75L79L5
3351A60m85M04n0j41j28K56Q0k31K5L08l53j8K10j0k11L6K71k55K11J52k72n4
3373i5K69J0k02q2L45k60m9M1k7k99K83J37k25J88J95l49N0K14j12n8j82N03l33
3396c8K5J4J28l54J88J86j69o3K88j62k30J04M3QK27j46q9j71K86j40j08L34P4
3419B35l25J26K69j36l54K11j96O9K04O6k95k4L33l50MP9J50O7k53K67k17j8K14
3442A26j57j73J42K30k08j77L26m4j63J20n6j08J3J50OlR7J4j15Rk3k4k8J57j69
3467e8j94J39K83l52o1K32R6J6l7J26k43J47R9k10qK26j55j64K71J86m85K9L34
$$ plain form
3490 217 66 6 179 5 -113 -76 29 -142 -30 40 20 -6 34 163 -195 -66 242 -61 -72 -52 -61 -88 -34 231
3514 231 -54 105 93 178 8 103 147 -97 132 91 25 -158 44 1 88 73 39 -258 -45 -10 100 30 -3 -113
3538 -113 -271 -90 148 -41 -14 64 -229 -47 43 -92 79 10 -1 -81 -227 -7 -70 -244 -178 73 -36 -157 109
3561 109 204 -175 142 23 -342 -162 216 -32 26 -129 -41 -175 25 124 -180 15 142 -183 -99 -10 -135 -234
3583 -234 24 230 7 -175 1 15 45 179 42 -241 -139 220 -16 -17 -9 16 -132 79 38 -238 -95 96 75
3606 75 -17 -90 197 -258 -40 152 120 -222 106 -42 -52 35 -53 105 20 100 -169 -108 130 3 -81 9 164 39
3630 39 -141 194 108 -178 15 257 -236 41 236 -6 -306 113 32 -63 36 164 -8 -148 -120 -5 -61 116
3652 116 82 -203 79 75 165 -180 141 25 -185 -314 198 -204 -146 243 185 -229 202 142 -169 -182 -64 234 39
$$ packed form
3490B17j51o0J73j74j18L7J05j71J12P0k0k6M0J29l58J29L08l03j1K0rk7N4K65
3514B31k85J59j2Q5j70R5M4k44K29m1o6j83K02m3Q7j5l4k97K13L5J10p0l3j10
3538a13j58J81K38j89K7P8k93J82R0j35J71o9j1q0j46K20o3j74O6K51j09j21K66
3561A09R5l79L17j19l65J80L78k48N8j55Q8j34K00R9l04J95J27l25Q4Q9j25r9
3583b34K58K06k23j82J76J4L0J34j37k83J02L59k36jQK5j48K11m1k76J43J91k1
3606G5r2p3K87m55K18J92l2l42L28j48j0Q7q8J58q5Q0k69O1K38j27q4R0J55j25
3630C9j80L35q6k86J93K42m93K77J95k42l00M19q1r5R9J28j72j40K8J15n6J77
3652A16l4k85K82mR0l45L21j16k10j29N12m02N8L89n8m14M31o0l11j3J18K98j95
$$ plain form
3675 39 324 34 -232 146 139 67 -21 218 28 -205 130 194 -137 -66 25 12 106 83 226 -105 28 75 -167 -166 21
3700 21 -88 -209 142 46 -24 -66 356 51 -97 147 44 18 83 20 -244 4 278 -6 -269 192 307 -65
3722 -65 134 88 77 -175 86 57 -81 89 35 -63 10 271 -179 -116 175 73 85 -162 326 -143 -238 151 105 -60
3746 -60 -121 156 -65 -174 138 200 -69 167 58 -223 97 280 -221 -222 27 33 -235 -18 -14 77 -164 122 -158
3769 -158 -237 -15 -19 -97 -55 167 -129 -94 199 181 -38 -44 17 -65 162 92 -183 -15 215 -96 -119 87 194 -20
3793 -20 -11 13 158 -91 -173 65 44 -119 221 -112 -103 138 -62 32 6 97 95 -147 -67 -201 -228 97 106 -108 -244 105
3819 105 -159 -148 205 126 -65 172 213 -160 -165 170 1 13 8 279 -78 -87 225 -209 -126 -14 41 -163 7 12 -88
3844 -88 -102 96 -121 -140 -115 235 -19 -132 122 83 -116 -228 91 -148 195 126 -46 -92 -39 129 -42 44 164
$$ packed form
3675C9K85k90k66L78pp2q8K39j90k33L35O4l31P1R1j3R4k3J43l31J33M7k42JJ87
3700B1j09j21L51r6p0m2M22l05j48K44j03k6O5o3k64K48K74k84k63M61J15l72
3722f5J99m6j1k52K61k9j38J70n4r8P3K61m50O3K91j02J2k47M88m69r5L89m6j65
3746f0o1K77k21j09L12O2k69K36j09k81L20J83n01jK49Ok68K17MR1k41K86k80
3769a58p9K22mp8M2K22k96L5K93j8k19oO1q2K27p0k75J68K30l11k3K06J07k14
3793b0RK4J45k49q2K38k1j63L40l33RK41k00R4k6R1kk42Q0j34k7L25Rk14j36L49
3819A05k64J1L53p9j91K37M1l73nL35j69J2nK71l57rL12m34Q3J12N5k04J70Nj00
3844h8j4J98k17j9K5L50k54j13K54l9j99j12L19k39L43o9j72m6N3J68j71Q6J20
$$ plain form
3867 164 -338 -147 -221 11 -236 -35 -80 -221 141 197 -199 -176 4 145 -181 247 18 -175 118 44 -42 -62
3889 -62 194 81 -102 56 -42 -188 -5 195 -112 -22 122 110 -107 3 222 -76 -171 58 -43 -66 -86 -58 -328
3912 -328 -328 103 -64 -172 87 -92 -27 -23 46 -235 -356 190 -41 -1 206 161 -263 5 84 -34 214 194 -45
3935 -45 -155 104 129 -17 -81 278 -13 -268 197 94 -26 39 75 -197 -120 175 -4 -165 123 222 -273 -16
3957 -16 269 -112 -201 39 154 -221 5 51 -2 -187 345 -285 -374 -42 89 -109 -251 47 -1 -386 -204 192
3979 192 -111 -136 53 -24 -128 287 -138 -127 -188 104 -191 -99 207 100 -240 101 89 -133 -93 188 18 42 66
4002 66 41 -170 215 25 -170 -65 266 51 26 166 176 -130 4 40 -56 -94 -19 2 -52 170 -15 -3 -13 67
4026 67 -121 25 -44 -12 -195 -89 148 61 -85 92 -58 -92 130 -7 -157 230 83 -24 -161 -110 96 59
$$ packed form
3867A64n02J91p4K32k47K01m5j41L62N6l96K3J80J41l26M28k29j93K93p4q6k0
3889f2K56j13j83J58r8j46J83K00l07R0J44j2k17J10K19k98r5K29j01k3k0K8k70
3912c28%M31j67j08K59j79O5MO9k81j21N46k31M0K07m5m24K68P9j18K48k0k39
3935d5j10K59K5j46o4L59k91k55M65j03j20O5L6k72P7K95j79j61K88R9m95K57
3957a6K85l81q9K40J15l75K26M6n3j85N32o30q9L32J31j98j42K98m8l85J82L96
3979A92l03k5J89p7j04M15m25J1o1K92k95R2L06j07l40L41j2k22M0K81j70K4K4
4002F6k5k11L85j90j95J05L31k15k5J40J0l06J34L6r6l8P5K1n4K22j85J2j0Q0
4026F7j88J46o9L2j83J06K37q7j46J77j50l4K22j37j50L87j47j07j37N1K06l7
$$ plain form
4048 59 -112 53 -106 -39 139 65 -66 -37 60 -116 -98 147 -73 -73 213 94 -153 238 194 -177 -136 101 -162
4071 -162 30 -4 53 -40 83 -102 -91 -104 222 42 -13 -30 133 -26 -5 160 -37 68 345 13 -146 -88 118
4094 118 -67 -170 -38 71 -13 141 191 -138 -89 5 68 17 156 -97 -172 117 265 -32 -249 116 58 -321 -80
4117 -80 246 -54 43 -4 -63 -94 31 29 1 57 31 -139 -69 60 -70 53 90 5 -95 -67 4 -79 -162 131 -22 -70
4143 -70 -126 28 -169 -204 25 46 -90 157 105 -74 -155 291 35 -297 142 -58 -164 13 58 -165 102 -41
4165 -41 -37 -229 19 -14 -228 0 -139 67 -119 212 -82 -138 14 -20 -262 6 178 -44 38 -77 14 -150 -95
4188 -95 60 -191 3 60 16 -17 -33 175 20 47 149 49 -267 -16 161 -74 133 24 -46 116 19 115 -184
4211 -184 22 7 -160 -1 136 3 -308 6 -21 -114 -166 109 -54 -44 5 34 -11 19 268 -328 -222 136 -57
$$ packed form
4048E9j71J65j59O7J78p4j31K9R7j76J8K45k20%K86j19k47L91m4l71M1K37k63
4071a62J92l4N7r3J23j85J1j3L26j80n5j7J63j59K1J65j97J05K77l32j59N8K06
4094A18j85j03J32J09q4J54N0l29M9R4O3n1J39k53p5K89J48k97k17L65n8l79K41
4117h0L26l00R7m7n9l1J25kk8N6k6j70P0J29j30J23L7q5j00K8P1q3q3K93j53m8
4143g0n6J54j97l5K29K1j36K47n2j79q1M46k56l32M39k00j06J77M5k23K67j43
4165d1Mj92K48l3k14K28j39K06j86L31k94n6J52l4k42K68J72k22Q2j15R1j64N5
4188i5J55k51J94N7m4l3j6K08j55K7J02j00l16K51J77k35K07j09p0J62r7R6k99
4211a84K06j5j67J59J37j33l11L14k7r3n2K75j63J0M9K9m5L0K49n96J06L58j93
$$ plain form
4234 -57 28 92 40 -82 208 -3 37 54 359 -31 -164 167 32 -210 -100 230 106 -114 210 36 -172 -57
4256 -57 -40 -63 70 143 -37 -271 76 -51 -105 135 78 100 103 50 -53 -66 230 7 -240 -151 -158 -94 -348 53 -106
4281 -106 -207 -86 186 -38 26 -19 -94 -192 27 5 48 28 -71 -68 -44 104 24 36 0 79 -129 -10 -65 99 -129
4306 -129 18 159 -212 9 -15 -9 -136 -33 -26 74 -5 -52 30 -35 -148 -70 -254 -41 -41 -201 -96 38 -29 -62 102
4331 102 -102 -187 -29 23 4 -164 137 96 -148 195 -17 -114 128 -61 -63 -9 200 50 77 29 97 -323 32 141
4355 141 -63 -139 -174 143 -41 -72 2 -65 -137 -213 -5 30 33 -5 -168 10 159 -61 -38 39 -14 -39 -15 191 -154
4380 -154 -55 123 -17 -99 -101 67 -93 73 85 -177 -92 125 -15 133 62 -71 -55 86 171 -81 -74 -104 -8 92
4404 92 -90 23 2 -286 175 -66 -38 37 23 201 -33 265 93 2 72 26 -149 186 -96 -174 -110 70 -48
$$ packed form
4234e7Q5O4n2j22K90k11M0J7L05l90j33L31j35k42J10L30j24k20L24j74k08J15
4256e7J7k3J33P3j80k34L47j27n4K40n7K2Ln3j03j3K96k23k47Q9pO4k54M01j59
4281a06j01J21K72k24O4m5p5r8K19k2M3k0r9LK4J48q0J2l6P9k08J19n5J64k28
4306a29J47J41l71K21k4Oj27J03PJ00p9m7Q2o5j13P8j84K13%j60J05J34o7l3J64
4331A02k04q5J58N2j9j68L01m1k44L43k12r7K42j89kN4K09j50K7m8O8m20L55J09
4355A41k04p6l5L17j84l1P4o7p2p6K08L5Ll8j63J78J49k20K3P7n3k5K4K06l45
4380a54R9J78j40q2kJ68j60J66J2k62Q5K17j40J48p1j33J6J41Q5k52Pl0R6J00
4404I2j82J13k1k88M61k41K8P5j4J78k34K98j72r1P0m6j75L35k82p8O4J80j18
$$ plain form
4427 -48 26 106 196 -35 4 -114 -12 17 22 129 85 -12 18 -62 62 79 172 126 11 161 134 100 58 -104 101 213
4453 213 -40 97 -64 -62 -68 -32 219 -9 -223 78 73 -243 -77 76 28 72 12 -247 -132 72 -129 -246 19
4476 19 -151 144 79 132 -42 -30 55 -206 52 17 124 92 72 165 -205 -257 105 -142 -141 -27 -31 108 122 39 22 224
4502 224 77 -9 -125 -69 14 -133 18 -233 129 -140 -148 14 -102 -188 -102 -5 -294 43 -62 45 -203 -70 -142
4525 -142 -49 -48 -172 14 -97 70 -143 70 2 -164 69 -80 -77 -40 -100 -137 27 -68 12 81 128 54 98 64 -103
4550 -103 23 -15 -74 -140 74 -20 168 -3 76 5 69 10 -25 -123 -276 -39 -71 -82 -54 -71 13 4 -112 -114 -106 -144 -163 4
4578 4 -12 -273 -23 42 -11 2 62 104 101 -63 -114 5 -47 -89 73 -193 -47 161 -62 38 -150 17 154 24
4602 24 -8 46 168 67 210 104 263 -155 -105 -19 99 82 -49 130 5 123 33 31 133 -65 -50 -163 -128 -63
$$ packed form
4427d8P4Q0R0k31L9j18J02K9NJ07m4r7L0q0J24J7R3m6j15J50k7l4m2j62K05J12
4453B13k53J37j61KoL6K51k28k14L01nl16J66J53m8M4o0k59J15K04k01j17K65
4476A9j70K95o5N3j74J2Q5k61K58l5J07l2k0R3l70n2L62k47JJ14mJ39J4q3j7K02
4502B24j47q6j16N6Q3j47J51k51L62k69qJ62j16q6Q6R7k89L37j05J07k48J33p2
4525a42R3Jj24J86j11J67k13K13o8j66K33j49LL7o0l7J64r5Q0O9M7p4M4l4j67
4550a03J26l8n9o6K14r4J88j71P9p1O4n9l5r8j53K37l2j1K8j7Q4rj16kQl8j9J67
4578Dj6k61K50O5n3J3O0M2lj64n1J19n2m2J62k66J46K08k23J00j88J67J37j30
4602B4l2N4J22j01J43j06J59m18N0Q6J18j7j31J79j25J18r0kJ02j98J5j13L5O5
$$ plain form
4626 -63 -41 -7 100 87 -17 50 -77 20 -145 110 142 -209 63 -97 150 220 113 -22 -51 74 127 -62 1 169
4650 169 -91 6 95 -142 -263 89 91 -113 45 147 -127 12 16 -61 -48 120 -25 -111 101 108 -50 -90 21 3
4674 3 62 36 -26 35 84 112 7 -70 -120 -177 143 85 -76 22 -271 -67 19 -222 -167 80 -88 -44 34 -200 -149 32
4700 32 -101 -5 -82 164 -89 -15 -139 -39 65 134 24 -72 17 50 59 30 -14 -145 -136 -121 -21 -59 216 101 -63
4725 -63 -164 111 17 -46 -19 -21 137 -1 63 -74 10 71 -45 -138 75 53 -258 173 -1 95 -232 -132 -75 -193
4749 -193 -27 120 145 -103 -74 245 -41 -73 -66 -69 -184 -3 -140 -286 -8 28 -13 -23 -33 -83 47 156 -182 -11
4773 -11 174 -107 80 -161 41 -11 -119 62 82 -99 -64 25 -130 -102 18 22 -109 -4 46 -95 109 110 -247 96
4797 96 -256 285 -114 -35 53 -15 -69 -47 50 -75 -102 -65 23 -54 48 79 8 -105 120 -134 40 60 -77 -90 95
$$ packed form
4626f3K2L4J07j3j04O7j27R7j65K55L2l51K72j60K47P0j07j35k9J25N3j89O3J68
4650A69k60R7Q9k37j21L52Kk04J58J02k74J39Mp7J3J68j45q6K12Pj58m0J11j8
4674CN9k6o2O1M9K8j05p7n0n7L20n8j61R8k93K04Q6k41N5K47j68M4P8k34N1J81
4700C2j33R6p7K46k53P4j24J00J04O9j10r6Q9L3Rk9m4j31RJ5J00l8K75j15j64
4725f3j01K75r4o3K7kJ58j38O4j37Q4O1j16r3K13k2l11M31j74R6l27J00N7j18
4749a93J66J47K5k48K9L19k86l2Plj15J81j37j46K78L6m1j0j0n0J30J09l38J71
4773a1J85k81J87k41K02n2j08J81K0j81L5Q9j55K8J20Mj31J05N0j41K04Jl57L43
4797I6l52N41l99P9Q8o8n4K2R7j25k7L7Q8p7J02L1p1j13K25k54J74K0j37j3J85
$$ plain form
4822 95 164 -258 -113 -114 -39 -148 -46 -3 -130 -67 -38 79 27 -8 -155 -53 39 -157 17 55 -137 -147 0 118
4846 118 116 -278 87 87 -139 26 87 -69 -22 -23 73 1 -31 248 -53 14 105 -209 165 155 131 -172 83 132 111 138
4872 138 19 -39 -247 164 -148 95 -114 -5 152 -157 -5 96 -33 -176 161 -81 -82 -8 -3 -15 -104 -234 -76
4895 -76 121 53 -38 -37 188 69 -108 -7 -21 -103 85 123 -53 77 84 31 -174 96 -57 -158 46 32 -110 -105 -6
4920 -6 -199 -166 12 41 -193 -82 -1 -25 -178 -132 12 43 52 -32 -164 -62 0 231 -209 -240 24 -144 -123 102 -10
4945 -10 -125 210 -1 -25 -36 -34 83 -8 47 -118 6 161 29 60 28 -17 131 77 -8 -26 -141 27 206 -31
4969 -31 121 25 4 189 -46 27 -98 -93 89 11 -22 -118 -108 -30 37 -136 34 -95 -139 -93 -57 154 44 -42 -79 -23
4995 -23 -31 -106 -96 55 -343 -8 -48 87 -98 82 161 -34 128 -9 -52 -65 45 90 -69 -2 178 -173 40 -18
$$ packed form
4822I5O9m22J45jP5j09J02M3j27O3K9J17n2l5j47J02R2j96J74L8j92j0J47J18
4846A18kl94L65%k26J65O1j56M7jR6p2l2K79l01O7R1l14L74j0k4l03K55M9k1K7
4872A38j19n8k08M11l12K43k09J09J57l09J52J01j29j43L37k42jP4Nj2q9j30J58
4895g6J97o8r1JK25j19j77J01j4q2J88L8j76J30Pn3k05K70j53j01K04j4j42NR9
4920fj93L3J78K9k34J11Q1k4j53M6J44L1Rq4j32J02O2K31m40l1K64j68K1K25j12
4945a0j15L35k11k4j1KJ17r1N5j65J24J55j32L1l2m5J48n4q5j8j15J68J79k37
4969c1J52r6k1J85k35P3j25NJ82p8l3r6J0P8O7j73J70j29m4M6L6K11j10q6l7N6
4995b3qp5J0J51l98L35m0J35j85J80P9j95J62j37m3j3J10M5j59O7J80l51K13n8
$$ plain form
5019 -18 -2 59 118 32 -312 73 32 -108 -96 93 -51 173 -125 24 -25 -127 49 0 -99 7 70 -189 9 10
5043 10 -134 -271 -68 25 31 -68 -67 108 -103 -52 169 10 166 -52 -288 143 -81 -133 97 131 45 58 89 36 -1
5068 -1 -144 21 -35 -50 281 52 -219 -60 -81 -68 -6 8 -120 -60 -11 92 -12 -333 -34 -91 53 -24 57 84 243
5093 243 -140 -175 86 40 -26 -60 82 -209 -131 277 26 93 -11 16 -45 -106 139 31 -75 64 287 -191 -183 27
5117 27 27 -177 181 -34 -191 -248 203 -60 -201 63 274 94 -294 -124 40 196 162 -38 -46 46 -145 -99 16
5140 16 64 -39 -107 -178 39 -42 138 -183 8 -165 150 -20 10 35 -80 10 152 -99 -152 -41 133 -15 -89
5163 -89 34 -133 -113 2 177 83 -87 91 141 70 -126 259 -19 -179 184 0 29 -124 9 3 147 24 -96
5186 -96 146 -10 -88 -13 -8 -28 -57 37 -62 -126 -106 180 12 34 85 -21 1 151 46 67 -5 150 171 -94 -8 107
$$ packed form
5019a8J6O1N9q6l44L85m1j40J2J89j44K24k98J49m9j02J76m9r9J06O3k59J98J
5043A0j44j37K03R3Or9JJ75k11N1K21j59J56k18k36M31k24n2K30L4q6J3L1n3l7
5068aj43J65n6j5L31k29k71J59k1J3O2J4j28O0M9J03j04l21K99n7J44p7Q1K7J59
5093B43l83l5K61m6o6l4J42k91P8M08k51O7j04K7o1o1K45j08j06J39K23m78QK10
5117B7%k04L58k15j57n7M51k63j41K64K11j80l88J70J64J56l4k00qR2j91M6J15
5140A6M8j03o8p1K17q1J80l21J91j73L15j70L0K5j15R0J42k51n3J11J74j48p4
5163h9J23j67K0J15J75r4j70J78N0p1j96L85k78j60L63j84K9j53J33oJ44j23j20
5186i6K42j56p8P5Nk0k9R4r9o4K0K86j68K2N1j06K2J50j05K1p2J55K1k65Q6J15
$$ plain form
5212 107 -4 11 130 17 54 -105 -58 17 -104 -23 -159 -64 158 -5 -92 42 -57 160 -232 194 1 -291 31
5235 31 8 -70 -62 42 29 -105 91 11 -11 -70 177 -130 -66 211 32 -183 13 -209 158 96 -68 -71 97 -20
5259 -20 112 -95 -21 288 130 -155 233 -130 -168 70 247 -11 -28 18 67 106 -25 62 -55 115 64 67 -58 -50
5283 -50 84 -148 91 -33 -5 -181 239 -202 40 -181 47 -238 -92 227 -90 31 175 183 19 103 -118 -90
5305 -90 -171 34 -177 -120 19 -100 -28 339 62 129 -91 207 -143 -298 20 102 -135 -12 136 147 7 -3 24
5328 24 -45 17 -128 -23 -112 179 -23 -25 -73 30 -71 172 6 -60 -210 -201 -194 -149 -66 110 -113 -152 133 -77 -106
5353 -106 165 8 -141 -60 -18 -24 54 161 -94 -129 -220 42 -68 -119 87 45 -147 28 150 61 10 169 -107 -105
5377 -105 77 -40 -81 98 66 -109 142 196 -53 -307 59 -159 -61 131 80 -73 187 182 -95 -171 127 -31 13
$$ packed form
5212A07j11J5J19j13L7j59M7P5j21Q1j36R5K22j63q7J34r9K17l92M26j93k92L22
5235C1k3p8QJ04j3j34J96q0k2n9K47l07O4K77j79k15J96k22L67o2j64lJ68j17
5259b0J32k07P4L09j58k85L88l63l8K38J77k58j7M6M9L9j31Q7j17J70n1Lj25Q
5283e0J34k32K39j24K8j76M20m41K42k21K28k85J46L19l17J21J44Qj64Q4k21K8
5305i0q1K05k11N7J39j19P2L67k77O7k20K98l50j55L18Q2k37J23J48J1j40j0K7
5328B4o9O2j45J05q9K91k02km8J03j01K43j66o6j50RPM5Q3J76k23l9K85k10k9
5353a06K71j57j49Q1M2oP8J07k55l5r1K62j10n1K06m2j92J75J22q9n1J59k76K
5377a05J82j17m1J79l2j75K51N4k49k54L66k18R8J92n1j53K60nk77p6K98j58M4
$$ plain form
5400 13 -36 156 -265 -93 225 -215 -39 170 58 48 -251 52 -4 -74 60 -107 95 -46 156 -133 -120 290
5422 290 16 121 119 -8 58 -91 -74 -57 143 220 -9 -108 35 70 -1 -123 109 20 -104 35 29 -55 102 140 -4
5447 -4 -147 108 101 -109 -179 1 -13 -123 302 109 -172 51 -35 -75 14 133 150 -117 127 62 -148 115 19 -36
5471 -36 -60 -27 45 36 -78 57 21 135 41 -104 -55 79 -4 -232 26 -41 -107 46 259 50 -74 81 -47 -204
5495 -204 -25 183 -167 9 220 40 131 -97 -25 18 -117 183 -152 -31 92 35 -100 29 165 -171 -130 255
5517 255 -86 88 25 18 -14 -4 74 -149 9 115 82 -46 -165 -64 130 -27 282 118 -109 -170 288 86 -147
5540 -147 103 -124 36 -113 74 -37 58 120 -111 -119 -8 -204 -112 -73 -10 -228 -110 130 -19 -59 102 -99 -98
5563 -98 -180 170 -155 -35 220 53 3 -20 138 -205 68 41 -2 -189 56 -215 124 155 -73 123 -61 169
$$ packed form
5400A3m9J92m21J72L18m40J76K09j12j0k99L03n6p0J34j67K02j41K02k89J3M10
5422B90k74J05kj27O6j49J7J7K00P7k29r9J43L5p1j22K32q9j24J39oq4J57L8j44
5447dj43K55pk10p0J80j4j10M25j93k81K23q6m0Q9J19J7k67K44o5k10K63r6n5
5471c6k4L3P2rj14J35l6J14r4j45M9J34q3k28K58o7o6J53K13k09j24J55j28j57
5495b04J79K08l50J76K11j80R1k28P2M3j35L00l35J21J23n7j35J29J36l36M1L85
5517B55l41J74o3pl2J0P8k23J58J06l3j28j19J01J94j57L09j64k27o1M58k02k33
5540a47K50k27J60j49J87j11R5O2k31qJ11j96R2L9O3k18J18K40j49m0J61k01J
5563i8q2L50l25J20K55j67n0k3J58l43K73k7m3j87K45k71L39L1k28J96j84K30
$$ plain form
5585 169 -133 -80 80 93 -27 24 65 35 -162 100 -17 -91 3 83 -56 -66 183 27 20 107 -90 -26 21 -69 -52
5610 -52 109 112 -46 20 -15 245 -12 -156 157 -10 -97 -49 -147 88 128 -108 -25 102 66 124 -54 160 -10 -47
5634 -47 83 49 -111 -41 104 -124 -52 -123 -25 -15 -34 107 230 -146 70 147 48 89 -127 -162 209 68 68 -48 -94
5659 -94 -20 -69 -157 -89 -171 -110 169 -34 136 171 44 -126 -75 312 141 -8 46 66 -76 -36 62 136 -237 118 80
5684 80 -26 -42 143 21 25 92 -166 -293 105 55 16 108 -56 -187 -102 30 166 -44 -29 16 -139 -225 238 0
5708 0 -152 -89 188 -251 -1 200 28 -35 13 133 147 196 9 -126 -41 -147 -99 -145 189 -37 -44 -152 102 71
5732 71 -271 54 -16 -45 210 38 141 -18 -4 -42 -163 -153 164 -115 122 -35 49 -205 5 73 -122 -11 -59
5755 -59 -89 70 91 -2 33 -39 -18 -260 8 -32 20 -49 -13 -62 -66 224 -89 17 181 113 280 -152 117 32 -54 154
$$ packed form
5585A69l02N3J60J3j20N1M1l0j97K62j17p4R4Q0j39j0K49j56pQ7j97O4M7r0J7
5610e2J61Lj58O6l5K60k57j44L13j67q7M8r8K35M0k36Q3J27l6N8j78K14j70l7
5634d7J30l4j60P0J45k28P2p1R8J0j9J41J23l76K16P7r9M1k16l5L71j41%j16m6
5659i4P4m9q8O8q2O1K79k03J70L5j27j70N1L87j71j49N4K0j42M0R8P4l73L55l8
5684H0j06j6J85j22MO7k58j27L98n0l9R2j64j31Q5J32J36k10J5M5j55q6M63k38
5708@j52O3K77m39K50K01j72o3M8J20J4M9j87j35Q5j06M8m6L34k26pj08K54l1
5732G1l42L25p0k9K55j72J03j59J4l8j21J0L17k79K37j57Q4k54K10O8j95J11m8
5755e9l0J59K1r3L5p2K1k42K68m0N2o9L6m9mK90l13J06J64o8J67m32K69q5q6K08
$$ plain form
5781 154 40 -49 -13 248 41 -31 -10 266 7 141 -17 13 -76 36 161 -123 216 42 -43 119 143 -39 98
5804 98 -90 -37 -19 -48 46 -164 -20 -84 -63 -90 91 126 -130 -1 3 90 -77 150 62 85 -104 46 13 -76 51
5829 51 113 162 84 15 92 42 92 12 -72 76 19 -92 -32 -94 121 26 -149 128 -39 -22 68 125 28 -256 -125 -50
5855 -50 21 -103 -64 -2 72 -122 152 148 96 35 77 131 -101 -267 105 -247 100 -160 132 -156 -163 189 9 -33 102
5880 102 109 -201 134 -1 -45 -16 207 91 53 58 -232 74 33 71 -230 103 55 -218 -178 146 -46 -122 50 128
5904 128 41 -210 -65 -55 -22 55 31 78 -224 214 -59 -27 80 -66 99 -119 176 -10 -36 -40 66 -102 71
5927 71 35 -152 -8 47 -55 22 -52 23 -175 74 16 -67 22 -32 122 -87 207 76 -14 -122 221 34 -223 225
5951 225 -51 -93 -111 118 22 -10 204 101 66 -27 -115 62 81 68 70 43 -53 44 -121 200 -31 -44 92 71 180
$$ packed form
5781A54j14q9L6K61k07p2K1K76k59J34j58L0q9J12J25k84L39j74q5J62K4j82J37
5804I8j88N3J8k9R4k10J44o4K1k7J81L5k56J29MQ7j67K27q8K3j89J50l3q9J27
5829E1O2M9p8o9P7n0N0q0q4J48n7j11O0o2K15r5j75K77j67J7R0N7r7k84J31P5
5855e0P1j24L9O2P4j94K74mn2o1M2N4k32j66L72l52L47k60K92k88pL52j80m2J35
5880A02Pl10L35j35m4K9K23j16l8Nk90L06m1L8l01L33m8k73M0L24j92p6J72P8
5904A28q7k51J45J0L3P7k4M7l02M38k73L2J07j46J65k18K95j86k6mJ06j68J73
5927G1l6j87J44N5j02P7p4P5j98K49n8q3Q9n4J54k09K94j31r0j08L43j87k57M48
5951B25k76m2j8K29r6l2K14j03l5r3q8J77J9j3Kk7r6R7j65L21k31j3J36k1J09
$$ [...]
8191a45
##END NTUPLES=NMR FID
##END=
