##TITLE=1H ikalashn
T-6
16.12.2024
##JCAMPDX= 6.0         $$ Bruker NMR JCAMP-DX V2.0
##DATA TYPE= NMR FID
##DATA CLASS= NTUPLES
##ORIGIN= UXNMR, Bruker Analytische Messtechnik GmbH
##OWNER= root
$$ TOPSPIN		Version 1.3
$$ 2024-12-16 11:29:45.046 +0400  Irina@DPX200
$$ Compression mode = diff/dup
##.OBSERVE FREQUENCY= 200.131300845
##.OBSERVE NUCLEUS= ^1H
##.DELAY= (6, 6)
##.ACQUISITION MODE= SIMULTANEOUS
##.ACQUISITION SCHEME= undefined
##.AVERAGES= 16
##.DIGITISER RES= 18
##SPECTROMETER/DATA SYSTEM= spect
##.PULSE SEQUENCE= zg
##.SOLVENT NAME= CDCl3
##.SHIFT REFERENCE= INTERNAL, CDCl3, 1, 17.49637
##AUDIT TRAIL= $$ (NUMBER, WHEN, WHO, WHERE, WHAT)
$$ ##TITLE= Audit trail, TOPSPIN		Version 1.3
$$ ##JCAMPDX= 5.01
$$ ##ORIGIN= Bruker BioSpin GmbH
$$ ##OWNER= Irina
$$ $$ F:/spectra/data/iren/nmr/1H/4/audita.txt
$$ ##AUDIT TRAIL=  $$ (NUMBER, WHEN, WHO, WHERE, VERSION, WHAT)
(   1,<2024-12-16 11:29:29.484 +0400>,<Irina>,<DPX200>,<TOPSPIN 1.3>,
      <created by zg
	started at 2024-12-16 11:28:21.546 +0400,
	POWCHK disabled, PULCHK disabled
       terminated by command 'halt'
       configuration hash MD5:
       BE 6D 3F 07 2A EA 11 49 91 17 2B D3 AF B3 58 0D
       data hash MD5: 16K
       1C D8 C3 F5 B8 84 43 59 FC D1 E4 86 BF 8D 2D 51>)
$$ ##END=
$$ 
$$ $$ hash MD5
$$ $$ 20 80 A8 E0 3C 80 9E BE 55 3B 31 43 BA 00 0C 62
##$RELAX= 
##$RELAX= 
##$RELAX= 
##$RELAX= 
##$RELAX= 
##$RELAX= 
##$RELAX= 
##$RELAX= 
##$RELAX= 
$$ Bruker specific parameters
$$ --------------------------
##$DU= <F:/spectra>
##$EXPNO= 4
##$NAME= <1H>
##$PROCNO= 1
##$TYPE= <nmr>
##$USER= <iren>
##$AMP= (0..31)
100 100 100 100 100 100 100 100 100 100 100 100 100 100 100 100 100 100 
100 100 100 100 100 100 100 100 100 100 100 100 100 100 
##$ANAVPT= -1
##$AQSEQ= 0
##$AQ_mod= 1
##$AUNM= <au_zg>
##$AUTOPOS= <>
##$BF1= 200.13
##$BF2= 200.13
##$BF3= 200.13
##$BF4= 200.13
##$BF5= 200.13
##$BF6= 200.13
##$BF7= 200.13
##$BF8= 200.13
##$BYTORDA= 1
##$CFDGTYP= 0
##$CFRGTYP= 5
##$CHEMSTR= <none>
##$CNST= (0..63)
1 1 145 1 1 1 1 1 1 1 1 1 1 1 1 1 1 1 1 1 1 1 1 1 1 1 1 1 1 1 1 1 1 1 
1 1 1 1 1 1 1 1 1 1 1 1 1 1 1 1 1 1 1 1 1 1 1 1 1 1 1 1 1 1 
##$CPDPRG= <>
##$CPDPRG1= <>
##$CPDPRG2= <>
##$CPDPRG3= <>
##$CPDPRG4= <mlev>
##$CPDPRG5= <mlev>
##$CPDPRG6= <mlev>
##$CPDPRG7= <mlev>
##$CPDPRG8= <mlev>
##$CPDPRGB= <>
##$CPDPRGT= <>
##$D= (0..63)
0 2 0 0 0 0 0 0 0 0.06 0 0.03 0 0 0 0 0.0002 0 0 0 0 0 0 0 0 0 0 0 0 0 
0 0 0 0 0 0 0 0 0 0 0 0 0 0 0 0 0 0 0 0 0 0 0 0 0 0 0 0 0 0 0 0 0 0 
##$DATE= 1734334166
##$DBL= (0..7)
120 120 120 120 120 120 120 120 
##$DBP= (0..7)
150 150 150 150 150 150 150 150 
##$DBP07= 0
##$DBPNAM0= <>
##$DBPNAM1= <>
##$DBPNAM2= <>
##$DBPNAM3= <>
##$DBPNAM4= <>
##$DBPNAM5= <>
##$DBPNAM6= <>
##$DBPNAM7= <>
##$DBPOAL= (0..7)
0.5 0.5 0.5 0.5 0.5 0.5 0.5 0.5 
##$DBPOFFS= (0..7)
0 0 0 0 0 0 0 0 
##$DE= 6
##$DECBNUC= <off>
##$DECIM= 32
##$DECNUC= <off>
##$DECSTAT= 4
##$DIGMOD= 1
##$DIGTYP= 9
##$DL= (0..7)
0 120 120 120 120 120 120 120 
##$DP= (0..7)
150 150 150 150 150 150 150 150 
$$ [...]
##$SW= 21.9926040160658
##$SWIBOX= (0..15)
0 0 2 0 0 0 0 0 0 0 0 0 0 0 0 0 
##$SW_h= 4401.40845070422
##$TD= 16384
##$TD0= 1
##$TE= 300
##$TE2= 300
##$TE3= 300
##$TEG= 300
##$TL= (0..7)
0 120 120 120 120 120 120 120 
##$TP= (0..7)
150 150 150 150 150 150 150 150 
##$TP07= 0
##$TPNAME0= <>
##$TPNAME1= <>
##$TPNAME2= <>
##$TPNAME3= <>
##$TPNAME4= <>
##$TPNAME5= <>
##$TPNAME6= <>
##$TPNAME7= <>
##$TPOAL= (0..7)
0.5 0.5 0.5 0.5 0.5 0.5 0.5 0.5 
##$TPOFFS= (0..7)
0 0 0 0 0 0 0 0 
##$TUNHIN= 0
##$TUNHOUT= 0
##$TUNXOUT= 0
##$USERA1= <user>
##$USERA2= <user>
##$USERA3= <user>
##$USERA4= <user>
##$USERA5= <user>
##$V9= 5
##$VALIST= <valist>
##$VCLIST= <CCCCCCCCCCCCCCC>
##$VD= 0
##$VDLIST= <DDDDDDDDDDDDDDD>
##$VPLIST= <PPPPPPPPPPPPPPP>
##$VTLIST= <TTTTTTTTTTTTTTT>
##$WBST= 1024
##$WBSW= 25
##$XGAIN= (0..3)
0 0 0 0 
##$XL= 0
##$YL= 0
##$YMAX_a= 1408684
##$YMIN_a= -929387
##$ZGOPTNS= <>
##$ZL1= 120
##$ZL2= 120
##$ZL3= 120
##$ZL4= 120
##$ABSF1= 10
##$ABSF2= 0
##$ABSG= 5
##$ABSL= 3
##$ALPHA= 0
##$AQORDER= 0
##$ASSFAC= 0
##$ASSFACI= 0
##$ASSFACX= 0
##$ASSWID= 0
##$AUNMP= <proc_1d>
##$AXLEFT= 0
##$AXRIGHT= 0
##$AXTYPE= 0
##$AXUNIT= <>
##$AZFE= 0.1
##$AZFW= 0.1
##$BCFW= 1
##$BC_mod= 2
##$BYTORDP= 1
##$COROFFS= 0
##$CY= 7568.61572265625
##$DATMOD= 1
##$DC= 2
##$DFILT= <>
##$DTYPP= 0
##$F1P= 17.9538593292236
##$F2P= -4.03888763876832
##$FCOR= 0.5
##$FTSIZE= 32768
##$FT_mod= 4
##$GAMMA= 1
##$GB= 1
##$INTBC= 1
##$INTSCL= 1
##$ISEN= 128
##$LB= 0.02
##$LEV0= 0
##$LPBIN= 0
##$MAXI= 945.577
##$MC2= 0
##$MEAN= 0
##$ME_mod= 0
##$MI= -402.1523
##$NCOEF= 0
##$NC_proc= 0
##$NLEV= 6
##$NOISF1= 8.587773
##$NOISF2= 6.764455
##$NSP= 1
##$NTH_PI= 0
##$NZP= 0
##$OFFSET= 17.49637
##$PC= 1
##$PHC0= 123.5548
##$PHC1= 8.464067
##$PH_mod= 0
##$PKNL= yes
##$PPARMOD= 0
##$PPDIAG= 0
##$PPIPTYP= 0
##$PPMPNUM= 100
##$PPRESOL= 1
##$PSCAL= 0
##$PSIGN= 0
##$REVERSE= no
##$SF= 200.13
##$SI= 32768
##$SIGF1= 18.5376
##$SIGF2= -6.396296
##$SINO= 400
##$SIOLD= 32768
##$SREGLST= <1H.CDCl3>
##$SSB= 3
##$STSI= 0
##$STSR= 0
##$SW_p= 4401.40845070422
##$SYMM= 0
##$S_DEV= 0
##$TDeff= 0
##$TDoff= 0
##$TI= <>
##$TILT= no
##$TM1= 0
##$TM2= 0
##$TOPLEV= 0
##$USERP1= <user>
##$USERP2= <user>
##$USERP3= <user>
##$USERP4= <user>
##$USERP5= <user>
##$WDW= 1
##$XDIM= 8192
##$YMAX_p= 0
##$YMIN_p= 0
$$ End of Bruker specific parameters
$$ ---------------------------------
##NTUPLES= NMR FID
##VAR_NAME=  TIME,          FID/REAL,        FID/IMAG
##SYMBOL=    X,             R,               I
##VAR_TYPE=  INDEPENDENT,   DEPENDENT,       DEPENDENT
##VAR_FORM=  AFFN,          ASDF,            ASDF
##VAR_DIM=   8192,          8192,            8192
##UNITS=     SECONDS,       ARBITRARY UNITS, ARBITRARY UNITS
##FACTOR=    0.0002272,     1,               1
##FIRST=     0,             0,               0
##LAST=      1.8609952,     -125,            -152
##MIN=       0,             -929387,         -929387
##MAX=       1.8609952,     1408684,         1408684
$$ Real data points
##PAGE= N=1
##DATA TABLE= (X++(R..R)), XYDATA
$$ [...]
$$ plain form
1984 1375 842 -1841 -1001 1460 -394 -2135 -674 -577 -1495 -251 -65 -2513 -1374 1976 446 -2040
2000 -2040 256 1876 336 399 1853 307 -333 2231 1715 -1428 -100 2039 -129 -1289 323 -672
2016 -672 -2155 -139 704 -2472 -2290 753 -268 -2096 -120 825 -758 349 1756 -218 -607 2345
2032 2345 1736 -1064 757 2611 -114 -908 1723 555 -1808 -173 748 -1895 -1190 737 -1262 -2484
2048 -2484 128 551 -2244 -998 1345 -426 -885 1718 1122 -1049 1345 2549 -347 -358 2338 1201
2064 1201 -1220 735 1048 -1405 -351 1517 -1488 -2576 543 600 -2514 -1076 612 -1296 -1046 839
2080 839 -171 -1552 1257 2308 -705 -253 2456 1011 -428 1480 1545 -733 550 1831 -892 -1609
2096 -1609 965 348 -2317 -563 639 -1475 -1394 602 -796 -1802 796 846 -1573 -446 1990 547
$$ packed form
1984A375n33k683Q40K461j854j741J461R7r18J244J86k448J139L350j530k486
2000b040K296J620j540O3J454j546o40K564n16l143J328K139k168j160J612r95
2016f72j483K016Q43l176J82L043j021j828J976R45j583J107J407j974l89K952
2032B345o09k800J821J854k725p94K631j168k363J635R21k643P05J927j999j222
2048b484K612M23k795J246K343j771m59K603n96k171K394J204k896j1K696j137
2064A201k421J955L13k453J054J868l005j088L119N7l114J438J688j908K50J885
2080H39j010j381K809J051l013M52K709j445j439J908O5k278J283J281k723p17
2096a609K574o17k665J754J202k114Q1J996j398j006K598N0k419J127K436j443
$$ plain form
2112 547 -839 1460 1508 -133 948 1893 -588 -484 1792 590 -1817 -247 757 -1226 -1332 213
2128 213 -1190 -2029 421 19 -2049 -789 1446 -59 -902 956 737 -231 996 1880 -115 233 2209
2145 2209 831 -815 601 1223 -601 -416 374 -678 -1338 -59 -237 -1934 -891 521 -905 -1377
2161 -1377 302 457 -621 260 941 -77 188 1654 597 -273 1186 1571 31 -98 856 149 -618
2178 -618 -33 -478 -1377 -522 417 -1107 -1686 -268 -188 -1053 -539 236 -341 46 914 322 -383 1238 1783
2197 1783 264 -83 968 1005 128 263 318 -517 -184 425 -459 -1637 -478 -177 -1089 -896 -366 -586 -673
2216 -673 170 -63 -621 692 1213 347 -166 807 1360 238 574 741 153 -36 472 224 -728 -148 129
2235 129 -1089 -1185 -202 -251 -1108 -432 -188 -1015 -402 472 -24 -617 739 1169 -274 171 1560 788 45
$$ packed form
2112E47j386K299M8j641J081R45k481J04K276j202k407J570J004j983j06J545
2128B13j403q39K450m02k068J260K235j505q43J858k19r68J227Q84j995L48J976
2145B209j378j646J416O22j824J85P90j052o60J279j78j697J043J412j426m72
2161a377J679J55j078Q81O81j018K65J466j057q70J459L85j540j29R54p07p67
2178f18N85m45q99Q55R39j524n79J418Q0q65N14P75n77L87Q68n92p05J621N45
2197A783j519l47J051L7q77J35N5q35L33O09q84j178J159L01r12J93N30k20q7
2216f73Q43k33n58J313N21q66n13R73N53j122L36J67n88j89N08k48r52N80K77
2235A29j218r6R83m9q57O76K44q27O13Q74m96n93J356M30j443M45J389p72p43
$$ plain form
2254 45 1089 640 -405 522 713 -734 -1006 432 -337 -1403 -639 57 -1152 -995 136 -542 -1060 311
2272 311 815 -791 -191 1561 424 -167 1026 981 -110 1038 1446 -484 -460 1298 428 -1447 -231
2289 -231 414 -1209 -1116 229 -976 -1515 404 183 -1536 -538 1065 -13 -709 947 682 -489 898
2306 898 1667 -31 -192 1877 555 -683 676 811 -1321 -459 672 -698 -1626 220 -8 -1848 -683
2323 -683 643 -959 -1044 1075 388 -1082 439 1353 -150 276 1831 280 -863 1272 1300 -619 -260
2340 -260 1130 -382 -1146 312 -183 -1575 -285 809 -1494 -1573 858 -149 -1214 130 758 -860
2356 -860 205 1801 120 -792 1472 1440 -586 343 1239 -280 -148 1248 201 -1335 2 893 -1179
2373 -1179 -1283 415 -907 -1314 333 177 -1671 -412 1259 -179 -588 828 523 -533 954 1581
$$ packed form
2254D5J044m49j045R27J91j447k72J438p69j066P64O96j209J57J131o78n18J371
2272C11N04j606O00J752j137n91J193m5j091J148M08j930K4J758q70j875J216
2289b31O45j623R3J345j205n39J919k21j719R98J603j078o96J656k65j171J387
2306H98P69j698j61K069j322j238J359J35k132Q62J131j370r28J846k28j840J165
2323f83J326j602q5K119o87j470J521R14j503M26J555j551j143K135K8j919L59
2340b60J390j512p64J458m95j392J290J094k303p9K431j007j065J344O28j618
2356h60J065J596j681r12K264l2k026R29Q96j519J32J396j047j536J337Q91k072
2373a179j04J698j322m07J647j56j848J259J671j438m09J416l05j056J487O27
$$ plain form
2389 1581 -389 -356 1509 874 -811 203 546 -759 -229 521 -1022 -1379 323 123 -1691 -1023 493
2406 493 -816 -431 699 179 -1094 693 1330 26 -123 1192 566 -12 1146 733 -671 250 1163
2423 1163 -188 -1310 280 234 -914 -357 94 -1154 -838 402 -135 -1486 -135 450 -451 233 1021
2440 1021 -12 -200 1160 1163 -72 -46 1093 365 -115 373 -50 -679 96 494 -1190 -952 124 -26 -696
2459 -696 -487 -377 -630 -218 636 -240 -564 658 894 206 -106 776 478 319 1069 280 -522 487 656
2478 656 -161 -862 -381 -414 -612 -270 -362 -856 -318 246 -248 -762 -346 257 160 40 471 360 327 857 774 134
2500 134 207 736 490 82 264 222 -620 -76 224 -396 -941 -463 44 -620 -204 -106 -620 -531 302 286 -375 289
2522 289 917 533 259 548 411 102 749 591 -385 -189 749 135 -724 -35 -34 -532 -319 -61 -913 -940 74
$$ packed form
2389A581j970L3J865o35j685J014L43j305N30P50j543l57J702k00j814O68J516
2406D93j309L85J130n20j273J787O37j304j49J315o26n78J158m13j404R21R13
2423A163j351j122J590m6j148N57M51j248L16J240n37j351J351N85r01O84P88
2440A021j033j88J360Lj235K6J139p28m80M88m23o29P75L98j684K38J076j50o70
2459f96K09J10k53M12Q54q76l24J222K36o88l12Q82k98j59P50p89q02J009J69
2478F56q17p01M81l3j98L42r2m94N38N64m94n14M16O03r7j20M31j11l3N30q3o40
2500A34P3N29k46m08J82m2q42N44L00o20n45M78N07o64M16R8n14Q9Q33j6o61O64
2522B89O28l84k74K89j37l09O47j58r76J96R38o14q59O89Jm98K13K58q52k7J014
$$ plain form
2543 74 74 -926 -484 409 -11 -102 695 350 -79 740 968 -253 -86 829 442 -505 281 285 -577 -175 195
2564 195 -555 -1038 60 71 -1046 -308 389 -502 -739 447 381 -438 339 871 -103 53 1218 471 -250
2583 -250 742 829 -378 35 715 -389 -616 339 36 -1299 -7 483 -770 -849 119 -176 -582 358 437
2602 437 -613 207 1037 22 -600 902 842 -88 378 897 -403 -192 812 151 -888 -6 493 -846
2620 -846 -670 347 -180 -725 78 192 -536 -252 681 -202 -405 662 405 -392 346 983 -204 -33 971
2639 971 276 -233 566 558 -637 -278 347 -441 -1166 115 34 -829 -133 394 -734 -747 774 196 -771 314
2659 314 991 19 123 886 -37 -44 910 561 -593 -112 812 -129 -591 102 229 -784 -115 201 -1043 -466
2679 -466 394 -10 -665 412 395 -213 -27 798 -57 -200 579 691 -380 166 711 -34 -290 490 -45 -621
$$ packed form
2543G4%j000M42Q93m20r1P97l45m29Q19K28j221J67R15l87r47P86Mq62M02L70
2564A95p50m83J098J1j117P38O97q91k37J186o6q19P77N32r74J56J165p47p21
2583b50R92Q7j207M13O80j104k27R55l03j335J292M90j253p9R68k95m06R40P9
2602D37j050Q20Q30j015o22J502o0r30M66N19j300K11J004o61j039Q82M99j339
2620h46J76J017n27n45Q03J14p28K84R33q83k03J067k57p97P38O37j187J71J004
2639I71o95n09P99qj195L59O25p88p25J281q1q63O96N27j128j3J521n78r67J085
2659C14O77r72J04P63r23pR54l49j154M81R24r41m62O93J27j013O69L16j244N77
2679d66Q60m04o55J077j7o08J86Q25q55j43P79J12j071N46N45p45k56P80n35n76
$$ plain form
2699 -621 -217 176 -437 -524 278 -487 -713 103 73 -735 -431 345 -178 -211 276 46 6 384 697 -105 106
2720 106 781 363 -187 12 163 -489 -217 280 -327 -629 -32 -139 -602 -426 192 -350 -196 236 28 -268
2740 -268 145 457 14 44 462 596 102 305 564 -82 185 306 -223 -232 32 -112 -527 -498 -18 -478 -513 -372
2762 -372 -90 -104 -197 32 -136 -194 409 296 142 335 516 306 78 390 131 54 -12 407 -275 -309 99 -181
2784 -181 -638 -40 -81 -288 -241 -31 -253 -288 33 145 -372 -2 493 226 -122 407 499 98 107 258 35 -88
2806 -88 81 -43 -565 -147 -416 -300 -426 -44 -84 -440 -308 -108 -353 -272 247 78 -15 289 530 -50 7 483
2828 483 526 38 439 304 -70 58 322 -214 -428 110 48 -450 -71 173 -545 -176 96 -33 -671 88 269
2849 269 -91 -199 383 128 -20 508 368 -316 81 409 69 -333 433 122 -701 83 53 -758 -479 66
$$ packed form
2699f21M04L93o13q7Q02p65k26Q16l0q08L04P76n23l3M87k30m0L78L13q02K11
2720A06O75m18n50J99J51o52K72M97o07l02N97j07m63J76O18n42J54M32k08k96
2740b68M13L12m43L0M18J34m94K03K59o46K67J21n29rK64j44m15K9M80m60l5J41
2762c72K82j4r3K29j68n8O03j13j54J93J81k10k28L12k59p7o6M19o82l4M08k80
2784a81m57N98m1k07M7K10k22l5L21J12n17L70M95k67l48N29R2m01RJ51k23j23
2806h8J69j24n22M18k69J16j26L82m0l56J32K00k45Q1N19j69r3L04K41n80N7M76
2828D83M3m88M01j35l74J28K64n36k14N38o2m98L79K44p18L69K72j29o38P59J81
2849B69l60j08N82k55j48N28j40o84L97L28l40m02P66l11q23P84l0q11K79N45
$$ plain form
2869 66 -131 -580 245 93 -363 -335 319 6 -327 398 475 -104 93 697 -88 81 439 283 -660 -20 332
2890 332 -324 -120 245 -205 -565 70 -34 -549 -170 215 -274 -381 248 195 -247 381 544 -65 -148 499 301
2911 301 -379 233 321 -144 -311 275 -146 -538 1 -200 -479 -401 14 -399 -445 87 -49 -305 -73 322 -168
2932 -168 -248 521 234 -120 334 197 -99 196 469 -278 42 249 -134 -477 -144 161 -431 -465 131 -103 -544
2953 -544 129 78 -214 -117 290 111 -61 331 372 -124 171 589 51 73 508 121 -207 65 78 -275 -62 40
2975 40 -345 -546 -12 160 -367 -140 138 -200 -6 44 246 -124 443 156 -212 179 618 107 54 189 393
2996 393 -123 -23 219 -161 -459 -17 -65 -418 -233 -147 -493 -196 223 -184 -461 92 218 -65 146 332 185
3017 185 57 371 206 130 54 213 136 -42 219 -114 -224 125 -72 -234 -218 110 -149 -330 -109 -55 26 -16
$$ packed form
2869F6j97m49Q25j52m56K8O54l13l33P25P7n79J97O04p85J69L58j56r43O40L52
2890C32o56K04L65m50l60O35j04n15L79L85m89j07O29n3m42O28J63o09q3O47j98
2911C01o80O12Q8m65j67N86m21l92N39k01k79P8M15m13m6N32j36k56K32L95m90
2932a68q0P69k87l54M54j37k96K95K73p47L20K07l83l43L33L05n92l4N96k34m41
2953e44O73n1k92R7M07j79j72L92M1m96K95M18n38K2M35l87l28K72J3l53K13J02
2975D0l85k01N34J72n27K27K78l38J94N0K02l70N67k87l68L91M39n11n3J35K04
2996C93n16J00K42l80k98M42m8l53J85Q6l46K97M19m07k77N53J26k83K11J86j47
3017A85j28L14j65p6p6J59p7j78K61l33j10L49j97j62J6L28k59j81K21N4Q1m2
$$ plain form
3039 -16 -4 -43 49 163 231 77 39 85 62 -63 180 58 59 -65 11 -85 -44 70 -195 -163 -110 -24 -358 -165 189
3064 189 -60 -83 -29 30 127 40 244 284 217 195 210 36 -180 189 -29 275 -240 -42 -165 -27 -18 -123 -119 -38 -202
3089 -202 -155 -148 -46 -190 -122 80 88 -130 -47 101 58 27 243 273 56 327 286 -54 -230 -47 -187 -384 -61 -173
3113 -173 -412 -249 -207 -352 -73 159 23 -101 77 220 117 -49 16 240 166 112 256 38 83 -48 -89 -209
3135 -209 -111 55 1 -96 105 44 -210 -155 -145 -202 -109 175 44 -197 223 53 110 162 282 -117 -30 32 90 -171
3159 -171 144 -1 -241 -277 113 -196 -18 -58 -136 -164 -267 42 -219 -199 147 168 -200 -26 138 9 -15 265
3181 265 106 82 11 252 -165 4 284 -10 -138 -103 74 -140 32 262 -231 18 62 -121 -344 -79 -25 -118
3203 -118 -22 5 -62 -112 84 115 71 197 210 102 -251 203 137 -150 -2 59 -233 -249 -115 44 -398 -210 142
$$ packed form
3039a6J2l9R2J14O8j54l8M6k3j25K43j22Jj24P6r6M1J14k65L2N3Q6l34J93L54
3064A89k49k3N4N9R7q7K04M0o7k2J5j74k16L69k18L04n15J98j23J38Rj05MQ1j64
3089b02M7PJ02j44O8K02Qk18Q3J48m3l1K16L0k17K71m1l40j76J83j40j97L23j12
3113a73k39J63M2j45K79K32j36j24J78J43j03j66O5K24p4n4J44k18M5j31m1j20
3135b09R8J66n4r7K01o1k54N5J0n7R3K84j31k41M20j70N7N2J20l99Q7O2N8k61
3159a71L15j45k40l6L90l09J78m0p8k8j03L09k61K0L46K1l68J74J64j29k4K80
3181B65j59k4p1K41m17J69K80k94j28L5J77k14J72K30m93K49M4j83k23K65N4r3
3203a18R6K7o7n0J96L1m4J26J3j08l53M54o6k87J48O1k92j6J34J59m42J88L52
$$ plain form
3226 142 -59 -155 67 -35 -17 212 151 16 350 272 113 -110 34 155 -136 111 -94 -43 -267 97 -144 -266
3248 -266 -184 0 -105 -85 65 -66 -39 -104 152 -22 -30 214 -47 -33 202 230 -4 8 60 81 208 169 317 -100
3272 -100 20 -60 -15 22 -36 -317 -197 21 -40 -158 -88 209 10 -1 100 89 -96 130 25 85 99 -40 -32 78
3296 78 -203 -43 60 11 -79 -183 -293 -55 -114 -1 50 116 -75 -91 -7 -9 178 184 -43 -14 29 44 66 11 69 22
3322 22 76 69 -4 -5 -127 65 -31 148 -214 -123 69 -187 -84 -336 -22 141 82 -64 183 -52 -123 -105 168 74
3346 74 19 -76 139 97 -91 29 -141 139 -261 86 -33 -51 -95 -44 -287 -124 159 0 128 96 -110 -79 50
3369 50 157 199 63 -73 25 -15 -138 9 -63 61 -2 -19 -80 110 -182 73 -161 18 -160 -63 -8 78 37 -148
3393 -148 223 -11 97 81 187 -14 12 187 -8 -316 272 58 53 -26 129 75 -86 -185 -190 -121 -291 -79 109
$$ packed form
3226A42k01r6K22j02J8K29o1j35L34p8j59k23J44J21k91K47k05N1k24L64k41j22
3248b66Q2J84j05K0J50j31K7o5K56j74qK44k61J4K35K8k34J2N2K1J27l9J48m17
3272a00J20q0M5L7n8k81J20K18o1j18P0K97j99j1J01j1j85K26j05O0J4j39QJ10
3296G8k81J60J03m9r0j04j10K38n9J13N1O6j91j6Q4kJ87Ok27K9M3J5K2n5N8m7
3322B2N4pp3jj22J92r6J79l62R1J92k56J03k52L14J63n9j46K47k35p1J8K73r4
3346G4n5r5K15m2j88J20j70K80m00L47j19j8m4N1k43J63K83j59J28l2k06L1J29
3369E0J07M2j36j36R8m0j23J47p2J24o3j7o1J90k92K55k34J79j78R7N5Q6m1j85
3393a48L71k34J08j6J06k01K6J75j95l08N88k14np9J55n4j61r9nO9j70K12J88
$$ plain form
3416 109 -104 -220 -25 -114 79 -2 -156 68 218 -120 -7 -112 117 -151 -76 137 -52 -103 -219 96 94 -13
3438 -13 157 -75 89 -44 293 150 -258 50 -10 3 61 23 -86 326 22 -23 30 -12 173 169 67 -101 74
3461 74 35 -4 10 103 77 417 -66 -26 183 -21 45 -88 121 -2 -33 29 172 -31 97 103 -178 -31 87 38
3485 38 57 -66 -6 -85 48 189 -79 9 166 -79 -27 125 -158 -228 27 -61 -43 249 139 119 216 -16 86 25
3509 25 -7 -22 -90 -126 -94 -24 -16 -21 -23 5 -179 -160 5 -41 -32 90 16 44 -150 95 -124 53 55 -15 96 107 161 40
3537 40 11 80 -35 -145 129 -192 63 48 -58 -160 -62 26 39 -218 -99 -221 21 -39 -49 89 -28 126 -87
3560 -87 19 213 155 88 -48 4 -48 -73 -125 117 5 -139 60 -147 19 -203 -52 -369 40 69 -69 54 -22
3583 -22 -66 -44 -120 154 -29 2 -61 -48 -82 -23 -45 -214 36 83 52 -118 10 101 -101 36 71 -78 -92 -47 39 -21
$$ packed form
3416A09k13j16J95q9J93q1j54K24J50l38J13j05K29k68P5K13j89n1j16L15kj07
3438a3J70k32J64j33L37j43m08L08o0J3N8l8j09M12l04m5N3m2J85mj02j68J75
3461G4l9l9J4R3k6L40m83M0K09k04O6j33K09j23l1O2J43k03J28Ok81J47J18m9
3485C8J9j23O0p9J33J41k68Q8J57k45N2J52k83p0K55q8J8K92j10k0R7k32J02o1
3509B5l2j5o8l6L2P0QnkK8j84J9J65m6RJ22p4K8j94K45k19J77Kp0J11J1N4j21
3537D0k9O9j15j10K74l21K55j5j06j02R8Q8J3k57J19j22K42o0j0J38j17J54k13
3560h7J06J94n8o7j36N2n2k5n2K42j12j44J99k07J66k22J51l17M09K9j38J23p6
3583b2m4K2p6K74j83L1o3J3l4N9k2j69K50M7l1j70J28R1k02J37L5j49j4M5Q6o0
$$ plain form
3609 -21 -52 24 36 62 -42 -51 -46 76 47 -95 161 -71 6 -81 59 22 -177 76 -111 39 -33 -33 -24 -33 -157 205 98
3636 98 -265 265 -68 84 204 338 124 125 115 90 83 -235 9 -167 51 -131 -118 -234 -237 204 -121 -139 138 -66
3660 -66 135 83 -59 -96 -31 127 -46 -308 186 84 -52 4 117 -19 -121 -173 -94 -130 -109 133 -211 42 53
3683 53 -205 16 -97 123 -4 -2 364 -138 89 -1 114 2 239 163 -62 -84 -100 28 -60 -104 -48 -97 -148 -32
3707 -32 54 -92 7 -11 15 -172 157 30 -71 -43 -51 -128 -110 -15 38 -158 232 97 -92 108 100 -124 -198 166 5
3732 5 -170 -149 24 -291 -200 -10 -52 -105 255 -100 -298 202 267 -103 -132 417 152 -37 97 212 -59 14 193
3755 193 -59 1 -92 11 -208 -133 149 -128 -83 127 -60 -156 -3 424 -202 -164 222 63 -26 86 23 -128 28
3778 28 200 -19 -70 112 82 -194 183 96 -167 -21 119 -188 -163 -2 87 -40 2 69 -7 112 265 170 -155
$$ packed form
3609b1l1P6J2K6j04rNJ22k9j42K56k32P7q7J40l7j99K53j87J50p2%Rrj24L62j07
3636I8l63N30l33J52J20J34k14Jj0k5pl18K44j76K18j82J3j16lM41l25j8K77k04
3660f6K01n2j42l7O5J58j73k62M94j02j36N6J13j36j02n2P9l6K1K42l44K53J1
3683E3k58K21j13K20j27KL66n02K27r0J15j12K37p6k25k2j6J28q8m4N6m9n1J16
3707c2Q6j46R9j8K6j87L29j27j01K8qp7J8R5N3j96L90j35j89K00qk24p4L64j61
3732Ej75K1J73l15R1J90m2n3L60l55j98N00O5l70k9N49k65j89J34J15k71P3J79
3755A93k52O0r3J03k19P5K82k77M5K10j87r6J53M27o26L8L86j59q9J12o3j51J56
3778B8J72k19n1J82l0k76L77q7k63J46J40l07K5J61Q9j27M2O7p6J19J53r5l25
$$ plain form
3801 -155 82 436 136 23 225 96 -163 165 87 -144 124 172 -180 -101 0 81 -274 -274 -44 -168 -97 149
3823 149 155 75 -4 201 102 71 323 85 -28 203 -6 -17 97 80 47 -273 156 -6 -236 -80 -109 6 -112
3846 -112 69 -109 -107 -119 -70 -213 62 229 23 -172 198 143 53 37 266 186 150 -17 176 -285 -83 165 -268
3869 -268 -188 -2 -74 -202 121 21 8 22 48 122 81 -3 326 80 56 147 203 -119 105 252 159 -61 -81 -115 -56
3894 -56 -160 -157 -189 -80 -60 -77 -18 -100 77 -42 76 40 16 170 68 81 226 90 148 63 180 81 -135 -44 208
3919 208 36 -120 -80 -119 -54 -108 -105 -56 30 -190 -132 47 65 13 -105 -10 74 39 77 -55 198 -77 -77 237 253 -6
3945 -6 -129 8 -62 -248 -74 -166 -202 -121 -27 -195 6 207 -125 21 -20 151 -180 -269 215 120 -33 108 362
3968 362 305 -193 -117 9 141 -227 122 -268 -220 -29 13 -213 -250 62 -239 -110 299 -299 -139 88 -82 -50
$$ packed form
3801a55K37L54l00j13K02j29k59L28p8k31K68M8l52P9J01Q1l55%K30j24P1K46
3823A49Oq0p9K05r9l1K52k38j13K31k09j1J14j7l3l20M29j62k30J56k9J15j18
3846a12J81j78Kj2M9j43K75J67k06j95L70n5r0j6K29q0l6j67J93m61K02K48m33
3869b68Q0J86p2j28L23j00j3J4K6P4m1q4L29k46k4R1N6l22K24J47r3k20k0l4N9
3894e6j04Ll2J09K0j7N9q2J77j19J18l6k4J54j02J3J45j36N8q5J17r9k16R1K52
3919B08j72j56M0l9O5n4LM9Q6k20N8J79J8n2j18R5Q4l5L8j32K53k75%L14J6k59
3945fj23J37p0j86J74r2l6Q1R4j68K01K01l32J46m1J71l31q9M84r5j53J41K54
3968C62n7m98P6J26J32l68L49l90M8J91M2k26l7L12l01J29M09n98J60K27j70L2
$$ plain form
3990 -50 119 132 100 6 312 344 -52 180 172 -36 213 -123 -160 -185 -57 -117 -264 -202 53 -163 -239 108 -20 -296
4014 -296 88 213 -190 -100 295 174 -107 190 18 -2 225 160 -72 -167 94 19 -201 -160 12 -109 -29 159
4036 159 -143 -360 -143 31 -363 -349 380 85 -142 116 274 -39 105 287 282 -37 226 36 -165 80 -12
4057 -12 -400 195 28 -391 -334 16 138 -411 -130 92 -84 -385 290 86 -114 191 145 103 42 379 4 -150
4079 -150 369 362 -351 -225 306 -117 -291 -31 -41 -394 -129 -28 -487 -182 239 111 -227 -46 305 21 59
4100 59 252 173 -156 400 266 -213 172 39 -87 -256 116 102 -340 -65 86 -199 -311 134 -36 -286 42
4121 42 191 -194 245 146 -18 38 443 227 9 164 294 -90 145 186 165 -45 -22 20 18 32 239 -179 -245 -133
4145 -133 14 -311 -248 79 -16 -41 43 35 -60 111 156 23 -15 188 159 37 400 179 93 4 105 -81 -346 25
$$ packed form
3990e0J69J3l2r4L06L2l96K32qk08K49l36l7k5J28o0j47O2K55k16p6L47j28k76
4014b96L84J25m03R0L95j21k81K97j72k0K27o5k32r5K61p5k20M1J72j21Q0J88
4036A59l02k17K17J74l94J4P29k95k27K58J58l13J44J82nl19K63j90k01K45r2
4057a2l88N95j67m19N7L50J22n49K81K22j76l01O75k04k00L05m6m2o1L37l75j54
4079a50N19pp13J26N31m23j74K60j0l53K65J01m59L05M21j28l38J81L51k84L8
4100E9J93p9l29N56j34m79L85j33j26j69L72j4m42K75J51k85j12M45j70k50L28
4121D2J49l85M39r9j64N6M05k16k18J55J30l84K35M1k1k10K3M2kJ4K07m18o6J12
4145a33J47l25O3L27r5k5Q4qr5J71M5j33l8K03k9j22L63k21q6q9J01j86k65L71
$$ plain form
4169 25 -194 -81 -209 -61 -81 -140 80 -125 -120 59 -34 -32 -5 116 86 93 93 222 135 2 109 -1 -179 -172 130 -200
4195 -200 -43 -63 -232 -219 -51 -87 -117 -211 66 -116 -17 110 39 96 63 186 283 -33 190 208 256 143 -118 122
4219 122 -9 -230 112 -130 91 -102 -359 -74 -201 -71 -141 -328 46 125 -175 165 -33 20 0 69 285 159
4241 159 79 180 90 195 210 -84 -202 12 -64 -172 -77 134 -250 -59 -4 2 -227 146 11 -355 169 4 -63
4264 -63 -219 284 153 -24 195 100 -172 159 60 -29 -181 32 -57 -248 -75 212 -248 -75 -86 -120 -278 14
4286 14 116 -118 60 322 191 -359 102 125 -236 -91 265 19 104 395 140 -59 -149 207 -185 -315 209
4307 209 -220 -392 -178 126 -47 -199 221 -132 -170 31 87 -21 173 392 -122 106 120 17 -299 92 191
4328 191 -239 -68 305 -117 -381 117 -203 -544 -251 30 -44 -138 -35 -32 -199 65 149 -227 -4 540 10 -32
$$ packed form
4169B5k19J13j28J48k0n9K20k05NJ79r3KK7J21l0P%J29q7j33J07j10j78PL02l30
4195b00J57k0j69J3J68l6l0r4K77j82R9J27p1N7l3J23R7l16K23J8M8j13k61K40
4219A22j31k21L42k42K21j93k57K85j27J30p0j87L74P9l00L40j98N3k0O9K16j26
4241A59q0J01r0J05J5k94j18K14p6j08R5K11l84J91N5Ok29L73j35l66N24j65o7
4264f3j56N03j31j77K19r5k72L31r9q9j52K13q9j91J73K87m60J73j1l4j58K92
4286A4J02k34J78K62j31n50M61K3l61J45L56k46Q5K91k55j99r0L56l92j30N24
4307B09m29j72K14L04j73j52M20l53l8K01N6j08J94K19n14K28J4j03l16L91R9
4328A91m30J71L73m22k64M98l20l41K93K81p4r4J03Lj67K64Q4l76K23N44n30m2
$$ plain form
4350 -32 318 424 -226 -147 102 -275 -187 191 197 -341 -24 227 -190 -328 37 -109 -184 50 -59 -11 14 444 -63
4373 -63 -246 402 314 110 19 283 46 -191 330 -236 -119 82 142 -86 39 62 -80 -385 -47 -220 -178 -160
4395 -160 192 96 -328 263 71 -171 244 302 72 -66 62 56 -86 149 142 -296 -107 318 71 -184 218 55
4417 55 -332 -146 -154 -300 -180 66 -51 -231 4 194 -64 -12 307 162 59 210 229 -79 58 314 -167 -243
4439 -243 48 -19 -411 -133 -125 -183 -148 -85 -245 -291 4 40 -295 119 256 209 100 253 149 127 287 168 -15
4462 -15 65 147 16 -95 -73 -76 -116 -63 105 -146 -22 -95 78 -107 -157 64 -42 115 203 -125 -73 201 227 107
4486 107 235 231 170 8 -45 42 11 69 148 -129 26 9 -157 -226 -215 25 -135 -211 -175 -27 -33 -170 -17 73 -69
4511 -69 84 275 213 260 187 250 -36 316 265 -56 -80 63 -83 -209 -3 -263 -271 -111 -93 -316 -291 27 159 -123
$$ packed form
4350c2L50J06o50P9K49l77Q8L78On38L17K51m17j38L65j46p5K34j09M8K5M30n07
4373f3j83O48q8k04r1K64k37k37N21n66J17K01O0k28J25K3j42l05L38j73M2J8
4395a60L52r6m24N91j92k42M15N8k30j38J28oj42K35pm38J89M25k47k55M02j63
4417E5l87J86qj46J20K46j17j80K35J90k58N2L19j45j03J51J9l08J37K56m81p6
4439b43K91o7l92K78Qn8L5O3j60m6K95L6l35M14J37m7j09J53j04k2J60j19j83
4462a5Q0Q2j31j11K2lm0N3J68k51J24p3J73j85n0K21j06J57Q8l28N2K74K6j20
4486A07J28mo1j62n3Q7l1N8P9k77J55j7j66o9J1K40j60p6L6J48oj37J53R0j42
4511f9J53J91o2M7p3O3k86L52n1l21k4J43j46j26K06k60qJ60J8k23K5L18J32k82
$$ plain form
4535 -123 5 264 -73 86 304 149 72 61 317 241 -45 -14 18 -272 -124 104 -168 -209 -97 -195 -285 -232 -272
4558 -272 -304 -211 142 -145 -173 295 258 112 62 403 32 321 447 225 84 237 217 -260 -121 76 -234 -383
4580 -383 86 25 -257 -128 -86 -160 -194 -189 -78 -136 241 282 -164 112 399 119 -198 328 340 -4 277 205 19
4603 19 -311 213 96 -446 -265 17 -285 -153 90 -88 -355 109 268 -202 -86 238 -86 -178 273 83 181
4624 181 279 360 -28 41 245 103 -50 65 21 -182 -256 68 -285 -304 -56 85 -273 -287 156 -121 -384 168
4646 168 5 -98 417 468 -80 -47 393 130 -189 244 39 -232 -95 98 -112 -589 116 -107 -697 -142 187
4667 187 -268 -369 -50 47 -338 280 188 -115 27 456 251 -228 367 180 -258 160 80 176 -357 127 -66
4688 -66 -387 -99 73 -354 -37 -8 -261 -407 171 199 -10 32 132 29 -105 162 360 -161 115 313 -2
$$ packed form
4535a23J28K59l37J59K18j55p7j1K56p6k86L1L2k90J48K28k72m1J12r8r0N3m0
4558b72l2R3L53k87k8M68l7j46n0L41l71K89J26k22j41J53k0m77J39J97l10j49
4580c83M69o1k82J29M2p4l4NJ11n8L77M1m46K76K87k80l17N26J2l44K81p2j86
4603A9l30N24j17n42J81K82l02J32K43j78k67M64J59m70J16L24l24r2M51j90R8
4624A81R8Q1l88O9K04j42j53J15m4k03p4L24l53j9K48J41l58j4M43k77k63N52
4646A68j63j03N15N1n48L3M40k63l19M33k05k71J37J93k10m77P05k23n90N55L29
4667A87m55j01L19R7l85O18r2l03J42M29k05m79N95j87m38M18q0R6n33M84j93
4688f6l21K88J72m27L17K9k53j46N78K8k09M2J00j03j34K67J98n21K76J98l15
$$ plain form
4709 -2 180 286 -26 -33 96 80 -284 -189 16 -278 -190 -320 -129 -226 10 -79 -186 -206 335 130 85 -151 325 150
4733 150 317 281 7 136 93 136 -88 -80 -28 -234 -218 54 -121 -230 -13 -21 -231 -247 189 23 85 -189 32 20
4757 20 49 100 14 85 307 329 159 43 108 200 -168 208 -266 -173 -256 104 -241 -223 -21 -152 -186 -115 -163 44 -10
4782 -10 28 172 -224 204 261 215 432 287 316 97 -21 222 -244 -237 77 47 -134 -135 -416 -316 -306 -200 -253 -155
4806 -155 68 -227 37 -101 32 -113 -57 326 210 137 51 340 197 -189 127 94 -28 -54 -81 -325 -444 -9
4828 -9 11 -370 -181 25 -236 -220 140 14 -159 163 362 109 148 341 217 -101 196 238 -113 74 -143 34
4850 34 -89 186 14 -227 -166 97 -446 -316 24 -69 -465 153 123 -314 -11 55 144 208 12 155 -111 -133 329
4873 329 -51 6 334 99 -242 -159 304 -194 -304 10 -24 -383 -46 5 -184 -196 31 -107 -152 331 201 -344
$$ packed form
4709bJ82J06l12pJ29j6l64R5K05k94Q8j30J91r7K36q9j07k0N41k05m5k36M76j75
4733A50J67l6k74J29m3M3k24QN2k06J6K72j75j09K17qk10j6M36j66O2k74K21j2
4757B0K9N1q6P1K22K2j70j16O5R2l68L76m74R3q3L60l45J8K02j31l4P1m8K07n4
4782a0L8J44l96M28N7m6K17j45K9k19j18K43m66PL14l0j81jk81J00J0J06n3R8
4806a55K23k95K64j38J33j45N6L83j16p3q6K89j43l86L16l3j22k6k7k44j19M35
4828iK0l81J89K06k61J6L60j26j73L22J99k53L9J93j24l18K97M2l51J87k17J77
4850C4j23K75j72k41O1K63n43J30L40r3l96O18l0m37L03O6Q9O4j96J43k66k2M62
4873C29l80N7L28k35l41Q3M63m98j10L14l4l59L37N1j89j2K27j38m5M83j30n45
$$ plain form
4895 -344 36 518 66 114 379 186 -131 406 201 -261 -272 298 67 -492 -267 -267 -582 -142 186 -203 -337
4916 -337 187 34 -203 28 329 85 -96 471 292 -175 295 379 -190 48 311 -83 -166 252 206 -352 30
4937 30 147 -188 -253 -59 -85 -297 18 143 -311 223 421 -99 -165 -12 191 -202 185 471 -18 -123 481
4958 481 118 -356 -86 40 -241 -246 37 -145 -409 171 4 -375 -70 56 -50 61 357 342 40 410 413 38
4980 38 127 354 313 84 517 150 -255 -77 165 -237 -209 83 -116 -271 -410 82 -161 7 87 -59 -220 185
5002 185 40 -22 128 173 173 71 521 82 61 127 343 88 -16 178 3 -258 10 -229 -80 -177 -46 -95 37
5025 37 86 60 59 -137 142 31 273 74 405 263 19 185 207 78 52 -52 -42 -170 146 -175 -407 -138 -189
5048 -189 -101 -44 -25 -242 -109 -4 -173 233 187 110 201 102 217 261 62 197 214 129 69 17 -6 15 -58 24 -329
$$ packed form
4895c44L80M82m52M8K65j93l17N37k05m62j1N70k31n59K25%l15M40L28l89j34
4916c37N24j53k37K31L01k44j81N67j79m67M70Q4n69K38K63l94q3M18m6n58L82
4937C0J17l35o5J94k6k12L15J25m54N34J98n20o6J53K03l93L87K86m89j05O04
4958D81l63m74K70J26k81nK83j82k64N80j67l79L05J26j06J11K96j5l02L70Ll75
4980C8Q9K27m1k29M33l67m05J78K42m02K8K92j99j55j39M92k43J68Q0j46j61M05
5002A85j45o2J50M5%j02M50m39k1O6K16k55j04J94j75k61K68k39J49r7J31m9J32
5025C7M9k6jj96K79j11K42j99L31j42k44J66K2j29k6j04J0j28L16l21k32K69n1
5048a89Q8N7J9k17J33J05j69M06m6p7R1r9J15M4j99J35J7q5o0n2k3K1p3Q2l53
$$ plain form
5073 -329 -108 44 83 -289 -123 23 -270 -82 -234 39 86 234 262 36 135 98 112 202 79 60 127 64 107 -164
5097 -164 -10 29 -98 -309 -37 69 -203 -446 -92 -110 -363 19 -81 179 -154 64 159 44 153 324 -86
5118 -86 -66 358 16 -32 37 216 -228 -158 17 -218 -207 162 -223 -240 -235 121 -195 -189 484 -55 -183 258 194 -91
5142 -91 266 433 8 114 229 52 -56 195 234 -93 -99 130 -79 -298 -135 -26 -287 -350 80 -485 -178 -31
5164 -31 77 -155 43 348 -187 62 437 236 -34 277 466 -44 17 252 -220 -145 201 59 -156 -155 208 -484
5186 -484 -320 56 -4 -358 186 288 -52 9 255 172 -85 229 223 -133 25 172 -166 -173 172 175 -259 -39 237
5209 237 -227 -278 319 -161 -563 -9 118 -218 2 237 -33 -93 186 125 42 1 500 -146 49 318 232 -213
5231 -213 356 196 -259 -80 190 37 -236 -25 -79 -298 -43 131 -116 -153 152 252 -156 201 195 -84 308
$$ packed form
5073c29K21J52L9l72J66J46k93J88j52K73M7J48K8k26R9l7J4R0j23j9O7o3M3k71
5097a64J54L9j27k11K72J06k72k43L54j8k53L82j00K60l33K18R5j15J09J71m10
5118h6K0M24l42m8O9J79m44P0J75k35J1L69l85j7NL56l16OO73n39j28M41o4k85
5142i1L57J67m25J06J15j77j08K51L9l27oK29k09k19J63J09k61o3M30n65L07J47
5164c1J08k32J98L05n35K49L75k01k70L11J89n10O1K35m72P5L46j42k15JL63o92
5186d84J64L76o0l54N44J02l40O1K46q3k57L14ol56J58J47l38pL45Lm34K20K76
5209B37m64n1N97m80m02N54J27l36K20K35k70o0K79o1q3m1M99o46J95K69q6m45
5231b13N69j60m55J79K70j53k73K11n4k19K55J74k47l7L05J00m08L57ok79L92
$$ plain form
5252 308 235 100 59 280 222 -112 6 195 -253 -423 156 -59 -275 -78 39 -346 -242 -133 -105 -172 158 1
5274 1 -93 75 322 90 -234 376 287 -95 137 201 87 17 212 194 -1 99 62 -203 -97 330 -326 -268 78
5297 78 -63 -467 -115 -22 -65 -37 146 238 -123 245 368 1 224 271 -31 -32 113 235 -123 -84 -220 99 -147
5320 -147 -107 -355 -307 -82 -157 -69 -235 -142 -107 31 -5 260 9 42 312 107 305 96 232 56 100 4 173
5343 173 -157 -76 -57 -149 -171 -179 -166 -363 -149 -10 -54 -241 37 -67 88 91 -29 181 479 154 137 4 104 142
5367 142 100 -25 182 -31 -95 -19 9 -159 -223 -273 -237 -162 -75 -152 -38 -63 -16 88 -53 216 262 108 82 105 125
5392 125 22 137 100 173 -39 124 -91 -82 -27 41 -164 -75 -69 -215 -325 -72 -243 -306 249 -64 -12 72 469 56
5416 56 -25 246 82 -44 271 131 3 -70 187 9 -284 152 15 -195 -127 -54 -388 -317 27 48 -352 -207
$$ packed form
5252C08p3j35m1K21n8l34J18J89m48j70N79k15k16J97J17l85J04J09K8o7L30j57
5274Ar4J68K47k32l24O10q9l82K32O4j14p0J95j8j95J00l7k65J06M27o56N8L46
5297G8j41m04L52R3m3K8J83R2l61L68J23l67K23M7l02jJ45J22l58L9j36L19k46
5320a47M0k48M8K25p5Q8j66R3L5J38l6K65k51L3K70k05J98k09J36j76M4r6J69
5343A73l30Q1J9r2k2qJ3j97K14J39m4j87K78j04J55Lj20K10K98l25j7j33J00L8
5367A42m2j25K07k13o4P6K8j68o4n0L6P5Q7p7J14k5M7J04j41K69M6j54k6K3K0
5392A25j03J15l7P3k12J63k15RN5O8k05Q9Oj46j10K53j71o3N55l13N2Q4L97m13
5416E6q1K71j64j26L15j40j28p3K57j78k93M36j37k10O8P3l34P1L44K1m00J45
$$ plain form
5438 -207 283 -35 27 108 366 -118 398 298 -3 273 167 -81 -89 146 -107 -201 -92 190 -65 -182 -21 -168
5460 -168 -569 -99 162 -314 -102 210 127 -52 440 8 -96 207 332 -141 -21 354 94 24 92 398 -345
5481 -345 18 -96 -245 -380 -64 32 -337 -135 -39 -182 -148 136 -15 -62 127 373 -12 84 478 73 40 329
5503 329 258 -43 -87 179 -134 -147 187 -32 -292 -205 -78 -333 -542 53 -145 -287 -88 -5 -244 147 260 198
5525 198 -17 342 222 -217 265 50 -275 58 71 52 -243 -83 52 -305 -209 46 72 -187 -74 -11 -373 -129
5547 -129 248 -51 -208 50 176 113 205 144 -153 -82 289 62 -198 242 34 -155 -26 -28 -61 -305 -101 -132 -232
5570 -232 -38 -1 -303 -155 75 -136 -229 187 287 -9 -78 258 141 62 195 -18 -28 42 239 -147 -122 73
5592 73 -131 -13 -174 -152 -308 -192 -110 -169 -151 -32 255 -85 -37 -197 -24 -126 118 247 158 -10 152 25
$$ packed form
5438b07M90l18O2Q1K58m84N16j00l01K76j06k48qK35k53r4J09K82k55j17J61j47
5460a68m01M70K61m76K12L12q3j79M92m32j04L03J25m73J20L75k60p0O8L06p43
5481c45L63j14j49j35L16R6l69K02R6j43L4K84j51m7J89K46l85R6L94m05l3K89
5503C29p1l01m4K66l13j3L34k19k60Q7J27k55k09N95j98j42J99Q3k39L91J13o2
5525A98k15L59j20m39M82k15l25L33J3j9k95J60J35l57R6K55K6k59J13O3l62K44
5547a29L77k99j57K58J26o3R2o1k97P1L71k27k60M40k08j89J29kl3k44K04l1j00
5570b32J94L7l02J48K30k11r3M16J00k96o9L36j17p9J33k13j0P0J97l86K5J95
5592G3k04J18j61K2j56J16Q2n9J8J19K87l40M8j60J73j02K44J29q9j68J62j27
$$ plain form
5614 25 64 264 -40 -236 -96 27 -124 -47 -121 40 34 -279 -266 -160 -21 -23 -30 -152 165 54 50 289 222 64 147
5639 147 15 318 63 78 94 -82 -20 -289 -142 -6 -87 -203 -140 -221 23 80 -210 -100 -178 147 67 -68 268
5662 268 -18 283 -124 173 -19 137 117 222 168 -43 -110 -198 -30 -229 -256 -360 -159 -167 -182 129 -8 -113 -190
5685 -190 273 46 17 261 240 153 277 230 46 -58 261 -97 45 155 107 -18 -102 -34 -319 -99 95 -77
5707 -77 -280 160 99 -12 -125 220 71 130 113 458 65 97 339 160 -106 104 23 71 28 84 -208 -104 24
5730 24 -401 -492 -117 122 -223 -333 228 -279 -141 236 240 -194 229 373 3 27 208 109 -8 205 174 -95
5752 -95 -134 134 91 97 55 -208 -370 -88 -123 -306 -228 -12 -16 -174 35 136 -113 -77 229 209 -55 234 240 23 261
5777 261 246 -45 -353 170 45 -395 -49 41 -245 -322 -79 -30 -337 160 -50 -321 -164 198 77 37 182 135
$$ packed form
5614B5L9K00l04j96J40J23j51P7p4J61ol13J3J06J39kpj22L17j11mK39o7j58Q3
5639A47j32L03k55J5J6j76O2k69J47J36q1j16O3q1K44N7k90J10p8L25q0j35L36
5662B68k86L01m07K97j92J56k0J05n4k11o7q8J68j99k7j04K01qj5L11j37j05p7
5685a90M63k27k9K44k1q7J24m7j84j04L19l58J42J10m8j25q4O8k85K20J94j72
5707g7k03M40o1j11j13L45j49N9j7L45l93L2K42j79k66K10q1M8m3N6k92J04J28
5730B4m25r1L75K39l45j10N61n07J38L77Mm34M23J44l70K4J81r9j17K13l1k69
5752i5l9K68m3Om2k63j62K82l5j83P8K16mj58K09J01k49L6L06k0k64K89Ok17K38
5777B61j5k91l08N23j25m40L46R0k86p7K43M9l07M97k10k71J57L62j21m0J45m7
$$ plain form
5799 135 -70 253 440 105 70 207 -74 -87 166 -6 -142 12 294 -118 -269 162 -36 -231 -18 10 -178
5820 -178 -162 169 152 129 205 137 -14 90 374 -3 -55 59 199 -136 -108 155 -320 -84 209 -148 -416 -246
5842 -246 85 -220 -246 198 -5 -199 0 -4 16 170 65 58 -17 221 -44 -41 167 180 -162 -125 245 82 -234 144
5866 144 23 -45 -234 -255 -107 -411 -69 52 -112 17 167 -21 -71 109 102 73 235 191 107 225 178 -82 49
5889 49 66 -11 -169 -90 -161 -68 6 -134 -42 -133 -187 128 -97 -138 61 25 293 -147 5 -65 21 222 108 17 143
5914 143 52 105 -121 156 50 -315 -346 -16 32 -125 -61 -277 -13 -68 -67 -65 207 152 -140 -29 280 356 312 -87
5938 -87 375 54 -45 159 -32 62 26 165 -60 -81 -173 -70 17 -156 -154 -273 -120 -155 -75 -362 -54 137 -153 -89
5962 -89 178 157 -20 141 163 276 126 25 -50 -68 -19 50 -60 -208 -159 -50 -275 -154 -19 -251 -84 24 -130
$$ packed form
5799A35k05L23J87l35l5J37k81j3K53j72j36J54K82m12j51M31j98j95K13K8j88
5820a78J6L31j7k3P6o8j51J04K84l77n2J14J40l35K8K63m75K36K93l57k68J70
5842b46L31l05k6M44k03j94J99mK0J54j05pp5K38k65LK08J3l42L7L70j63l16L78
5866A44j21o8j89k1J48l04L42J21j64J29J50j88n0J80pk9J62m4q4J18m7k60J31
5889D9J7p7j58P9p1R3P4j40R2r1n4L15k25m1J99l6K68m40J52p0Q6K01j14r1J26
5914A43r1N3k26K77j06l65l1L30M8j57O4k16K64n5JKK72n5k92J11L09P6m4l99
5938h7M62l21r9K04j91R4l6J39k25k1r2J03Q7j73Kj19J53l5Q0k87L08J91k90O4
5962h9K67k1j77J61K2J13j50j01p5j8M9O9j10j48M9J09k25J21J35k32J67J08j54
$$ plain form
5985 -130 -57 161 87 -203 69 118 78 13 81 28 42 135 136 94 -158 57 -99 14 81 165 -191 -167 -152 -90 -353 -55
6011 -55 71 -315 25 182 -171 259 271 157 -36 127 229 -18 270 140 -131 -112 184 116 -305 -205 46
6032 46 -80 -256 -37 -32 -250 107 84 -244 -184 237 -74 14 408 -39 -114 49 188 -79 -46 140 115 -113 -90
6055 -90 129 -239 -286 26 -123 -390 73 -231 -240 -19 -76 -93 -103 323 146 30 136 377 -40 -63 359 59 -113
6078 -113 234 33 90 -113 111 -165 -297 154 133 -232 112 119 -62 -261 23 -84 -354 167 468 -273 159
6099 159 368 43 -153 140 201 -124 187 204 -84 54 21 -44 -143 36 20 -267 -356 -102 -202 -219 169 94 -111
6122 -111 -141 88 -103 -115 388 209 36 301 317 132 -38 248 101 -131 264 131 -206 -303 40 -150 -181 -16
6144 -16 -167 -78 -70 -47 -246 -115 80 111 9 359 138 119 160 186 136 227 176 184 129 49 128 -44 -9 82 21 -191 61
$$ packed form
5985a30P3K18p4k90K72M9m0o5O8n3J4R3Jm2k52K15j56J13O7Q4l56K4J5O2k63K98
6011e5J26l86L40J57l53M30J2j14j93J63J02k47K88j30k71J9K96o8m21J00K51
6032D6j26j76K19Nk18L57k3l28O0M21l11Q8L94m47p5J63J39k67L3J86k5k28K3
6055i0K19l68m7L12j49k67M63l04rK21n7j7j0M26j77j16J06K41m17k3M22l00j72
6078a13L47k01N7k03K24k76j32M51k1l65L44Pj81j99K84j07k70N21L01p41M32
6099A59K09l25j96K93O1l25L11J7k88J38l3o5r9J79j6k87q9K54j00j7L88p5k05
6122a11l0K29j91j2N03j79j73K65J6j85j70K86j47k32L95j33l37r7L43j90l1J65
6144a6j51Q9QK3j99J31J95L1j02L50k21j9M1K6n0R1n1Qn5q0P9j72L5R1o1k12K52
$$ plain form
6171 61 20 -142 -134 86 -56 -89 144 135 154 79 0 11 155 68 293 135 -51 -96 124 -124 108 -27 -75 -229 -160
6196 -160 -146 -107 -284 -66 -18 -3 -117 -97 51 -103 205 19 55 92 -34 304 50 205 -153 117 -149 -106 -99
6219 -99 3 70 -179 42 -158 -242 -142 -185 -254 10 73 41 35 -77 86 -35 -62 84 196 81 281 271 176 151
6243 151 98 -12 -181 -15 41 -233 -238 -168 64 -206 -117 -24 -171 -202 -65 18 36 210 -65 81 194 324 185
6266 185 160 127 325 -162 116 157 133 77 -23 163 -161 -98 118 -156 -33 17 -105 -276 241 -39 -172 -46
6288 -46 282 35 59 74 76 306 247 33 0 246 114 287 -203 174 98 -286 -253 251 -248 -369 15 14 -275 -164
6312 -164 113 -22 -92 143 20 -77 340 138 149 134 199 -35 203 -37 -10 -29 -265 43 -83 -293 -115 21
6334 21 -268 -114 79 -199 34 127 82 -306 42 -2 -63 62 34 94 60 136 228 -130 -148 200 21 -110 124 79
$$ packed form
6171F1m1j62QK20j42l3K33rJ9p5p9J1J44q7K25j58j86m5K20k48K32j35m8j54O9
6196a60J4L9j77K18M8J5j14K0J48j54L08j86L6L7j26L38k54J55l58K70k66M3P
6219i9J02O7k49K21k00q4J00m3o9K64O3l2oj12J63j21k7J46J12j15K00j0r5k5
6243A51n3j10j69J66N6k74nP0K32k70Q9R3j47l1J37Q3J8J74k75J46J13J30j39
6266A85k5l3J98m87K78M1k4n6j00J86l24O3K16k74J23N0j22j71N17k80j33J26
6288d6L28k47K4J5KK30n9k14l3K46j32J73m90L77p6l84L3N04m99j21L84jk89J11
6312a64K77j35p0K35j23r7M17k02J1j5O5k34K38k40K7j9k36L08j26k10J78J36
6334B1k89J54J93k78K33R3m5l88L48m4o1J25k8O0l4P6R2l58j8L48j79j31K34m5
$$ plain form
6358 79 -117 -191 126 -327 -145 243 -229 -263 122 137 -237 126 6 -39 -29 126 164 196 70 321 167 6 163
6381 163 62 -149 108 -67 -96 -344 -84 -69 -157 -35 -128 -251 -3 -34 -6 -20 158 54 -155 148 402 188
6403 188 -12 283 60 189 -11 -136 -190 -59 224 178 -165 -66 60 -205 -188 -178 -203 -206 214 -37 -208 156 134
6426 134 118 61 252 46 -40 293 51 103 105 141 57 -118 190 -49 -229 127 -63 -125 -255 22 -136 -272 -135
6449 -135 13 -65 -253 214 21 222 207 38 -8 227 141 147 54 18 -5 11 37 -70 -202 13 -143 35 -73 -279
6473 -279 -213 -2 -92 121 -201 108 -105 89 94 47 289 145 14 44 249 101 41 50 136 -31 -5 101 74 143
6497 143 -51 -128 -116 -143 -8 19 -79 -41 22 -103 122 6 155 72 43 -93 47 100 124 -143 263 77 -202 26
6521 26 178 -93 -12 -153 -332 -106 -9 -159 37 -38 -40 102 -181 -55 -57 93 -65 215 -10 -25 86 69 139 64
$$ packed form
6358G9j96p4L17m53J82L88m72l4L85J5l74L63j20m5J0J55L8L2j26K51j54j61J57
6381A63j01k11K57j75k9k48K60J5q8J22r3j23K48l1K8j4J78j04k09L03K54k14
6403A88k00K95k23J29k00j25n4J31K83m6l43R9J26k65J7J0k5lM20k51j71L64k2
6426A34j6n7J91k06q6L33k42N2KL6q4j75L08k39j80L56j90o2j30K77j58j36J37
6449a35J48p8j88M67j93K01j5j69m6K35q6Or3l6k3J6K6j07j32K15j56J78j08k06
6473b79O6K11r0K13l22L09k13J94Nm7K42j44j31L0K05j48o0RQ6j67K6J06k7O9
6497A43j94p7J2k7J35K7r8L8O3j25K25j16J49q3k9j36J40N3K4k67M06j86k79K28
6521B6J52k71Q1j41j79K26R7j50J96p5kJ42k83J26kJ50j58K80k25j5J11j7P0p5
$$ plain form
6545 64 269 158 -117 -111 -70 -224 -197 -38 -45 -53 -69 -212 -214 -111 79 28 -131 154 144 -102 112 120 25 -13 168 -8
6571 -8 -176 123 144 -242 88 146 163 -98 -103 -11 -256 -63 151 -19 -116 -2 326 4 76 -79 -140 -96 169 140
6595 140 27 401 25 157 214 90 -62 -232 -3 96 -37 -92 -6 -168 -147 172 -23 -140 -83 246 -177 -17
6617 -17 95 -75 62 103 93 -56 163 287 136 -88 204 -66 -198 56 18 -188 -321 -15 22 -274 -88 41
6639 41 -244 -225 131 -5 -263 110 114 -51 133 131 16 -104 210 74 -55 63 143 -100 -83 37 -44 42 -157
6662 -157 1 -320 14 182 -69 -204 88 -103 -53 54 28 -55 141 117 -149 15 66 154 74 -81 8 -66 -151
6685 -151 171 -237 -127 -245 -77 -115 -153 19 -22 -60 161 47 -141 104 76 -174 -96 138 67 44 188 134 63
6708 63 -189 188 13 -78 138 -117 -131 -69 -107 -353 -212 32 -54 -39 -217 -44 34 63 103 -98 48 90 37 -41
$$ packed form
6545F4K05j11k75OM1j54K7J59pqj6j43kJ03J90n1j59K85j0k46K14Qr5l8J81j76
6571hj68K99K1l86L30N8J7k61nR2k45J93K14j70r7J14L28l22P2j55o1M4K65k9
6595A40j13L74l76J32N7j24j52j70K29R9j33n5Q6j62K1L19j95j17N7L29m23J60
6617a7J12j70J37M1j0j49K19J24j51k24K92k70j32K54l8k06j33L06L7k96J86J29
6639D1k85J9L56j36k58L73Mj65J84kj15j20L14j36j29J18Q0k43J7J20q1Q6j99
6662a57J58l21L34J68k51j35K92j91N0J07k6q3J96k4k66J64N1Q8q0j55Q9p4q5
6685a51L22m08J10j18J68l8l8J72m1l8K21j14j88K45k8k50P8K34p1k3J44n4p1
6708F3k52L77j75r1K16k55j4O2l8k46J41K44q6J5j78J73P8K9M0k01J46M2n3p8
$$ plain form
6732 -41 170 200 -64 165 151 -24 21 -95 99 -236 30 335 -41 -234 157 -15 -117 -46 136 -83 42 103
6754 103 3 -59 117 305 194 244 -18 49 -20 119 -47 166 -177 132 95 -89 -155 -133 -57 -75 -151 -13 46 -9
6778 -9 89 85 216 -71 -112 260 90 57 1 104 -66 60 301 54 -128 39 -159 169 -114 -190 70 -170 70
6801 70 -95 -139 -39 -13 -46 0 198 -126 220 115 175 202 22 256 91 245 84 -184 -76 19 -67 -127 -66 -191
6825 -191 -144 -92 46 -77 -101 -59 -108 -46 -321 -79 -43 25 137 -138 100 112 144 175 34 74 -63 -8 -69 -12 -162
6850 -162 -11 48 -259 -125 -163 -193 23 39 -27 -152 -126 -56 -109 -14 233 7 147 98 166 -61 56 336 148 16
6874 16 31 -119 -214 -77 103 -115 -105 58 -46 -256 -44 150 -86 205 6 72 2 -42 107 129 262 -30 -11
6897 -11 -119 -101 80 -16 336 -53 38 88 170 -54 -190 -4 -80 -65 66 130 -248 -40 103 -93 88 289 161
$$ packed form
6732d1K11L0k64K29j4j75M5j16J94l35K66L05l76j93L91j72j02P1J82k19J25O1
6754A03j00o2J76J88j11N0k62O7o9J39j66K13l43L09l7j84o6K2P6j8p6J38N9n5
6778iR8mJ31k87m1L72j70l3n6J03j70J26K41k47j82J67j98L28k83p6K60k40K40
6801G0j65m4J00K6l3M6J98l24L46j05O0K7j80K34j65J54j61k68J08R5q6o0O1j25
6825a91M7N2J38j23k4M2m9O2k75K42L6O8J12k75K38J2L2L1j41M0j37N5o1N7j50
6850a62J51N9l07J34l8l0K16J6o6j25K6P0n3R5K47k26J40m9O8k27J17K80j88j32
6874A6J5j50r5J37J80k18J0J63j04k10K12J94k36K91j99O6p0m4J49K2J33k92J9
6897a1j08J8J81r6L52l89R1N0Q2k24j36J86p6J5J31O4l78K08J43j96J81K01j28
$$ plain form
6920 161 38 49 200 144 -11 63 226 60 56 -44 -50 -256 166 -35 -113 55 3 -144 -315 98 115 -80 42
6943 42 195 -161 116 79 -34 185 163 57 27 88 -141 14 95 192 68 -100 56 103 -6 -248 -118 -135 -109
6966 -109 34 269 -152 58 43 -71 -26 6 57 -171 251 103 73 186 271 0 -130 72 -216 -162 84 -181
6988 -181 -151 14 172 53 17 40 -56 -157 -181 -60 80 17 -2 51 -43 42 106 -78 267 181 173 -279 19 100 -124
7013 -124 -274 -78 -16 -94 -61 -93 -228 67 201 -107 -101 -4 227 17 -104 -27 140 -159 48 -10 30 -54 91 -13
7037 -13 -5 27 -74 -61 113 -101 -47 66 8 -203 -174 42 -301 -183 -8 -68 55 89 20 254 218 133 226 129 -40
7062 -40 225 30 10 -28 -12 -126 102 43 -254 -75 -126 -186 -57 84 -113 -16 79 33 -26 12 -72 92 227 74
7086 74 18 22 45 -47 -141 42 71 193 161 217 40 85 -121 102 -6 -55 -133 -176 -23 -58 19 -13 -44 80 98 39 89
$$ packed form
6920A61j23J1J51n6j55P4J63j66mj00ok06M22k01p8J68n2j47j71M13J7j95J22
6943D2J53l56K77l7j13K19k2j06l0O1k29J55Q1R7j24j68J56M7j09k42J30j7K6
6966a09J43K35m21K10j5j14M5L2N1k28M22j48l0J13Q5k71j30K02k88N4K46k65
6988a81L0J65J58j19l6K3r6j01k4J21J40o3j9N3r4Q5O4j84L45q6qm52K98Q1k24
7013a24j50J96O2p8L3l2j35K95J34l08OR7K31k10j21P7J67k99K07n8M0q4J45j04
7037a3QL2j01J3J74k14N4J13n8k11K9K16l43J18J75o0J23L4o9K34l6q5R3r7j69
7062d0K65j95k0l8J6j14K28n9k97J79n1o0J29J41j97R7R5m6n9L8q4J64J35j53
7086G4n6MK3r2r4J83K9J22l2N6j77M5k06K23j08m9p8m3J53l5P7l2l1J24J8n9N0
$$ plain form
7113 89 -42 -61 157 -232 270 233 0 27 67 18 -39 -24 77 -222 54 16 16 37 -175 111 -170 25 -144 -1
7137 -1 -52 165 139 -67 199 95 -10 -99 67 79 124 44 176 -129 -139 -27 -153 71 65 -222 -198 52 -38 -45 -125
7162 -125 19 -25 -102 28 88 -63 -104 175 178 -110 60 200 81 -96 25 -151 -50 77 -179 -267 -156 159
7184 159 -263 -34 40 104 -230 111 130 102 -105 265 -20 13 97 13 229 -72 74 -49 15 -63 224 -126 -92
7207 -92 -169 66 -149 76 -6 -62 159 104 -108 -222 132 -129 -114 263 -31 95 104 146 -36 61 133 156 -88 74
7231 74 -54 -152 -2 164 31 -155 64 74 -72 -193 -81 -33 35 303 14 57 175 309 41 -44 87 120 87
7254 87 149 -46 78 253 69 -131 -309 7 -192 -124 -57 -74 -130 -227 -45 -12 77 28 109 198 26 206 73 -130
7278 -130 116 34 115 138 -45 -162 17 213 80 -77 141 -52 -26 63 -153 -31 161 14 -242 -248 69 187
$$ packed form
7113H9j31j9K18l89N02l7k33K7M0m9n7J5J01k99K76l8%K1k12K86k81J95j69J43
7137an1K17k6k06K66j04j05q9J66J2M5q0J32l05j0J12j26K24ok87K4K50r0pq0
7162a25J44m4p7J30O0j51m1K79Lk88J70J40j19j77J21j76J01J27k56q8J11L15
7184A59m22K29P4O4l34L41J9k8k07L70k85L3Q4q4K16l01J46j23O4p8K87l50L4
7207i2p7K35k15K25q2n6K21n5k12j14L54k61J5L77k94J26RM2j82R7P2K3k44J62
7231G4j28r8J50J66j33j86K19J0j46j21J12M8O8K68k89M3J18J34k68q5J31L3l3
7254H7O2j95J24J75j84k00j78L16j99O8O7j7n6r7J82L3Q9m9Q1Q9j72J80j33k03
7278a30K46q2Q1K3j83j17J79J96j33j57K18j93K6Q9k16J22J92j47k56oL17J18
$$ plain form
7300 187 7 103 -75 154 41 98 -2 32 -113 202 -49 198 242 106 -41 139 161 162 153 136 -3 -225 -145 89
7324 89 -63 11 40 -12 -147 29 -37 147 76 52 -22 -22 18 189 -231 -108 10 -186 131 -214 194 -164 19 -3
7348 -3 3 -23 -68 -33 94 -194 -22 -115 -143 -31 63 56 88 37 154 -84 33 79 65 -42 -12 -1 -1 71 -145 68 -64
7375 -64 -118 -159 -141 -111 -59 50 118 131 10 67 204 241 310 30 180 87 -54 164 -75 -44 102 -67 -173 70
7399 70 5 70 -3 -5 -85 1 -282 -215 -127 -279 4 121 -44 141 76 -6 118 174 9 -145 9 144 50 -25 -26 -7
7425 -7 48 -40 -78 -144 -44 -60 80 31 150 -105 -101 -99 27 142 -51 177 24 -21 -111 -64 -33 -17 145 -40 -104 231
7451 231 57 -139 -213 29 176 -224 -73 -87 -186 -135 37 13 -121 9 29 112 13 36 54 57 184 13 -59 48
7475 48 -81 -92 120 11 30 -88 -1 -109 -269 124 -105 -105 -48 -13 76 226 95 138 -144 -19 -110 135 109 270
$$ packed form
7300A87j80R6j78K29j13N7j00L4j45L15k51K47M4j36j47J80K2Jrj7j39k22Q0K34
7324H9j52P4K9n2j35J76o6J84p1k4p4%M0J71m20J23J18j96L17l45M08l58J83k2
7348cOk6m5L5J27k88J72r3k8J12R4pL2n1J17k38J17M6j4j07L0J1%P2k16K13j32
7375f4n4m1J8L0N2J09O8J3j21N7J37L7O9k80J50r3j41K18k39L1J46j69j06K43
7399G0o5O5p3kq0Q6k83O7Q8j52K83J17j65J85o5q2J24N6j65j54J54J35r4p5jJ9
7425gN5q8l8o6J00j6J40m9J19k55MKJ26J15j93K28j53m5r0M7L1J6J62j85o4L35
7451B31j74j96p4K42J47m00J51j4r9N1J72k4j34J30K0Q3r9K3J8LJ27j71p2J07
7475D8j29j1K12j09J9j18Q7j08j60L93k29%N7L5Q9J50j31M3k82J25r1K45k6J61
$$ plain form
7499 270 -199 99 233 -14 88 -54 86 93 -192 201 158 -44 27 99 -167 36 293 -42 -49 -94 190 26 -76
7522 -76 39 20 98 266 24 -69 96 -47 1 22 13 72 -278 -53 176 -109 -125 -28 -133 -362 281 -93 -53 -73
7546 -73 -44 14 117 28 104 7 116 192 152 178 209 -6 -1 57 -98 70 -137 39 -107 16 -81 149 -18 -45 211
7571 211 7 -33 92 46 5 134 -103 115 108 214 128 111 -121 -96 -149 4 5 92 93 -42 -41 -122 -31 -83 -215 -103
7597 -103 70 23 -17 25 -6 -81 -18 109 -4 -72 107 -31 -10 -113 69 120 -23 -131 -134 -21 62 -15 87 70 1
7622 1 112 33 31 -125 67 107 244 -122 -88 46 152 -36 108 21 238 -19 22 -105 -111 42 205 92 -163 59
7646 59 151 -208 -93 47 -415 -140 15 -80 -72 -23 -70 -9 -83 135 -105 -58 -33 2 131 -22 -39 52 -18 -71 177
7671 177 -3 -68 116 10 -219 -39 124 -2 -58 87 -76 78 -42 -50 107 -197 -13 14 247 246 -64 74
$$ packed form
7499B70m69K98J34k47J02j42J40Pk85L93m3k02P1P2k66K03K57l35pm5K84j64j02
7522g6J15j9P8J68k42r3J65j43M8K1rN9l50K25K29k85j6R7j05k29O43l74M0k0
7546g3K9N8J03q9P6r7J09P6m0K6L1k15NN8j55J68k07J76j46J23r7K30j67k7K56
7571B11k04m0J25m6m1J29k37K18pJ06q6j7k32K5n3J53JQ7Jj35Jq1R1n2j32J12
7597a03J73m7m0M2l1p5O3J27j13o8J79j38K1j03J82N1j43j08lJ13Q3p7J02j7o9
7622AJ11p9kj56J92M0J37l66L4J34J06j88J44q7K17k57M1j27oJ53J63j13k55K22
7646E9R2l59J15J40m62K75J55r5QM9m7O1p4K18k40M7K5L5J29j53j7R1p0n3K48
7671A77j80o5J84j06k29J80J63j26n6J45j63J54j20qJ57l04J84K7K33jl10J38
$$ plain form
7693 74 54 -108 -153 -209 -178 -42 -181 111 110 -142 6 -164 -1 -30 42 -206 23 -91 -206 13 145 -47 -99
7716 -99 -20 -12 -193 -47 42 182 61 58 84 92 142 -7 17 197 -345 -96 149 -73 -69 70 -32 45 33 -93 51
7741 51 70 180 18 215 144 -88 97 -197 -50 -167 -116 -30 -139 -152 -6 -123 -42 -21 100 21 -26 86 280
7764 280 -109 64 -28 14 -28 -34 -109 -46 236 -192 -178 -19 76 -109 11 19 -99 -26 146 -61 -153 95 -106 127
7788 127 -274 15 125 -217 33 -12 35 122 -3 164 -37 31 195 48 -24 -148 77 -123 51 125 42 -123
7810 -123 53 157 -176 115 -57 -72 -113 61 -38 -21 -250 19 -59 -36 71 -117 192 -21 -154 196 64 120
7832 120 -79 138 128 -84 -102 53 123 -163 14 -51 148 -112 88 -10 -72 -53 201 141 243 26 6 153 235
7855 235 16 7 35 253 -27 -146 -67 -16 -155 67 -43 -51 -78 -8 89 173 -18 -100 7 -182 1 3 -84 -117 7
$$ packed form
7693G4k0j62m5n6L1J36j39K92jk52J48j70J63k9P2k48K29j14j15K19J32j92n2
7716i9P9Qj81J46Q9J40j21lK6QN0j49K4J80n42K49K45k22MJ39j02P7j2j26J44
7741E1J9J10j62J97p1k32J85k94J47j17N1Q6j09j3J46j17Q1K1J21p9m7J12J94
7764B80l89J73r2M2m2op5O3K82m28J4J59R5j85J20Qj18P3J72k07r2K48k01K33
7788A27m01K89J10l42K50m5M7Q7j25J67k01O8J64j47p2j24K25k00J74P4q3j65
7810a23J76J04l33K91j72j5m1J74r9J7k29K69p8K3J07j88L09k13j33L50j32N6
7832A20j99K17j0k12j8J55P0k86J77o5J99k60K00r8o2J9K54o0J02k17k0J47Q2
7855B35k19rK8K18k80j19P9N1j39K22j10qk7P0R7Q4j91q2J07j89J83Kq7l3J24
$$ plain form
7880 7 -10 -183 -121 -23 -137 -63 -83 52 1 -9 -93 -87 -205 -68 -126 3 -60 116 203 -2 88 -28 58 -65 140 297
7906 297 -190 33 147 61 -67 -119 145 -239 30 62 -290 -114 97 -167 -82 198 -56 -20 -9 -6 -66 117 -5
7929 -5 54 116 -15 43 128 177 206 -102 31 59 -29 -36 169 41 37 -215 81 -20 -126 23 -232 -170 -67 -242 19
7954 19 25 -69 12 -67 -8 62 -40 1 -95 6 82 95 138 37 -232 144 -52 54 -62 -39 3 34 -255 -154 -110 179
7980 179 25 -2 -54 -82 21 4 135 -4 155 -98 180 127 124 160 7 125 61 24 -50 62 54 20 33 -2 -152
8005 -152 -276 141 51 -18 188 117 74 -41 211 -126 -73 95 16 10 -38 -37 189 51 19 46 26 -144 -57 -55 -60 104
8031 104 -101 -60 -125 91 44 84 29 -261 60 35 76 55 -110 4 156 53 83 176 -235 19 73 -30 24 107
8055 107 52 -73 -54 -121 -48 120 24 -179 63 -62 -228 -21 -18 26 -10 -69 -44 -29 -55 44 128 38 -55 125 85 8
$$ packed form
7880Gj7j73O2R8j14P4k0J35n1j0q4Oj18J37n8J29o3J76Q7k05R0j16Q6j23K05J57
7906B97m87K23J14q6j28n2K64l84K69L2l52J76K11k64Q5K80k54L6J1Lo0J83j22
7929eN9O2j31N8Q5M9K9l08J33K8q8pK05j28mk52K96j01j06J49k55O2J03j75K61
7954A9Or4Q1p9N9P0j02M1r6J01P6J3M3j01k69L76j96J06j16K3M2L1k89J01M4K89
7980A79j54k7n2k8J03j7J31j39J59k53K78n3lL6j53J18o4l7p4J12ql4J3l5j50
8005a52j24M17r0o9K06p1m3j15K52l37N3J68p9om8JK26j38l2K7k0j70Q7KnJ64
8031A04k05M1o5K16m7M0n5k90L21k5M1k1j65J14J52j03L0R3m11K54N4j03N4Q3
8055A07n5j25J9o7P3J68r6k03K42j25j66K07LM4l6n9K5J5k6R9Q4r0r3J80m0p7
$$ plain form
8081 8 77 18 -37 29 -22 -111 -93 5 -245 11 -107 -30 169 -130 166 -37 115 6 -77 -164 102 50 101 -88 137
8106 137 -90 166 74 -30 15 82 -14 231 15 -39 53 41 -121 -16 156 -266 39 -75 106 11 87 16 95 -10
8130 -10 -15 -56 -8 22 64 -5 -36 109 59 49 -244 80 -98 139 -7 82 209 22 254 65 28 37 -173 -131 -20
8155 -20 149 57 109 40 87 162 -43 -22 -28 -243 -44 -10 -59 22 107 11 -37 -25 67 -11 -9 64 266 -125 93 -10 -100
8182 -100 -108 -117 -28 -79 136 13 -32 -27 -125
$$ packed form
8081HO9n9n5O6n1q9J8R8k50K56j18P7J99k99K96k03J52j09q3q7K66n2N1j89K25
8106A37k27K56r2j04M5O7r6K45k16n4R2j2j62J05J72m22L05j14J81r5P6p1P9j05
8130a0nm1M8L0M2o9l1J45n0j0k93L24j78K37j46Q9J27j87K32j89l7Rk10M2J11
8155b0J69r2N2o9M7P5k05K1ok15J99L4m9Q1Q5r6m8J2R2p8KP3K02l91K18j03r0
8182a00qrQ9n1K15j23m5Nr8
8191a25
$$ Imaginary data points
##PAGE= N=2
##DATA TABLE= (X++(I..I)), XYDATA
$$ plain form
0 0 0 0 0 0 0 0 0 0 0 16 -16 16 -16 32 -32 48 -49 64 -80 96 -113 143 -161 193 -225 257 -305 353 -401 462
30 462 -530 598 -680 771 -869 976 -1100 1230 -1373 1531 -1702 1893 -2099 2322 -2569 2836
46 2836 -3128 3447 -3800 4186 -4611 5082 -5601 6186 -6839 7577 -8416 9385 -10519 11858
60 11858 -13474 15473 -18015 21364 -26008 32897 -44193 65953 -123330 596490 1408684
71 1408684 -3345 -929387 -714057 246841 614723 219659 -471533 -492541 -8129 285736
81 285736 144366 156351 209308 -76215 -502377 -427457 58888 484201 419715 -94683 -502901
92 -502901 -182541 438281 470368 -76636 -397685 -251206 44282 225483 218873 58829 -39400
103 -39400 -76658 -206038 -231585 89669 330184 56034 -323710 -233946 145733 314016 115810
$$ packed form
0@%%%%%%%%%J6l2L2l2M8o4Q0r7J13j44J76k09K56l04L54m18M82n62O58p54Q63
30D62r92J128j278J451j640J845k076K330k603K904l233L595l992M421m891N405
46B836n964O575p247P986q797R693j0683J1787j3025J4416j5993J7801j9904K2377
60A1858k5332K8947l3488L9379m7372N8905p7090J10146j89283P19820Q12194
71A408684j412029r26042K15330R60898L67882l95064o91192k1008M84412K93865
81B85736j41370J1985N2957k85523m26162P4920M86345M25313o4486n14398m08218
92e02901L20360O20822L2087n47004l21049J46479K95488J81201o610j60044r8229
103c9400l7258j29380k5547L21254K40515k74150l79744Q9764L79679J68283j98206
$$ plain form
114 115810 -228076 -328776 -34412 237334 122043 -49752 71362 172763 -22476 -197118
124 -197118 -83373 112550 135924 -30864 -197756 -80589 252468 282454 -118442 -353741
134 -353741 -99847 175272 68672 -184586 -189813 102942 355251 171185 -294775 -373594
144 -373594 87856 388256 94861 -304236 -245517 151084 392773 207530 -187247 -297852
154 -297852 -22597 169587 19411 -126995 -14570 111874 46355 -65677 -67165 13931 54473
165 54473 -48851 -191105 -108799 157684 226933 10989 -139603 -45857 81947 62759 -46131
176 -46131 -97960 -4334 136626 110602 -51439 -72452 68981 88227 -76742 -166151 -58254
187 -58254 88102 107079 -2002 -96836 -39689 76864 34055 -119788 -119112 43085 112576
$$ packed form
114A15810l43886j00700K94364K71746j15291j71795J21114J01401j95239j74642
124a97118J13745J95923K3374j66788j66892J17167L33057K9986m00896k35299
134c53741K53894K75119j06600k53258n227K92755K52309j84066m65960p8819
144c73594M61450L00400k93395l99097N8719L96601K41689j85243l94777j10605
154b97852K75255J92184j50176j46406J12425J26444o5519j12032j488Q1096M0542
165E4473j03324j42254Q2306K66483O9249k15944j50592R3746J27804j9188j08890
176d6131n1829R3626J40960k6024j62041k1013J41433J9246j64969q9409J07897
187e8254J46356J8977j09081r4834N7147J16553m2809j53843O76J62197O9491
$$ plain form
198 112576 25600 -38994 5969 74795 64650 -35686 -107472 -29397 94647 66609 -47023
209 -47023 -24012 95371 84763 -66579 -155161 -75405 73845 109150 -33679 -160201 -50352
220 -50352 163162 155293 -69219 -198040 -96369 72486 127468 44270 -55108 -32873 68321
231 68321 74241 -15975 -40534 6173 -4538 -49103 -14727 66643 86934 22417 -75275 -111526
243 -111526 -22709 75839 21890 -95355 -70702 54220 89045 19647 -41415 -45932 -5621 27898
255 27898 -6107 -42845 26244 110138 52856 -57478 -47534 31467 44166 -7990 -59446 -58856
267 -58856 22923 95220 35560 -70811 -58414 9810 -2491 -41595 -22915 6439 15493 24936
279 24936 10914 -10081 20410 37185 -35741 -76579 12989 92008 48940 -17044 -23650 2365
$$ packed form
198A12576q6976o4594M4963O8826j0145j00336p1786P8075J24044k8038j13632
209d7023K3011J19383j0608j51342q8582P9756J49250L5305j42829j26522J09849
220e0352K13514p869k24512j28821J01671J68855N4982q3198r9378K2235J01194
231F8321N920r0216k4559M6707j0711m4565L4376Q1370K0291o4517r7692l6251
243a11526Q8817R8548n3949j17245K4653J24922L4825o9398o1062m517M0311L3519
255B7898l4005l6738O9089Q3894n7282j10334R944P9001J2699n2156n1456N90
267e8856Q1779P2297n9660j06371J2397O8224j2301l9104J8680K9354R054R443
279B4936j4022k0995L0491J6775p2926m0838Q9568P9019m3068o5984o606K6015
$$ plain form
291 2365 39735 37509 -48160 -100577 -12826 75766 30256 -35780 -19817 3147 -5172 -9618 -27545
304 -27545 -43607 2889 46221 5223 -19288 38859 53783 -14723 -42016 -7379 11829 22474
316 22474 31393 -1670 -17806 34563 43705 -35555 -62569 -4446 12169 -18729 -14854 1382 4989
329 4989 25406 14362 -53831 -58484 25221 45000 -17830 -25776 22796 37752 33084 21762 -24735
342 -24735 -42333 13761 35862 -11200 -11299 33924 16925 -23220 -8146 1501 -22951 -21514 -13589
355 -13589 -30413 -3209 53750 24887 -46232 -31152 19605 10764 -7994 -2099 -8509 5207 52471
368 52471 41409 -20328 -16761 23775 -563 -32410 -3008 18959 5493 7890 3950 -26618 -16660
381 -16660 17908 -11931 -55074 -18276 27906 12999 1059 11344 -3475 -12013 11725 5276
$$ packed form
291B365L7370k226q5669n2417Q7751Q8592m5510o6036J5963K2964q319m446j7927
304b7545j6062M6496M3332m0998k4511N8147J4924o8506k7293L4637J9208J0645
316B2474Q919l3063j6136N2369R142p9260k7014N8123J6615l0898L875J6236L607
329D989K0417j1044o8193m653Q3705J9779o2830p946M8572J4956m668j1322m6497
342b4735j7598N6094K2101m7062r9M5223j6999m0145J5074R647k4452J437P925
355a3589j6824K7204N6959k8863p1119J5080N0757q841j8758N895o410J3716M7264
368E2471j1062o1737L567M0536k4338l1847K9402K1967j3466K397l940l0568R958
381a6660L4568k9839m3143L6798M6182j4907j1940J0285j4819q538K3738o449
$$ plain form
393 5276 -22038 4106 39023 12411 -7507 21375 24527 -8371 -15011 -11811 -21912 -613 28173
406 28173 94 -31256 -1830 18473 -13066 -27725 -12051 -13669 -8392 20282 18215 -5232 7926
419 7926 21248 -7064 -16164 14332 15245 -7431 4185 21544 10872 8250 10723 -17201 -33040
432 -33040 -3014 10096 -13124 -11994 8853 295 -11435 -1276 -5783 -18951 -4379 6856 -10396
445 -10396 -3592 31586 30992 -206 -7411 -1521 -3426 7408 20463 2684 -12118 6069 15069
458 15069 -718 -2155 930 -21919 -35146 -10698 11607 10834 7761 -4195 -25649 -17429 16449
471 16449 19607 -6476 -14351 -3661 6353 24779 36776 12870 -18213 -15910 -1595 2853 13137
484 13137 19510 -2423 -23329 -10510 8103 6473 -2192 -15043 -33272 -25439 11258 27745 10624
$$ packed form
393E276k7314K6144L4917k6612j9918K8882L152l2898o640L200j0101K1299K8786
406B8173k8079l1350K9426K0303l1539j4659J5674j618N277K8674k067k3447J3158
419G926J3322k8312r100L0496R13k2676J1616J7359j0672k622K473k7924j5839
432c3040L0026J3110k3220J130K0847q558j1730J0159m507j3168J4572J1235j7252
445a0396O804L5178n94l1198p205N890j905J0834J3055j7779j4802J8187R000
458A5069j5787j437L085k2849j3227K4448K2305p73l073j1956k1454Q220L3878
471A6449L158k6083p875J0690J0014J8426J1997k3906l1083K303J4315M448J0284
484A3137O373k1933k0906J2819J8613j630q665j2851j8229P833L6697J6487j7121
$$ plain form
497 10624 -4426 -10392 -16965 -6020 20671 22012 -207 -6450 2520 7825 18079 26135 4722
510 4722 -24133 -21262 -2418 4854 11567 13682 -8132 -26717 -13325 2220 -2775 -3676 -962 -14088
524 -14088 -18389 6979 24841 15206 4969 -3528 -18050 -10655 20259 28577 10619 3126 -1042
537 -1042 -14520 -4923 23463 17592 -18599 -32025 -20678 -3030 23950 30859 -10102 -46421 -27744
550 -27744 5816 15266 16571 6494 -21557 -21477 18206 36400 15996 779 -8394 -23681 -9824
563 -9824 30026 35718 6729 -11187 -21038 -24013 6153 32642 1490 -40616 -29645 833 11538
576 11538 19591 12648 -23429 -35263 -2740 16338 9625 13888 11696 -11328 -7480 22296 19336
589 19336 -3072 -448 -345 -16502 -3423 24748 13705 -9661 -7694 -10871 -22104 -3962 12312
$$ packed form
497A0624j5050n966o573J0945K6691J341k2219o243Q970N305J0254Q056k1413
510D722k8855K871J8844P272O713K115k1814j8585J3392J5545m995r01K714j3126
524a4088m301K5368J7862r635j0237q497j4522P395L0914Q318j7958p493m168
537a042j3478R597K8386n871l6191j3426J1347J7648K6980O909m0961l6319J8677
550b7744L3560R450J305j0077k8051Q0L9683J8194k0404j5217r173j5287J3857
563i824L9850N692k8989j7916r851k975L0166K6489l1152m2106J0971L0478J0705
576A1538Q053o943l6077j1834L2523J9078o713M263k192k3024L848K9776k960
589A9336k2408K624J03j6157J3079K8171j1043k3366J967l177j1233J8142J6274
$$ plain form
602 12312 -8900 -18410 4204 7320 -7368 2466 9319 -8199 -5296 13820 372 -12672 16255
615 16255 34969 10674 -9565 -12410 -15001 5624 35141 10191 -38640 -27503 15347 19419 2977
628 2977 -7908 -28469 -30782 6305 24007 -13 -6686 7337 -4457 -14103 10046 21477 4466
641 4466 -476 -849 -13058 4294 42393 26421 -25497 -32601 -4947 8614 15817 11440 -21682
654 -21682 -33911 3069 22657 -1705 -13472 -7760 -16514 -11830 17240 18798 -5051 -2265 9308
667 9308 -1071 -160 17143 7889 -9766 2181 10816 -1555 3971 15892 -6272 -25300 -5217
680 -5217 10122 -2066 -6953 -6578 -15543 -4240 20908 6037 -28074 -19849 10595 17739 12299 3748
694 3748 -14786 -9145 27451 31242 -9541 -25231 -694 15113 13400 8504 -8015 -17735 1978
$$ packed form
602A2312k1212r510K2614L116j4688R834O853j7518K903J9116j3448j3044K8927
615A6255J8714k4295k0239k845k591K0625K9517k4950m8831J1137M2850M072j6442
628B977j0885k0561k313L7087J7702k4020o673J4023j1794r646K4149J1431j7011
641D466m942l73j2209J7352L8099j5972n1918p104K7654J3561P203m377l3122
654b1682j2229L6980J9588k4362j1767N712q754M684K9070J558k3849K786J1573
667I308j0379R11J7303r254j7655J1947Q635j2371N526J1921k2164j9028K0083
680e217J5339j2188m887L75q965J1303K5148j4871l4111Q225L0444P144n440q551
694C748j8534N641L6596L791m0783j5690K4537J5807j713m896j6519r720J9713
$$ plain form
707 1978 11757 -11606 -20618 766 5247 -10331 -8794 2054 3046 6053 4480 -14467 -16831 13254
721 13254 26275 4516 -7675 1536 6165 9739 13529 -1277 -17211 -3573 13335 3564 -6843
734 -6843 -1858 -3788 -9505 -2768 -1343 -12242 -9344 4598 3212 -3038 2712 2770 -6222 -142 10816
749 10816 4371 -2227 5500 8300 2705 6774 10538 -37 -8282 -4574 -3691 -2063 8988 6974 -14461
764 -14461 -21714 -2226 11529 5626 -7753 -19710 -17576 7581 27640 11845 -14869 -14162 3549
777 3549 13798 14933 7208 -7073 -7394 8362 12686 2517 -130 968 -8677 -13237 -1947 6651
791 6651 2520 -3359 -10181 -15206 -4570 12099 6365 -11421 -11064 552 5094 9578 12901 2570
805 2570 -7598 -389 7949 5597 5783 6599 -4145 -8391 4349 9226 -2180 -7375 -5395 -9429 -7572
$$ packed form
707A978R779k3363r012K1384M481j5578J537J0848R92L007j573j8947k364L0085
721A3254J3021k1759j2191R211M629L574L790j4806j5934J3638J6908r771j0407
734f843M985j930n717O737J425j0899K898J3942j386o250N750N8q992O080J0958
749A0816o445o598P727K800n595M069L764j0575q245L708Q83J628J1051k014k1435
764a4461p253J9488J3755n903j3379j1957K134K5157K0059j5795k6714P07J7711
777C549J0249J135p725j4281l21J5756M324j0169k647J098r645m560J1290Q598
791F651m131n879o822n025J0636J6669n734j7786L57J1616M542M484L323j0331
805B570j0168P209Q338k352J86Q16j0744m246J2740M877j1406n195J980m034J857
$$ plain form
820 -7572 4630 2317 -9691 -6372 2216 -1882 -2941 4952 1379 -5136 3556 10328 2676 2565 8810
835 8810 1949 -3439 6606 7322 -6338 -5410 6521 2474 -4903 -2150 -5307 -10799 -431 5045 -8888
850 -8888 -12295 2758 4826 -3247 1601 4199 -5137 -1912 10617 4568 -2276 8072 9494 -2655
864 -2655 424 9031 229 -6075 2812 470 -9048 -318 6045 -7131 -10151 1986 -2553 -11859 -1174
879 -1174 5664 -4708 -3278 6777 205 -2921 9883 7926 -7059 -695 12219 4399 -657 8211
893 8211 1896 -8829 1781 8036 -6676 -9289 2598 -2320 -9105 1961 2740 -11532 -6980 5661
907 5661 -2770 -7450 5569 5340 -5217 3387 11985 -741 -3350 9399 5526 -4649 4233 8527
921 8527 -3352 -1588 7397 -3505 -11290 1849 3145 -10561 -6467 3464 -4467 -6540 4576 -123
$$ packed form
820g572J2202k313j2008L319Q588m098j059P893l573o515Q692O772p652j11O245
835H810o861n388J0045P16j3660R28J1931m047p377K753l157n492J0368N476j3933
850h888l407J5053K068q073M848K598r336L225J2529o049o844J0348J422j2149
864b655L079Q607q802o304Q887k342r518Q730O363j3176l020J2137m539r306J0685
879a174O838j0372J430J0055o572l126J2804j957j4985O364J2914p820n056Q868
893H211o315j0725J0610O255j4712k613J1887m918o785J1066P79j4272M552J2641
907E661q431m680J3019k29j0557Q604Q598j2726k609J2749l873j0175Q882M294
921H527j1879J764Q985j0902p785J3139J296j3706M094R931p931k073J1116m699
$$ plain form
935 -123 -10458 46 8790 -1972 -2202 9798 3892 -3422 7496 9567 -3617 -1120 8061 -857
949 -857 -4832 7120 4290 -9941 -4870 3666 -5387 -7245 2034 -3945 -11267 1537 7443 -5310
963 -5310 -5628 5241 585 -3499 6941 6896 -3803 2468 11360 1891 -2946 6482 3465 -6461 402
978 402 5668 -4475 -5377 3369 -2421 -9431 -752 1482 -8759 -5894 3971 -1242 -4903 4138 4080 -3992
994 -3992 1422 7868 198 -779 8264 5275 -2704 3394 7399 -1665 -3352 3060 -1879 -6557 1197
1009 1197 1713 -7382 -5316 2111 -3414 -6964 87 222 -5330 31 5279 -354 -600 6811 3908 -2430
1025 -2430 3272 7416 792 -236 5410 2458 -1848 1862 1070 -5806 -2962 2448 -3681 -8040 -1648
1040 -1648 1321 -3465 -2890 -675 -4440 -2733 4879 2992 -2881 1274 6368 2404 1008 5397 3396
$$ packed form
935a23j0335J0504Q744j0762k30J2000n906p314J0918K071j3184K497R181q918
949h57l975J1952k830j4231N071Q536r053j858R279n979p322J2804N906j2753
963e310l18J0869m656m084J0440m5j0699O271Q892r469m837R428l017r926O863
978D02N266j0143r02Q746n790p010Q679K234j0241K865R865n213l661R041n8q072
994c992N414O446p670r77R043k989p979O098M005r064j687O412m939m678P754
1009A197N16r095K066P427n525l550P051J35n552N361N248n633k46P411k903o338
1025b430N702M144o624j028N646k952m306L710p92o876K844N410o129m359O392
1040a648K969m786N75K215l765J707P612j887n873M155N094l964j396M389k001
$$ plain form
1055 3396 -786 1651 3094 -659 768 3837 -2395 -7324 -1362 2146 -3607 -5953 -3044 -3319 -2429
1070 -2429 1979 -60 -5422 -1255 4843 1136 -2043 3673 5636 2092 2272 4052 1296 1756 5185
1085 5185 -17 -5446 540 5263 -1282 -6119 -2374 -1460 -3426 -1166 -2775 -7570 -3035 5121 890
1100 890 -5290 -77 3595 379 1615 4820 914 -41 6269 4654 -1347 2464 6128 -1838 -5210
1115 -5210 1659 1377 -3746 -1102 -336 -6618 -4380 2475 -1882 -6879 -553 1509 -4952 -855 7064
1130 7064 2221 -2836 2483 3795 463 5207 6583 -2738 -2535 7989 4752 -5750 -2118 3280 -1943
1145 -1943 -3114 -697 -6001 -5637 4975 2840 -10830 -8099 4974 3262 -2210 265 -1138 -2646
1159 -2646 6795 8934 -3177 -3002 9263 5335 -5542 -179 6647 2308 373 -156 -8180 -5918 8824
$$ packed form
1055C396m182K437J443l753J427L069o232m929N962L508n753k346K909k75Q90
1070b429M408k039n362M167O098l707l179N716J963l544J80J780k756M60L429
1085E185n202n429N986M723o545m837L745R14j966K260j609m795M535Q156m231
1100H90o180N213L672l216J236L205l906r55O310j615o001L811L664p966l372
1115e210O869k82n123K644P66o282K238O855m357m997O326K062o461M097P919
1130G064m843n057N319J312l332M744J376r321K03J0524l237j0502L632N398n223
1145a943j171K417n304L64J0612k135j3670K731J3073j712n472K475j403j508
1159b646R441K139j2111J75J2265l928j0877N363O826m339j935n29q024K262J4742
$$ plain form
1174 8824 5489 -12398 -11316 1279 1555 -87 2449 -4103 -9057 2647 8416 -1242 -1384 7121 1183
1189 1183 -4880 4971 9267 1041 673 2557 -5167 -4022 8597 5590 -7885 -5824 670 -4661 -2976
1204 -2976 4855 -1653 -10555 -2963 2849 -1689 2326 6562 -4340 -8295 6274 10678 -162 -786
1218 -786 4165 197 1057 7072 507 -6304 3090 5856 -7350 -8565 4543 3954 -4613 -4363 -4944 -6801
1234 -6801 2536 7377 -5575 -9513 4473 7469 -1994 -775 4860 1689 1936 4923 -1703 -3539 9705
1249 9705 10654 -6521 -9675 1872 4520 699 72 -5781 -10015 726 7173 -3869 -8040 965
1263 965 393 -6388 -473 6570 2824 490 1979 -3008 -1593 10200 9262 -4668 -5732 4047 3979 1272
1279 1272 3311 -1234 -7574 -2782 2073 -2768 -2516 2793 -3247 -10097 -2068 5823 1365 -2445 -1829
$$ packed form
1174H824l335j7887J082J2595K76j642K536o552m954J1704N769r658j42Q505n938
1189A183o063R851M296q226l68J884p724J145J2619l007j3475K061O494n331J685
1204b976P831o508q902P592N812m538M015M236j0902l955J4569M404j0840o24
1218g86M951l968Q60O015o565o811R394K766j3206j215J3108n89q567K50n81j857
1234f801R337M841j2952l938J3986K996r463J219N635l171K47K987o626j836J3244
1249I705R49j7175l154J1547K648l821o27n853m234J0741O447j1042m171R005
1263I65n72o781N915P043l746k334J489m987J415J1793r38j3930j064R779o8k707
1279A272K039m545o340M792M855m841K52N309o040o850Q029P891m458l810O16
$$ plain form
1294 -1829 -2951 810 8995 5559 -3928 -1152 6389 2392 -1908 3054 4538 -362 -1501 -1192 -3087
1309 -3087 902 4232 -3988 -10351 -2490 4530 -333 -4493 -2120 -1246 -395 2361 -42 -2990 2889
1324 2889 7877 753 -4620 2035 7423 4390 483 -2002 -2853 2114 6376 -711 -7825 -2669 2971
1339 2971 -1599 -5711 -2219 408 -642 -2116 -3834 -2899 3373 6178 -1414 -5915 1518 7880 4201
1354 4201 -115 621 784 2062 3881 1195 -2068 570 2490 -2948 -5046 498 2324 -2841 -5264
1369 -5264 -3727 -2240 803 2512 -2826 -6373 876 6271 1304 -2333 1881 3919 1856 1892 1424 409
1385 409 3569 4369 -2373 -4739 3011 4462 -3403 -5725 -1111 -192 -1197 -1060 -3770 -4820 1246 3615
1401 3615 -3590 -4756 3183 4689 -537 238 2299 939 3196 4989 -826 -3059 4427 5516 -3023
$$ packed form
1294a829j122L761Q185l436r487K776P541l997m300M962J484m900j139L09j895
1309c087L989L330q220o363P861P020m863m160K373Q74Q51K756k403k948N879
1324B889M988p124n373O655N388l033l907k485q51M967M262p087p114N156N640
1339B971m570m112L492K627j050j474j718R35O272K805p592m501P433O362l679
1354D201m316P36J63J278J819k686l263K638J920n438k098N544J826n165k423
1369e264J537J487L043J709n338l547P249N395m967l637M214K038k063L6m68j015
1385D09L160Q00o742k366P750J451p865k322M614R19j005J37k710j050O066K369
1401C615p205j166P939J506n226P75K061j360K257J793n815k233P486J089q539
$$ plain form
1416 -3023 -3486 2291 771 -2701 -1575 -2867 -3963 1390 1771 -6534 -5755 3810 2666 -4557 -1375 2928
1432 2928 1108 1256 3075 -704 -170 6599 3924 -4457 -1017 6691 2128 -3393 -600 -600 -2496 1377
1448 1377 529 -7257 -4751 4103 698 -6561 -2214 2479 -906 -451 1490 -1999 -649 6747 3404
1463 3404 -4911 492 7958 1999 -2409 1750 1636 -1136 1925 1285 -5478 -2010 4506 -2124 -7858
1478 -7858 -409 2904 -3155 -3071 677 -2126 -1273 4779 936 -4833 1956 7079 -16 -1994 4338 2991
1494 2991 -778 2548 2051 -2988 697 4820 -2742 -6528 1548 2862 -4680 -3924 295 -2555 -1898 1847
1510 1847 -1981 -4941 2689 5380 -2868 -2580 5192 3692 -671 1909 2133 -969 2742 4833 -2567
1525 -2567 -4112 3617 2679 -4777 -2845 1157 -2446 -2676 482 -2875 -4418 2218 2289 -4894 -2377 4238
$$ packed form
1416c023m63N777j520l472J126j292j096N353L81q305P79R565j144p223L182M303
1432B928j820J48J819l779N34O769k675q381L440P708m563n521K793%j896L873
1448A377q48p786K506Q854l405p259M347M693l385M55J941l489J350P396l343
1463C404q315N403P466n959m408M159j14k772L061o40o763L468O516o630n734
1478g858P449L313o059Q4L748k803Q53O052l843n769O789N123p095j978O332j347
1494B991l769L326m97n039L685M123p562l786Q076J314p542P56M219k850O57L745
1510A847l828k960P630K691q248K88P772j500m363K580K24l102L711K091p400
1525b567j545P729r38p456J932M002l603k30L158l357j543O636P1p183K517O615
$$ plain form
1541 4238 1839 -1756 1792 2198 -284 3315 4311 -1645 -1354 5235 2391 -3744 -679 2707 -1117 -2481
1557 -2481 -241 -2665 -3049 1490 -177 -5716 -2393 3466 115 -3102 620 1613 -365 2044 2898 -950
1573 -950 451 4802 1933 -2202 1349 3661 -368 -1548 875 -749 -1687 867 -1109 -4662 -1468
1588 -1468 1697 -2062 -4184 -243 1009 -885 166 675 -938 724 3606 1353 -1300 2060 3996
1603 3996 390 -324 2015 1033 -317 540 -653 -2463 -416 929 -2127 -4053 -757 116 -2068 -1788
1619 -1788 -186 -1092 -306 1491 567 -833 1707 2968 379 119 2527 2642 442 618 922 -250 170
1636 170 1240 -1124 -2896 -318 123 -2353 -2406 -267 -946 -2068 -777 -220 -1022 603 1719 -437 -512
1653 -512 2448 3129 497 644 2146 1147 751 1907 624 -1271 463 931 -2414 -2591 416 -158 -2971
$$ packed form
1541D238k399l595L548M06k482L599R96n956K91O589k844o135L065L386l824j364
1557b481K240k424l84M539j667n539L323N859l351l217L722R93j978K409Q54l848
1573i50J401M351k869m135L551K312m029j180K423j624r38K554j976l553L194
1588a468L165l759k122L941J252j894J051N09j613J662K882k253k653L360J936
1603C996l606p14K339r82j350Q57j193j810K047J345l056j926L296Q73k184K80
1619a788J602r06P86J797r24j400K540J261k589k60K408J15k200J76L04j172M20
1636A70J070k364j772K578M41k476n3K139o79j122J291N57q02J625J116k156p5
1653e12K960O81k632J47J502r99l96J156j283j895J734M68l345j77L007n74k813
$$ plain form
1670 -2971 -1957 -888 -1866 -432 1436 -1194 -2404 1008 2486 40 493 2502 755 109 2638 2145
1686 2145 -341 1098 2151 -1165 -1633 1488 431 -2390 -1119 -397 -2927 -2040 1017 -935 -3016 -809
1702 -809 595 -1568 420 2649 -384 -1566 2692 2917 0 1209 2867 -136 -423 2867 639 -2172
1718 -2172 799 1387 -2719 -2444 1047 -1035 -2769 -63 -809 -3943 -756 2902 -937 -2637 1379 1200
1734 1200 -546 2274 3243 -843 -241 4013 1589 -1644 1783 2362 -1611 -914 1623 -1450 -2637 1524
1750 1524 43 -4947 -2226 1437 -843 -1616 577 -1304 -3359 2072 3543 -1251 -1256 2944 1787 -129
1766 -129 2663 2152 -1681 674 3396 -1098 -2127 2155 1087 -2905 -1272 286 -2678 -1480 2029
1781 2029 -2041 -5026 115 2694 -1330 -1124 1154 -689 -380 3801 2345 -1815 1009 4067 269
$$ packed form
1670b971J014J069r78J434J868k630j210L412J478k446M53K009j747o46K529m93
1686B145k486J439J053l316m68L121j057k821J271P22k530Q87L057j952k081K207
1702h09J404k163J988K229l033j182M258K25k917J209J658l003k87L290k228k811
1718b172K971N88m106K75L491k082j734K706p46l134L187L658l839j700M016j79
1734A200j746K820R69m086O02M254k424l233L427N79l973O97K537l073j187M161
1750A524j481m990K721L663k280p73K193j881k055N431J471m794nM200j157j916
1766a29K792n11l833K355K722m494j029M282j068l992J633J558k964J198L509
1781B029m070k985N141K579m024K06K278j843L09M181j456m160K824L058l798
$$ plain form
1796 269 -767 2313 793 -1804 993 1606 -2981 -1896 1960 -705 -3480 -966 -596 -2444 378 1839
1812 1839 -2410 -2658 2568 2556 -1474 405 2136 13 911 3607 752 -1601 1949 2789 -1246 -1294 1077
1829 1077 -707 -1338 991 -1073 -4310 -940 2378 -1574 -3389 -320 139 -676 1323 860 -1703 295
1845 295 3609 1148 -1061 1807 2627 44 896 1613 -725 -799 2183 539 -3209 -1633 1000 -694
1861 -694 -1574 -600 -2024 -2086 1267 1089 -2381 -1438 2022 914 -686 1138 1557 248 1562 2528 129
1878 129 -426 1854 1327 -756 -342 377 -1278 -910 598 -1285 -2985 -918 700 -1180 -1738 -374 -662
1895 -662 -631 812 742 -626 590 2269 1009 131 1425 1217 406 1421 1509 -1111 -1080 1256 1060 -1435
1913 -1435 -2066 -760 -694 -485 -611 -1899 -1909 353 791 -1161 -1228 903 1269 223 627 954 547 1569
$$ packed form
1796B69j036L080j520k597K797O13m587J085L856k665k775K514L70j848K822J461
1812A839m249k48N226j2m030J879J731k123Q98K696k855k353L550Q40m035m8K371
1829A077j784o31K329k064l237L370L318l952j815L069M59q15J999m63k563J998
1845B95L314k461k209K868Q20k583Q52P17k338p4K982j644l748J576K633j694
1861f94q80R74j424o2L353j78l470R43L460j108j600J824M19j309J314R66k399
1878A29n55K280n27k083M14P19j655L68J508j883j700K067J618j880n58J364k88
1895f62L1J443p0j368J216J679j260q78J294k08q11J015Q8k620L1K336j96k495
1913a435o31J306O6K09j26j288j0K262M38j952o7K131L66j046M04L27m07J022
$$ plain form
1931 1569 2410 251 -1103 765 1687 283 -394 -446 -953 -622 383 -1153 -2960 -1380 690 -817 -1747
1948 -1747 -260 316 -660 215 663 -157 477 1955 1050 -137 1179 1861 224 453 1483 -212 -1431
1965 -1431 343 705 -1442 -1139 -113 -1138 -1714 -220 -668 -1846 -666 1173 -679 -683 936 330 -207
1982 -207 1353 1841 -617 294 2930 1330 -919 477 994 -171 -27 443 -1825 -1510 1295 -123 -3127
1999 -3127 -1332 932 -957 -1635 324 -226 -1208 1324 1287 -1207 120 2585 1095 -452 1391 1308 -479
2016 -479 1007 1910 -1352 -1633 1749 197 -2165 -806 522 -1457 -1656 183 -1194 -2041 537 836
2032 836 -1975 -330 2307 -14 -944 1872 1670 -650 720 2302 72 -363 1910 324 -1644 527
2048 527 1173 -1968 -1735 711 -890 -2277 -36 -84 -2420 -382 1406 -1078 -1673 1934 1350 -886 667
$$ packed form
1931A569Q41k159j354J868R22j404o77n2n07L31J005j536j807J580K070j507r30
1948a747J487N76r76Q75M48q20O34J478r05j187J316O82j637K29J030j695j219
1965a431J774L62k147L03J026j025n76J494m48j178J180J839j852mJ619o06n37
1982b07J560M88k458R11K636j600k249J396N17j165J44M70k268L15K805j418l004
1999c127J795K264j889o78J959n50r82K532l7k494J327K465j490j547J843q3j787
2016d79J486R03l262k81L382j552k362J359J328j979j99J839j377q47K578K99
2032H36k811J645K637k321r30K816k02k320J370J582k230m35K273j586j968K171
2048E27O46l141K33K446j601j387K241m8k336K038J788k484n95L607n84k236J553
$$ plain form
2065 667 2100 65 666 2422 288 -1425 1754 1982 -1296 -929 1144 -675 -1878 163 -558 -2588
2081 -2588 -243 1008 -1862 -1994 1278 444 -1438 537 1213 -709 367 2280 370 -726 1950 2148
2097 2148 -869 186 1770 45 -1164 857 36 -2001 -176 582 -2081 -1798 759 -697 -2259 -271
2113 -271 608 -1039 -252 1282 -292 -584 2060 1497 -906 683 2359 318 -283 1247 509 -1009 612
2130 612 611 -1754 -1144 682 -604 -2088 -415 64 -1417 -616 532 -891 -626 1311 804 -1018 768
2147 768 1837 466 108 1622 911 -31 1039 856 -1114 -524 947 -413 -1626 27 0 -1388 -1010
2164 -1010 -16 -1139 -1051 357 -16 -1011 243 1245 -106 -207 1341 1051 319 964 1057 -108 365 1227
2182 1227 -109 -925 170 303 -820 -1030 -182 -602 -922 -481 -621 -1352 -512 572 -405 -978 761 942
$$ packed form
2065F67J433k035O01J756k134j713L179K28l278L67K073j819j203K041p21k030
2081b588K345J251k870j32L272q34j882J975O76j922J076J913j910j096K676J98
2097B148l017J055J584j725j209K021q21k037J825P58k663K83K557j456j562J988
2113b71Q79j647P87J534j574k92K644n63k403J589J676k041o01J530p38j518J621
2130F12jk365O10J826j286j484J673M79j481Q01J148j423K65J937n07j822J786
2147G68J069j371l58J514p11r42J070j83j970N90J471j360j213J653k7j388L78
2164a010R94j123Q8J408l73r95J254J002j351j01J548k90p32O45R3j165M73Q62
2182A227j336q16J095J33j123k10Q48m20l20M41j40p31Q40J084r77n73J739J81
$$ plain form
2200 942 294 545 678 356 810 1360 636 -393 704 1029 -272 -453 -20 -61 -826 -444 -491 -1077 -608 0
2220 0 -744 -1248 -160 521 -353 -230 637 363 147 1209 1006 -64 900 1279 207 -86 602 720 -540
2239 -540 -310 77 -858 -684 -54 -780 -1588 -394 -13 -1090 -963 527 220 -835 370 650 -229 630
2257 630 1525 357 -248 1397 1371 -534 220 809 -270 -813 530 -152 -1186 -336 0 -1719 -1243 604
2275 604 -374 -1429 -48 411 -621 247 1258 -171 -391 1761 1251 -186 477 1578 340 -175 712
2292 712 -56 -737 338 677 -1534 -993 603 -703 -1866 -196 74 -1271 -283 663 -717 -810 1177
2309 1177 912 -596 602 1550 -163 48 1763 581 -610 1048 1007 -1045 -558 885 -420 -1564
2325 -1564 265 -26 -1862 -559 548 -910 -1036 675 -17 -1184 674 1513 -647 -175 1663 693
$$ packed form
2200I42o48K51J33l22M54N50p24j029J097L25j301j81M33m1p65L82m7n86M69O08
2220@p44n04J088O81q74J23Q67k74k16J062k03j070R64L79j072k93O88J18j260
2239e40K30L87r35J74O30p26q08J194L81j077J27J490l07j055J205K80q79Q59
2257F30Q95j168o05J645k6j905P54N89j079n43J343o82j034Q50L36j719M76J847
2275F04r78j055J381M59j032Q68J011j429k20K152n10j437O63J101j238n15Q87
2292G12p68o81J075L39k211N41J596j306j163J670K70j345R88R46j380r3J987
2309A177k65j508J198R48j713K11J715j182j191J658m1k052M87J443j305j144
2325a564J829k91j836J303J107j458j26J711o92j167J858Q39k160M72J838r70
$$ plain form
2341 693 -309 1126 932 -642 519 1494 -592 -967 840 219 -1397 -583 259 -1186 -801 543 -659
2358 -659 -1718 273 973 -643 -225 1153 -150 -440 1582 818 -678 685 1916 -222 -570 1121
2374 1121 333 -1074 390 386 -1469 -837 736 -655 -1417 -176 -4 -1337 -256 876 -628 -735 1263
2391 1263 892 -863 484 1382 132 159 1523 160 -750 1129 910 -800 -557 586 -232 -1208 -26
2408 -26 -362 -1649 -214 519 -876 -1050 453 299 -670 501 587 -438 444 1787 303 -522 1005 1256
2426 1256 71 -19 672 -182 -591 615 -36 -1285 -396 458 -672 -824 -151 -457 -1133 211 589 -925
2444 -925 -454 1002 529 -78 434 664 80 803 987 -167 -210 1137 750 -580 -307 -5 -530 -405 209
2463 209 -650 -1238 -23 214 -585 -992 -141 137 97 486 214 -164 521 1160 258 -191 570 1055 331 267
$$ packed form
2341F93j002J435j94j574J161R75k086l75J807o21j616Q14Q42j445L85J344j202
2358f59j059J991P00j616M18J378j303k90K022p64j496J363J231k138l48J691
2374A121p88j407J464mj855O32J573j391p62J241J72j333J081J132j504j07J998
2391A263l71j755J347Q98j250K7J364j363r10J879k19j710K43J143q18r76J182
2408b6l36j287J435P33j395j74J503j54r69J171Q6j025Q82J343j484q25J527K51
2426A256j185r0O91q54m09J206o51j249Q89Q54j130j52O73l06o76J344L78j514
2444i25M71J456m73o07N12K30n84P23J84j154m3J347l87j330K73L02n25J25O14
2463B09q59n88J215K37p99m07Q51K78m0L89k72l78O85O39r02m49P61M85p24o4
$$ plain form
2483 267 400 -228 -81 311 -38 -1020 -615 -67 -543 -571 -440 -364 -504 -102 181 -289 -378 644 464 93 600
2504 600 569 248 519 878 318 -202 335 635 -207 -156 -98 -522 -476 54 -217 -1115 -748 381 -293 -569 -41
2525 -41 86 -86 252 930 -210 90 1075 880 -153 165 652 365 296 499 -197 -720 348 178 -766 -594
2545 -594 234 -76 -931 -139 -211 -654 -218 285 -627 -341 1042 559 -285 383 1021 329 149 1126 256 -460
2565 -460 501 722 -521 -128 323 -677 -1142 96 -159 -1122 -401 135 -730 -516 581 118 -543 312 1018
2584 1018 -120 -71 910 428 -73 890 718 -447 264 1137 -368 -1003 197 66 -1021 -393 23 -963
2602 -963 -479 595 -453 -1352 495 802 -462 -120 832 -180 -156 989 752 -215 412 1091 -8 -349
2620 -349 834 268 -710 182 324 -800 -697 257 -506 -890 117 97 -1039 -226 744 -262 -721 736
$$ packed form
2483B67J33o28J47L92l49r82M05N48m76k8J31P6j40M02K83m70q9J022j80l71N07
2504F00l1l21K71L59n60n20N37L00q42N1N8m24M6N30k71q98L67J129o74k76N28
2525d1J27j72L38O78j140L00R85j95j033L18M87k87o9K03o96n23J068j70r44J72
2545e94Q28l10q55P92p2m43M36N03r12K86J383m83q44O68O38o92j80R77q70p16
2565d60R61K21j243L93M51j000m65J238k55r63P21N36q65K14J097m63o61Q55P06
2584A018j138M9R81m82n01R63j72j165P11Q73j505o35J200j31j087O28M16r86
2602i63M84J074j048q99J847L07j264L42R52j012K4J145k37r67O27O79j099l41
2620c49J183n66r78Q92J42j124J03R54p63l84J007k0j136Q13R70j006m59J457
$$ plain form
2638 736 450 -343 604 923 -182 -71 1199 264 -439 590 653 -727 -430 490 -600 -735 342 36
2656 36 -1150 -403 615 -402 -572 280 -67 -450 599 489 -398 -118 1159 547 -382 412 511 -213 125
2675 125 621 -301 -595 436 361 -921 -445 338 -710 -558 369 -336 -901 299 180 -447 -168 817 146
2694 146 -109 695 639 -37 524 808 -7 -295 403 38 -518 348 158 -623 -500 117 -256 -932 -74 -1 -547
2715 -547 -58 343 -191 -335 534 342 -148 242 698 -37 171 695 89 -259 474 247 -414 -301 116 -264
2735 -264 -383 -133 -189 -556 -233 25 -512 -541 151 120 -348 104 417 27 -28 590 287 232 98 166 -117 -11
2757 -11 441 163 -134 109 -102 -327 -198 -186 -466 -401 -177 83 -380 -149 114 -232 -197 159 153 148 191 307 234
2780 234 161 418 292 -177 42 200 130 -113 44 -238 -365 -237 172 -523 -450 123 -277 -385 -168 184 17
$$ packed form
2638G36k86p93R47L19j105J11J270r35p03J029O3j380K97R20j090j35J077l06
2656C6j186P47J018j017j70Q52l47l83J049j10q87K80J277o12r29P94R9p24L38
2675A25M96r22k94J031p5j282M76P83j048J52R27p05n65J200j19o27K79R85o71
2694A46k55Q04n6o76N61K84q15k88O98l65n56Q66j90p81J23O17l73o76Q58P3n46
2715e47M89M01n34j44Q69j92m90L90M56p35K08N24o06l48P33k27o61J13M17l80
2735b64j19K50n6l67L23K58n37k9O92l1m68M52L13l90n5O18l03n5j34O8k83J06
2757a1M52k78k97K43k11k25J29J2k80O5K24K60m63K31K63l46L5L56onM3J16p3
2780B34p3K57j26m69K19J58p0k43J57k82j27J28M09o95P3N73m00j08K17L52j67
$$ plain form
2801 17 185 444 319 156 360 411 94 173 450 108 -43 220 306 -309 -347 -50 -448 -493 -11 -261 -688 -183
2823 -183 199 -288 -214 219 213 -229 108 173 -105 164 700 176 26 261 276 -228 32 181 -226 -431 48 -101
2845 -101 -550 -81 96 -542 -288 -102 36 -453 97 192 -516 315 618 180 13 491 425 32 283 367 19
2866 19 -178 488 10 -300 -38 171 -469 -340 180 -161 -547 -107 202 -399 -85 508 34 -123 377 292 -143
2887 -143 203 708 55 48 501 238 -43 101 198 -358 -190 331 -178 -685 -96 54 -664 -304 277 -406 -501
2908 -501 462 65 -392 236 416 -159 -12 590 264 -295 401 559 -177 -39 591 -238 -421 287 78 -500
2928 -500 11 183 -526 -265 52 -18 -431 197 265 -311 -92 438 78 -189 535 137 -163 70 510 -56 -394
2949 -394 369 59 -432 1 -18 -231 -163 267 -235 -580 -86 103 -430 -246 355 -203 -93 292 273 -171 60
$$ packed form
2801A7J68K59j25j63K04N1l17P9K77l42j51K63Q6o15l8K97l98m5M82k50m27N05
2823a83L82m87P4M33om42L37O5k78K69N36n24j50K35J5n04K60J49m07k05M79j49
2845a01m49M69J77o38K54J86J38m89N50R5p08Q31L03m38j67M78o6l93K51Q4l48
2866A9j97O66m78l10K62K09o40J29N20l41l86M40L09o01L14N93m74j57N00q5m35
2887a43L46N05o53pM53k63k81J44R7n56J68N21n09n07N89J50p18L60N81o83r5
2908e01R63l97m57O28J80n75J47O02l26n59O96J58p36J38O30q29j83P08k09n78
2928e00N11J72p09K61L17p0m13O28O8n76K19N30l60k67P24l98l00K33M40n66l38
2949c94P63l10m91M33j9k13O8M30n02l45M94J89n33J84O01n58J10L85j9m44K31
$$ plain form
2970 60 688 -119 38 501 97 -273 95 88 -583 -109 103 -249 -429 -51 -191 -489 -126 -44 -331 -344 133 153
2992 153 -225 308 270 252 201 355 307 -123 366 381 -73 -30 260 -202 -308 316 -48 -479 -73 93 -356 -81
3014 -81 -120 82 -264 243 47 -182 85 269 196 -43 291 272 154 -9 339 -67 33 245 172 -306 -129 -35
3036 -35 -383 -119 86 -113 -318 -295 228 -487 -103 30 243 -116 142 154 261 304 236 -6 105 212 299 11
3058 11 74 52 -24 -135 -52 -86 -313 -273 94 -225 -255 104 -181 -109 23 296 -95 -11 164 56 129 109 127 252
3082 252 52 490 169 26 188 143 -100 -245 -189 113 -90 -65 0 -514 39 -69 75 -405 113 111 45 81 75
3105 75 161 2 158 297 -33 48 193 -156 -350 31 121 -36 -143 146 -64 -238 53 -153 -325 -42 -50 -175
3127 -175 -90 316 -91 150 91 132 -13 140 252 26 -40 4 58 -209 126 80 -52 -197 94 -337 -228 7
$$ packed form
2970F0O28q07J57M63m04l70L68po71M74K12l52j80L78j40k98L63Q2k87j3M77K0
2992A53l78N33l8j8n1J54m8m30M89J5m54M3K90m62j06O24l64m31M06J66m49K75
3014h1l9K02l46N07j96k29K67J84p3k39L34j9j18j63L48m06J00K12p3m78J77R4
3036c5l48K64K05j99k05K3N23p15L84J33K13l59K58J2J07M3o8k42J11J07Q7k88
3058A1O3k2p6j11Q3l4k27M0L67l19l0L59k85P2J32K73l91Q4J75j08P3k0J8J25
3082B52k00M38l21j43J62m5k43j45N6L02k03K5O5n14N53j08J44m80N18ko6L6o
3105G5Q6j59J56J39l30Q1J45l49j94L81R0j57j07K89k10j74K91k06j72K83qj25
3127a75Q5M06m07K41n9M1j45J53J12k26o6M4N4k67L35m6j32j45K91m31J09K35
$$ plain form
3149 7 9 -377 -167 206 12 -177 106 256 -237 11 204 101 125 308 278 105 124 59 -239 -158 43 -82 -308
3172 -308 -3 -52 -212 -187 118 -88 -215 9 130 -288 143 151 -89 -65 308 116 -97 -93 305 92 21 150 44
3195 44 -184 55 -208 -125 264 -129 -86 -78 36 -1 -146 -11 49 -232 -330 -24 171 -142 288 366 114 181 136 -28
3219 -28 87 116 -125 -49 34 -53 -64 -172 77 -53 -226 -17 119 -365 17 -2 -123 -20 251 148 -260 155
3241 155 -57 -116 29 162 204 36 181 144 -99 1 371 34 -95 -147 -29 -103 -251 -38 -92 -112 43 72 -93
3264 -93 51 125 124 -93 143 -87 -2 285 215 -62 -46 24 69 -205 -50 93 -227 19 46 -256 115 147 96 -164
3288 -164 34 94 -142 -66 174 -169 67 258 165 197 84 152 133 -110 -93 -33 -76 -246 -77 -266 -146 -13 22
3311 22 100 -35 -59 143 -249 -70 -131 113 -39 40 31 29 198 81 -93 -127 83 32 -25 99 -84 116 151 21
$$ packed form
3149GKl86K10L73j94j89K83J50m93K48J93j03K4J83l0j73J9o5k98Q1K01j25k26
3172c08L05m9j60K5L05k06j27K24J21m18M31Qk40K4L73j92k13ML98k13p1J29j06
3195D4k28K39k63Q3L89l93M3QJ14l7j45J35O0k81r8L06J95l13M30P8k52O7m5j64
3219b8J15K9k41P6Q3q7j1j08K49j30j73K09J36m84L82j9j21J03K71j03m08M15
3241A55k12n9J45J33M2j68J45l7k43J00L70l37j29n2J18p4j48K13n4k0J55K9j65
3264i3J44P4jk17K36k30Q5K87p0k77J6P0M5k74J55J43l20K46K7l02L71L2n1k60
3288a64J98O0k36P6K40l43K36J91r3L2j13O8j9k43J7O0m3j70J69j89J20J33L5
3311B2P8j35k4K02l92J79o1K44j52P9rkJ69j17j74l4K10n1n7J24j83K00L5j30
$$ plain form
3335 21 165 120 -39 -57 -225 -24 -112 -108 44 102 213 131 89 -7 118 34 -35 66 -123 155 57 -82 -97 66 0
3360 0 101 75 -49 -37 -67 109 -235 -204 6 70 -10 42 18 -109 11 -39 -64 -170 -160 -222 8 -43 -28 -63 -22 -84
3386 -84 54 -87 -146 40 -45 -79 -69 59 3 -60 56 -197 -152 -49 -80 102 309 175 -109 5 -73 137 7
3409 7 8 -167 -33 -87 56 53 14 11 179 -20 -168 123 -33 -109 -141 -39 -124 -130 -37 -22 4 -81 -51 30 54 218 27
3436 27 -13 111 -227 7 -65 -69 -190 -267 -197 -205 -58 -167 -44 -15 108 26 -189 37 66 100 -146 -75 307 159 97
3461 97 116 10 27 30 27 -372 -4 -31 22 64 -78 24 63 49 -74 -86 -82 -211 66 11 89 30 2 113 21 171 -32
3488 -32 2 -76 103 67 -47 -143 -60 -22 -26 -102 -25 -81 -26 -39 196 218 -42 154 218 -22 18 284 25 -34 73 73 -49
3515 -49 74 -180 -192 -32 131 -129 -121 34 71 54 -114 22 -16 123 -148 60 -74 100 141 89 83 116 152 -111
$$ packed form
3335B1J44m5j59j8j68K01q8MJ52N8J11q2m2r6J25q4o9J01j89K78r8j39j5J63o6
3360@J01k6j24J2l0J76l44L1K10O4q0N2k4j27J20n0k5j06J0o2K30n1J5l5M1o2
3386h4J38j41n9J86q5l4J0J28n6o3J16k53M5J03l1J82K07j34k84J14p8K10j30
3409GJj75J34n4J43ll9lJ68j99j48K91j56p6l2J02q5oR3J5K6q5L0Q1K4J64j91
3436B7m0J24l38K34p2mj21p7P0qJ47j09J23K9J23q2k15K26K9L4k46P1L82j48o2
3461I7J9j06J7Lll99L68k7N3M2j42J02L9j4j23j2Mj29K77n5P8n9k8J11r2J50k03
3488c2L4p8J79l6j14r6Q3L8mp6P7n6N5j3K35K2k60J96O4k40M0K66k59n9J07%j22
3515d9J23k54j2J60J63k60QJ55L7j7j68J36l8J39k71K08j34J74M1n2oL3L6k63
$$ plain form
3539 -111 129 128 -81 144 -160 -158 -39 -216 146 112 -119 -80 -180 -14 -123 -95 -45 -11 -41 108 53 -44 -98 -17 134
3564 134 17 -76 178 12 54 24 -49 -85 15 -77 56 -178 10 114 -67 51 100 -35 -33 -71 -106 110 -16 110
3588 110 107 -44 2 -56 95 193 177 43 -24 -18 -117 18 -209 -250 95 -50 -37 -192 160 -34 124 49 -28 -107 -61
3613 -61 15 23 173 129 180 56 247 -50 40 -4 -52 -34 -93 63 133 21 -343 -58 -9 -200 28 -208 -15 125
3637 125 -109 -109 24 -52 -11 -54 128 -49 66 126 68 109 148 -55 74 -62 -234 199 -64 13 6 -40 -31 49 -128
3662 -128 -207 31 -82 285 133 169 51 187 48 115 138 -108 160 103 -323 160 -34 -13 -37 -87 76 18 56
3685 56 107 -99 -10 -78 -230 -147 113 146 -85 125 165 192 20 -16 127 -230 -96 206 16 -79 135 -4 -91 -75
3709 -75 16 -35 -80 -53 -113 -353 21 -89 -259 -29 113 -113 -224 101 48 -110 -3 158 -27 -39 98 -41 60
$$ packed form
3539a11K40jk09K25l04KJ19j77L62l4k31L9j00J66j09K8N0L4l0J49n5r7n4Q1J51
3564A34j17r3K54j66M2l0p3l6J00r2J33k34J88J04j81J18M9j35Kl8l5K16j26J26
3588A10lj51M6n8J51R8j6j34o7Or9J35k27m1L45j45J3j55L52j94J58p5p7p9M6
3613f1P6QJ50m4N1j24J91k97R0m4m8J8n9J56P0j12l64K85M9j91K28k36J93J40
3637A25k34%J33p6M1m3J82j77J15O0n8M1L9k03J29j36j72M33k63P7pm6RQ0j77
3662a28p9K38j13L67j52L6j18J36j39O7K3k46K68n7m26M83j94K1k4n0J63n8L8
3685E6N1k06Q9o8j52Q3K60L3k31K10M0K7j72l6J43l57J34L02j90r5K14j39q7J6
3709g5R1n1m5K7o0k40L74j10j70K30J42k26j11L25n3j58J07J61j85j2J37j39J01
$$ plain form
3732 60 -26 11 -240 -90 45 -178 -144 -117 -54 -317 -81 51 57 -52 47 -5 -140 0 312 80 36 -27 179 -13
3756 -13 108 271 -253 -86 30 -47 -50 25 13 -206 -183 55 -115 -49 119 49 18 32 77 -198 -163 331 82 -93
3780 -93 260 359 -138 -48 245 -22 70 90 23 -266 77 15 -256 -202 72 -139 -141 -87 -206 -75 36 185 -60 -312
3804 -312 176 202 151 62 106 -13 49 351 -16 -115 60 75 -101 -73 159 30 -269 244 -86 -256 -16 -20 54 5
3828 5 97 -35 -218 161 284 -46 24 259 321 44 342 244 15 -111 394 -98 -129 61 136 -130 -241 -9 -297
3851 -297 -197 -59 88 -202 435 197 -71 -116 164 -21 -43 334 199 124 -123 347 -161 92 59 96 -178 28
3873 28 34 -142 -102 -12 -46 -115 -153 0 110 -7 88 -57 -158 172 87 -248 103 69 86 -15 224 55 -66 -78
3897 -78 -47 2 93 -234 -36 -96 -203 -81 -280 -135 -77 -37 -118 -64 6 -73 177 28 -59 -88 134 227 -88 36 179
$$ packed form
3732F0q6L7k51J50J35k23L4K7O3k63K36J32Oj09R9n2j35J40L12k32m4o3K06j92
3756a3J21J63n24J67J16p7lP5j2k19K3K38j70O6J68p0l1J4M5k75L5M94k49j75
3780i3L53R9m97R0K93k67R2K0o7k89L43o2k71N4K74k11kN4j19J31J11J49k45k52
3804c12M88K6n1q9M4j19O2L02l67r9J75J5j76K8K32j29k99N13l30j70K40mP4m9
3828ER2j32j83L79J23l30P0K35O2k77K98r8k29j26N05m92l1J90P5k66j11K32k88
3851b97J00J38J47k90O37k38k68m5K80j85k2L77j35p5k47M70n08K53l3L7k74K06
3873B8Oj76M0R0l4o9l8J53J10j17R5j45j01L30q5l35L51l4J7j01K39j69j21j2
3897g8L1M9R1l27J98o0j07J22j99J45N8M0q1N4P0p9K50j49q7k9K22R3l15J24J43
$$ plain form
3922 179 169 34 128 18 -114 -117 78 -231 -179 -106 89 -248 -103 170 65 -64 -120 122 -151 254 187 151 186
3945 186 90 -43 43 -24 123 -88 7 88 -48 -189 -138 32 -308 -176 -191 -167 -192 81 -55 -135 -63 175 126 84
3969 84 257 240 -28 -65 171 111 -13 110 153 -28 41 122 -218 -17 225 -205 -335 7 30 -159 -319 90 -110
3992 -110 -162 200 -5 143 122 145 82 -13 359 -59 -22 76 272 -194 -128 206 61 -92 125 17 -248 -96 -45
4015 -45 -35 -323 59 29 -252 -1 285 -129 106 264 -45 62 276 444 -28 -7 213 -115 -90 261 136 -133
4037 -133 -1 25 -275 -270 105 -69 -238 121 1 -190 31 20 -29 -192 221 322 -288 157 259 -98 -17 269
4059 269 -189 -284 42 152 -188 -111 -70 -231 -437 186 -25 -404 -301 93 -186 3 -13 210 -2 224 299 -53
4081 -53 -41 221 149 -57 212 156 -84 22 376 -61 -352 85 138 -354 35 71 -210 56 -103 -205 -532 -34
$$ packed form
3922A79j0j35R4j10j32lJ95l09N2P3J95l37J45K73j05j29n6K42k73M05o7l6L5
3945A86r6j33Q6o7J47k11R5Q1j36j41N1J70l40J32j5K4k5K73j36q0P2K38m9m2
3969H4J73j7k68l7K36o0j24J23M3j81O9Q1l40K01K42m30j30L42K3j89j60M09k00
3992a10n2L62k05J48k1K3o3r5L72m18L7R8J96m66O6L34j45j53K17j08k65J52N1
4015d5J0k88L82l0k81K51K86m14K35J58l09J07K14J68m72K1K20l28K5L51j25k69
4037a33J32K6l00NL75j74j69L59j20j91K21j1m9j63M13J01o10M45J02l57Q1K86
4059B69m58r5L26J10l40P7M1j61k06O23k11l79J03L94k79J89j6K23k12K26P5l52
4081e3J2K62p2k06K69n6k40J06L54m37k91M37N3m92L89L6k81K66j59j02l27M98
$$ plain form
4103 -34 288 -168 -95 61 140 31 259 256 -31 163 220 -67 -291 254 60 -273 120 41 -82 -410 44 -229
4125 -229 -497 -179 150 -280 -190 170 -152 10 238 45 153 113 302 3 97 61 205 -6 276 240 -136 -87
4147 -87 -109 -45 -291 32 -115 -47 34 128 -138 -242 28 86 -27 43 81 -34 149 418 27 -73 181 57 31
4170 31 68 259 15 -97 -108 -192 -169 -236 -60 -180 -113 -14 -72 -155 14 -12 -142 128 250 71 -4 173 245 188 97
4195 97 173 59 -174 68 -165 -271 -75 -6 -295 -19 -258 -82 39 -377 -131 71 -67 -189 -138 -167 32 116
4217 116 191 -94 212 302 34 93 387 205 33 -157 -24 -158 -113 -82 -263 -318 -1 -206 -181 -158 -112 3 -2 99
4241 99 -69 -156 -16 373 181 -41 274 77 19 226 206 -81 -291 -97 41 -126 -115 -65 -491 -155 160 -360
4263 -360 -235 77 -183 -267 214 257 -141 -36 217 157 -195 168 194 -17 60 365 132 -177 300 -3 -167 -291
$$ packed form
4103c4L22m56P3J56P9j09K28lk87J94N7k87k24N45j94l33L93p9j23l28M54k73
4125b29k68L18L29m30R0L60l22J62K28j93J08m0J89k99R4l6J44k11K82l6l76M9
4147h7k2O4k46L23j47O8Q1R4k66j04K70N8j13P0L8j15J83K69l91j00K54j24k6
4170C1L7J91k44j12j1q4K3o7J76j20O7R9n8q3J69k6j30K70J22j79p5J77P2n7r1
4195I7P6j14k33K42k33j06J96O9k89K76k39J76J21m16K46K02j38j22N1k9J99Q4
4217A16P5k85L06R0k68N9K94j82j72j90J33j34M5L1j81n5L17k05K5K3M6J15nJ01
4241I9j68q7J40L89j92k22L15j97n8K07k0k87k10J94J38j67J1N0m26L36L15n20
4263c60J25L12k60q4M81M3l98J05K53o0l52L63K6k11P7L05k33l09M77l03j64j24
$$ plain form
4285 -291 106 -49 -261 -89 27 -398 -73 237 -223 133 342 -45 -221 385 276 72 501 433 -135 16
4305 16 309 309 -187 145 -11 -160 -169 192 -44 -273 116 -182 -336 -50 210 -59 -261 278 295 -211 -12 236
4327 236 -51 75 416 162 -179 214 63 -110 -112 386 -318 -207 50 -128 -260 -171 58 -397 -290 113 22
4348 22 -289 117 305 -71 -169 233 130 79 307 124 199 -28 322 -202 -280 233 -52 -148 -87 57 -237 -287 -48
4371 -48 -126 -381 -32 156 -235 -160 122 -128 43 184 94 -88 257 469 -18 78 260 -25 128 34 184 -204
4393 -204 -128 214 -154 -316 -22 -170 -409 -207 107 -241 -188 17 63 -174 121 167 -30 -76 420 136 -21 260
4415 260 220 -59 186 173 46 -309 -173 -123 -335 -162 -161 -399 -310 38 -184 -45 241 1 39 129 380 198 23
4438 23 213 318 82 327 392 -125 2 131 -26 -384 28 132 -141 -189 -171 -50 -263 -40 -120 -48 22 264
$$ packed form
4285b91L97j55k12J72J16m25L25L10m60L56K09l87j76O06j09k04M29o8n68J51
4305A6K93%m96L32j56j49rL61k36k29L89k98j54K86K60k69k02N39J7n06J99K48
4327B36k87J26L41k54l41L93j51j73kM98p04J11K57j78j32Q9K29m55J07M03r1
4348B2l11M06J88l76r8M02j03n1K28j83P5k27L50n24p8N13k85r6O1J44k94n0K39
4371d8p8k55L49J88l91P5K82k50J71J41r0j82L45K12m87R6J82k85J53r4J50l88
4393b04P6L42l68j62K94j48k39K02L14l48N3K05M6k37K95M6j97m6M96k84j57K81
4415B60m0k79K45j3j27l55J36N0k12J73Jk38Q9L48k22J39K86k40L8R0K51j82j75
4438B3J90J05k36K45O5n17J27J29j57l58M12J04k73m8J8J21k13K23q0P2P0K42
$$ plain form
4460 264 -46 -155 209 64 88 122 171 46 96 296 60 -33 174 113 -191 -190 -14 67 -135 -400 -105 -285 -181
4483 -181 -103 -5 -52 186 206 63 -45 143 90 66 -90 218 125 23 216 30 -99 189 115 -46 -39 29 -158 -415
4507 -415 -202 -169 -196 -281 91 199 -124 305 35 -5 -14 202 207 -71 217 160 153 24 -72 -67 -24 261 15 -95 -160
4532 -160 -88 -316 -215 -242 -251 -147 93 -108 -359 -81 192 121 101 82 102 -2 178 337 154 3 83 91 -84 -67
4556 -67 -64 -205 -58 -56 -187 -321 -24 -7 -206 -256 63 -184 -152 37 112 -108 221 358 -69 72 286 210 61
4579 61 313 358 -128 -17 269 -147 -413 46 -28 -422 -251 -103 -172 -307 126 73 25 31 273 -182 120 360 11
4602 11 -149 418 570 -184 160 373 -87 -183 143 -47 -491 -169 140 -356 -333 19 -132 -346 19 50 -255
4623 -255 -43 199 -12 -147 170 358 -248 231 462 -83 70 278 22 -19 300 140 -335 -108 164 -230
$$ packed form
4460B64l10j09L64j45K4L4M9j25N0K00k36r3K07o1l04JJ76Q1k02k65K95j80J04
4483a81P8R8m7K38K0j43j08J88n3k4j56L08r3j02J93j86j29K88p4j61PO8j87k57
4507d15K13L3k7q5L72J08l23M29k70m0rK16Nk78K88n7pj29r6NM3K85k46j10o5
4532a60P2k28J01k7rJ04K40k01k51K78K73p1k0j9K0j04J80J59j83j51Q0Qj75J7
4556f7Lj41J47Kj31j34K97J7j99n0L19k47L2J89P5k20L29J37m27J41K14p6j49
4579F1K52M5m86J11K86m16k66M59p4l94J71J48o9j35M33n3m8OK42m55L02K40l49
4602A1j60N67J52p54L44K13m60r6L26j90m44L22L09m96K3L52j51k14L65L1l05
4623b55K12K42k11j35L17J88o06M79K31n45J53K08k56m1L19j60m75K27K72l94
$$ plain form
4643 -230 -518 -97 -64 -526 -128 130 -191 -77 249 154 -199 64 382 146 115 281 319 -165 263 270 -291 -124
4665 -124 136 -249 -521 151 -59 -488 -59 87 -358 -385 266 -52 -326 296 292 -143 47 253 23 4 433
4686 433 322 -12 205 223 54 -166 119 7 -342 -51 85 -339 -348 -184 -274 -290 262 13 -425 -70 30 -91
4708 -91 -296 191 -82 -35 324 341 -143 -23 204 142 -108 43 9 -343 7 -75 -255 -310 23 -336 -209 82
4730 82 43 -67 -45 -21 148 65 153 509 140 -142 162 128 26 272 89 -300 -148 -18 -27 -240 -23 99 -232
4753 -232 -232 -9 -136 -167 98 -30 -176 85 312 243 -6 19 163 86 258 67 -19 -87 253 127 -31 140 -15
4776 -15 -240 -66 124 -77 -266 -207 14 -273 -91 -71 -134 -114 193 -8 -32 -24 183 145 225 324 241 207 233 267 178
4801 178 -111 122 -164 -225 -135 81 -126 -395 72 -285 -156 -1 -190 63 -174 105 9 -60 273 152 102 35
$$ packed form
4643b30k88M21L3m62L98K58l21J14L26r5l53K63L18k36l1J66L8m84M28Pn61J67
4665a24K60l85k72O72k10m29M29J46m45k7O51l18k74O22mm35J90K06k30j9M29
4686D33j11l34K17J8j69k20K85j12l49K91J36m24rJ64r0j6N52k49m38L55J00j21
4708i1k05M87k73M7L59J7m84J20K27o2k50J51l4l52L50q2j80n5L33l59J27K91
4730H2l9j10K2K4J69q3Q8L56l69k82L04l4j02K46j83l89J52J30rk13K17J22l31
4753b32%K23j27l1K65j28j46K61K27o9k49K5J44p7J72j91q6o8L40j26j58J71j55
4776a5k25J74J90k01j89N9K21k87J82K0o3K0L07k01k4QK07l8Q0R9q3l4K6L4q9
4801A78k89K33k86o1R0K16k07k69M67l57J29J55j89K53k37K79r6o9L33j21n0o7
$$ plain form
4823 35 349 400 65 232 202 11 -81 104 -61 -229 -172 -162 -314 -157 9 -206 -279 165 65 -156 76 313
4845 313 -86 127 213 138 55 271 157 -258 1 180 98 -173 -73 -42 -381 -179 -184 -329 -159 -112 -31 -200 -110
4868 -110 129 -196 -40 261 -8 -24 231 398 -216 97 262 127 120 445 21 -331 -37 135 -392 -265 95
4889 95 -61 -583 -22 27 -387 -166 167 -103 -99 154 102 -94 96 438 -304 18 426 325 -187 158 328 -151
4911 -151 -54 125 -259 -413 38 62 -633 -188 135 -85 -367 90 67 -285 29 197 -6 255 468 228 -127
4932 -127 162 237 -246 337 452 -232 25 138 52 -339 145 -94 -348 -238 -46 -192 -413 -40 118 -317 -22
4953 -22 112 -263 -206 425 267 -275 161 463 111 -130 272 186 -199 -17 208 -221 -77 33 -226 -394 -88
4974 -88 37 -357 -209 205 8 -249 110 152 -75 313 173 -65 -28 337 -9 -153 306 286 41 -253 147
$$ packed form
4823C5L14N1l35J67l0j91r2J85j65j68N7J0j52J57J66k15p3M44j00k21K32K37
4845C13l99K13Q6p5q3K16j14m15K59J79q2k71J00L1l39K02nj45J70M7Q1j69R0
4868a10K39l25J56L01k69j6K55J67o14L13J65j35pL25m24l52K94J72n27J27L60
4889I5j56n22N61M9m14K21L33k70MK53n2j96J90L42p42L22M08j01n12L45J70m79
4911a51R7J79l84j54M51K4o95M45L23k20k82M57k3l52L14J68k03K61K13k40l55
4932a27K89P5m83N83J15o84K57J13q6l91M84k39k54J10J92j46k21L73J58m35K95
4953b2J34l75N7O31j58n42M36L02l52k41M02q6l85J82K25m29J44J10k59j68L06
4974h8J25l94J48M14j97k57L59M2k27L88j40k38L7L65l46j44M59k0k45k94M00
$$ plain form
4995 147 -303 -150 42 -191 -250 -212 -88 -90 -424 13 95 -351 -49 352 -156 171 295 125 96 183 231 -84 227
5018 227 214 109 38 149 94 -156 -55 7 -318 -264 108 -176 -338 16 -147 -180 47 41 -37 76 80 -47 -14 189
5042 189 396 180 146 199 51 1 -119 -288 -285 -32 77 -266 -132 -271 -189 -216 36 -15 -105 108 17 115 -11 94
5066 94 161 249 118 160 234 189 116 98 94 -191 -166 137 -174 -139 -118 -119 -357 -133 -55 -116 -217 -258 -35 -55 51 100 112
5093 112 -99 126 157 38 284 100 -97 -17 -26 190 114 24 0 -433 30 -42 -181 -147 -44 -252 -190 -8 -162
5116 -162 -112 -191 197 91 -72 110 131 -54 87 428 202 57 119 32 -94 -120 -102 -182 49 72 -205 -356 -89
5139 -89 -35 -225 -137 165 -211 -195 30 71 -232 177 382 77 -6 319 220 -171 225 285 -146 -110 323 -172 -290
5162 -290 -60 -94 -226 -251 176 -117 -460 165 63 -224 117 65 -51 20 407 181 -96 309 137 -40 179
$$ packed form
4995A47m50J53J92k33n9L8J24kl34M37Q2m46L02M01n08L27J24j70k9Q7M8l15L11
5018B27j3j05p1J11n5k50J01O2l25N4L72k84j62L54j63l3K27op8J13Mj27L3K03
5042A89K07k16l4N3j48n0j20j69LK53J09l43J34j39Q2k7K52n1r0K13r1R8j26J05
5066I4O7Q8j31M2P4m5p3j8mk85K5L03l11L5K1jk38K24P8o1j01m1K23k0J06M9J2
5093A12k11K25L1j19K46j84j97Q0rK16p6r0k4m33M63p2j39L4J03k08O2J82j54
5116a62N0p9L88j06j63J82K1j85J41L41k26j45O2q7j26k6J8q0K31K3k77j51K67
5139h9N4j90Q8L02l76J6K25M1l03M09K05l05q3L25r9l91L96O0m31L6M33m95j18
5162b90K30l4j32k5M27k93l43O25j02k87L41n2j16P1L87k26k77M05j72j77K19
$$ plain form
5183 179 316 -166 -226 279 121 -187 -116 188 -210 -270 73 -299 -363 93 269 -179 -144 351 82 -75 383 342
5205 342 41 237 244 40 -179 28 85 -134 -65 236 -419 -227 156 -224 -329 149 -77 -405 -133 288 -67
5226 -67 -176 182 -69 -187 367 287 -115 128 258 176 -41 92 -52 -239 -203 122 -58 -312 -38 -299 -271 -150
$$ packed form
5183A79J37m82o0N05j58l08P1L04l98o0L43l72o4M56J76m48L5M95k69j57M58m1
5205C42l01J96Pk04k19K07N7k19O9L01o55J92L83l80j05M78k26l28K72M21l55
5226f7j09L58k51j18N54q0m02K43J30q2k17J33j44j87L6L25j80k54K74k61K8J21
$$ [...]
8191a52
##END NTUPLES=NMR FID
##END=
