##TITLE=1H ikalashn
T-3
13.12.2024
##JCAMPDX= 6.0         $$ Bruker NMR JCAMP-DX V2.0
##DATA TYPE= NMR FID
##DATA CLASS= NTUPLES
##ORIGIN= UXNMR, Bruker Analytische Messtechnik GmbH
##OWNER= root
$$ TOPSPIN		Version 1.3
$$ 2024-12-13 16:11:00.609 +0400  Irina@DPX200
$$ Compression mode = diff/dup
##.OBSERVE FREQUENCY= 200.131300845
##.OBSERVE NUCLEUS= ^1H
##.DELAY= (6, 6)
##.ACQUISITION MODE= SIMULTANEOUS
##.ACQUISITION SCHEME= undefined
##.AVERAGES= 32
##.DIGITISER RES= 18
##SPECTROMETER/DATA SYSTEM= spect
##.PULSE SEQUENCE= zg
##.SOLVENT NAME= CDCl3
##.SHIFT REFERENCE= INTERNAL, CDCl3, 1, 17.49637
##AUDIT TRAIL= $$ (NUMBER, WHEN, WHO, WHERE, WHAT)
$$ ##TITLE= Audit trail, TOPSPIN		Version 1.3
$$ ##JCAMPDX= 5.01
$$ ##ORIGIN= Bruker BioSpin GmbH
$$ ##OWNER= Irina
$$ $$ F:/spectra/data/iren/nmr/1H/4/audita.txt
$$ ##AUDIT TRAIL=  $$ (NUMBER, WHEN, WHO, WHERE, VERSION, WHAT)
(   1,<2024-12-13 16:10:39.921 +0400>,<Irina>,<DPX200>,<TOPSPIN 1.3>,
      <created by zg
	started at 2024-12-13 16:08:27.500 +0400,
	POWCHK disabled, PULCHK disabled
       configuration hash MD5:
       BE 6D 3F 07 2A EA 11 49 91 17 2B D3 AF B3 58 0D
       data hash MD5: 16K
       2E BD 62 FA 5B CC 51 33 71 55 10 64 F0 3F C7 41>)
$$ ##END=
$$ 
$$ $$ hash MD5
$$ $$ 21 80 60 1E AA 8C 49 E9 AD EF 1B 27 D9 6D 70 6C
##$RELAX= 
##$RELAX= 
##$RELAX= 
##$RELAX= 
##$RELAX= 
##$RELAX= 
##$RELAX= 
##$RELAX= 
##$RELAX= 
$$ Bruker specific parameters
$$ --------------------------
##$DU= <F:/spectra>
##$EXPNO= 4
##$NAME= <1H>
##$PROCNO= 1
##$TYPE= <nmr>
##$USER= <iren>
##$AMP= (0..31)
100 100 100 100 100 100 100 100 100 100 100 100 100 100 100 100 100 100 
100 100 100 100 100 100 100 100 100 100 100 100 100 100 
##$ANAVPT= -1
##$AQSEQ= 0
##$AQ_mod= 1
##$AUNM= <au_zg>
##$AUTOPOS= <>
##$BF1= 200.13
##$BF2= 200.13
##$BF3= 200.13
##$BF4= 200.13
##$BF5= 200.13
##$BF6= 200.13
##$BF7= 200.13
##$BF8= 200.13
##$BYTORDA= 1
##$CFDGTYP= 0
##$CFRGTYP= 5
##$CHEMSTR= <none>
##$CNST= (0..63)
1 1 145 1 1 1 1 1 1 1 1 1 1 1 1 1 1 1 1 1 1 1 1 1 1 1 1 1 1 1 1 1 1 1 
1 1 1 1 1 1 1 1 1 1 1 1 1 1 1 1 1 1 1 1 1 1 1 1 1 1 1 1 1 1 
##$CPDPRG= <>
##$CPDPRG1= <>
##$CPDPRG2= <>
##$CPDPRG3= <>
##$CPDPRG4= <mlev>
##$CPDPRG5= <mlev>
##$CPDPRG6= <mlev>
##$CPDPRG7= <mlev>
##$CPDPRG8= <mlev>
##$CPDPRGB= <>
##$CPDPRGT= <>
##$D= (0..63)
0 2 0 0 0 0 0 0 0 0.06 0 0.03 0 0 0 0 0.0002 0 0 0 0 0 0 0 0 0 0 0 0 0 
0 0 0 0 0 0 0 0 0 0 0 0 0 0 0 0 0 0 0 0 0 0 0 0 0 0 0 0 0 0 0 0 0 0 
##$DATE= 1734091834
##$DBL= (0..7)
120 120 120 120 120 120 120 120 
##$DBP= (0..7)
150 150 150 150 150 150 150 150 
##$DBP07= 0
##$DBPNAM0= <>
##$DBPNAM1= <>
##$DBPNAM2= <>
##$DBPNAM3= <>
##$DBPNAM4= <>
##$DBPNAM5= <>
##$DBPNAM6= <>
##$DBPNAM7= <>
##$DBPOAL= (0..7)
0.5 0.5 0.5 0.5 0.5 0.5 0.5 0.5 
##$DBPOFFS= (0..7)
0 0 0 0 0 0 0 0 
##$DE= 6
##$DECBNUC= <off>
##$DECIM= 32
##$DECNUC= <off>
##$DECSTAT= 4
##$DIGMOD= 1
##$DIGTYP= 9
##$DL= (0..7)
0 120 120 120 120 120 120 120 
##$DP= (0..7)
150 150 150 150 150 150 150 150 
##$DP07= 0
##$DPNAME0= <>
$$ [...]
##$SW= 21.9926040160658
##$SWIBOX= (0..15)
0 0 2 0 0 0 0 0 0 0 0 0 0 0 0 0 
##$SW_h= 4401.40845070422
##$TD= 16384
##$TD0= 1
##$TE= 300
##$TE2= 300
##$TE3= 300
##$TEG= 300
##$TL= (0..7)
0 120 120 120 120 120 120 120 
##$TP= (0..7)
150 150 150 150 150 150 150 150 
##$TP07= 0
##$TPNAME0= <>
##$TPNAME1= <>
##$TPNAME2= <>
##$TPNAME3= <>
##$TPNAME4= <>
##$TPNAME5= <>
##$TPNAME6= <>
##$TPNAME7= <>
##$TPOAL= (0..7)
0.5 0.5 0.5 0.5 0.5 0.5 0.5 0.5 
##$TPOFFS= (0..7)
0 0 0 0 0 0 0 0 
##$TUNHIN= 0
##$TUNHOUT= 0
##$TUNXOUT= 0
##$USERA1= <user>
##$USERA2= <user>
##$USERA3= <user>
##$USERA4= <user>
##$USERA5= <user>
##$V9= 5
##$VALIST= <valist>
##$VCLIST= <CCCCCCCCCCCCCCC>
##$VD= 0
##$VDLIST= <DDDDDDDDDDDDDDD>
##$VPLIST= <PPPPPPPPPPPPPPP>
##$VTLIST= <TTTTTTTTTTTTTTT>
##$WBST= 1024
##$WBSW= 25
##$XGAIN= (0..3)
0 0 0 0 
##$XL= 0
##$YL= 0
##$YMAX_a= 949050
##$YMIN_a= -1420411
##$ZGOPTNS= <>
##$ZL1= 120
##$ZL2= 120
##$ZL3= 120
##$ZL4= 120
##$ABSF1= 10
##$ABSF2= 0
##$ABSG= 5
##$ABSL= 3
##$ALPHA= 0
##$AQORDER= 0
##$ASSFAC= 0
##$ASSFACI= 0
##$ASSFACX= 0
##$ASSWID= 0
##$AUNMP= <proc_1d>
##$AXLEFT= 0
##$AXRIGHT= 0
##$AXTYPE= 0
##$AXUNIT= <>
##$AZFE= 0.1
##$AZFW= 0.1
##$BCFW= 1
##$BC_mod= 2
##$BYTORDP= 1
##$COROFFS= 0
##$CY= 7568.61572265625
##$DATMOD= 1
##$DC= 2
##$DFILT= <>
##$DTYPP= 0
##$F1P= 17.9538593292236
##$F2P= -4.03888763876832
##$FCOR= 0.5
##$FTSIZE= 32768
##$FT_mod= 4
##$GAMMA= 1
##$GB= 1
##$INTBC= 1
##$INTSCL= 1
##$ISEN= 128
##$LB= -0.5
##$LEV0= 0
##$LPBIN= 0
##$MAXI= 945.577
##$MC2= 0
##$MEAN= 0
##$ME_mod= 0
##$MI= -402.1523
##$NCOEF= 0
##$NC_proc= 0
##$NLEV= 6
##$NOISF1= 8.587773
##$NOISF2= 6.764455
##$NSP= 1
##$NTH_PI= 0
##$NZP= 0
##$OFFSET= 17.49637
##$PC= 1
##$PHC0= -10.81236
##$PHC1= -25.59669
##$PH_mod= 0
##$PKNL= yes
##$PPARMOD= 0
##$PPDIAG= 0
##$PPIPTYP= 0
##$PPMPNUM= 100
##$PPRESOL= 1
##$PSCAL= 0
##$PSIGN= 0
##$REVERSE= no
##$SF= 200.13
##$SI= 32768
##$SIGF1= 18.5376
##$SIGF2= -6.396296
##$SINO= 400
##$SIOLD= 32768
##$SREGLST= <1H.CDCl3>
##$SSB= 3
##$STSI= 0
##$STSR= 0
##$SW_p= 4401.40845070422
##$SYMM= 0
##$S_DEV= 0
##$TDeff= 0
##$TDoff= 0
##$TI= <>
##$TILT= no
##$TM1= 0
##$TM2= 0
##$TOPLEV= 0
##$USERP1= <user>
##$USERP2= <user>
##$USERP3= <user>
##$USERP4= <user>
##$USERP5= <user>
##$WDW= 1
##$XDIM= 8192
##$YMAX_p= 0
##$YMIN_p= 0
$$ End of Bruker specific parameters
$$ ---------------------------------
##NTUPLES= NMR FID
##VAR_NAME=  TIME,          FID/REAL,        FID/IMAG
##SYMBOL=    X,             R,               I
##VAR_TYPE=  INDEPENDENT,   DEPENDENT,       DEPENDENT
##VAR_FORM=  AFFN,          ASDF,            ASDF
##VAR_DIM=   8192,          8192,            8192
##UNITS=     SECONDS,       ARBITRARY UNITS, ARBITRARY UNITS
##FACTOR=    0.0002272,     1,               1
##FIRST=     0,             0,               0
##LAST=      1.8609952,     73,              215
##MIN=       0,             -1420411,        -1420411
##MAX=       1.8609952,     949050,          949050
$$ Real data points
##PAGE= N=1
##DATA TABLE= (X++(R..R)), XYDATA
$$ [...]
1721A09k22K11o7L57l83l0j68Q4M9K86j61o3m3M40k51l90K84L4j63LJ42n9R3M3
1745A35m3j60K19j87l7L32o08M6K85M6r7J67r0N0k85J15q9L42J50j89j14L1J17
1768A36j9k57K83j47K83j97k68P9Q5L1l9L8r1Q4k0J85k38r9k2L08J1r4k22J98
1792HqO3j48O0K15j97p4j11R6J48o3j26L28k20k16J80%q6K89M4j47k0j64L2J90
1817G3J08k46p4K91L9j64k34L17j22O4n0j84j76J65J86J43r9j38r1K26K34k11
1839E7j35qJ19l6l4P6R7k20j35J13J46N9k15J78k72L58j63P1P6Kj97J66j59J64
1863A08k83J54o6M7R4j51j24P3J54qR7N5k57O2j32M74m81J90P3j60L0qJ33r1J73
1888A56M8k13k09K69l08N3O0K32mp8jq8o6P1J71M1l81L97j92k5P7Q1k71J38m9
$$ y = [109, -113, 98, 31, 388, 5, -25, -193, -109, -60, 226, 65, 2, -41, 399, 148, -242, 42, 76, -87, -84, 58, -1, 92, 135, 92, -68, 151, -36, -73, 259, -349, -303, -18, 28, -69, 98, 8, 58, -227, -112, -201, 141, 291, 102, -12, 19, 136, 117, -140, 143, -4, 279, 82, -186, -107, -22, 9, -30, 8, -83, 1, -19, 166, -72, -171, -193, 115, 126, 32, -190, 8, 0, 63, -85, -25, 190, -7, -81, -192, -96, 52, -11, -137, 191, -29, -245, -65, -65, -151, 138, 182, 35, 15, -149, -117, 73, 181, -65, -139, 152, 191, 27, -207, 110, -12, 52, 2, -182, -358, -193, -7, 136, 37, -101, -192, 34, 268, 57, -78, -86, 33, -3, -37, 39, 136, -84, -219, -106, 40, 99, -116, 62, -210, 148, -15, 56, 132, 134, -63, 103, -56, 108, -175, -21, -87, -40, 54, -97, -221, -148, 6, -2, 95, 150, -107, -45, -177, 297, -184, 6, 79, -81, -51, -59, 74, -17, 156, 204, -9, -218, 51, -257, -204, -144, 88, 84, 6, 5, -83, -149, -78, 93, 134, -247, 150, -42, -67, 10, 91, -180, -42, -91]
1913i1Q1M4P1r3O4Qk44L23k01K3K46l94K51J60k13O2j1m6Pj02O4k81J75K58j85
1938b4L8j11j07K07J99q2j43L3j00k4j12P8L60k0n90L61K2o1m1L02n58K74K16
1961A17j58r5L79j12k34J99k80R0j30K98J51l88K31n6L11l62j87M1J03R1j65K89
1983A33P5k53LL08r7j63J06j31L8j43J56k46K50j9K4r4L02l65L8M2L61m70K95
2006A50j72j04K89j13j00k6K81l32k0M9L10j63J30l8q6Pj04j09J5K94k10K76m60
2029b36L3L17j08k75M92k85K26j75J10r0p6L91j86q3k09L41P9l1j75j63K01j31
2051c3K19j16J5M6k30p3K39J4j79n5K34k48J97J44k66k01L32o7n1J82j90L18J9
2074B50j85l0k27J11J32j60K85k26L5J3J00l1j11K27Q0k63P2J30k21R3j25N0J8
$$ y = [-91, -10, 34, 105, 12, 76, 84, -160, 163, -38, -15, 231, -163, 88, 248, 35, 97, 86, 40, 47, -55, 9, -272, -97, 161, -24, 14, -97, -204, 3, 202, 120, -23, 10, -90, -114, -226, -148, 212, 192, -398, -37, -15, -76, -117, 185, -373, -99, 117, -41, -136, 243, 131, -103, 96, -184, -94, -224, 74, 225, -163, 68, 12, 323, -39, -226, -185, -82, 9, -156, 133, 208, -45, -42, 266, 169, 6, 112, -19, 19, -124, 32, -214, 36, 17, 41, -53, 249, -116, -78, -36, 325, -145, 150, -22, -126, 163, 50, -50, -76, 205, -127, -147, -98, 212, 49, 179, 141, 55, 62, -42, -151, -136, 158, -52, 224, -236, -203, 114, 6, -269, 223, -62, 164, -11, 99, 9, -67, 324, 138, 55, -154, 187, 266, 235, 60, -103, 98, -33, 186, 70, 85, 131, -99, -172, 67, 81, -98, -153, 81, -167, 30, 174, -92, -293, 39, -28, -79, 103, -87, 231, 250, 65, 35, -192, -81, 51, -109, 176, -50, -15, -2, 98, 67, -44, 183, 263, 0, 72, 202, -19, 74, -51, -1, 17]
2097A7Q5n3Rk4k74L00P2O3n29K76K8k9J7n6K62k39J01j17M3l6L0J39l9k25K34
2122E5O8j17J3J25m84L64P7j54k3K31J3m17J61K53M1k20P2j8n8j03K2k25M47j71
2146d8J25p2O1J42k46j76L84k5L6k52R2j73K76j7r4j14k2K17k61N03m88j6K76
2169A08J1o6j22R1J2k0P4n9j38M5J38k85J44k4L68l48N1R3j3k18J67k24J80n3
2193h8L4l8lR4J45k25J91k22mK58j01m0O0o9j2J67k9p3L1m9QNj53K12j58n6O2
2220e3n5j21J13j13J21m4K01o5kl4j49J83r2J63K70m62J22K06k09R4k80K69k41
2243a78L05j61p2qL31m41K17K2k10J21J3P2j26K15k2j55P8R2j52K35j97L9k2l5
2267c9q7k7J31n9m5J19l2j80J69l2J52J21r0r2J80k93k09K96Q6k22J97k76K02
$$ y = [17, 102, 49, 58, 34, -240, 60, 132, 195, -334, -58, -30, -59, -42, -98, 164, -75, 26, -91, -48, -84, -54, 85, 46, -179, 55, 123, 6, 19, 144, -340, 24, 101, -53, -76, 155, 168, -249, -88, 165, 206, -14, 58, 40, -18, -121, -99, -324, 123, -48, 77, 5, 66, 208, -38, -214, 170, 145, 181, -71, 21, -152, 124, 107, 13, -101, -123, 94, -167, 336, -152, -168, 108, 119, 53, -69, 22, 34, 14, 88, 29, -109, -64, 74, -211, -67, -91, 277, -71, -20, 73, 60, -158, 9, -215, -35, -88, -54, -92, -95, -1, 144, -81, 110, -112, -116, 142, 41, 1, 61, -8, -20, 147, 118, 45, 76, 27, 35, 40, -113, 99, -59, -115, -53, -108, -229, -116, -229, -108, -152, 49, -16, -18, -52, -201, -18, -110, 53, 323, -139, -17, 189, -20, 74, -206, 63, -178, 127, -34, -106, -114, 217, -224, -7, 15, -195, -74, -61, 11, -115, 100, 78, -77, 1, 93, -59, 176, -21, 18, -4, -39, -126, -153, -22, -81, -126, -7, -39, -219, -50, -82, 70, 191, 101, 9, 189, -104, -313, -17, 69, -153, 44, -232, -30]
2290c0J11r5j50k5J70K10k14rR8r7J80k62L04k72RL47j8k78K05j91J43j33J31
2313A34l22J44l0l9L12k05j70K84r0J38l46L08r8j89N4K24k64N6P0J90k31N3M4
2336B7l73J96L72l55N1jK41p5Jj91J34M6k79K79r6J36J65m06J16j98J24K0L1j24
2360a59nK67K8j21N0j62J06n0j40J55QK19K4l99M03j45o0J6j29K23j75o5L68q5
2384A72l42K52k63M0J59q6M8n8j18j67K51J10J74j79l8J65M7l61O4J41J01j07
2406EK4q3J29l18O7Q8j25L69n6p2j61k4J91O8k60J30K15m86L74Rk4k00J46l4j7
2431d5l07K01R7j02J44J2J65l88L54k13L46j60j39J80m7j56M0P4m4j44P4k7J01
2454A6K5n2J49J20k72R0J4l9j83m4j12J09L39j44j95K29m12N26M8j21k92L34r8
$$ y = [-30, 81, -14, -164, -189, -19, 191, -23, -32, 66, -31, 149, -113, 191, -81, -72, 275, 257, -21, 184, -7, 136, 3, 134, -188, -44, -74, -113, 199, -6, -176, 108, 18, 156, -190, 118, 20, -169, -115, 109, -155, -99, -29, 161, -70, -17, 27, -346, -150, 222, -133, -82, -83, 158, 83, 84, -107, 27, 73, -206, 73, -23, 113, 278, -128, -12, -210, -86, -66, -35, -159, -164, 103, 131, 10, 60, -102, 4, -46, -186, -31, -23, 196, 220, -179, 224, 79, 19, 35, -94, 129, -46, -111, 257, 172, -170, 82, -181, -141, 18, -68, -20, -78, -196, -363, -112, -2, 172, -7, -45, 120, 167, -194, -130, 11, 112, 5, 29, -54, 75, -243, -176, -88, -213, 156, 100, 28, -133, -157, 34, 102, -158, -28, 187, -299, 75, 84, 60, -140, 6, -28, -45, -352, -151, -54, -156, -12, 0, 165, -223, 131, -82, 264, 104, -35, 145, 98, -58, -18, 56, 12, -132, -58, -85, 16, 41, -11, 138, 258, -14, 76, 90, 51, -132, -176, -288, -179, 160, 16, -179, 50, -362, 164, 212, 91, -201, 133, 35]
2477C5J14j43k66M04m1k61L28l5j52Q5p6J32l21L14k28P7j44L37k05P6k88L23
2499F5n9N9N0k80K40ko6J61k10J13q2L46l69k36K19M57n00m4J63J7m9j13k6J68
2523B2M3j42K79j97Q4j0L9K5j98P3n8J19J82l22%L20q7j62l5J83J96m39J91j52
2547d6j10K06j24p4m3M64j39L1m3l34K60pJ39l39J19n4L89l48L04j49k14L28l45
2570a29J11o4j57J49K2m6K92r3j61M3Q2p4N6rj22K06k31N27n30NK70o9k45J41
2594b6L15j78l36K45j55O9L7j18K74k04J06j59J13R2k22L3J51kk39J22K43k10
2616d9K07k38K1J65O9k12o4k4K4k96O30j44l1l4O7n7J1r4j15J67LJ36j49m2J34
2641H5J56N0l97L63k03m9r9O0J42kj76k33J37L14j91K9K42k79J5J24j03o9K49
$$ y = [35, 149, 6, -260, 144, 103, -158, 170, 135, -17, 68, -8, 124, -197, 117, -111, -34, -178, 159, -46, 30, -258, 65, 6, 65, 115, -165, 75, 73, 7, 168, -42, 71, -11, 335, -34, -270, -51, 406, -94, -138, 25, 42, -7, -120, -146, 22, 65, -77, 202, 5, 89, 79, 118, 143, -55, 18, -40, 79, 261, -61, -61, 259, 172, 10, -25, 158, 354, -85, 106, -46, -156, 50, -74, -148, -191, 273, 134, 165, 122, -212, 48, 41, 180, -159, -40, -94, 295, -53, 251, 102, -112, 216, -129, -18, -82, -239, -90, -68, -114, 178, 85, -76, -33, 49, -25, 31, 22, -100, 106, -125, 402, -128, -123, 147, 78, -167, -26, 289, 111, -225, 20, -135, -66, -29, -147, 127, -77, 29, -130, -17, 75, -147, -114, 37, 35, -204, -82, 161, -49, 158, -80, -59, 106, 175, -37, -101, -125, -101, -397, 233, 89, 58, 24, 91, 34, 45, -49, -164, 3, 6, 142, -7, -49, 85, 241, 291, -106, 257, 54, 5, -94, -34, 108, 106, -70, -303, -166, 148, -43, -14, 228, -51, -36, 88, -15, -84, 165]
2664A65J3j86M4J20k4l07M0J95j15O8K17k02j60J84L40k98J14j82j20l4L93j08
2686A57l24j25J92K59j6N9n8k6k82J63J84j40m0o1K7o0j18K04p5O4O5o2K12Q9
2710B88k12l4L80k44p2j42Q6j47Q0k28Q5O1R6j37lL72k83j51J92m1J6K66m30J48
2734e4O9j13q9J50NK74k89m9J3p9N9K21r1m8k8J03Pj20M7j10J78k41Q9J98m8j55
2760a01O0l7L2n5K6N2j23K72pn0p5j09p3J53pk09L88j04q0J51k15L09j83K06l70
2785a49k11K31m7J06K63j48k38L40k33j8J39q5R3P6l1J81k81k03K88j06J83j08
2807D2L8o6j13K15k19K83l03L3J77j78J48k43N5J37Q9j84J80j92MJ72j31l89N75
2830A30j57j40L77j13k31J22J9J18M5l46N9J23K3p7n1l4P9J78k08N8l32K56O3
$$ y = [165, 178, -8, 36, 156, 132, -175, -135, 60, -55, 13, 230, 28, -132, 52, 392, 94, 208, 26, -94, -128, 265, 157, -167, -292, -100, 159, 143, 202, 144, 118, -164, -1, 183, 43, 3, -58, -31, -91, -209, -5, -80, -16, 49, -13, 199, 288, 76, 42, 422, 178, 106, -36, 50, -97, -17, -245, -160, -99, -3, -140, -143, 229, -54, -205, -13, -54, -38, 228, -202, -54, 15, -98, -187, -37, -32, 242, -47, -96, -83, -162, -103, 118, 27, -21, -49, 54, 61, -59, -12, -122, 56, -185, -96, 102, 54, -101, -41, -78, -46, -101, -75, -23, -146, 126, 119, 69, -6, -115, -188, -35, -42, -251, 137, 33, -47, 104, -111, 198, 15, 221, -149, -360, -129, -176, -70, 193, 45, -193, 147, -86, -104, 35, -50, 43, 119, 88, 269, -12, -215, 73, -33, 150, 42, 80, 14, -99, 116, -103, 180, -123, -90, 87, -91, 57, -186, -131, 6, 95, -89, 91, -101, -97, 75, -56, -445, 130, -27, -167, 210, 97, -134, -12, 7, 125, 170, -176, -117, 6, 29, -48, -99, -133, -54, 124, -84, -26, -358, -102, -39]
2853c9Q9M1l5K23k63J70j27Q1k18J21o5k40M27k63K75j27j56L37l29J06j54M56
2875C10l87L5j56K98o5J77k35J1k3K85k20l29J93K95j34R0p9j91o2N11m95J80
2897IR9j41J33J9j58k7Q0j69L44K1j85L04k85k02M8j23J11Q2m3K41l37L45m1o0
2921F5K70j89k07j2K05r6po2J57k61j7QK00j08j50K58K2j24J23j97l4J26J51k6
2945I5L1l94L14R1l26K50pJ38k81j45K05J19K43k89K07k93R2N4N5k19J31j0K05
2968B66k1k23q5L1q4j60L11j13j14K91J8Q6l55K76P9l29Q8K5Q5mOl6Q2p0J3r7
2994c4KpkJ48J43l0p5L3l20K77l01J08M0J9K8P7o0j7K49j93O2j92M5Q0l45M00
3020A35m9k56J25J84l9k69N1L6j58R9J02j0J82j30j99J80j15J93k00J54Mk12K51
$$ y = [-39, 50, 91, 56, 279, 16, 186, 59, 140, -78, 43, -22, -262, 165, -98, 177, 50, -106, 231, -98, 8, -146, 310, -77, -42, -198, 100, 35, 212, -23, -12, -35, 250, 30, -299, -106, 189, 55, 145, 66, -125, -187, 324, -171, 9, 108, -33, 100, 119, -39, -66, 14, -155, 189, 210, 25, 329, 44, -158, -110, -233, -122, -40, -83, 158, -179, 166, 125, 65, 335, 146, -61, -73, 132, 36, 29, -33, 124, -137, -154, -146, 54, -54, -204, 54, 76, -48, 75, -122, -156, -30, 121, 95, 126, -268, 46, 137, -189, 61, 54, 192, -89, -234, -29, 90, 333, 44, 251, -42, 50, 104, 159, -60, 71, 61, 266, 245, 22, -63, -32, -116, -276, 35, -78, -192, 99, 117, 203, -152, 124, 203, -126, -38, -13, 72, 68, 74, 38, 120, 50, 63, -34, -32, -39, -41, 107, 250, 220, 145, 178, -142, 135, -166, -58, -18, 1, 29, 106, 46, 29, 278, 85, 147, -45, 0, 80, -265, 135, 86, -170, -45, 139, 100, -169, -118, -82, -240, -141, -39, -49, 133, 3, -196, -16, -131, 62, -138, 16, 20, -192, 59]
3043E9J44k24J58l6k23L96q1k35Q3j51J22K26k40K7J04l80J18J0L5K79m98M92
3065A85j20m0N6j83j03L86k34J81j43k6j7q2K52k6PJ87l68P2n4mJ24l3K29l49
3089a03RP3N30n96J22Q5nn6J8j26K01j23J5L3m0p3Q5l5k05L00l9j03m6l1k25M72
3115A37j77j46J86j70J96j59J85pJ75o8q9j49K78k39N4l14L17J30q9j46J54j39
3137h0K27j18J49l08Q0J61J82k70J75k23k7K58j46j67k6N6l5N5Q0L6n6ok01K10
3161Flj82K08j54J07NJ93m27K98M3k45j9M8J72pJ92j31l25K18J23K8l44K97k38
3185a37K0o4N02l96J99j84j19K57k0j6J58k44J02L4k09J2K3R1m1RQ7j35j31J03
3209i9j76J71o0L76m04J3L74K6l66R6J05o7j83J11J04m0R4j79J73j03j57J56K5
$$ y = [59, 203, -21, 137, 101, -122, 274, 193, -42, 41, -110, 12, 238, -2, 25, 129, -251, -133, -123, -88, 191, -307, 185, 65, 25, 81, -102, -205, 181, -53, 128, -15, -41, -58, -140, 112, 86, 93, 280, -88, -16, -70, -74, 50, 17, 246, -103, -94, -21, 509, -87, 35, 120, 115, 59, 77, -49, 152, 29, 44, 77, 37, -36, 49, 14, -191, 109, 70, -33, -79, -110, -335, 137, -40, -186, 0, -170, 26, -133, 52, 45, 220, 152, 63, -86, 192, -47, 7, -307, 10, 140, 51, -95, 59, -80, 147, 29, 178, -130, -50, 111, 293, 23, 198, -25, -52, 206, 60, -107, -133, -77, -112, -57, 23, 59, 3, -3, -204, 6, 3, -179, 29, -125, -18, -13, 180, -247, 51, 94, -151, -170, -122, 50, 43, 235, 104, -221, -3, 120, 148, -196, 101, -137, -117, -181, 321, -75, 124, -60, -179, 78, 58, 42, 200, -44, 58, 92, -117, -105, -82, 9, -32, -23, 64, -71, -202, -99, -275, -104, -164, 212, -192, -179, 195, 221, -145, -49, 56, -11, -194, -83, 21, -19, 75, -104, 69, -34, -191, -35, -10]
3232a0K04k34p0K2K16J23j53k36K99k25m9O7J65j04k31L76j53j35K69l67K67K63
3254C04k85j01J11j87P6J31j7m6j86K53p1O5j36K21kr2N6nj11K59k99K04k21Q7
3278HQ5k4q5J32k3k43K82k23j67K23j56K6J90k03K2q2M58j71j7L0Nk79J79M4K96
3303C07l57N4N2p4J40r9k5L41j47l21L95P0l18Q0l12J41K62k34k98N53j47J9j6
3326F6l48K68l8R4j04NK8J02n2P3m13M39l33J59J13r7M3K0m3r5P0o9J18l3jP4
3352D6k43J81p2M4o2n5J83L5p2K20j22o8j49J02m6M76n55K87K4j90Q8N7k83RQ1
3377h4J03o0j09K1Q7Q5qp3O2j54K05Mk00J61R4N4j96o6j44L64m04O3K10R9k8k12
3403a26J48r4J17J7Oj53J16O8r8j54j3J30J40k29J4R3j17M3j31K51l44L01R0l1
$$ y = [-10, 194, -40, -110, -88, 128, 251, 98, -138, 161, -64, -113, -46, 119, 15, -216, 160, 7, -128, 141, -226, 41, 304, 19, -82, 29, -158, -82, 49, 32, -14, -200, 53, -18, 47, -89, 132, 130, 38, 94, 89, -22, 237, -62, 142, -79, 8, 93, 69, -16, 116, 93, -150, 132, -91, -258, -35, -191, -165, 25, -178, -156, -238, 220, 49, 32, 62, 67, -212, -33, 11, 307, -50, 4, 56, -18, 122, 23, -2, 339, 192, -129, 266, 336, 18, 98, -214, -73, 189, -45, -343, 210, 63, 82, 66, -282, -14, -52, 42, -62, -57, -29, 73, 21, 94, -319, 120, -213, -54, 59, -38, 5, 25, -18, -113, -43, -112, 6, -27, -28, 46, -197, -16, -88, -44, -106, -161, 22, 57, -15, 205, 83, 15, -134, -32, -78, 398, -157, 130, 154, -36, 52, 109, -174, -165, -84, 19, -41, -150, -129, -42, 43, 35, -38, 24, -130, 75, 79, -121, 40, 134, 188, -8, -74, -218, 146, -258, -195, 15, 114, 86, -126, 22, -72, 45, 62, 68, -85, 31, 99, 1, -153, -166, -36, 104, -125, -111, -18, -135, -92, -223, 28, -316, -15, 75, 44]
3427D4o3J08Q8k46O7OL99l55k0j9J1j0JJ86l65J63J10k47P3m9q4k6J70K10j55
3452cK50J8l12O3J36l30J95M7O3k42M1R1Mk1q7O6k02M11j24n6N4K45m20J99j38
3477e2J5o1M2K44n7m6J1j00o3K25k07K76l34J93j67p5K13j0p0J46j0k0j27j76
3501b10K56kj27J48O8k18J98l88N13k57M5J99l19n2j44O9P5PQ6L1K36m34L09K26
3525C15j52j87J85j43J64j94K29j56R7j81j10J35M7l27L74K9k53J24K6j20N1J42
3547I5o6J22j33q9j6J46l7r0K00n3m01L28j12n6J32LL17l65k4j8J84P3q6j82P3
3572e5K35k75J44j86j5L77j69j65L8L86m71j2LJ75lK4j24k19L66n1j2Qm0O7j42
3597a16j2M16m34K82k03KL03j98L1l59M69k67J43K94j15k04L0o0j48kL1K2j69
$$ y = [44, -19, 89, 177, -69, -2, 4, 403, 48, 28, 9, 20, 10, 11, 197, -168, -5, 105, -142, -69, -118, -202, -228, -58, 152, -3, 247, 265, -47, 16, 152, -178, 17, 64, 127, -115, -74, 17, 21, 0, -87, -21, -223, 188, 64, 8, 62, 307, -113, 86, -52, -37, -98, -56, 188, 131, 85, 96, -4, -67, 158, -49, 227, -107, 86, -81, -156, 57, 47, -23, 123, 113, 93, -34, -210, 46, 44, -83, 65, 133, -85, 113, -275, 238, -19, 26, 225, -94, -146, -290, -221, -146, -139, -53, -22, 214, -220, 89, 315, 163, -24, 161, 18, 182, -12, 217, 61, 158, -23, -133, 2, 49, -278, 96, 125, -128, -4, 22, -98, -47, 95, 29, 151, 18, -71, -87, 59, 22, -68, 132, 79, -322, 6, -106, -162, -30, -27, 290, -75, -99, -117, 67, 140, 54, -128, -55, 180, -95, 49, -137, -152, 225, 56, -109, -71, 315, -156, -168, -165, 10, 7, 31, -93, -312, 54, 3, -9, -1, -41, 26, -116, -128, 288, -146, 136, -67, -65, 238, 40, 71, -288, 181, -86, 57, 351, 236, 32, 62, 2, -146, -148, -117, -95, -264]
3620b64K63j70K83p0P4j51M2k2K89k91N9K8j2k75K28l6k86K43J35j32r4J58Q0
3643G9j21m2J53j65p2K37l8l16J58P4J17O8j42j99J07K45j9k30K45J7k19K37m65
3666b91M67j80J02j49M9P8k4j97M45l1k62LR7k01J96k18J1k1J54J64l13Kj30L26
3690G7k73J25n7M77l79R6k15L5K47J15k44m2R2Nj95J81k69P2j09K83j64K30R8
3713A86k40K08q7j45m3m6O9K72k90P9r4K18m72L71p6J04j56K89p1M6l01J77O4
3736F2N9p6j06j07K56k05K29J19q7n1O5r6k35n1J30j0K28j44N6J73k34j16J48
3759Gq7M9k07M40j71l3o4N6k6J37J2k64L6R3J54j22n9l06J58L10J2M5k01j12L60
3784B17k92J42j84j7R9O7r7J39J06j85j21j5o8L45j45j03o4O9K1j21J24m8Q4M9
$$ y = [-264, -1, -171, 112, 42, 116, -35, 7, -15, 274, -17, 42, 70, 58, -217, 11, -25, -311, -68, 67, -65, -159, -1, 79, -42, -84, 69, -96, -168, 69, 31, -285, -127, -53, 64, 132, -10, -209, -102, 143, 124, -106, 139, 156, -63, 174, -291, 176, -4, 98, -51, -2, 76, 52, -145, 300, 269, 7, 10, 107, -94, 102, -116, -105, -126, 28, 192, -121, -119, -249, 77, -196, -71, -128, 349, -30, 66, -149, -114, 133, 248, 4, -38, 54, 59, -136, 45, -224, -152, -261, 22, -142, 88, 186, -54, 154, 67, -78, -121, -167, -98, 174, -116, -37, -131, 87, -385, -14, -90, 14, -142, 147, 76, 122, -179, -2, 62, 121, 45, -61, -168, 88, -117, 112, 231, 144, 93, 158, 62, -173, -224, -94, -104, 124, -20, 36, 209, -25, -141, 7, -80, -31, -238, 202, 31, -2, -66, -10, -36, 101, 113, -151, -115, -22, 132, 10, -49, -355, -197, 113, 125, 170, -31, -143, 217, -75, 67, -117, -134, -35, 32, -65, 74, 180, -5, -126, -141, -209, 136, -9, -112, -176, -107, -86, -207, -83, -131, -47, 2]
3808Bn2rn5K36k6rl13M96j43j48p4j50L7j10N40Oj48j66P2p2J20J94q2j3j62K43
3834B14l69J76J12j60K70k05p5K6Q0l19K83K3k12J78L8j58Q2J07j22l3l7JJ80
3857H0j49j19j8L76k67J37j70L02n41L17j36J1n0K54J02k3J00j39P3n9M5j54J15
3880H7nP9r5J4j74K4lm2R5MJ47j5j35m6j21j90K65L1J33j42L97l45J62l52J20
3905a07N6J4K1j04J07K18j4j30K4l5J06k13J70j86MJ6O0k31K58j64J00J51j50
3928b9j68N1J87k16J2M39k69r1L9J23P9j81m8J32j49lJ38O8j32j49kK51j05J24
3952A01j73oK41j2k38M24l14N8j3N2R8l41O0N8J18j90j24K4LK43kNn4m1o8L4J82
3979A25q0Q0k27J40k27K15n2r1M2N4J68p9j29K20j70k8n5j0J82k51J84j74n0L60
$$ y = [2, -50, -59, -114, 122, 96, 87, -226, 270, 127, -21, -95, -245, -208, -318, 222, 228, 80, -86, -14, -86, 34, 228, 146, 133, -29, 214, -155, 21, 133, -27, 243, 38, -37, -11, 69, -250, 33, 56, -156, 22, 60, -98, -16, 91, -31, -64, -101, -100, 80, -69, -188, -206, 170, -97, 40, -130, 172, -369, -52, -188, -177, -227, 27, 129, 106, 206, 67, 140, 81, 126, -28, 87, 82, 161, 66, 80, -94, -70, -73, -115, -20, -16, 131, 116, -19, -65, -186, -376, -111, -80, 53, -89, 308, -37, 125, -227, -107, -51, -37, -16, -120, -13, 205, 191, 61, 85, 50, 156, -57, 113, -73, -69, -53, 7, -224, 34, -130, -30, 121, -29, -197, -146, 41, -175, -163, 276, 7, -84, -45, 78, 157, -24, -72, 60, -89, -92, 46, 114, -18, -167, -169, 82, -23, 101, -72, -78, 163, 151, -87, 337, 23, 81, 68, 120, 218, -123, -63, -5, 113, -77, -201, -177, -174, 69, 67, 72, 18, -23, -91, -57, 125, 45, 125, -102, 38, -189, 26, -26, -117, -75, -21, 147, 68, -61, 159, -11, -39, -94, -104, 78, -173, 11, -163, -213, 147]
4003A47j80Q6M7l07K22j79J76j8j50L22l69L32n2j21L14n03L6J15l7Q5J70k10
4025g4J46j31K23r2j76Q1j15L2J56j91K9J95j73k8M41N2l60J88j57j8k09L17R6
4048B32j16q7o5K47k18P6q7p3J4J95j4k8K8j96M8n9L47k82J4j23K79m0j81l4j63
4073b86K61M0l7j54J44j53J11L09J54m84J62r1Q2M1k06K50Q1j37o3J20r3Nj66
4096a10j37K54R5q2j56J53j41j68L32j88J82j12j07J83J20l33K7K34k19kJ75j08
4118a08M24m76K04m0m2j49k0Q9K35j78m3j0K28k52J67K5j77K33j41n6R6k29L81
4141A61l3l88L93l7l4q1L27k49M4j15J07r0k2J49k63J62o7k06L14Mj99J48n4j80
4165b09p5K15J59n7k76J55p3J81o5J43j90K33L0L9k45k36J50L15k64J31LP4k98
$$ y = [147, -33, 53, 100, -207, 15, -164, 12, -6, -156, 166, -203, 129, 77, -44, 270, -233, -197, -82, -119, -34, 136, -74, 72, -59, 164, 72, -104, -23, -138, -106, 50, -141, -112, 83, -90, -118, 323, 375, 15, 203, 46, 28, -181, 136, 232, 116, 29, -36, 211, -7, 69, -18, -91, -77, 118, 104, 76, 104, -92, -44, -103, 244, -38, -24, -147, 132, 92, -89, -123, -286, -25, 15, -22, -176, -32, -185, -74, 235, 389, -95, 67, -24, 58, 99, -107, 143, 224, 87, 24, 144, 51, 56, -110, -247, 7, 102, 20, -136, 17, -124, -292, 40, -148, 34, -78, -185, -2, 118, -215, -188, 46, -173, -175, 0, -108, 316, -160, 44, 4, -38, -187, -207, -118, 117, -61, -104, -114, 114, -138, 29, 54, -123, 110, -31, -87, 9, -220, 161, 128, -260, 133, 96, 62, -19, 308, 59, 103, -12, 95, 5, -17, 132, -131, 31, -36, -242, 72, 76, -123, 25, -29, -209, -284, -69, 90, 33, -243, -88, -161, 20, -45, 98, -92, 141, 171, 210, -35, -271, -121, 194, -70, 61, 64, 138, -160]
4188a60K70k42R4K79l12K4O2l23L52ok48J4J07L85m21J3L06N3m10k68L63q8J49
4211gN0j88mK24j42M8k5mj65L23j07L7j01j68J20L13k77M8J04l5N9j23J75j81
4235b6J22k18K90l6l41j31M02k51K04q4J33j50K96j06j4mk30J82n14O32P7m02
4257a69J76R9j38J06l10K89j15R7j29J13J29k6j51Q4L4Ol25L29j73Q0J93j57L5
4280G7j11K26l22L06o7J42k69r9L56m1j43N4k88L49k62R7P0LJ17k87n6N12k04
4303A60j86K6J02p7l6J54l6P4j84R0n7j99K57j68L51j30k00p7L82j32q6J43j8
4326A53r9p8K5L24l81O6J24J38j99N0m2J94j19j28l9J27l48L1L21j21O6j29P9
4349A5L2p0J96j25KJ13l4j45L06l40p5K35k1k0j40M3r7J55J02k55Q1R5N2m2j0
$$ y = [-160, 110, -132, -38, 241, -71, -47, 15, -308, 44, 38, -210, -196, -89, 296, -125, -112, 194, 247, -163, -431, -68, -156, -7, 43, -145, -149, 75, -67, -19, -44, -48, -213, 110, 3, 40, -61, -229, -109, 204, -73, -25, 79, 44, 103, -20, 155, -26, 96, -122, 168, 132, -209, -340, 62, -189, 15, -69, 64, -86, 210, 104, 90, 86, -144, 38, -476, 156, 233, -169, 7, 106, -32, 74, -236, 53, -62, 35, -94, 19, 148, 122, -29, 55, 89, 95, -230, 99, -74, 6, 199, 42, 77, -34, 192, -130, 176, 109, 251, -18, -117, 239, 198, 55, 109, -179, 170, -92, 5, 75, 78, 195, -92, -148, 364, 160, -26, 0, 102, 25, -11, 143, 107, 181, -3, 87, 30, -169, 88, -80, 271, 141, -59, -136, 246, 114, 28, 171, 153, 54, -24, 1, 325, -56, 10, 134, 272, 73, 123, 81, 275, 156, 28, -11, 116, -232, -201, 120, -1, 65, -64, 15, 47, -23, 173, 48, 50, 163, 129, -16, 290, -50, -125, 110, 89, 69, -71, -28, -125, 30, 132, -123, -42, 53, 105, 63, 53]
4374E3m7K23k23r6R9L06k44j17J5N4j87j9J11M9N9O5k33L84j95R0k03K26j2o2
4398I6l30L4M72k28k90J67K08p4k74L24j23O3j53L18m05K19O9p8m9j61L48n2M2
4421A43l64K23K11l48l0J47M0j40K32L2p6K7k83L33l15N5K65j79K80j59k11K70
4443A53j86J61J60m58M79m65J62j18J18j72R9J6j4L31k95r6P0K71m67L02J55O0
4465B66k50l9J07k57M06l7m39K76J82m58J82R3N8j02J01k68J48n3L03q7k69L34
4487A97j15n3q1j7K62m10K08jj32oK63o9J15l78R7J31m9p2K23k19J45j81K36j36
4511d2k03K95K5k83K17M7o8M9k3%k49M61j17m6r7n2L08m3j13k33K05j47K88k66
4535h7JN8J3m6j37J70L03m22K5J29j09J39N6k43L5J10o6j63J18K66l4k37r1J55
$$ y = [53, 6, 229, 6, -90, 9, 315, 71, -46, -31, 23, -164, -183, -72, -23, 36, 101, -132, 252, 57, 147, -56, 170, 158, 96, -234, -200, 272, 44, -246, -79, 129, 55, -219, 105, -18, 45, -108, 210, -195, 24, 93, 15, -34, -195, 153, 101, 143, -221, 2, 213, -135, -165, -18, 22, -118, 114, 146, 70, 97, -186, 147, -168, -113, 152, -27, 253, 94, -117, 153, -33, 128, 288, -170, 309, -156, 6, -112, 6, -166, -67, -51, -65, 266, -29, -125, -55, 216, -251, 51, 206, 266, 16, -23, 84, -173, 233, 196, -243, 33, 215, -243, -61, 32, 90, -12, 89, -179, -31, -84, 219, 132, -137, 197, 82, 29, -52, -69, 193, -217, -9, -10, -142, -148, 115, 46, 161, -217, -120, 11, -38, -110, 113, -106, 39, -142, 94, -42, -245, 50, 75, -208, 9, 56, -12, 37, 14, 14, -235, 226, 109, 63, -34, -86, 222, 179, 66, -167, 38, -109, 179, -87, -86, -28, -15, -61, -198, -28, 275, -147, -122, 7, -102, 37, 93, -150, -115, -5, -71, -234, -116, 150, 116, -121, -212, -57]
4559e7p0K37N6p4%j48j40M39l98Q4R4j09M1K09j48k40K48p8J92j74J24k54J05
4582f1L13k57o0J22r3j43R9N8p6n4O2J15j01Q4N9L8qj64j14R1O9j57K79P4k45
4607g0J40M5j42J30k42R9j9m7m8J54k5j53J71K85l14j43MK19j77Q6n1K41O9k44
4631c2J91r5j06K5J09J69k94J9j22K11o3J40l37M11m21Q9L48k76K37j85j26o4
4653a72J41k11K80J89l49J63o5J64k69J77l8K1J72l37J92k6m2J9j27o9J55J80
4675A48k45R4j10K79l01R2K10j33J26n4Q7m3J4n32N27m17L66J28j1j73K8rnj33
4699f7J91J00k08J04j62P3Mk63L13O3p0l05oM27j96J78l83j08L42r5j37L32k57
4722a30K42k22J3J4N0J36l02K66r3mj08n9K29J8j55M07l64K35k52j31K57n2J84
$$ y = [-57, -127, 110, 166, 92, 92, -56, -196, 243, -155, -71, 23, -86, -45, 164, 16, -224, 24, -54, 138, -36, 88, -166, -61, 252, -5, -65, 57, -36, -179, -80, -22, -98, -152, -90, 25, -76, 8, 67, 105, 97, -67, -181, -90, -21, -178, 101, 175, -70, 70, 115, -27, 103, -139, -40, -59, -106, -154, 0, -25, -178, -7, 278, -36, -179, -175, 44, -133, -47, -98, 143, 212, -32, 159, 64, -42, -17, 92, 261, -33, -14, -136, 75, 12, 152, -185, 226, -195, -106, 242, -34, 203, 18, -108, -172, -31, -242, 38, 227, -122, 41, -24, 140, -129, 48, 10, 31, 203, -134, 58, 32, -10, 9, -118, -187, -32, 148, -97, -3, -113, 166, -135, -43, 167, 34, 160, 106, 193, 150, 164, -368, 159, -258, 108, 236, 225, 52, 80, 71, 66, -67, 124, 224, 16, 120, -42, 31, 35, -228, 85, 148, 78, -227, -233, 194, -2, 176, -207, -315, 27, -68, -205, 127, -130, 112, -110, -97, -83, -33, 103, -199, 67, -26, -30, -138, -197, 32, 50, -105, 302, -62, 173, -79, -210, 47, -5, 179]
4745A79k63N29j83k05k4J89l93J96j75J70l03K42J15j40J04q3M90m94K22kj4r6
4767F1J01k06k3m5J71Q0j80J12j71J38m3J6k39J19L56m68K44J20r6l0J6J1r8J51
4791I7n0RJ76q2j85Rj58K68N4j82P4J14m7j51K21kj97MO1j32j42M66l47L60j90
4816D8J21j08r2J64j86P2n7J75j84k4k3K40j73JJ51j54jk2J06n1N7r9qJ14j56
4841h9J37j13K54j74L6r6N0o9P8J78k92j04K11N9n8J20J8k95J41M7j65N4J95j30
4865gK22k10k50L02j87l3L82r4j61n1r9J02j07K66lo4j41K16l1j38K22l64L23
4888I5j71p0m8Q2L29j96j56J98j28p8N6L5K21J8m08M63n76L85o2O0q7J17k5j31
4912g7J41J18m7K5J9j42l5M6r2K14j57J2m9j0o9K41j22P9j66n2N7L9O8r3j2N9
$$ y = [179, -84, 445, 262, 57, 33, 222, -171, 25, -150, 20, -283, -41, 74, -66, 38, -45, 445, -49, 173, 171, 157, 61, 162, -44, -67, -112, 59, 139, -41, 71, -100, 38, -5, 11, -228, -109, 247, -221, 23, 143, 47, 17, 33, 44, -54, 97, 47, 56, 232, 150, -35, -26, -184, 84, 138, -44, 30, 144, 97, -54, 167, 165, -32, -28, 33, -99, -241, 225, -122, 238, 48, 169, 61, -31, 133, -53, 19, -38, 137, -47, -71, -94, 146, -27, -26, 125, -29, -30, -52, 54, 3, 60, -39, -47, 67, -89, 48, -65, 189, 15, 51, -45, 5, -64, 14, 192, -100, -204, 7, 66, 8, 128, 146, -149, -8, 39, -126, -72, 123, -7, 215, 5, -245, 57, -130, -163, 219, 125, -36, -87, -186, -84, -191, 75, 72, 8, -133, 83, 52, -86, 136, -228, 95, -76, -146, -194, -112, 217, 21, -135, 63, -65, -143, -87, -52, 169, 187, -221, 242, -334, 51, -11, 49, -38, 79, 54, -77, 64, 182, 135, 160, 179, 37, 2, 48, -44, 170, 13, 25, -24, -34, -103, 138, 16, 95, -71, -123, -66, -27, 41, -52, -64, -5]
4938eK38r0k87p5K10L9K24k37k8P3N3l2k66R5j44M8J61J62j22K07k43M4J29k92
4962a38n1K47Lq2k56J05J51j92J97K91m75L91j33l15J65p6j80L07K01k59Q5p8
4984i2L64k30j26L45k90M7R9j37O6j72J08J71l39R4J65M7l51L12j00J57r0k50
5006b02M54j82j52K52O5m96K75m5O8p2L2M7j40LJ77j02K3l9j92N0JR1K66l64L63
5031A81j19l4l6q4k2K00k28m7K64j23j1K09j27l13N29k68J80j26k36J87NJ43n
5054A19k15M4K29k01L5j60K02qL8q0nJ10J00j3l84J52L3j31J59l84M49p6J10o9
5078E4l52M98k9j27j01P1k29M02k79J4NP8j90J96j00m8N4J63j86L12m89J79J78
5101G4NJ49k89p6j14K9J60O5j58M11j67j77J71m6j91O9J76P5Lj91m12N62J0k25
$$ y = [-5, 233, 143, -144, -219, -9, 30, 254, 17, -11, 62, 115, 83, -183, -88, -232, -184, -23, 139, 17, 224, -19, 25, 154, -138, -189, 58, 61, -21, -277, -172, -21, -213, -16, 275, -200, 191, 58, -257, -92, -168, -348, -41, 160, -99, -14, -92, 272, 42, -84, 261, -29, 18, 117, -20, 46, -126, -18, 153, -186, -92, 73, 120, -231, 81, -19, 138, 48, -202, 252, 70, -82, 170, 235, -261, 14, -31, 37, -35, -3, 44, -96, -93, 84, -18, 5, -34, -226, -176, -175, -84, 182, -182, 181, 62, 28, -8, -92, -114, 86, -142, -189, 75, -48, -59, 150, 23, -290, 239, -29, 151, 25, -211, -24, -19, 124, 119, -96, -52, 177, -24, 11, -149, 53, 45, 83, 3, -2, 108, 208, 195, -189, -37, -4, -135, 24, -360, 89, 13, 123, 54, -298, 200, 171, 44, -57, 14, -215, 187, -92, -78, -73, 5, -185, 11, -89, -137, -83, 80, -106, 206, -283, -104, 74, 79, 228, -61, -137, -251, -222, -62, 3, -155, 256, 89, -88, 83, 37, -154, -85, 91, 166, 169, -22, -434, 128, 138, -87]
5125h7R5J05k26L01n83L53n6J62p8Q1j15J48o8n3k04M05k48J3L0j44K60j93l5
5148a37K18lj88J1M9R3q8J51k40J6J30r7J33m7M8K0j42N7o5J72j63m9k00K91L
5173b7p2J17L8k7R9J57k60k00l9L93k67K08k11j36K23j9k9J94j46K4R7k09J51
5196E9k3j82J46K13p4k51J56N4j89J37n2J4K4L7j62M4j22J33j97K16O3l51L11
5219DL6l0m5N4jK7k41J09m1J12m8j42j7J52J45k16J44m8L16k32k79K78K6j38M62
5244C87m01k3L69m83J75K4k13M32k58k09K49r0l4J1N2J52L1o8j39j06R5m4L1K14
5268A54J20m44J87K05j3k18k6n4rJ01mj59J60j23J42m5K9o4J40j3p5J38O2k9m88
5293c26L38J02j48q5K94k23j75K32O4j47m7J32o8P5k60J69o2J52J12q3O2r8j40
$$ y = [-87, 8, 113, -113, 188, -395, -42, -98, 64, -14, 67, -48, 100, 32, -21, -225, 180, -68, -55, -25, -169, 91, -102, -137, 81, 78, -110, -99, -50, 43, -45, 106, -134, -118, 12, -85, 48, 1, 49, 69, -73, -16, -81, 91, -72, -121, -321, -30, -27, -99, 18, 56, 29, 128, 285, 25, -175, -214, 179, -88, 120, -91, -227, -4, -23, -52, 142, -4, 20, 117, -92, 59, 36, -146, 0, 213, 139, -112, 44, 98, -91, 46, -6, 8, 32, 69, -93, -49, -171, -38, -235, -19, 44, -307, 4, 40, 10, -35, 19, 18, 45, -196, -87, -128, -16, -64, -206, -223, -71, 74, -142, 2, -46, 270, 38, -241, 37, 63, -75, 387, -14, -37, 332, -151, 24, 48, -165, 267, 9, -200, 49, -41, -75, -64, -12, 140, 171, 103, -36, -142, -47, -91, -60, 154, 274, -170, 17, 222, 209, -9, -35, -89, -98, 3, -1, -160, 0, -123, 19, -26, 3, -61, 79, 66, -9, 129, 191, 162, -326, 12, 114, -34, -119, 175, -48, -223, 9, 73, -74, -121, 11, -57, 18, -242, -73, -135, 17, 129, 46, 108, 10, -130]
5316a30Q1P6%l47L51j28K27J4j74J74j27j13P7o8J30k10J80r1K46n4k1k14K39
5339A18p2q0n0L6n4O7M5k7J65k10L15k03J79r4Kk78J5J78q7J89l69M23k38Q2R5
5364A47m84P6K45j16J06M9O0l2q7J7J86k3j58Q6pM6q3m8nj09K4J55L4o3M4m5p2
5391e7L80l21k1ql4J89J1k27K4l2Q3n6jk14L35j76J16j32L27j77n4L3j25J36j92
5416a93K46q8n3P0L87k13R5k13J69j98j36J63j58K08j15K05k51j29J30K01j96
5437f9K11n1j11j06K37M9j60J40m3n8j91J36j34K88k34ln0M35k83k52M95k01j25
5460h0J98l23J68J6o4J15O4j99J58n1k3J54o5J6J51p8j14j58j53J73j30K82J91
5483B48m03J75q4k32N05m22L25k1j52J64m2J20n2q3l13L84j48jrr2K05j50N5k06
$$ y = [-130, -49, 27, 27, -320, 31, -97, 130, 144, -30, 144, 17, -96, -19, -87, 43, -167, 13, -78, 168, 114, 93, -121, 118, 46, -34, -84, -48, -102, -35, 10, -17, 148, -62, 253, 50, 229, 135, 137, -141, -126, 52, -35, 154, -215, 208, -30, 52, 147, -337, -261, -16, -132, -26, 23, 83, 51, -36, -19, 167, 144, -14, 72, 65, 111, 28, -20, -25, -134, -110, 45, 79, 16, 60, 15, -57, 323, 2, -19, -27, -61, 128, 139, -88, -64, -96, -13, -69, -70, -284, 51, -125, -9, -141, 186, 9, -45, -12, -137, -1, -193, 53, -35, -88, -18, 369, 156, 251, 38, 207, 9, -127, 36, -122, 86, -29, 176, -75, -204, -74, 127, -69, 142, 91, -20, -126, 111, 160, 0, 140, 97, 39, -152, -16, -150, 138, -96, -99, -149, 286, 3, -249, 246, 45, -80, 118, -205, -37, -21, -85, 30, 94, -105, 53, 2, -21, 133, 68, 84, 235, 157, 43, -115, -268, -95, -225, 57, 248, -155, 20, -64, -296, 209, -213, 112, 91, -61, 103, 61, 181, 129, 46, -267, 117, -31, -32, -41, -133, 72, -78, -23, -229]
5507b29J11l3K4N1jK59k22J05L1k46K00j56J82k59K6J70j26J77l7q6J52O2k81
5530a26P4J10%J3o1j32J46N7j64L19j10m05J66K85l08j63J30J18J34o7k49L37
5552A04q7q4K09k03L9J36r4r1J65l02K1K32j3j69N7J72l3K5nPk62N5R1Q6k30J91
5578A7o4j7m6l8J29R7j93k5p8J47O3J36k49J13J39k35K98k04l7P0k46L97k66o9
5602a61L6J18j53O8k1J16J45Q9j77o3m8K56m81M38k69N3P8j01K19l48J84j10J30
5625bo1J90k61K00k38L44j52k50K23j18L0r3qL92l4l42J77j22J50J40l55J46J3
5648c1o9j0j53J75Q3K9j42K83l49J1Q1RP6K05j35j24k05K56kRN1k8j25N9J60k22
5674a08O1K97q3k38K75j47K28k56LPk09K55N7l68K43J82l92L08j66K17k81O3K55
$$ y = [-229, -118, -151, -127, -76, -77, 182, -40, 65, 96, -150, 50, -106, 76, -183, -157, 13, -113, 64, 27, -59, 93, 155, -126, -52, 58, 58, 71, 10, -122, 24, 81, -83, 236, 126, -279, -113, 172, -136, -299, -169, -51, 83, 16, -233, 104, 17, -67, 142, -61, -22, 114, 20, -71, 94, -208, -187, 45, 32, -137, -80, 92, 59, 84, 79, 86, -176, -121, -30, 56, -174, 17, -47, -64, -110, -148, -19, 78, -115, -140, -218, -71, -8, 128, -121, -8, 131, -104, 194, -10, -47, 23, -223, 174, -92, -161, -125, -7, -160, -92, -113, 3, 148, 237, 60, -3, -51, 205, -276, 162, -107, -54, 24, -77, 142, -206, -22, -132, -2, -63, 127, -134, 66, -172, 172, 20, -230, -7, -125, -95, -188, -196, 196, 162, -180, -3, -125, 25, 165, -190, -44, -31, -100, -110, -263, -88, -5, 24, -118, 165, -184, -173, -92, -83, -7, 198, 63, -61, -266, -10, -12, -3, 48, 20, -105, -46, 114, -108, -47, 250, 167, -71, 204, 57, 285, 29, 32, 39, -170, 85, 142, -226, 17, 199, -193, 115, -51, 166, -115, -52, 203]
5697B03m4j44m4k7J49l01MJ45M8Q0l3q0N4k4K0j84R1J86l8J4j28J1j83K07j7J68
5723A33J13j73k9j3j49K5K23k50J79P2k22J74K9l1k40J30J38j77j79R8q2J66l2
5746i7J7J9J85j55j96L64j52j16K79l33J47n9M0J55k03J51k85Q5J29K1P2J53l20
5769i9N0O2M8j81QM08m83J13N0L1j4J52k77Q6q8J7M8J6J28J2k03J1j86k5M70k01
5795d7k20L68k25J6J00j45M7O8N9KJ10k78J68K2Q4k21J55j80J23M4lpN7k09J73
5820F1o7l7r4J20l5L1J6k92M52j01m0M7k13K01N0%l40J75P9j61K23j27k72M62
5844A38L1j92j84J32j38K23q9L57k97K4o2j41J92m2OjL5k22K33K8l8J00q8P4O2
5869A41J20j89K7k0J92n65K56J00o1J36j37j46m2J44Q7j40pL09m00M39k37Q7Q2
$$ y = [203, 159, 15, -29, -56, 93, -208, -204, -59, -11, 69, 36, -44, 10, -14, 6, -178, -87, 99, 61, 75, -53, -42, -225, -18, -35, 133, 246, 73, 44, 31, -118, -93, 130, -120, 59, 131, -91, 83, 112, 81, -159, -29, 109, -68, -247, -149, -231, -65, -97, -80, -61, 124, -31, -227, 137, -15, -131, 148, -185, -38, -97, -57, 98, -105, 46, -239, -154, -25, -4, 68, 221, -99, -49, 13, 61, -120, -112, 296, -187, -74, -24, 7, -7, 145, -132, -46, -134, -117, -69, -53, 75, 87, -116, -105, -291, -316, 154, -47, -267, 101, -124, -108, -8, -153, -106, -38, 21, 23, 133, -145, 23, 45, 129, -92, 63, -117, 6, 50, 47, 40, 97, -112, 61, -6, -43, -137, -17, -52, -21, -5, -297, 155, 54, 14, 61, -152, 49, 99, 99, -241, -66, 13, -148, 75, -52, -324, 138, 169, -23, -207, -75, -213, 10, -79, 278, -19, 5, -57, -198, -6, -48, -42, -43, -8, -230, 3, 31, -7, 93, 5, 79, 141, 261, 72, 99, 79, 271, -294, -38, 62, 1, 137, 0, -146, -188, -44, 43, -97, -104, 205, -195, 244, 7, 94, 176]
5892A76j39j03R6J58J1k47L26K7j90j18m8J29K06k32k81K1N7K29j82J65p1K2L19
5915C31l75L3J87j60J85j77j9n4pJ08j28l6q9J55K6L18j70n9Q9j75J14l3Q3k36
5939h9P6j62L75k38m6J1QL6J56j38J99j25O5j18j22J56J7j11J96q1K5p5k2Jj02
5964a08K72j52j3M7J12j10k80J93O0j2J72k14J61m0q2k86K65J39k30J89k11J3
5986a15J02J92j42o9j95M56j73j16J03R1k05m6J63J9j8J10j08j3k01j16J99M2
6008d0N5K6N2j00m2K33j29J53j93j72J23N1m9M5J25j35K09k16k74J00K49K61J6
6031C48m20J60J25j62J02k9q3OP3r8J2J30P1k14j85J25J5L04j10l67K50k5L4K2
6055H4j18j62N9L2N0K2j9l07L84j07J74j43J6J98k15P6j3p3J97k5K0r2l45R6R8
$$ y = [176, 37, -66, 30, 188, 199, -48, 278, 305, 115, -3, -51, 78, 284, 52, -229, -208, -151, 78, -104, 61, -10, 12, 331, -44, -11, 176, 16, 201, 24, 5, -49, -56, 52, -76, -112, -201, -46, -20, 298, 128, 69, 158, -17, 97, 64, 147, -89, -13, -175, 200, -38, -84, -73, -65, -29, 127, -11, 188, 63, 128, 10, -112, 44, 61, -50, 146, 65, 90, 15, -7, -6, -108, 164, 12, -1, 46, 158, 48, -232, -39, 21, 9, 181, -33, 128, 88, 6, -280, -15, 124, -106, 83, -128, -115, -13, 179, 37, -32, -227, 229, 56, -60, 43, 134, -71, -117, 46, 65, 47, 157, 49, 36, -165, -281, -82, -40, 15, 41, 93, -7, -49, 184, 55, 208, 15, -157, -34, 17, -32, 13, 138, 3, 212, -4, -278, -178, 71, 332, 348, -72, 88, 213, 51, 153, 124, 41, 47, 120, 22, 34, 164, 235, 21, -164, -39, -24, 280, 170, -197, 53, 28, 62, 84, -34, -196, -137, -105, -55, -33, -52, -359, 25, -82, 92, -51, -35, 163, -52, 24, 11, -62, 135, 110, 130, 38, -307, -211, -113]
6080a13J40J33k09q1R2R1j83K00k46K29lp9l4k3Q3O1M1n7n2Q5J1J0o6k08P7K71
6106A70k66j1Q0J68k02K64J1Mq3k22J30mJK01m39K21OR0j58P0j39O3K88j61L6
6131A18j57k6J46j01L8o7N2K43k32L2j21J03o2K4j08K63l53J2K69l05L66m6k92
6154b04L49k72o5Q4k40L33k7j73J35K08j28K39k57k37K75n7J5k4O3J3k53L02L
6177H2j67K22J05j57k47NJ76k3R5p2k9J10k49n5J34J45r6J45m0l80L87k17O3Q7
6201B4q1J17k14L33l36K03r5J30k30J6PM67j67l52M74m46J86J62j61P3Q1l04L28
6224B15n08M9M80m16J83j7Q8j43j12J73mJ8l9N7j97K52j09K56j11j57jj6P8p8
6248e9J69k1j92p6K17J90k03k62L87j10R3l07J28j28J53Q8J0j14Q2j18q3K2J40
$$ y = [-113, 27, 160, -49, -130, -38, 53, -130, 70, -176, 53, 50, -29, -63, -86, -3, 58, 99, 42, -10, 75, 86, 96, 30, -178, -101, 170, -96, -107, -27, 141, -61, 203, 214, 218, 135, -87, 43, 39, 40, 241, -198, 23, 29, 119, -39, 31, -108, -45, 243, 82, 118, -39, -65, 81, -20, 18, -49, 3, 246, 14, 46, -75, 28, -34, -10, -118, 145, -208, -196, 73, -232, 134, 88, -204, 145, -127, -192, -108, -348, -15, -42, -215, -80, 128, 0, 239, -18, -255, 20, -37, -22, -46, 17, 30, -223, 79, 82, -85, 137, 242, 85, -162, -157, 19, -4, 91, 19, -10, 100, -149, -204, -70, 75, -21, 124, 84, -296, 91, -126, -63, 24, -57, 60, -154, 179, -157, 46, -49, 81, -149, -133, -126, 341, 174, -178, 296, -150, 36, 198, 37, 110, 191, -113, 215, -293, -244, 236, -180, 3, -14, 74, -69, -181, -8, -12, 6, -33, 24, -173, 79, -30, 226, 115, -42, -43, -59, 19, -59, 110, 89, -103, -179, 38, 228, 25, -237, 150, 40, 133, -174, -46, -174, -21, 67, 77, -37, 45, -73, -156, -134, 6]
6271Fk1j94L74j85P5O2P9j38m3m2L27J7l26K58k85m1o9L0J48J81k66J25m1l6k
6296gM8L0R4jk04k22M11l7m8M3k18oj30K22R5K01l47lj30L76p0m7l40K28q3pJ19
6323c3r0N8J34j01oO7N1j44K30j72QO3p1j3Q4k5J63m54K67n1J11L19n79J69k1
6348c6K1k61K29m4L50m45K12P3m1k84K36j83j51M17q4Mk84L13j83J08Nk09L80
6371A43j60J60j37K37j66j62j8K40k13J75k15R4R8J33m35M11Kl15l7K44Rj18L48
6394C18r8l68L58k63J12j88kM16k2r4j08j67M9J59k32R9n0q6J64oJ27j45k6L4
6418a9K3L18n01nL9J30R8j0L01m74L83p9k05k63K94q3j41K37j03q4J25J13k0R7
6442A71q3p0o8J66j69O1m0J46j33j83P3K35l8k50J63k12J25L3J4l9Mm7L6J50m5
$$ y = [6, -15, -209, 165, -20, 55, 117, 196, 58, 15, -27, 300, 317, -9, 249, -36, -77, -146, -116, 32, 213, -53, 72, 31, -5, -7, 41, 71, 165, 164, -40, -262, 149, 112, 64, 107, -111, -117, -247, -25, 70, 271, -76, -79, -209, 167, 97, 50, -290, -62, -145, -152, -33, -123, -65, 69, -32, -38, 29, 80, -64, 166, -6, 2, 65, -6, -19, 65, 40, 203, -251, 16, -35, 76, 395, -184, -15, -36, -15, -276, -47, -91, 259, -186, 26, 99, 58, -226, 10, -173, -324, 93, 9, 13, -271, 42, -141, -33, -28, -237, 143, -17, 143, 6, 243, 77, -85, -103, 137, -76, 99, -116, -22, 76, 209, -226, 185, 187, -128, -165, 79, 88, -30, 318, 220, -148, 210, -53, 59, -129, -131, 285, 263, 169, 61, -106, -57, 102, -130, -31, -81, -167, -3, -9, 118, -27, -53, -19, 4, 322, -179, -184, -145, -15, 83, 73, 374, -100, 283, 204, -1, -264, 30, -53, -194, 43, -60, -144, -19, 94, 74, 171, 88, 18, -50, 116, -53, 8, -32, 114, -19, -202, -129, 106, 68, -182, -19, -231, -106, -73, -59, -98, -94, -141, -105, 45, 0]
6467@nj8K3K50m36J39QL05k59q4p2N2P7Q1m4j61P8J16j03r1J23j36K01k05j21
6492b82K50R4j40J62l20J58J11J55j08J29k21J79j09l02L53o7j67l9J69J15j02
6513A8m4p5K32j70J42l33K30p0P6J55j40j30J51p7OK1n6Q2N0p3J98j05j55R3Q8
6538A14k03M06l09J11j12P5k74p2L68p2J54q3j10P9k7j84J06j17K04Rj28J34n0
6561A9q5j06J71J36L4k9k09l6J61j56L38j23l42M13j74j19K51k9k1m28O7K00J44
6584G7K4k40K39j44J90m0j20J45j67L30m13N9nP2oj03L76k76K83m30qN6k1P2j29
6609a79J86O1Qmj10j25Qj10Q0L49j29j87L84m17K51j88m1J97M3j35J49k17J06
6632b0jJ7J48k51K08j48nk6J44j11K59l57K66q3j65J87m3o0j32N53l52j60J07
$$ y = [0, -5, -23, 0, 250, -186, -47, -39, 266, 7, -77, -149, -97, -20, 61, 17, -144, -66, 50, -53, -144, -21, -157, 44, -161, -282, -32, 62, -78, 84, -236, -78, 33, 188, 80, 209, -12, 167, 58, -244, 109, 42, -125, -164, 5, 120, 18, -26, -101, 131, -39, 103, -230, 0, -70, 6, 161, 21, -109, 42, -35, -29, -8, -64, 18, 68, -5, 193, 88, -67, 26, 114, -89, 317, 8, 119, 7, 82, -192, -264, 104, 32, 186, 103, -7, 72, 45, -139, -33, -150, 54, 63, -65, 69, 19, -66, -172, -1, 135, 169, 140, -69, -105, 56, -100, 238, 115, -227, 186, 12, -107, 144, 115, 94, -334, -267, -67, 77, 101, -139, 100, -44, 146, 106, -14, 131, -36, 294, -119, -60, -65, 7, 1, -102, 274, -2, 281, -149, -157, -101, -122, -50, -179, 7, 68, 76, 72, -38, -163, -155, -265, -185, 164, 35, -152, 232, -185, 66, -122, -163, 34, 77, -58, 91, -126, -20, -21, -4, 144, -107, 101, -47, -52, -78, 66, -45, 214, -143, 123, 40, -125, 62, 19, -41, -173, 380, 28, -132, -25]
6655b5M7q0j33J92J72n21K48j24K15n4J17j56K70k67K27m95K86K35l33K09q0P2
6677B2n6J63j3j03p1O2J37P6l63L40l15J35r5J40P1k47o8J44K16l38K08K81m81
6700a55J75r8O9P3j02J19j79j01J93l8M8L1o6J52k76J84j65J12K46l85J57M0N
6723C9m9P8J95m83K33K10l24L4j67K88q0L5R7k62K43j42k5J56k04J03J09Q1j11
6746E4p6K89j40j36l0J94P8k68K25k57m9J03J00r5q9K48l5lj24l4nk99J55J70
6770b4k3K00j39J12j79J25N2m3p3J03km3r1L41k21j58K07j60O1k5k16J55L1q8
6794i8K35l50K45r3J39o6k1Q6M2r8K5r6L4Q6Q5J18k61J75j40O5R7k00L5r4J62
6819A12p2k29K69K4j85M10m94L41k20j15M0k2M50l75J82p3P1j33pJ62j15q7K45
$$ y = [-25, 22, -58, -191, 1, 173, -348, -100, -224, -9, -63, 54, -102, 168, -99, 128, -367, -81, 154, -179, 30, -50, 22, -34, 129, 116, 13, -58, 4, 141, 217, -146, 194, -121, 14, -81, 59, 130, -117, -185, -41, 175, -163, 45, 326, -155, 20, -78, -9, 64, -38, 81, -98, -199, -6, -44, 4, 35, -31, 121, -155, 29, -136, -24, 222, -163, -6, 34, 39, -10, 68, 263, -220, 13, 223, -101, -67, -234, 54, -26, 9, 106, -156, 87, -55, -80, 76, -128, -25, 84, 165, 54, -22, 267, 127, -9, -39, 155, 233, -35, 190, -67, -116, -13, 87, -8, -97, 151, 116, 113, -11, -45, -50, -349, -194, -24, -47, 153, 14, 126, -53, 72, 124, 81, 8, 111, 109, 66, -25, 316, 95, -63, 144, -16, 45, 20, -196, -41, -10, -98, 137, -213, 32, -61, 78, 12, -9, 77, 119, 21, 46, -50, -16, 70, 155, 273, 12, 187, 47, 112, 209, 9, 44, -50, 112, 40, -189, 80, 104, -81, 329, -165, 176, -44, -159, -119, -141, 309, -66, 116, 43, 114, -19, -26, 136, 21, -66, 179]
6842A79j1j47j9m5lP2J51k26o2N6j49R3K96j92k4M9k03J82L03o11L30J30L00m00
6866D9j0K39m52J02J98j69L17l99L69l96L24l1k31Q1K2n7R4j55J5L38m51J24J75
6889I6mjK2l59J57j3J02q6J80k82L69k12k1M1k50J63L02m05N5J14oL57k84M0k98
6914b23J62J09k17J3K34j46MJ21j77L80m66K69o9LK12n34M00j8J2k27J69K1J46
6937A78k08j17n4J72k81R2L02k08K61q7K5j16n4J94j91m5K86n11J6K09K92k50
6959i5K29j18K04N9k58RJ09m78J80J78m0J97j55Mk4K15j49J87l78L78l67J58J38
6982A83l2j39o7K05q2l33K71l0n4J73l8m7J28j84o9K8J23K59j28l91L22j54kK03
7006A45l04Q7N11n36K22P5j70m2K13K2j74j3rK63m03J99q6k19N6K98j08l6J12
$$ y = [179, 168, 21, 2, -43, -46, 26, 177, -49, -111, -55, -204, -111, 185, -7, -31, 18, -185, -3, 300, -311, 19, 149, 449, 49, 39, 278, -174, -72, 126, -43, 274, -125, 244, -152, 172, 141, -90, -9, 13, -44, 50, -105, -90, 248, -203, -79, 96, 92, 91, 113, -246, -89, -102, 0, -86, 94, -188, 181, -31, -52, -11, -261, -98, 204, -201, -146, -32, -38, 319, 35, 75, -223, -61, 48, -169, -156, 78, -68, -64, 57, -120, 260, -206, 63, -6, -3, 209, -325, 75, 57, 69, -158, 11, 32, 178, -30, -147, -201, -29, -310, -218, 84, -124, 137, 50, 75, -41, -95, 99, -92, -137, 149, -362, -346, -137, 155, -95, 134, 16, 220, 279, 21, 30, 139, -339, -159, 19, -21, 176, 21, 25, 1, 216, 67, 254, -124, 254, -113, 45, 183, 151, 12, -55, 150, 68, -265, 6, -24, -78, 95, 57, 10, 138, -46, -115, -87, 36, 295, 167, -224, 98, -56, -58, 145, -159, -72, 439, -97, 125, 200, 30, -12, 201, 223, 49, 36, 27, 290, -113, 86, 0, -219, -163, 135, 27, -9, 103]
7029A03q2q9J22o3J10R7l28J37M7k21K45p6r5J46k85K13P1K41k21Kk15j55M13
7052A17J66j62o3q6j3k2j2J88j36j57M29l84K75K5n5j35kJ97k22m4K48j15J03
7075A40K4l56J46K8J69j56K6K78k97j62L03l17J35L43k46J37n9j69n8k26L19j20
7097a18K67M0k10K41q6m6j62J1J18j23J04R6r7p7J54j27L4j94M28l05Q1j46J36
7120A9k21R8P3k64J36L54m91M97k84M4m4j22K61l6M3j98J88k66J84kj43K82j96
7143h8J65p7J30Qj63Pq8q8j5L2L25j46P0K7n9p8L8r4P7R6j41N4kj19J06j68J95
7170Dm2K07j66M4M4j87Q1Q0J49j24j25L4l6J72L1l55L5L14j84p7J86N3j06lN3
7195H2J38pl15K58n2M3j68J88J48j62j92J01q8J27K1j50J84j55j41J76J32q6j73
$$ y = [103, 21, -68, 54, -9, 101, 198, -130, 7, 54, -167, 78, 2, -93, 53, -232, -19, 52, 293, 72, 74, -141, -296, 117, 283, 121, 58, -28, -41, -63, -75, 113, -23, -180, 249, -135, 140, 165, 110, -25, -27, 170, -52, -96, 152, 37, 140, 164, -192, -46, -18, 151, -5, 21, 299, 2, -160, 143, -174, -39, 304, 58, 195, 136, -33, -91, -317, 2, -118, 149, 189, -21, 220, 134, 88, -74, -63, 55, -68, 36, 132, 35, -42, 112, -15, 19, -175, 253, -52, 29, -117, 19, -202, -104, -31, -295, -159, 195, -296, 201, -83, -39, -83, -205, 56, 20, 63, -135, 53, -213, -29, -31, -174, 108, -88, 77, 0, 130, 138, -25, -18, -106, -194, -209, -177, 148, 2, 72, 99, 40, -38, 0, -94, -17, 79, -62, -8, -10, -129, -23, -191, 4, -38, 169, 3, 47, 91, -96, -15, 65, 214, 90, -35, -1, -37, 135, 166, -189, -154, 160, -24, -101, 85, 138, 32, 29, 82, 220, 213, -102, 156, 104, 147, -21, 167, 315, 153, -39, 62, -26, 101, 122, -28, 156, 1, -140, 36, 168, 82, -91]
7218i1p2J04o1K05k6m7j44K40j34Q7j6K4j45J39j50M1k56L80r1N9r3m7J78qr4
7243a8j15n2K34L1k21K17j11J26k5K2k42J49k39J19rN5J98K77m10J59j81j55K16
7266B5J35n1k86J97o5KJ07j41k6L7j42J91N5o2q8K6K95k36L6P9Q1k13ml25M79
7291A06j07j04K59k55J48m3P8l5l86J78J61q2j4K40O3l05p1J28R9n9J33k61N1
7314g8r1Q0J53q0m6l7MN12m06J55J6l82K85J10k57J74K9k10p9K0OJ15J2O3L5J03
7340B06k14k29M2P5m7K41j35K00n2q7j02O8k6L67l15O3j36K95j88j3K00j98K20
7363B35j01j05m1J69j10j6M1j99K61k75lL3J39jj08K19j96J96o0k55K70m0o8P0
7387E5MK4l3j53j47J14l3L84j83j12J08Q7k29O1n7Qr0J93m4k38K28l6qJ11q7j93
$$ y = [-91, -163, -59, -120, 85, 59, 12, -132, 108, -26, 61, 45, 69, -76, 63, -87, -46, -302, 78, -13, 46, -47, -94, 84, 76, -18, -133, -185, 49, 80, -141, 76, -35, 91, 66, 88, -154, -5, -244, -125, -134, -79, 119, 396, -14, 145, -36, -191, 25, 160, 109, -177, 20, -45, -43, 64, -77, -103, -66, -208, -17, 38, -24, -112, -86, 209, -27, 9, 88, 169, -44, -48, -373, 106, -1, -105, 154, -101, 47, 4, 82, 47, -339, -161, 0, -82, -96, 144, 207, -98, -169, -41, 58, -1, 132, -129, -78, -169, -89, 64, -16, -62, -99, -95, 417, 11, 166, 182, -200, 85, 195, -62, 112, 141, -69, -148, -128, -122, -7, 5, 68, 103, 206, -8, -237, -195, -120, -167, 74, -61, 139, 87, 0, -102, -34, -60, 307, -8, 55, -81, 214, 26, 13, 213, 15, 235, 134, 29, -12, 157, 47, 31, 72, -127, 134, -141, -144, -111, 28, 27, -81, 138, -58, 138, 78, -177, 93, 53, -15, 55, 59, 83, 50, -103, -250, -136, -169, 215, 32, -80, 28, 115, -114, -53, -110, -102, -192, 1, -43, -281, -53, -89, -97, 14, -73, -266]
7413b66K54l5M9k3K6q1O3K07k33J15l21J32K6J38m4QJ39j85O5JM9j50N8R5j60
7438g3O0j01O3m2K16j01l9qK07k75K39k1k45M4j6L15k55K20k19P1J26j39K1k64
7462b16L47k92J85k28J94O3oJ16j95R9l09M09p2l12J99M9k1M0Kj66r0J97j59K20
7486E4n8m1J30j20J28Lk3k29J30n1Q2j0q7L12j04q0j09q7J25j75L35l1j18J43
7510A19r4JM9q4n0K06j24j40Q4K78j29K3m2k41m6j76K78J04lk72K78k86P2L02
7534A07j24L10n01L57k99J21j14J46Nk67K13K18K8l00J16qj35M6J58j2l1j70Q
7557a28J11j24K41m2j2k8Q6J13l08K27k60j32R7K91k16K61r2m8k06K53k44J85
7579B5K47k85P9n9l9j78j09K75J56k15K67m2J5j26j53K27l1L1J60q6j81L8p7j37
$$ y = [-266, -12, -47, 2, -21, 5, -76, -13, 194, -39, 76, -245, -113, -87, 51, 7, 15, 154, -31, 34, 35, 84, -66, -8, 87, -73, -13, -114, -51, -93, 123, 22, -17, -25, 182, -93, 146, 125, -120, -76, -92, 223, -32, 188, -31, 40, 166, 27, 48, -216, 131, -161, 24, -204, -10, 53, 47, 163, -32, 67, -242, 167, 95, -217, -18, 31, 10, 50, 52, -114, -204, -7, -166, 54, -4, -45, 85, -35, 93, 96, 73, -156, -26, -77, 5, -5, -92, 220, 116, 36, -73, -160, -35, -210, 125, 94, -24, 119, 25, 26, 75, -9, -59, 147, 23, -117, -33, 245, 116, 139, 97, -144, -190, -366, -88, 16, 13, -259, 19, -267, -195, 107, -17, 293, -208, 149, -150, -29, -143, 3, 8, -259, -46, 172, 200, -100, 16, 8, -127, -81, 77, 65, 34, -136, -128, -17, -141, 100, 58, 46, 18, 104, 217, -91, 136, -124, -256, -159, 132, -84, 177, 85, 37, -169, 84, -160, 25, 272, -13, 66, 7, -32, -210, -319, -44, 112, -103, 164, 122, 137, 11, -142, 85, 54, 85, 245, 159, -22, 16, -61, -198]
7603a98M81l15J79k79O3K71k77n3j31M13j61j68kJ57M2p1J25j82j6K22k32J77
7625D5j87L64k54nK5j36K46j15pR1o9J35k78%Q9J6J68j86L2n4J64Rl12M67l69
7650a21L06l14L7J47j47K53k99L56j49J20j09o0j49J02k35K02J73n2o0J62k21
7671e8J2J91r5R2j28q6M0O5k42M2l7P1P9L5L31K7l98l5J08K9k22L10j94j01J38
7696b6n5L02q4j41J72q8k71J87J26M0k11j86K63M4k66O2J34J05m1J82l00R7Or
7720D2n4n5l9q5J2K62l14K64J9k43K99p9J73j22j85J76pj42N6k1j86M31l62R5
7744f5K08L1j11o0k10J69K94j87m8M5j41K4p1J0Lp7L23K1l61K64j14p6Q6j38L16
7769A35j68m3J82k3PJ54k80j13J09m7J0o0P2M1N2l9J2J02n6J00l21J20P0rpj23
$$ y = [-198, 283, -32, 147, -132, -69, 202, -75, -128, -259, 154, -7, -175, -177, -20, 22, -49, 76, -106, -122, 100, -132, 45, -142, 222, -32, -37, -12, -148, 98, -17, -24, 67, -2, 133, -145, -145, -56, -40, 128, -58, -26, -80, 84, 93, -219, 248, -121, 185, -129, -92, 55, -92, 161, -138, 218, 69, 189, 80, 20, -129, -27, -262, -60, 113, 61, 1, 163, -58, -46, 145, 50, 142, 14, -72, -32, 33, -209, -167, -204, -133, -54, -19, 312, 339, -59, -94, 14, 43, -179, 131, -63, -164, -26, -81, 221, 137, -4, 168, 80, -191, -4, 122, 162, -49, -235, 28, 72, -194, -132, 2, 107, 66, 248, -52, 45, 51, 42, -12, -67, -106, -191, -179, 83, -231, 33, 52, -191, 108, 29, 202, 80, -105, 71, 64, -78, -22, -43, -229, 202, -160, -65, 143, 174, 63, 3, -207, -38, 256, 69, 21, 66, -75, -51, -122, -112, -109, -186, 137, 158, -203, 61, -53, -129, -43, -181, 135, -33, -76, 106, 83, 90, 244, -36, -149, -40, -87, -77, -137, -65, -24, 28, -11, 1, 103, 47, 147, -174, -54, 16, 7, 0, -123]
7795a23L30l58O1J1J81j7K6L6k60P0k9P3K61mk26l00P9J72k2R3K92n93P6K91N3
7820A73k74r0L14k25J72j47o3j2P4j33K10L0r0J60j85M9L0q9K5k4K90k39R2K3
7844G1R5m98N63j13j48%l2Q3j5K15j87j45J44L8j54p9J62m8K10j41k85K23P4j18
7868h5J72o9L6r5K06k25J30P2l38L39j36L9m4N0j4R5m4Q6n7mo0J98j29k19M2L5
7894a9r8O8M6k52K57k7r0P8Q3R2l31M3J57j3J09N0K6k65p0N7K50l92J77P8P3N3
7920A40l47J88K5j45n0J09J17k0l5J14R7k01J3j13l9j93L02n5K49r3k85K49r5
7943f8K53m04K09J63n74M87J13P4j83j73J06Q2j57J70Q5k64J71Q1j38l0j7pl4
7966e5rK03Q9j09L3k09p6J82l6j51L09k22j36KL5K46k4o8N7j76Q2j14rK55k23
$$ y = [-123, 207, -151, -90, -79, 102, 85, 111, 147, -113, -43, -72, 1, 262, 258, 32, -268, -189, -17, -39, 54, 346, -247, -171, 120, 173, -101, -191, 123, -102, 70, -77, -140, -152, -78, -211, -1, 29, -61, 99, -86, -37, -7, -96, -71, -95, 195, -44, 48, 71, 166, -332, 231, 118, -30, -30, -62, 21, 6, 221, 34, -111, 33, 71, -83, -162, 0, -48, 162, 21, -264, -41, 33, -85, 87, 18, 54, -41, 165, -60, 70, 142, -196, 143, 7, 46, 2, 52, 38, 133, 89, 175, 118, 114, 54, 252, 123, -96, -54, -19, -117, -49, -3, -255, 2, -25, -115, -37, 46, 138, -193, -150, 7, -6, 103, 153, 179, -86, -156, -99, 151, -241, -64, 14, 87, 140, -207, -19, 6, -139, -189, -80, 37, 17, -18, 96, 193, -8, 5, -108, -147, -340, -38, -93, 156, 63, -222, 27, -68, 185, -219, -10, 153, -421, 66, 179, 253, 70, -103, 3, 85, -72, 98, 183, -81, 90, 171, 33, 3, -14, -21, -55, -64, 139, 228, 119, 152, -57, -133, 49, 13, -138, 171, -51, -187, -185, -150, 96, 72, 4, 61, -115, -33, -147, -156, 99, -124]
7991a24M05k66j32Q3J61j2m8m66K32K25l80N02Q0k85L04j45n0o0K22l02J96k24
8013h4K12j31k96L15K7k29K92k73J68j83M07k30k1J36k14J58k04Oo5L14Q9j49
8035D5Q3j54J08n1j81K03j79J49J5j83m2M2K07j75K17j1j68K30r6j92J9J5k2J4
8059a07K12j09l76N13j42J34Q9o2j60Q4lO2j03J02k91M27k24j22K40r5l9j33J06
8082Cj9j68K73k27J69K40j65R8k15j41R5O7p2M1q1J02k4O0j4%kL3k28k2K32k4
8108A1k72L22j54jp8M28j02M7j10K03j35l09K43l17L82k7k05K66j60j86N36l87
8130eK8k2O2j99L9J56J84o6j16Q6k20m9J46r0p8L33j06J3P9k69q2N0R3m4Q4N3
8156F0J68j97j6m26K17K51j76L2R6J58j10j47p2J23rJ48q0N5J51p4k45O6L01m03
$$ y = [-124, 281, 15, -117, -34, 127, 115, 67, -399, -167, 58, -322, 180, 260, -25, 279, 134, 84, 24, 246, -56, 140, -84, 128, -3, -299, 16, 43, -186, 106, -167, 1, -182, 225, -5, -26, 110, -104, 54, -150, -144, -209, 105, 194, 45, 128, -26, 82, 31, -150, 53, -126, 23, 38, -145, -187, -145, 62, -113, 104, 93, -75, 155, 59, -133, -114, -99, -121, -107, 105, -4, -380, 133, -9, 125, 214, 152, -8, 76, 73, 135, 32, 134, -157, 270, 46, -76, 164, 69, 30, -103, 3, -16, -184, 89, -138, 31, 271, 106, 204, -11, -152, -57, 10, -62, -21, -102, 0, -24, 36, 22, 22, 20, 53, -175, -197, 35, 11, -261, 61, -93, -94, -172, 256, 154, 201, 91, 294, 159, -150, 93, -224, 158, 131, -74, 192, 32, -154, 382, -5, 23, 1, 63, -136, -97, 59, 243, 177, 61, 147, -73, -122, 24, -66, -144, 189, 83, 96, 175, -94, -176, -126, -33, -77, 7, 60, 228, 31, 15, -411, -194, 57, -119, -87, 9, 167, 57, -90, -162, -39, -48, 100, 20, 75, 226, 152, -93, -27, 274, -129]
8180a29N3J24Mn1n5P5j30J02j69L38q9
$$ y = [-129, -76, 48, 52, 1, -54, 21, -109, -7, -176, 162, 73]
8191G3
$$ Imaginary data points
##PAGE= N=2
##DATA TABLE= (X++(I..I)), XYDATA
0@%%%%%%%%%%%%%l2O4o4O4o4R6j28J28j60J92k24K57k89L52m16M80n44O09o99
32c78P95q98J025j153J284j439J616j800K001k223K464k727L019l336L679m058
48b129M472m926N425n976O592p275Q038q898R876j1004J2323j3869J5721j8008
62i638K0896k4668K9832l7380M9469p1989J27993n21247r83679R28322J193706
73G01617K24491q51445o96653O5065N81040K63745j49477j51867M4829j36535
83a05190k55196M9542M32730K74310k07574m96029k30735L05954N00939N3938
93C22689l93736k81448J18387K27852Q4554m2591n2775k4020k9641p6913R644
104a37998K02387J57800j72432k87502P748K68859J50226j23578k05392k7762
$$ y = [0, 0, 0, 0, 0, 0, 0, 0, 0, 0, 0, 0, 0, 0, -32, 32, -32, 32, -32, 64, -64, 64, -96, 96, -128, 129, -160, 192, -224, 256, -288, 321, -378, 417, -481, 544, -609, 675, -764, 852, -948, 1053, -1170, 1294, -1433, 1586, -1750, 1929, -2129, 2343, -2583, 2842, -3134, 3458, -3817, 4221, -4677, 5199, -5805, 6518, -7351, 8370, -9638, 11258, -13410, 16422, -20958, 28511, -43478, 84515, -436732, -1420411, -492089, 701617, 926108, 74663, -621990, -556925, 24115, 287860, 138383, -13484, 31345, -105190, -360386, -310844, 121886, 396196, 188622, -307407, -538142, -232188, 268751, 322689, -71047, -352495, -234108, -6256, 78298, 35707, -17068, -41088, -70729, -147642, -137998, 64389, 222189, 49757, -237745, -229997, 38862, 189088, 65510, -139882, -167644]
114a67644J63477R8830j12779r9267J09561J05611j19386j50309Q1935K09384
124A19413M8516j86832j90408Q1353K83932R1552k46949k21410J15012K54197
134A48376M4929j83018j48624P5517J87287J5778j90188r1340J60325J52210r1004
145H0248j86428k1368J57324J33459n7540j71680m6323J31287R4387n7125o4266
156h025K9365K8935l9008l8237L4712Q4597K6136j01833j18531M2561J53498M3701
168A37871j10884r8462J9597P8388L8886l6999n0041J8435M3725k9802n9956K8755
180b0487Q4991J2796p2595o0051J9442P3656L4850n2588n5080L0161M4252l6398
192B949n2585L3798P5030L273q5749p9887L1679J22010N2437r6392j09174K0441
$$ y = [-167644, -4167, 94663, -18116, -117383, -7822, 97789, -21597, -171906, -89971, 119413, 167929, -18903, -209311, -127958, 155974, 247526, 577, -220833, -105821, 148376, 193305, 10287, -138337, -62820, 124467, 140245, -49943, -141283, 19042, 171252, 80248, -106180, -127548, 29776, 163235, 105695, -65985, -112308, 18979, 113366, 56241, -8025, 21340, 50275, 11267, -26970, 7742, 92339, 118475, 16642, -101889, -59328, 94170, 137871, 26987, -71475, -51878, 26510, 65396, 28397, -21644, -3209, 40516, 10714, -49242, -20487, 64504, 77300, 4705, -55346, -35904, 37752, 72602, 20014, -35066, -4905, 39347, 2949, -49636, -15838, 59192, 62465, -23284, -103171, -71492, 50518, 102955, 6563, -102611, -82170]
204h2170R3680L9627l2604m4444q586K3201P355j9722R901M9764K725p1059m5203
217g7535M3359P2215J8234n3273o9258l286O5104L9100k9250l2823L071J257j0057
230c3142J0244K9076J7439j7309m9175k5470N1929P5135p841p9323m1148L8570
242c1015O0763J9995l7179n1026j696M0626J8210j3258m223o21j9900j2374K0959
255a0739L0813P728k5069m1001m690N3049M2563k8308n1747l556L4117K6319j583
268B7896k3417j6061J4707J6159j3581j0490J8569J1186k0399j9030O054J8190
280I783J3815p715k7893q591K8039J7258j7863j3645J0367Q069l550l811k358
293A905O664J3909o444k4615J758K7212N150k0874j1844N726R967O199q377j7262
$$ y = [-82170, 11510, 51137, 18533, -25911, -34497, -11296, -3941, -23663, -13762, 36002, 38727, -32332, -77535, -34176, 38039, 56273, 3000, -66258, -69544, -4440, 34660, 5410, -27413, -24342, -23085, -33142, -22898, 6178, 23617, 6308, -42867, -68337, -16408, 58727, 50886, -28437, -69585, -31015, 29748, 49743, 12564, -38462, -40158, 468, 18678, 5420, 1197, 576, -19324, -31698, -10739, 20074, 27802, 2733, -38268, -42958, 10091, 52654, 24346, -27401, -30957, 3160, 29479, 27896, 4479, -11582, 3125, 19284, 5703, -4787, 13782, 24968, 4569, -14461, -8407, 9783, 23598, 15883, -12010, -20601, 7438, 24696, 6833, -6812, 3555, 11624, 8074, 4263, 1905, 8569, 22478, 16034, -8581, -6823, 20389, 25539, 4665, -7179, -1453, 8514, 14713, 6336, -10926]
307a0926M136J9842k702k0587r94J5766L871n721n817m026O416J2963n139j5439
321h357N664J4750n510j1871L092O935N08k189q194o676J1627J2113j3609j6541
335a8258Q304J3521k166p735m139n19Q916P993j0224j0545J0691J1012p482o595
349g226M743J954m90J915l686m080P460L086j2022l518J2189L740j0647m185J929
364h838L142P370M43j3259l551J4409O593q799l801M739J84J469K968l602j491
379b024O341q02r502K798R899j981q623k65J668J590M466j355r233O23R360P6
395C036o282J998L645k143M17K297j929J278N166l325p253M931P717m294m939
410C20N50J07J123L704k525o842J952N324l012k174L686N31m514J147K511l11
$$ y = [-10926, -6790, 13052, 10350, -10237, -11231, 4535, 8406, 2685, -3132, -7158, -742, 12221, 7082, -8357, -2693, 12057, 6547, -5324, -2232, 4703, 5211, 3022, -5172, -11848, -221, 11892, -1717, -18258, -9954, 3567, 1401, -6334, -10473, -10992, -2076, 5917, -4307, -14852, -4161, 6851, -631, -7226, -2483, -529, -1019, 896, -2790, -6870, 590, 3676, -8346, -11864, 325, 4065, -6582, -10767, -8838, -5696, 1674, 2117, -11142, -14693, -284, 6309, -2490, -6291, -1552, -1368, 101, 3069, -533, -2024, 4317, 3515, -5987, -3189, 6710, 4729, -3894, -4159, -2491, -901, 3565, 2210, -7023, -6400, 2960, 3036, -3246, -1248, 2397, 254, 671, 2968, 1039, 2317, 7483, 4158, -3095, 1836, 9553, 5259, 320, 870, 977, 2100, 5804, 3279, -3563, -1611, 3713, 701, -1473, 2213, 2744, -1770, -623, 1888, 1577]
426A577K200J910n322l313O801M323m382k133M13j273J036L766k540m644K214
441F33J654l916o0M067j344l254N77K55n98L620J296n113j604N303J147k509J144
458A298L93k841R20K886j741j346K161j945l735K550K993k018k098K14j554k12
474d075M110J093m139j671K081L72J488L285j267m946M57K479J738K550j36n983
490b564l763M924M323n83j933k257l179N37M535R13j624r6k032l238K192N859
506B014J427k602k217k985L18O163M785l889m948j076J008K993L935j197n389
521a660j165J544j42J486L086j291m168j394J351J360L693J962m377m301J524
536b492L447K106J769j584n248p30M653K368j407j244j237j300O63J506p12l43
$$ y = [1577, 3777, 5687, 365, -2948, 3853, 8176, 3794, 1661, 2074, 801, 1837, 5603, 3063, -1581, 633, 2287, -1629, -1689, 2378, 1034, -2220, -1643, -1388, -1986, 1634, 2930, -2183, -3787, 1516, 2663, 154, 1298, 1691, -1150, -230, 2656, 915, -431, 1730, -215, -3950, -1400, 1593, -425, -2523, -2309, -3863, -4075, 35, 1128, -3011, -4682, -2601, -2229, -741, 2544, 1277, -3669, -3212, -733, 1005, 3555, 3419, -2564, -6327, -1403, 2920, 2337, 404, -1853, -5032, -4495, 40, 953, -671, -767, -2799, -6037, -3845, 2014, 3441, 839, -1378, -4363, -4045, 2118, 6903, 3014, -1934, -3010, -2002, 991, 4926, 3729, -1660, -2825, -1281, -1423, 63, 3149, 1858, -2310, -3704, -2353, -993, 2700, 4662, 285, -4016, -2492, 955, 3061, 4830, 3246, -2002, -2732, 1921, 4289, 2882, 1638, 401, -899, -236, 1270, 558, 215]
552B15J971j401l764L92L443J236p4j306l348r95N399L727k915l757m61J438K697
569B497J982k884l646J863K377j228j204J268l19j751Q5k40j63K822J088m143
585a596k845K703L691R43r82l231l125K846N818L59l696k609o79J027L354J767
601C745k728k826l60m10L02L796J949l701l861o37J945L918L737k221o644k384
617f380L720M984K928j218o301l844L934N536R40k461k695k847L69L414K390r11
633A558r36k369k942R54M858K537k390k900k534j05N000M714k111n365j701J695
649b037K823L103o69m056j649J952Q87l1J503k61k967j672J837J357J560J83k766
666i03k835J981L706J87j091j250j293L59L019J091k448j183P37J30l4J812p89
$$ y = [215, 2186, 785, -2979, -2587, 856, 2092, 2018, 712, -2636, -3631, 1768, 5495, 2580, -1177, -1638, -200, 2497, 4479, 1595, -2051, -188, 2189, 961, -243, 1025, 706, -1045, -960, -1200, -1363, 1459, 2547, -1596, -4441, -1738, 1953, 2896, 1914, -1317, -4442, -1596, 4222, 4581, 885, -1724, -2403, -1376, 1978, 3745, 1017, -1809, -2169, -2579, -2277, 1519, 3468, -233, -4094, -4731, -2786, 1132, 4869, 2648, -3996, -6380, -2660, 2324, 5252, 4034, -2267, -6111, -2177, 3359, 4299, 1838, -857, -3704, -3335, 79, 2469, 1558, 622, -1747, -4689, -3735, 1123, 3660, 1270, -1630, -4164, -4269, 731, 5445, 3334, -2031, -3732, -2037, 786, 3889, 3220, -836, -2485, -533, 354, 323, 1826, 1565, -1402, -3074, -1237, 120, 1680, 1863, -903, -3738, -1757, 1949, 2136, 1045, -205, -1498, -1139, 1880, 2971, 523, -660, 77, 207, 173, 1985, 1196]
683A196j448k27J3l64Q24J880j177k237m5J147P67J016K1k606j079K067J943J01
701A792n36j421j401R35K543L27j574q47l97n93J470J289q01r85p81p20L97K180
719H77J183k060j454k32Q71J261J126m72k275J13J364L85J04M1n69r21N18j66
737c06r6J253O55j576j647N83Q70N92L62j071j173K21J750J48m48l96r4o72Q35
756b10R57n42n4N30m39j077Q04R05j94n37n08n58J70J380L0j002l16K22m29K51
776f17J131j34o75k24J31L70P13K59p36l86p4N33K16N24k37j239m11J086L17K34
796G81n35r92m35R77R07m89o45l3j24K66J194m5j347J47M78k1K59M55nr65J93
817B1K40k21M05J97o76p15L62M85J27N9k56p83L65N45J77m19J42l0n57N02M54
$$ y = [1196, -252, -479, -466, -830, -6, 1874, 697, -1540, -1585, -438, 329, 1345, 1366, -1240, -2319, -252, 1691, 1792, 1256, -165, -1566, -631, 1912, 2239, 665, -182, -579, -1172, 298, 1587, 786, -199, -980, -1700, -1303, 877, 2060, 0, -1454, -1686, -815, 446, 1572, 1100, -1175, -1062, 302, 687, 791, 832, 263, -658, -140, -306, -402, 851, 1506, -70, -1717, -1134, -264, 328, 690, -381, -1554, -1333, 417, 565, 117, -279, -373, -1045, -210, 747, 205, 151, 681, 242, -835, -31, 874, 680, 143, -365, -923, -753, 627, 657, -345, -661, -439, -868, -617, 514, 380, -295, -519, -388, -18, 695, 954, 218, -168, -242, 291, 507, 1031, 794, -445, -856, 230, 547, 781, 246, -746, -1181, -204, 703, 214, -431, -464, -588, -322, 872, 827, -520, -373, 105, 84, 343, 798, 793, -172, 21, 261, 40, 445, 642, -34, -749, -387, 98, 225, 284, 28, -755, -390, 155, 332, -87, 55, 25, -532, -30, 424]
838D24J2k65j12q6j16M54N75o02o92M88m67P6P15k54m26k24K55l4m32Q63j80o14
860f42J90L58j08J70M35l93l05M54L98p07M61J6m75k2K65M9k60j4Jp32N70K97
882FN3n64K17j4j61K40M61o38j2N88j43j53N55J39n84m4L10k18J08P5k98l15M58
905F6N30o57m38L55k09n4L52J24n53K66N25m44j43O10j28k55L28k91j44L55K82
926D77l40l66M79L39o74M12j25l82n2M85l66o4K8N58r52M16M91m27r0K19K10l33
948e7K34M02p11J17K20J70l75K75J99n51J30L69l34m05L39n2m05L81R7n5l79O57
970B66m15k19L51Q1n50N13M93m81l16O74J48n56N4L25k68r1J14k96k65M29p3l69
992d51K10L13n4l56L25r4m03M40L85o30M42J26j31l27N97k0n43K53R2m32K31N32
$$ y = [424, 436, 171, 59, -27, -143, 311, 886, 284, -408, 80, -387, -311, 404, 150, -276, -500, -245, -279, -711, 152, -28, -642, -452, -94, -202, -32, 403, 10, -295, 159, 557, -150, 311, 327, -148, -170, 95, 144, -116, -130, -129, -861, -291, 6, 59, -505, -288, -302, -463, -223, 238, -400, -412, 176, 33, -120, 435, 574, -10, -54, 256, 38, 146, 221, -77, -392, 66, 596, -61, -499, -144, -353, -407, -55, 69, -484, -218, 307, -137, -280, 330, 202, -53, 275, -16, -160, 195, 477, 137, -229, 250, 589, -85, 327, 202, -180, -232, 253, -113, -177, -149, 409, -543, -127, 364, -63, -153, 66, 276, -57, 177, 579, -132, -15, 205, 375, 0, 275, 474, -77, 53, 422, 88, -317, 22, -30, -435, -54, 43, -12, -391, 266, -149, -368, -17, 64, -486, 27, 520, 39, -277, 397, 545, -11, 43, 368, 100, 9, 123, -173, -438, -9, -82, -451, -241, 72, 18, -338, -13, -107, -510, -70, 315, -315, 127, 253, 122, -205, 392, 372, -171, 82, 174, -258, -27, 505]
1014E05n39j75L74j27j46p2K82J8m42J92P7l35N49J87o55J20L39J56m67N26m4
1035C23l23KL72k21m8j62K25m77L2L01j04J51j85o6R4nQ8m67M22l1M7k19P21O7
1059E37n11J69K2l14K53M74n50l90K70N9l6J98J44n59k05L34Q4l10L80j1l61L2
1081b91M34L8O0o5j99k28O05J24l42l09L91k76K13q4R0Lj17j55k35k7L90J79k81
1104h2r6l00J07M50L37m03j91J13J52j65K03K16m35N4K18j6j94M19k48l22L32
1125A49K4k54Q7N5m0n71L90L24k25J0k16r1p4M50M41n28J20P1k15L09M8j99o4
1148AJ70l6j85k71P11l93j54O9l13K11Q02m59o71k6O96kpk98J85k42L51L19k89
1171A69k30K45k77n7L84l8j83J72j44m22K71L65R9l53k83j34L16L13K34m69k91
$$ y = [505, -34, -209, 165, 38, -108, -180, 102, 120, -322, -130, -53, -388, 161, 348, -307, -187, 152, 308, -159, 367, 323, 0, 2, 374, 153, 105, -57, 168, -309, -277, 24, -80, 71, -114, -180, -86, -91, -3, -470, -48, -79, -32, -251, 470, 537, 26, 195, 217, -97, 156, 630, 80, -310, -40, 19, -17, 181, 325, -234, -439, -105, -21, -331, 49, 38, -323, -291, 143, 181, 241, 176, -23, -251, 354, 478, 136, -173, 218, -58, 155, 71, 161, 164, 47, -108, -343, -370, 20, 199, -82, -178, -478, -371, 79, 416, 13, -178, -65, 87, -78, 125, 341, -94, -40, 178, 162, -32, 387, 139, -183, 149, 173, -81, 6, 61, 21, -550, -160, 164, -61, -51, -267, -358, -432, 18, 459, -69, 51, 122, -93, 216, 264, 65, 1, 171, 135, -50, -321, 390, -3, -157, -88, -401, -190, 612, 153, -518, -544, 152, 150, 143, -155, 30, -212, 139, 458, 169, -61, 184, -93, -150, 234, 196, 13, 185, 41, -381, -110, 255, 354, 1, -282, -416, -100, 213, 447, -22, -313]
1192c13K32R7J42J85J50k98k95J73Qn2J72P5m03j03N07m45L03L0o1m09j71N16
1214D0K52j66l36M9m23P34K46m32j57L72J32m52K93j13j45J74Ql74nO92M0n73
1236a44k08N6L18L59m45k33l01N23M77l52O8J8l04K0J43J93l15L55n3k03j8N53
1258E07k78j85o2l82J51L24q0o4K9o9j62L9K90k40l10M60J29J11o9l7j12r3J24
1281B1K47j45o5j3J36k31m4M0j15N07k74l80ML74P0J31k60l13L19m1N43m45k74
1304b08M74k7l71p0L54j9J2M4l27M1L29Pk74k96K61j22K72k5l79j11M38j3j20
1327a30jJ68J4q1q9K96K0J98l01k72Q9K99o8k49M14P1m64O9o4J77N2j61j59J6
1351a56K18J45j7l23L60m11L41k74L4j69M16J86m16OR3J59l10J04k18L58K9jl69
$$ y = [-313, -81, 16, 158, 343, 493, 195, -100, 73, 81, 29, 201, 276, -127, -230, 277, -168, 135, 165, 104, -305, -476, 40, 292, 126, -210, -161, -584, 150, 396, -36, -193, 179, 311, -141, 152, 39, -106, 68, 76, -298, -303, 389, 429, -144, -352, -296, 22, 381, -64, -297, -598, -75, 402, 50, 118, 136, -168, -148, -5, 188, -127, 228, 175, -28, -46, 507, 229, 44, -18, -400, -249, 75, -5, -69, -40, -109, -271, -232, 58, -182, -492, -32, 97, 208, 139, 102, -10, -103, 21, 268, 123, 58, 45, 181, -50, -94, -54, -169, 338, 64, -316, -312, 62, 132, 263, 3, -310, 9, -32, 511, 66, -208, 266, 239, -132, -202, 152, 133, 145, 189, -138, -97, 232, 239, -35, -331, -70, -192, 80, 55, -324, -435, 3, -10, -130, -131, 37, 51, -30, -119, 177, 197, 395, 94, -178, -89, 210, 142, -107, 307, 378, -86, -17, -81, 96, 148, -13, -172, -156, 62, 207, 190, -133, 227, -184, 157, -117, -83, -252, 164, 350, -66, -60, 33, 192, -118, -14, -232, 126, 155, 154, -215]
1374b15j05R4M53j59n2k78L35r3P6km5P2j67r9O2K32J24l46K19j64m2R1K06l56
1398a59J23J44J12l48J35J46l38RQ5K26j73J85o6o8r1M99m15j20n1M03j22n8j7
1421D1j47R8Oj2j68J67J74J04l17P1l4k55J94K42l27J18J9j29j31N77k48N2j42
1444d7K66j88J24J60l79j77J68Qr6K50O4q1L0j38M1k51L67j86J83l53J81O9j74
1467a59M47m59R8M8L05l90J62j80p7K25q0j81q8K86M1k54J25L22N1j85N6q2j83
1490a52K94m44M08j54K40l02J3P7M0J43q4j56L7J00j81K08L2J05k59p7k37M84
1512A35j94P3q1K69l19j34K32k6N9p8K49o0L6j17j86J61J28k29J32j73K8P3j64
1535a86L30k48N6j62K93j0J71m27jK03k15K14j20K4M4j47K48K17l42K41k48L16
$$ y = [-215, -320, -226, 227, 68, 16, -262, 73, -20, 56, 54, 9, 81, -86, -185, -123, 109, 233, -113, 106, -58, -100, -9, 197, -159, -36, 108, 220, -128, 7, 153, -185, -176, -91, 135, -38, 147, 81, 13, -78, 421, 6, -114, -165, 238, 116, 58, 41, -106, -8, -2, -14, -182, -15, 159, 263, -54, 17, -17, -272, -78, 164, -163, -45, -26, -155, -286, 291, 43, 95, -47, 219, 31, 155, 315, -64, -241, -73, -65, -161, 89, 153, 72, 102, -36, 5, -246, 121, -65, 118, -235, -54, 15, -159, 288, -171, -73, -25, 280, -110, 52, -128, -205, 20, -60, -241, -329, -43, -2, -256, -131, 191, 242, 57, 113, 31, -152, 142, -302, 106, -48, 192, -110, -97, -20, 20, 163, 79, -77, -40, 60, -121, 87, 119, 224, -35, -112, -349, 135, -59, 14, -67, 202, -117, -251, -19, -45, 14, -64, 185, 125, 161, 44, -142, 19, 147, -82, 50, -123, -95, -22, -186, 144, -104, -48, -210, 83, 73, 244, -183, -184, 19, -196, 18, -102, -78, -34, -181, 67, 284, -58, 183, -65, 251]
1557B51o8q9n4k26L26k00L1J36j6j05j10J60j22K1j00J83oo1P1l0J63l0Rk31K60
1582A63j81Q5ll59M02M9j11q4k9j27J46Qp1L43k38K9Q0j46M5O3q5K59l54J57P2
1607A13o9J06j49p8K84j01k21J32l12K69J5K40l34j36L06n00N23j68ON7o5R2K00
1630B10l61R7J35J56l46K27o2j44Q6J24Pp2k72K82n7r5o6j84M58r8k21M46m79
1653b29P2M66k46l1K51L4q9k3q7o2n8qk48K29Q5p1l9J76J1k34j23K69J57l3k00
1678c1R2j58K90k15q4%L56n0k71j27J29J15l8j05P5m8j76L48j18j23J20m2%K8
1702c3j66L32Lj85J32k52m4J67P4r7K0K76k56J21O6j16J8K66k50k10K78ll5j20
1726a4j18K72l9r5J7jk38pK19j62kJ01R4K03k12mjP1k29J57k42K73k38J82J67
$$ y = [251, 183, 94, 40, -186, 140, -60, -29, 107, 91, -14, -124, 36, -86, -65, -165, 18, 12, -49, 22, -8, 155, 125, 134, -97, 163, -18, 67, 64, -295, 107, 156, 45, -39, -68, -195, -49, -41, -112, 231, -7, 22, 102, -44, 1, 64, -21, 238, -116, 41, 113, 44, 150, 1, -77, 207, 106, -115, 17, -295, -26, -11, 229, -105, -241, 65, -435, 88, -80, -74, -17, -82, 10, 210, -151, -54, 81, 237, -109, 118, 56, -88, -2, 122, 129, 57, -215, 67, 10, -85, -151, -335, 123, 25, -196, 250, -229, -157, 309, 63, 32, 283, 317, 228, 205, 118, 56, -2, -10, -258, -29, 56, -15, -54, 122, 133, -101, -224, 45, 202, 169, -31, 61, -97, 193, -22, -106, -106, 250, 200, -71, -198, -69, 46, 8, -97, -22, -70, -246, 102, -16, -139, -19, -61, -61, -33, -199, 133, 136, -49, 83, -169, -213, -46, 28, -69, -49, 227, -29, 92, 158, 42, 60, 326, 76, -134, 144, 141, 106, -14, -132, 140, 101, 6, 23, 22, -216, -223, -4, -166, -168, -67, 27, 230, 18, 14, 13, 84, -145, 12, -230, 43, -195, -13, 154]
1751A54k31J86k62J53j71j15K47R0J6OJ2P7k88K71k99qK73l6ko5j5P2k06Q4o6
1776a23K72k48L1K88j33j32M8k12o5J22K56j44j47J28M1K15j94q9P0k39M03p3
1798G5l40K59kp7Q2K11l89k0L37j59q0R6L7j79J97q5J55J1j38K34m44K23o6K53
1822A91k37P0L07m08J46k6k34N7n5J3L38r3k13q5M68jl66J33l1o5J78K20k03l02
1846a98L95l37J71j61J40k06J26J34J01l31J43r6k71O14m84L16P3j19j51J76l6
1867aK43n10L14q0n0J3J09q8K56L5k49K9r5M2L0j60K5L22k0k00J77j99kQ5o2o
1893d2j00K9k4J63J54K6rj65j09K30l34J71j48L96k71r7l4K55j97K39j46kN3j65
1917a27J89k53K27R6o0n0r5o8L21m6J41k80K41q8J86k95r5j00J16K2J27J34k09
$$ y = [154, -77, 109, -153, 0, -171, -286, -39, 51, 67, 73, 85, 162, -126, 145, -154, -162, 111, 75, 73, 8, -7, 65, -141, -57, -123, 149, -99, -68, 220, 87, -45, 3, -209, -274, -152, 104, -40, -187, -59, -18, 197, 3, -86, -16, -255, 148, 75, -265, -6, -8, -85, -3, 208, -181, -201, 136, -23, -103, -7, 30, -149, 48, -37, 118, 129, -9, 225, -219, 4, -62, 191, -46, 24, 331, -77, 69, 43, -191, -134, -189, -176, 162, 69, -144, -229, 239, 238, -128, 5, -26, -91, 87, 307, 104, -198, 197, -140, 31, -130, 10, -196, -70, 64, 165, -166, -23, -119, -390, 224, -260, 56, 129, 10, -141, 35, -1, 242, -268, 46, -34, -84, -71, 38, -50, 206, 241, -8, 21, -74, -32, -2, -162, -137, 185, 165, -35, 142, -57, -59, 26, -36, -42, -142, -113, -137, 26, 180, 206, 197, 32, -77, 153, -181, -10, -158, 238, -33, -130, -164, 91, -106, 133, -13, -15, 38, -127, 62, -191, 36, 132, 72, 22, -73, -141, 180, 134, 275, -5, 236, 148, 334, 39, -56, -156, -40, -18, 109, 243, 34]
1940C4j82J86J18k76M1l13M18j67j36j8K52j55R8L97n86L64q0Q8j6N3m30M93q8
1963I5j76L4L6j1k97N35k02j07O0j10pJ19O4k00pO2o6J83k08K65K16l48J05L7
1987G2j56k53J92L22q3j04NJ93m4p3k76L74l11L9K11l37K96R2j85O7K7l46j6J71
2011a23K58P1k89O0J48j28o3K54o3N5l53L49p3p0m7o8K46J65k58J69j96j63K5
2034i4J35j65k2p8L11k98K80l2j15M9J9p8L8oJ21J00j76n1j44L58p0k27K4K15
2058I4n2o2J77k76L47k18k28J14K11K4R2l25K9J51k09L72l22N5k2K28l7o9k06
2081a32J47k7J06q6j14K07j07m5Q1N7p5j02j2l5j13K82K30m47K82j94LK10q5J18
2105A49j6l11l7J88K32j27q8l13L63k61O7L56k33J99q0p6K2j57J31P0l00P1J67
$$ y = [34, -148, 38, 156, -120, -79, -392, 26, -141, -277, -295, -43, -198, -100, 297, -289, 75, -5, 83, 67, 120, -310, 183, 95, -81, -47, -11, -22, -319, 216, 14, -93, -33, -143, -150, -31, 33, -167, -174, -112, -178, 5, -203, 62, 278, -70, 35, 72, -84, -337, -145, 177, 94, -10, -5, 188, 144, 71, -205, 169, -142, -103, 108, -229, 67, 159, -26, 41, 68, -278, -294, -123, 135, 206, -83, -23, 125, -3, -66, 188, 125, 180, -173, 176, 103, 33, -14, -82, 164, 329, 71, 240, 44, -119, -94, 41, -124, -146, -224, 87, -211, 69, 37, -78, -29, -10, -88, -50, -56, 65, 165, -11, -62, -206, 152, 82, -145, -121, 94, 42, -20, 157, -119, 228, 10, -218, -104, 107, 131, 223, -102, -73, 78, -131, 241, -81, -26, -48, 180, 143, 74, -132, 15, -12, 94, 8, -106, 101, -6, -51, 30, 87, 12, -90, -102, -137, -250, 32, 262, -185, 97, -97, -94, 116, 31, 149, 133, -178, -215, -27, 205, 78, -10, -323, 40, -221, -154, 202, -31, 168, 88, 12, 34, -123, 8, 78, -222, -151, 16]
2128A6q7j8rJ07m2m1k3K00k04l1N9l2R6l67K02K02k9j45P6k10J40Q8k3R5j14p2
2154a66K38m9L2P6j42R4l43K42O7q0j84J21j18o7R3L43r1J22k95K63j60l7K52
2177B11n16K24O6M9j4J22k86K48j59R7j69K27J90n34Q4N3J73k22N8K6j05K60J
2200H4l65K98%j79M29j97Mj66J43j11L77k64J39k09L11j24p9j43l2m6K66k88K49
2223I7m3J2jJ27l29K69k10K17k64J39J42k21K07o1N4l14K63kj11j45J53rM6O6
2247H2k37k17M95j6j29N9j76K49j06L2M5l04L38k13M7J28l1j37m6L00j50J5k04
2270a76R3k9J01J33M8k44J21k05K64p0Q8o3k04J50Q1O0k04J83j47k41L96J02l41
2293a04L1J39k17R0J36j63K94j82n2l0K18j13k7J09k35R0J33k00r6O9J86j64K22
$$ y = [16, -71, -89, -98, 9, -33, -74, -97, 103, -101, -132, -73, -105, -9, -376, -174, 28, -1, -146, -70, -280, -140, -52, -75, 20, -94, -166, 72, 23, 55, 131, -11, 83, -260, -18, 49, -31, -215, -94, -212, -279, -186, 157, 66, 188, -107, 156, -4, -41, 211, -305, -81, -15, 34, 20, 142, -144, 104, -55, 42, -127, 100, 290, -244, -160, -107, 66, -156, -98, -72, -177, 83, 84, -281, 17, 17, -162, 267, 70, 74, -92, 51, -60, 317, 53, 192, -17, 294, 170, 91, -52, -84, -130, 136, -152, 97, 54, 66, 65, 192, -137, 132, -78, 139, -125, 14, 156, -65, 142, 81, 135, -179, 84, 82, -29, -174, -21, -30, 16, 82, -155, -372, 123, 107, -22, 37, -139, 110, 4, 36, 81, -223, 115, -98, -51, 77, 46, -91, -137, 163, 13, 28, -176, -83, -112, -11, 122, 170, -74, 47, -158, 106, 36, 124, 61, -143, 7, 88, 148, -56, 127, -20, -261, 135, 237, -104, -73, 66, -151, -61, 75, -88, 206, 24, -28, -58, 160, 47, 20, 129, -106, -16, 117, -83, -179, -110, 76, -88, 134]
2316A34j36o1K13l38J2K14j30L91k56J38k12P6O6o3o3k73K65J5L91n66j28J55
2338a56k5J61K28J49m86J63q8Q8M0j60J54j74M47l78R5j11J0J29j57J84j15o9
2360g1j63K72J21j10j49J45j3P2q7j51K42j68J21j7K63j39j94o8o4J01P6jr9o8
2384a49L03K9m74L56j66K2qJ0O7p8J94Qk27P2o1J19o2J2q9K62O9p2l6k04J49l30
2410b84L64n5k75J26Q1q5J09n7k65M65J66k75j18K6K36k95J83k13K56l8L67k19
2432B00l8j21N7J94j50j82L7k7n6K32j51K1J30k8j84l0K26J24k16J28o3j56j52
2455b05J53jJ77j40K19k33K47m50K88J7j42J75O8k20j04J49j49L09k72J80n4p3
2477f1Q1q9J9J64k40J37J56k44J65j61N4j98J19J67j72M21j62k67J41K74l30j64
$$ y = [134, -2, -63, 150, -188, -176, 38, -92, 299, 43, 181, -31, 45, 111, 48, -15, -288, -23, -8, 383, -183, -311, -156, -181, -20, 208, 357, -129, 34, -54, 34, 74, -86, 68, -106, 341, -37, 58, -53, -43, 86, -71, 113, -2, -71, -234, 38, 159, 49, -100, 45, 32, 104, 17, -134, 108, -60, 61, 44, 307, 168, -26, -94, -158, -57, 19, 18, -81, -149, 154, 183, -291, 65, -101, -79, -87, -77, -10, -88, 106, 114, -113, -41, -102, 17, -45, -33, -122, 140, 209, 137, 101, -103, 46, -284, 80, 25, -250, -124, -43, -128, -19, -76, -341, 124, 290, 15, -103, -77, 159, -136, 47, -166, 90, 52, 419, 200, 162, 41, 98, 292, 142, -40, -3, -30, -86, 146, -5, 16, 146, 118, -66, -96, 130, 254, 38, 166, 103, -53, -205, -52, -53, 124, -16, 203, -30, 217, -233, 55, 72, -70, 105, 173, -47, -151, -2, -151, 158, -114, 66, 12, -61, 20, -69, -50, 114, -126, 11, 167, -77, 88, -73, -19, -217, -98, 69, -103, 318, 156, -111, 30, 304, -26, -190]
2499a90K05m7R8j68OK23O2k17l2M4K41j47k08L09l02J1J30L5j13L7nJ02K06l09
2523b9Q5J62k29Q8m2J6mj85K69qj99J21j0N4q0q8o2l3M47k32m1M4Jp9O3j53J13
2550a1P3l6L4j43j43J82q3K1K07j81m4J87j09J12j61J67j14L10j18k46J92M3L8
2573A77k36J34j80P9o4J26J36L9j23k6j11k70O14p9m98M14J69l22j72K62L2j8
2595H3q7J18j45R1n6k38J7L28j29j21K92l38K3p6NLJ43j34J97r1J06n0J8K95j77
2620G7j37P5J13j37R8L0k73K78l70N22l65j55M46J4k54K63k3k32M6K4m6o9J61
2643H6n8j21J91k27J2j5K12l1j25k49L90M9j11J76j32l41M55l63R5k4N5M2j09
2666a43Q2Kp1m0j08L68k10P6l8J43o3j38K58Mm1r9j16J69Pj65J51L4R5j06q1l1
$$ y = [-190, 15, -32, 66, -102, -96, 127, 189, -28, -60, -16, 225, 78, -130, 179, -123, -112, 18, 53, -60, -23, -28, 74, 280, -29, 56, 218, -11, 77, 35, 51, 47, -138, 131, 123, -76, 45, 35, 89, 9, -79, -141, -174, 273, 41, 0, 44, 45, -34, 29, -124, -11, 62, 26, 60, -83, -226, -44, -127, -106, 101, -80, -124, 63, -46, 66, -95, 72, -42, 268, 150, -96, 96, 139, 177, -59, 75, -105, -26, -90, 36, 172, 211, 88, 62, -49, -319, 295, 216, -282, 132, 301, -21, -193, 69, 101, 83, -4, 114, -31, 60, 4, -234, -217, 111, -18, -139, 153, -185, -162, -238, -233, -230, -87, -221, -24, -115, -9, -59, -41, 254, 77, -60, 15, 128, -9, 89, 119, -154, 124, -246, 276, -89, -244, 202, 216, -38, 225, 202, -30, 16, 40, -6, -75, 86, 28, -93, 98, -129, -117, -132, 80, 49, -76, -325, 65, 114, 3, 179, 47, -294, 161, -202, -107, -131, -76, -34, -143, -61, -59, -130, -170, -278, 90, -120, -44, -82, 61, -2, -140, 118, 122, 81, -18, -134, 35, 42, -123, 28, 62, 157, 51, -30, -61]
2692f1j11j92J26R1P8R8N4k26k5J2J67J66n6k75J91J6J03j38M6M4j19N5k28J09
2716g5o7J50O3p3k2L1O7M4p9k53L03j33Q1Lj75L90r2j23l6N4J00k17P6k19J71
2741c1j46K68l0q6K17l34M95j95m47K96j29K72j3k00J48Mo0R8N1k96J4p6K01j98
2765a77K5M7J53J49L6k83K30j9k49O6LK32j00j81J86l7J9K66j97k55J27q2j18
2788a59m6J94j01k8J97L5j87J35r8j21N50l05k64J83j34oJJ42p7J3L7J02J67j30
2812A00J28l66L19j41j10K73j60O0k98J03l4L7R4R1j66K92k17P1k67j80L79j30
2834a22K98m63L16J13j60L22l14N2J3j11Q5l53R1K47j29R4j56K18J7M8l71L43
2856G8m77M06l2L0l3J06r0j32J6K27k3J24j04k3L7o0k38K37j31K12L7l14M21l77
$$ y = [-61, -172, -364, -238, -147, -69, 29, 83, -143, -168, -156, 11, 177, 121, -154, 37, 53, 156, 18, 64, 108, -11, 44, -184, -75, -142, 8, 71, -2, -24, 7, 74, 118, 39, -214, 89, -44, 37, 40, -135, 255, 163, 40, 4, 58, 158, -59, 17, -202, -31, -177, 91, 61, -25, 192, -142, 353, 158, -289, 7, -122, 150, 137, -63, 85, 89, 29, 127, 178, -118, -104, -180, 21, -177, -152, -105, 48, 197, 233, -50, 180, 161, -88, -22, -19, 213, 113, -68, 118, 81, 100, 366, 169, -86, 41, -41, -159, -205, -11, -112, -140, 57, 92, -95, 40, -58, -179, 371, 66, -198, -15, -149, -155, -154, -12, -89, -76, -39, 63, 230, 100, 228, -138, 181, 40, -70, 203, 43, 103, -195, -92, -126, -89, 5, 96, -70, 222, 5, 76, -191, -371, 8, -122, 176, -287, 29, 142, -18, 304, -10, 42, 55, -56, 29, -324, -233, 14, -115, -21, -177, 41, 58, 106, -265, 78, -399, 7, -25, 5, -28, 78, -12, -144, -128, 99, 76, 200, 96, 73, 110, 50, -188, 49, -82, 130, 167, -147, 274, -103]
2880a03M4K12p9k68N26m49J38q9J78Kq9j97l6K62N7m4j86K4QJ20O4k82L79j80
2904A2N4k15K35m0q4J69q9j43n0L56k61O1P2q8k9j84J68P8j53J87j84j3j92M37
2928A04j72J70j41K19j84j63Q2p4J77K27j52qj3r7j0J54j48J98K9m5j03K2k47
2951a75P3L6P6j08J06Mr0l8N3J76P5m0k24K77r7j4LK51l30j4N1O3l22L85k74P6
2977b1J79j42j23p0r4J86K68j77j56J65K59k10l2R6k07K92m01K44j51K25n4k17
2999a41L18kj46R2k45K7K89k98j03M09l28L11j09K2m1j22J61j64J38M3j9K84k05
3022A71M3n8N8j56j26Pj35N69m59K28k79M22n91L47K88l66K25k09L2o8O5j10J04
3045BJ51J4k06K0o7J29N1j56J03j15rJ86j90m7k0K1K53J8j27k14K38o2J66l2l31
$$ y = [-103, -59, 153, 74, -194, 332, -117, 21, -68, 110, 112, 23, -174, -210, 52, 109, 65, -121, -97, -89, 31, 95, -187, 192, 12, 66, -149, 86, 46, -38, 131, 42, -101, -151, 205, -56, 5, 77, -11, -40, -224, -56, 22, -131, 56, -128, -141, -333, 104, -68, 102, -39, 180, -4, -167, -85, -159, 18, 245, 93, 85, 72, -25, -35, 119, -29, 169, 198, 153, 50, 72, -175, -102, -66, 10, -98, 8, 12, -78, -116, -63, 113, 188, 148, -76, 201, 104, 90, 93, 344, 14, 0, 51, 114, -208, 177, -97, -21, 158, 16, -107, -177, -271, -85, 183, 6, -150, 15, 274, 64, 32, 128, -79, 213, -188, 56, -95, 130, 76, -141, 177, 175, 29, 121, -124, -97, 192, -106, -209, 200, -128, 183, 74, 96, 55, -67, 94, -70, 68, 111, 92, 376, 171, 214, 156, 214, 58, -68, -61, -196, 373, -86, 142, -137, 285, -306, 41, 329, -37, 188, -21, 11, -57, 8, -102, 2, 153, 167, -39, -19, -86, 43, 94, -62, 41, -74, -83, 103, -87, -134, -154, -133, 120, 138, 11, -203, 35, -27, 139, 107, -224]
3070b24K21j51K51k21J55K1Q%j85K6K74k06P6j58N1J27j09j45NJ18K15n42M20
3093B7l1K22l90NL62k69o8Q7K27j61k66J30P4K6l2q5K56P9r1j17l0j47L57j57
3117Hn2L8K08j04j53j17J40M6J31k14j56L54J43k13K8k74J43J12l8j4l4l0O6M6
3141F4P5j83m9j6K1j03K16j15j21M66j69o6n0M06n62J25J27k88K48j2L2j91j6
3164a61k0K36k62J93r7K32k63L15r8j17J45P8j55j58j8N2l3L07k54R4Q6o0k59
3187b17K83J75l76P2M6P3P1l95K12N9KP4J20j39L0m0k27qp2J84J76M5p8k17J81
3212C4j56J00k9j70R8q1J26J84QP8j00l31K88j41l0L63k39j04N3j97J78kk4j20
3236b14J95o2K78k58J98j33j2J09k62k9L62k01j84L14o4P8k98J19%K86l84M49
$$ y = [-224, -3, -154, 97, -124, 31, 52, 60, 60, -125, -99, 175, -31, 45, -113, -62, 65, -44, -189, -184, -66, 149, -393, 27, -4, 218, -172, -167, 195, -74, -142, -55, 172, 11, -255, -125, -51, -25, -57, -142, 114, 193, 102, -15, -45, -192, 165, 8, -44, -6, 202, 98, -55, -172, -32, 14, 145, -69, -225, 129, 272, 59, 87, -187, -44, 68, 30, 16, -18, -48, 18, 64, 139, -44, -93, -109, -88, -191, 25, -90, -211, 255, 86, 20, -30, 376, -186, -61, 66, -222, 26, 14, 46, -145, -161, -181, 55, -207, -14, -111, 121, -142, 173, 75, -42, 103, 181, 26, -132, -150, -98, -131, 176, -78, 16, 102, 42, -217, 66, 241, -135, -63, -17, 56, 127, -268, -56, 3, 5, 79, 199, 60, 90, 50, -177, -185, -257, -73, 103, 148, 70, -147, 34, -122, -22, -51, -221, -123, -204, -78, 106, 114, 192, 92, -239, 49, -92, -122, 241, 2, -102, -49, -246, -68, -70, -94, -214, -19, -81, 197, -61, 137, 4, -8, 101, -161, -190, 172, -29, -213, 101, 37, 115, -183, -64, -64, 222, -162, 287]
3258B87j24j33KP2K01m85L48j70J1K8r3J34j6J12j59k30K42k5k8j05RK06o8J17
3282A33j79O5k77M56k29n8K72k21J11K7k51J15J38j64K54j42M1j0k1%J61m14m3
3305b36J10j36L25j45J47K16l93Q2J25M3j45Q7m9Q8K0j66o2j10J71m8p1J70L3
3328E6j74K62p0j15o7L3K16j37K07k32J40j9J4k9n5n4N1J29p4p0m5o5J97J12l49
3353a38L34k24j43L15k03K07k60K15LL2l88M57k32j25L5O4K15k69L8K48k48J59
3375I2L0l57K81m1J82l45M2J6K32k84K67P7j85J11J08p5k00J3J89Mo2k26KJ95
3399F6k0j4L1k19J37K01j17OO6k19o6J15NK2j76J58p0K30m1n7J44l26P1k9J61
3424E9N3k77K3n3L92l11J79n6j0J86O9l27O2k43L80L1n5l06K43p9L64k21L8k13
$$ y = [287, 163, 30, 32, 104, 305, -180, 168, -2, 9, 37, -56, 78, 62, 174, 15, -215, 27, 2, -26, -131, -122, 84, 16, 133, -46, 19, -258, 198, -31, -89, 183, -38, 73, 100, -151, -36, 102, -62, 192, 50, 91, 81, 60, 60, 221, -193, -236, -126, -262, 63, -82, 65, 281, -112, -30, 95, 138, -7, 80, 31, 119, 139, -27, -89, -199, -28, -76, -147, 23, 56, -118, 144, 74, -41, -108, -75, 141, 4, 211, -21, 119, 100, 114, 85, 30, -24, 27, 156, 82, 12, -33, -98, 99, 211, -138, 196, -28, -171, 144, -59, 148, -112, 103, 106, 138, -250, 207, -25, -150, -115, -51, 164, -105, -67, 181, -67, 92, 122, -235, 46, 5, 187, -158, -116, -100, 132, -152, 115, 192, 7, 118, 226, 151, -49, -36, 153, 157, 95, -131, -129, 66, 46, 32, 63, -156, -19, 182, 65, 71, 137, -82, -148, -33, -28, -6, -182, -24, -94, 136, 95, 38, 182, -144, -73, -102, 59, 112, -165, -142, -195, 197, -114, 65, 9, -1, 185, 254, -73, -11, -254, 126, 157, 102, -204, 39, -40, 324, 103, 141, -72]
3448g2J89n5m8j07J72Q4j65J72j26m0j91J77j90N56l84l6L8J50j19K4jp7N3m6
3472d2J46l71K92Jq7k20N01j04j36j06L37p0l41K43n2Q2j30p0M0L43m60K32Q6
3495A14J04l36K23j0l06R0kJ50k0k38R7j9L9j40K41m9m2k95L68J49o6p8J40j09
3519Ej2J18M2m31K03L41k22Q0J5j02k37J59K01n3k14J12m2mnQM5Lj82M51m02J62
3545C9j25J42o8pQ7j51J72N3O7j84o4J06q6N1j05QNk25N41m21PP6J21l8r3o7m4
3572b03K2J14K99l17M2P3q8P8N9j06Q4j67j80L06Q3k3j5j4Q5j94K85n77L01J62
3596A09j71O8J18r7P7N0k09J28k43J23R9j2j57R9P2j56K78k88P4K42k40O3k58
3619b31K45j9k05L12j10m5J92o6K96p4l70J58n4j28K17m67K87Q8L2r4M6n5M8l2
$$ y = [-72, 117, 62, 14, -93, 79, 163, -2, 170, 44, 4, -187, -10, -200, 356, -28, -64, -26, 124, 5, 29, 28, -49, 4, -42, 104, -267, 25, 26, -61, -281, 220, 116, -20, -126, 211, 141, -200, 43, -9, 73, -57, -127, -87, 256, -204, 28, 114, 218, -118, 105, 95, -211, -121, -123, 27, 7, -231, -134, -153, -114, -254, -13, -62, -104, -399, -31, 118, 52, -26, 114, 5, -7, 111, 153, -278, -75, 266, 44, 124, 139, 37, -200, -41, 160, 107, -107, 5, -37, -41, -46, -38, 7, 10, -172, 279, -123, 39, -86, 56, -12, -19, 68, -83, 89, 142, 209, 25, -39, 67, -19, 32, -73, -65, -60, -285, 256, -165, -158, -82, 39, 1, -92, -159, -203, -181, -67, 232, -85, -43, 30, -58, 20, 79, -27, 57, -110, -290, 16, 99, 76, 61, 47, 132, -62, 223, -354, -53, 109, -62, 6, 124, 27, 104, 154, -55, 73, -170, -47, 52, 40, -117, -18, 54, -102, 176, -112, -38, 204, -36, 27, -231, 14, -5, -210, 102, -8, -53, 139, 73, 369, 295, -75, 83, 29, -99, 118, -349, -62, 26, 58, -36, 10, -45, 3, -29]
3643b9M3m3K15p2j08M40k90oj24k07J16o5J60j01p0Q5J48nr8R0P0k00j53K99l6
3668E9j01j89K96r7J29J46j38j56n1K92k92rK22j83r5J43O1j95K84p7j12O7q7
3691h3L2j28J30J50j39M5J36m3r3K82q0j28J31j65J12k26j9K4P8K34l32j01j9
3714b02j50K65k9M50l69L4P7j84L6o8p7K25J45o3r8P0q9J17L2j31J46j73N8L4
3738E6R3K0j51K40k10n7o9K90oj29k50J66k3J43j56j26L51j17o4MM06n04O6K61
3762B34l52K25q5q0N5J56l02J93j14j94O29m67j58M0L09l14K69K9j76j06j42K78
3784g3M8L11k85m1J59k45j23L79j10J69j90%L4J32o9k18rK96p1j36j08K91J32
3807B73m11J11K25k53M12j08k96q7j38M71k29K34j53k82M46j09j2k13J36J7j81
$$ y = [-29, 14, -29, 186, 114, 6, 446, 156, 150, 26, -181, -65, -130, 30, -71, -141, -56, 92, 87, -11, 79, 149, -51, -204, 95, 59, -42, -231, 65, -32, 97, 243, 105, -51, -102, 190, -102, -111, 111, -72, -167, -24, 37, -158, 126, 49, -63, 4, -83, -51, -179, -49, 101, -38, 7, 143, 100, 7, 289, 209, 81, 212, 47, 159, -67, -86, -62, 16, 250, -82, -183, -202, -352, -87, -116, 334, -35, -1, 76, -108, -72, -140, -217, 8, 153, 90, -8, 62, -27, 90, 122, -9, 137, -36, 22, 56, 149, 169, 18, 258, 48, -9, -78, 212, 206, 77, -173, -7, -30, 113, -43, -169, 182, 65, 1, 5, 411, -93, -27, 234, -118, 107, 22, -58, -3, 153, -149, 44, -70, -264, 365, -102, -260, -220, 89, -225, 44, 73, -103, -209, -351, -73, -25, 286, 1, -40, 119, -126, -249, 130, 20, 189, -1, -1, 33, 165, 96, -122, -131, 165, 94, -42, -150, 141, 273, -138, -27, 198, -55, 357, 249, -47, -134, -272, 199, -30, 204, 51, -231, 215, 106, 94, -119, 17, 34, -147]
3828a47L0M2L47m54J60m9l0j28N2N8J48Q4Kj54J56k95J93j13L10k52m0n6J35j49
3852a50J37j44K51j5K3o7k80J83K70j87J03j58k04L31j2M8j65L7j18J79k91J59
3874g0NJ34K7k74L39r2j44q1J28K37l09j9rL02j93K88j83q6%M0K00m14K02J50
3898A78k33O3j42m8J28k6J60K2r7M7jm9n2j8j24K36P5o6J22j16J03j55k33M74
3922B48p4m53J03K64p8J96l25J35O3j19P8O7r7JJ18l09J33r4R9K3J66j46j11j64
3946b76L90J42l44K64k21oJ37R0j17J29k04j28K34j71J95k02L27m4k20j62J19
3967f8K15Q5q1k13r8J06Q6M6j4p7j54O9J32j14K08K6j63K49j21r1r0J29o7J8N2
3992G0j37J8j56J73K9j02J63R7j33O6l62L09j32K7j81K41K09l23K5K62k02Q8j31
$$ y = [-147, -117, -75, 272, -182, -22, -71, -101, -229, -177, -119, 29, 113, 115, -39, 117, -178, 15, -98, 212, -40, -80, -136, -1, -150, -13, -157, 94, 79, 102, 35, -245, -62, 208, 21, 124, -34, -238, 93, 81, 129, -36, 1, -117, 62, -229, -70, -65, 69, 96, -178, 161, 69, -75, -156, -28, 209, -100, -119, -128, 174, -19, 269, 86, 0, 0, 40, 240, -174, 28, 178, -55, 8, -134, -182, -54, -80, 80, 102, 5, 52, 51, 2, -50, -68, -192, 44, 119, 53, 175, 59, 162, 7, -226, 248, 174, -279, -176, 88, 10, 206, -119, 16, 79, -40, 38, 105, 8, 9, 127, -182, -49, -143, -44, -21, 145, -1, -112, -276, 114, 256, -88, 176, -45, -51, 86, 176, 59, 188, -16, -144, 90, -81, 114, -88, 239, 195, -25, -187, -68, 147, 232, 151, -62, -160, -54, 32, 78, 64, -13, -167, -98, 34, -80, 128, 154, -9, 240, 119, 28, -62, 67, 0, 18, 70, -67, -49, -205, -32, -3, -105, 58, 155, 22, 88, -274, 35, -97, -70, -251, -10, 199, -124, -99, 163, -39, 49, -82]
4015h2P1K97j27l13K9j13Q4K38Q3l08K20k54m9J88o1K65O7mm8k69r1J90p7J0J27
4040G3j47K2L57m02n0L15k29j17J56oJ71j71J86l5k29O7L91j38l47K83q2j8j16
4063f6j53K28j03j9L72k55J9j4J09j67K09j15l76M49n07M14j57K20J6o4l32J69
4085a23l5J10J52n7j5j40p5jJ64Q9N7j94K9m2MK01n3R3l24K12L3k0l93M41n6o4
4111gj52K00J14j65Q9Rq7j4J33l2P4O0k78k64J18L03M3j16j02J65j67K49l04K89
4135A58p0o2O1k58J79l22p7M30j18p0J85J4j45M1j12O4M23m34K4L04M0k03L7k95
4159b06K27k2o8K5j1PkN3j8K8Q1j02q7J64Jk00K09j52J53l07K82j67J13J01j29
4184b7nn3m0kL41j00J39l81L01k00J96N8j19P8j36J03m11K99J26j52J45m40K88
$$ y = [-82, -11, 286, 159, -154, -125, -238, -154, 84, 167, -141, 79, -175, -224, -36, -97, 168, 235, 231, 183, -86, -177, 13, -64, -54, 73, -74, -52, 305, -97, -147, 168, -61, -178, -22, -28, 143, -28, 158, 123, -106, -39, 352, 214, -133, 150, 68, 50, -66, -219, 9, -94, -113, 259, 4, 23, 9, 118, -49, 160, 45, -331, 118, -389, 25, -132, 88, 104, 40, -292, -123, -158, -48, 104, 47, 32, -108, -183, -184, -20, 69, 126, -68, -39, -81, -77, 124, 71, 164, -160, 52, 85, 65, -328, 113, 57, -7, -159, 41, 155, -10, 79, 88, 1, -13, 120, 88, 162, 222, -56, -320, -202, 101, 144, 28, -74, 91, -76, 173, -131, 158, 88, 26, 87, -171, 8, -314, -391, 39, -79, -149, 36, 50, -95, -54, -166, -102, 321, -113, -89, 215, 255, 52, 89, -206, 21, -1, -69, -44, -55, -48, -50, 3, -15, 13, 94, -8, -95, 69, 70, -130, 79, -73, 80, -227, 55, -112, 1, 102, -27, -32, -85, -125, -127, 214, 114, 253, -128, 173, -27, 169, 227, 108, 186, 50, 153, -258, 41, 167, 15, 160, -280, 8]
4207Hj04J22r8K40k38J90Nj03m2R2J23j81K41j72k23R8l7j4K63l43J84n2l3L6
4231c8J64ok36N3l21L14j1J38q1O4j42J05PQqJ4j52J74p3k00J9J57K13m1K2J50
4257B93l47J56j77J77j42k3J54j75L1jJ44j09L1LK0o7O5m4J16l39L25k45r0J20
4281a24J9R1j10j05J22P0j17P5M23l15r9J54j40J80O6k01L7k8j84j0J37J36j18
4304d1J31j71R2J14l30P9K61k39j6r1M0R8j04J87J61j77J63p9n3j43n5L36j77
4327a4J50k20j17L06j18MJ12l02K51j42J58ql23K69K7j86J30R1q7K16L7l79J92
4350D7r6L3j40N22k86j20lM2Q2P8m3qj88K36j77%J98l12P7J10n2R5j71J26J06
4375A56p5j22p2J41k6P9k37k1K38k38L29k26J54q8J0J34j84N0j03J36m5r4J55
$$ y = [8, -96, 26, -72, 168, -70, 120, 125, 22, -20, 72, 195, 14, 255, 83, -140, -42, -79, -93, 170, -173, 11, -41, -74, -38, 126, 120, -116, -63, -384, -70, -81, 57, -24, 40, -102, 3, 10, 18, 10, 24, -128, 46, -27, -227, -208, -51, 162, 121, 143, 293, -54, 102, -75, 102, -40, -63, 91, -84, -53, -54, 90, -19, 12, 15, 35, -32, 33, -11, 105, -234, 91, -154, -244, -124, -105, -14, -124, -229, -107, -37, -154, -79, 344, 29, -70, 84, -56, 124, 190, -11, 26, -2, -186, -196, -59, 77, -41, 90, -81, 11, 125, -205, -126, 135, -104, -120, -211, -171, -73, -177, 10, 171, -6, 157, 78, 25, -118, -173, 163, -14, 136, -84, -201, 105, -13, -9, 103, -199, 52, -90, 68, 60, -263, 6, 33, -153, -23, 68, -19, 197, 234, -145, 47, -49, -16, -156, 366, 80, -40, -43, -1, 81, 159, 116, 108, -80, 156, -21, -21, 177, -135, -58, 52, 0, 95, -76, 50, 156, 81, -41, -113, 28, 2, 81, -156, -177, 61, -177, 152, -74, 80, -8, 2, 136, -48, 2, -101, 35, -10, -104, 51]
4398E1k7J02m0p5Q0k08P5k0K34r7n3J38O3j67L9j23R2o3J03n1Lj77m9N07m75n5
4424a93K64l56J97N0J09N5j42mLR6M9j91nk39K20Q6J61p6j1j06Lj2j7n6J4M4p1
4451a28K02O4o1l95M26P2lj67M6M7l29K38J96m68K39j77M9K47j03p7l8K10o9j8
4475Cj15M1J02M5J16j23J07n0j37P1k30K46Q6k32O7j16Q1J59k95K65k50K68j62
4498e3L55m17N3K76j99K90l56k50K91r5J35j08K93j00Q2P1j89j98N14k32k1n2
4520I0j89K69m8p0j61M5K10k9j4J67m17R5J13n5K0k8M3J6K7j45j10l1K26l6k7
4545c9O8l7R0j18k0j8J80o3l8R2q3n5K3r4j96K56K03j47K33l15o7L70l41Q8k8
4570e6p1J04M2%N4j88Q5m8q2P7P1q3j88K44L3r4k23K45k35J30n3J62K00o2j46
$$ y = [51, 24, 126, 86, 11, 91, -117, -42, -62, 172, 75, 22, 160, 223, 56, 95, -28, 64, 1, 104, 53, 56, -121, -170, 337, -138, -193, 71, -285, -88, -38, 71, 126, -16, -20, -17, 79, 128, -63, -68, -307, -87, -1, 160, 84, 73, -33, -30, -42, -59, -115, -101, -57, -128, 74, 138, 77, -318, 108, 180, 177, 10, 56, 103, -226, 12, 208, -260, -21, -198, -149, 98, -5, -82, -120, 90, 21, 3, -112, -71, 31, 76, 192, 69, 176, 126, -11, 60, -170, 76, 162, -70, -3, -119, -38, 121, -174, 91, -159, 109, -53, 302, -115, -62, 214, 15, 305, -51, -301, -10, -105, 30, -78, 215, 115, 197, 268, 79, -119, 395, 163, 142, 90, -99, 170, 122, 52, -109, -64, 146, 117, 103, 270, -147, -52, 61, 6, 26, -2, 41, 57, 84, -61, -171, -202, 24, -12, -39, 29, -8, 82, -36, -56, -74, 106, 43, 5, 97, 14, -41, -18, -112, -308, -52, 151, 4, 237, -78, -145, 225, -116, -28, -56, -127, -23, 19, 19, 73, -115, -30, -78, -160, -83, -12, -95, -283, -39, -6, -100, -323, -78, -313, -183, -236, -74, 126, 64, -82]
4595h2ON7j80K04o9J36j5k6M9o7L7m7K09q1L8j21j33K39J19m32J17J79j71J18
4619H4m2l7q2J51qk8o5LJ38l6J06k54L6J7k05K73j5k7r3o7k06M12Q8P2p1k99J37
4646a8L52k99j24j5J22Q9j57K97r9l7j59J51j3j80Q8kJ11r8pj02J7k0L02n12K59
4671e4j56L83j9m2j74j6Q0P2o9M9Q2Q6k42J28j00jR9k92J27P4m9p8j25K61J33
4696A57l68j07K03J33j37J21k11J64J8K62k34J11N1j41J65k60mK50j97Kj49L02
4718A31j34k37K08N4j08Q9J98k65j3J21j44J96k49J94K5j96J34J92k78L2M4k9
4740c5O4q7q7M13l24J29l6k43M0k2K02J5l16L69L4k24Q1O8NL1m8R2j04N3Q3j43
4766A0P2R4l48j6K59N0Q8j92j77K07J62k99m2Q3N8l2m4j00R2J72j61K55k03j38
$$ y = [-82, -76, -19, -199, 5, -64, 72, 57, 31, 80, 13, 50, 3, 212, 131, 169, 48, -85, 154, 273, -159, -42, 137, -34, 84, 42, 5, -77, 74, 66, 38, -27, -24, 114, 78, 184, -70, -34, -17, -222, 51, 36, 9, -84, -151, -357, 55, 143, 215, 144, -155, -18, 334, 35, -89, -104, 18, 107, -50, 247, 148, 111, -48, 103, 90, -90, -2, -4, 107, 9, 2, -100, -83, -103, 199, -313, -54, -210, 173, 154, 112, -62, -78, 2, 74, 5, 54, 136, 222, -20, 108, 8, 7, 106, -186, -59, 15, -34, -112, -237, 24, 157, -211, -318, -115, 18, -119, 2, -209, -45, -27, 235, 1, 112, 163, 22, 187, -73, -77, 173, -24, -22, -171, 131, -3, -240, -32, 22, -86, 3, 201, -64, -77, 44, -100, 96, -153, 41, 66, -130, 4, 196, -82, -50, -6, -35, 29, -58, -145, 268, -56, 73, 37, -206, -166, -188, 14, 29, -287, 82, 116, -108, -27, 41, 46, 77, 29, 121, 17, 70, 153, 10, 82, 176, -172, -188, 71, 121, 209, 17, -160, 47, 209, -90, -132, -49, 9, -23, -67, -167, -75, 97, -64, 191, -12, -150]
4790a50P1J54j72j04J20L96m89J9N70m33k39L25j76k5K66j55j75L62l14N7k0q2
4812a94K11J22j75k35J49q5P9K00N9k53K18P2k55K19k12J41J74k37M8j67m3M10
4834B46n89L73K55k76k9j37n3q0J2M89n6l20K26j38J06K8J77lj71j11N6J04k60
4857a51M2J06J01N7j1L7j44J37k90K11n7j11L6M8k7R7j51J01k66LL18m1n09N69
4881A05j11N4q9K28k17J29k34m2K91j9j56J27j0j13j2p6J90j6m5Q7j09L1J11J5
4905A19O3k54K04J40j84M4K27k32j86J95M0j67n9j92M76k04K03j29j0j01k32Q7
4927a52K7L09j01j89J4J49p4j35K48j54P5O5r3J44j93k69M43k13L28l41O4r7L58
4950B13k08j59K82m18J28L26l70O5J94ln2L74k87K2k72L33m33K22j33N6K67m7
$$ y = [-150, -79, 75, -97, -201, -81, 315, -174, -155, 415, -18, -257, 68, -108, -133, 133, -22, -197, 165, -149, -92, -112, -194, 17, 139, -36, -271, -122, -207, -128, 72, 131, -122, 96, 168, -87, 132, -80, 61, 235, -2, 46, -121, -164, 246, -343, 30, 285, 9, -20, -157, -210, -290, -278, 211, 155, -165, 61, -77, 29, 57, 234, 231, 60, -51, 5, 109, -151, -109, -3, 98, 155, 144, 181, 37, 174, -116, 95, 38, -73, -37, 11, -16, 81, -70, 31, -235, -232, 86, 45, -464, 105, -6, 48, -41, 187, -30, 99, -135, -177, 114, 95, -61, 66, 56, -57, -69, -145, 45, 29, -16, 71, -38, -7, 104, 119, 182, -72, 132, 272, 88, 132, 359, 127, -59, 136, 176, 9, -50, -242, 234, 30, 233, 104, 94, -7, -239, -152, -125, 184, 83, -106, -92, 57, -17, -152, 96, -58, 17, 82, -11, 133, -60, -329, 114, -99, 229, -112, -48, -145, 213, 5, -154, 128, -290, -162, 164, -206, -141, 53, 50, -2, 372, 85, 107, -165, 168, -265, -43, -176, -120, 147, 100]
4972A00Jj91J06Rq1J51O1o4l05JR2J2K68j02Q1j30J7j04J36m0J5P8l77N15l50
4997a01M10j08k58K32k32L54l02R0rl83K79l9O1j89K62J49l43J74j50O4J30o7
5019B4O0j09N7nK14l76K15j67L35j39j14j24K11k38J55J51Ok42K5j35J54K59r2
5042A25j07J8j50j06M24j00k02N0J88j46m6J2l52J49L58J66j86j94Op8J41k19
5064b49L96k72N9j29Q2m1P8J72k46PL70k44J12o3o4P2m7M6J53O9l60J87m0J09
5088A57n6j7j34L6K41m09L1J56k00K87P9k40K79k22l7R1p8P7j83M3j45M13j58
5111A1J06j99L5j38J99m4L8r2J51j28j60K10k77M00k70M21l82N2R3%Q6k64P4j26
5135b04J97J93l3K4l05l4L36L1r7m7K4m3LL9k21l1K83r6r2o7K81k64j02j08L25
$$ y = [100, 101, -90, 16, 25, -56, 95, 156, 92, -213, -212, -120, -108, 160, 58, 139, 9, 26, -78, 58, 18, 33, 111, -266, 249, -101, 309, 201, -57, 175, -57, 297, -5, 85, 76, -307, -28, -67, -6, -195, 67, 216, -127, 47, -103, -39, 91, 24, 84, -25, 32, 27, 241, -135, 80, -87, 248, 109, -5, -129, 82, -156, -1, 150, 156, -86, -61, -196, -42, 217, 125, 18, 36, -114, -220, 204, 104, -98, -48, 140, -6, -52, -40, -392, -243, 115, 281, 95, -99, -93, -171, -30, -249, 147, -125, -66, -195, -113, -154, -76, 96, -150, -143, 227, -17, 95, 32, -32, 40, -7, 39, 192, 261, -99, 88, 48, 157, 101, 84, -50, -14, 227, -182, -151, 5, -195, 92, 171, -69, 210, -12, -49, 42, -36, 41, -142, -99, -244, 169, 11, 117, -82, -47, -185, 14, -30, 8, -84, 67, -61, -221, -11, -288, 112, -158, 263, -119, -67, 26, 26, 112, -152, -78, -204, -7, 186, 153, 177, -128, -162, 174, 205, 108, 61, 85, 42, 45, 84, -137, -168, 115, 19, -73, -140, 141, -123, -225, -333, -8]
5160hlJ99l12K53n5j95P9O8q0M9R0j99J51o4J23j12o3j09L53q7r3J43K0k93K40
5185I5k20M04j32m13K80R1j90n1K15q8M2J4J54k48K28j41J49j69j84N38l29k89
5207b44L91j64K21k00K64r0k82K8J28j36R4k17L6J28K51k74Q4J26j85l6J17K2
5229F2k91K70K45m43J01J88M5j64J12l04rL96k26Kj0P8k97P6O0Llj44L13Q2J5
5254A57k14l46K79J87j04j17P3J60j6k34J43J97j03n00L55N5j64J02N4Kk49L37
5276E4J58m04R7p7R7j62J37L15j48r2K83l29J10n4k89L29m3O6j42J81lj33k4J26
5300E3r6r6J83J10k73K05N2l9j53m0K3J98k31Q3j7J04N1j91K57m81Q6K35l3j06
5324a16K58j82M6J40j41J41r2k47KK12j67J25K13l04J96k43K89L1l16L80j45k
$$ y = [-8, -11, 188, -124, 129, 74, -121, -42, 26, -54, -5, 85, -114, 37, -27, 96, -16, -79, -188, 165, 78, -15, 128, 148, -145, 95, -125, 279, 147, -266, 14, 105, -85, -136, 79, -9, 33, 47, 201, -47, 181, 40, 189, 20, -164, 374, 45, -244, 147, -17, 204, 4, 268, 178, -104, -76, 52, -84, 10, -207, -171, -43, 208, -66, 18, 144, -41, -77, 40, 62, -229, 41, 286, -157, -56, 132, 177, 13, 125, -179, -188, 208, -18, -16, -26, 52, -245, -169, -109, -106, -109, -253, 60, 142, 157, -57, -403, -124, 63, -41, -158, -85, 75, 59, -175, -32, 165, 62, -438, -83, -28, -192, -90, -36, -34, -283, 54, 212, -192, -95, -172, -75, -237, -100, 215, 67, -25, 258, -71, 39, -15, -304, 25, -18, 48, -94, 87, 84, -49, -73, 53, -43, -139, 44, 154, -119, 86, 138, 99, -54, -94, -71, 127, -104, -21, -38, 66, 117, -74, 183, -298, -212, 23, -10, -116, 142, -40, 6, 146, 5, 146, 54, -193, -191, 21, -146, -21, 192, -112, 84, -159, 130, 161, -155, 225, 80, 78]
5346G8J37k75k4kK20j59k72L10J81N9l50J44M8k27j01K43J00P7l85o0M92l27J57
5369F4m8k41L10p0q5P3j60O2K48o9Nl3q1K24j74N5J52l98J11K10p9j83P1k01J56
5394h1N8j2l0J93k48JQ3k10L95j59J6l0j92J30j02N1K22k26L8n2J70j38J42m5
5418b6j49M07l07mJ81j29j59L05J75j50j58J17j21R0j4l53L64o8op7O9q9K40m10
5442b72L23m31M71J7q6j8n3l0L66m76L75k68k93K94R8L0J39m26J62J70J6l24K19
5465Cj47J33J27ol21J94L39l87J03j32J04Q6m3j22j7R0J50j99LO8M3o9j28m4J54
5490a8p8J17J45kk21J49j52J61k3J09l52J00l6P3O7o6J28l9J4L9k61K2J41K11
5514B28k48kM6J12j49m4J34r2n0R8R5j44r3K34l20J81k9m9n4K88k7j46Q6j09J79
$$ y = [78, 215, -60, -84, -86, 134, -25, -297, 13, 194, 253, -97, 47, 95, -132, -233, 10, 110, 187, -198, -258, 234, -93, 64, 16, -225, 85, 15, -70, 3, -157, -95, 153, 84, 89, 56, -25, 199, 25, 80, 232, -166, -55, 155, 76, -107, -36, -237, -81, -23, -35, -65, 128, -120, -119, -36, -246, 149, -10, 6, -24, -216, -86, -188, -137, 85, -141, -103, -155, 15, -123, 19, -26, -175, 232, -75, -79, 102, -27, -186, 119, 294, 144, -14, 103, -18, 72, 58, -295, 69, 1, -5, -82, -13, -102, 138, -272, 51, -380, 91, 108, 22, 4, -49, -79, 287, -189, 186, -82, -375, -81, 17, 47, 186, -240, -78, 92, 108, -216, 3, -144, -11, 116, 110, -211, -17, 322, -65, 38, -94, 10, 96, 53, -69, -86, 4, 154, -45, -42, 26, 69, 0, -128, -172, -18, -96, 21, 166, 164, -57, 92, -60, 101, 78, 187, -165, -65, -101, -28, 39, -27, 101, 62, 76, 115, -146, -124, 17, 228, -20, -22, 24, 136, -13, -57, 77, -15, -65, 33, 128, -16, -109, 125, -195, -14, -43, -92, -146, 142, 115, -31, 55, -54, 125]
5539A25j67j49J2N9N8P4n2R5l22M00k84K59r8m2J57k01J85k54Q0J82k72J47K28
5562B20n49M87j45k39R2j4j46R5jJ55L71m39K52k13K86n47K73J72l76K2K60j13
5584i7J21J19j4K49k53J2M9k44K10rk35K78k65J00l6K09j92J24l80K49k63J69
5606i9M13j32m8j31J66k47M1j82J85q9O6J51q6j28J78k4j43j17N8N0L45k70J56
5629A13j93J02q1o9K49k12J69j76J64j06O2k3p8J55j48K30j44J22l2n9J63j78
5651C0K7j23J14R0j59k05Q4J24j52O2J93k54J31JJ95l06r6J51r7K60J70k68J85
5674A57j30q6k0J26J79k11k2o1L10j56K22l46m4J21Q9k01Q2J31j59Q0r5l33L10
5697e7k90L12j57K60l3k39L53j10j10NL6J4K63m26J35J45k23J38n2N7Rj13L1K94
$$ y = [125, -42, -191, -179, -120, -62, 12, -40, 55, -267, 133, -151, 108, 10, -32, 125, -76, 109, -145, -65, 117, -155, -8, 220, -329, 158, 13, -226, -134, -148, -294, -199, -200, -45, 326, -113, 139, -74, 212, -335, -62, 110, -266, -244, 16, -97, 24, 143, 129, 378, 125, 137, 186, -58, 152, 143, -92, 186, -79, 21, -15, 194, 2, 126, -254, -5, -268, -99, 314, 182, 134, 3, 169, -78, -37, -219, -34, -123, -57, 94, 8, -120, 58, 34, -109, -226, -168, -118, 227, -43, 113, -80, 22, -59, -128, 121, -91, 78, -98, 66, -40, 22, -1, -79, 76, -72, 158, 14, 136, 104, 45, 208, 30, 57, -66, 48, 138, -21, -226, -142, -18, -170, -108, 85, -169, -38, -37, 158, -148, -244, -93, -190, 70, 240, -28, 157, 27, -59, -79, 47, 226, 15, -7, -68, 242, 86, 308, -38, -82, 39, 128, -73, 9, 140, -19, 61, -34, -367, -57, -347, -35, -192, 68, 35, -204, 149, 39, -71, -66, -30, -16, 247, -179, -44, 101, -122, 16, -36, 21, 30, -83, -52, 242]
5721B42l50n4K00j40J1J11j67K48k29J62pK13j88Q1N1j97j2L5j34P0J64Q1k17
5744b6p0K90j76j79K44k4ln5j26J39J52j79k88J15K17j42J06j39J81j18J97j04
5766A2k89K97O4M5j31J51j96PJ0l3K99j57O0k50K16j61Rl6K20n03L24j27J16K12
5790A59j14N8m5J6L2j93R1O7m6j45ML0J00j21j73L07p4K4k6J7M6J24N4m6k29n0
5816a33J66L5j53K85k28N8P0n2K02k7k01j2oO7j99j2K34k93K35LJ26j96j44J73
5840br7o8L6M2J37r5m6J34O2k60P4o5J65O6k11J41J55j81K3L7j48rJ37j44L51
5865B34k05J3rk34Q1J63L4R8j82J6j2n7M9m9J03J75k15N0J50k5o5k18J50q8l8
5890h1rJ85L7j02n3K4j31J40PJ70k69N3j99J60Mj6J42Q4j11L1qp7j68R0L39m80
$$ y = [242, -108, -162, 38, -102, -91, 20, -147, 101, -128, 34, 27, 240, 52, 133, 184, -13, -25, 10, -124, -54, 110, 191, -26, -96, 194, 18, -161, 83, 59, 56, 1, -125, 14, 166, -13, -301, -186, 31, -111, -5, -144, 37, -81, 116, 12, -277, 20, 84, 129, -2, 149, -47, -40, -30, -63, 236, 79, 139, -111, 105, -56, -47, -83, 137, -366, -42, -169, -53, 159, 45, 103, 58, 74, 106, -87, 4, 71, 25, -120, -116, -86, 14, -107, -280, 27, -47, -23, -49, -32, 14, 138, 192, 146, -83, -133, 33, 68, -85, 200, -28, 30, 100, 48, 250, 223, 22, 10, 4, 71, -128, -140, 94, -199, 36, 39, 165, -31, -175, -2, -99, -167, -131, -89, 48, -47, -93, 41, 103, -157, -83, -148, 17, 83, -128, 13, 168, -13, 10, 47, -101, -110, 27, -117, 234, 29, 42, 33, -201, -120, 43, 77, 175, -7, 9, -3, -60, -11, -60, 43, 218, 3, 53, 203, 178, 113, -105, 45, -43, -81, -90, 95, 132, 30, -23, 1, -130, 10, 17, 187, -82, -29, -228, -68, -64, -80, 62, 146, 35, 66, 58, -19, -187, -97, 242, -238]
5916b38J73J06j37r4K6L8K86j58j30J97l43K28K05k01%R1o3J84k25P4j4J42O7
5939B14k67n7N2J35J69k21j6m4r6J93L1k85J97k3O4J8k32L66m9n1J34k93P7k5
5963ij60L16k61O5j62L05J8J23j92j07J72l42K41O5k90K13k56K82j7J21j22R5
5985I8l6j4L6L9j42j09J45N0l55K23J89l59L33k91O22m11n3J32M7j21k5j72J89
6008A5Kj4N0j78k4P6J46k15J14j16K35p4P0k30J17K78l32L10m78O8J46o8k59M03
6032D2o6j13J82J29m0k87K40j74K32k7l9j40p0n6K84l6M0K7r0j59q9M23k73l2
6056i2J26j25L2J5L3m5N8K14k89k4J30J7j06j53O2L9K40k90k18L17m6n4J97k07
6080a69K71o8O5j4m0J26j35O1j77K1J24j1j37j08J37K86j63m0j32N7J06j97J87
$$ y = [-238, -65, 41, -96, -190, -164, -126, 160, 2, -128, 69, -274, -46, 159, -42, -42, 49, -14, 170, -55, 19, 5, 147, 214, -53, -110, -58, 77, 246, 25, 9, -35, -131, 62, 93, -192, 5, -18, 46, 64, -168, 198, 149, 98, 232, -61, 16, -9, -169, 147, -114, -49, -211, 94, 112, 235, 43, -64, 108, -234, 7, 72, -218, -5, -261, 21, 4, 125, 3, 98, 62, 48, 84, 123, -19, -128, 17, 67, -288, -65, 124, -235, 98, -193, 429, 18, -35, 97, 144, 23, -2, -174, 15, 17, 3, 53, -125, -149, -73, 73, -142, -28, -144, 91, 17, 87, -143, -26, 252, -80, 230, -248, -180, -34, -102, -361, 42, -24, -137, 45, 174, 134, -153, 87, -87, 145, 118, 79, -61, -131, -187, 97, 61, 101, 128, 38, -121, -210, 213, -60, -92, 34, -91, -59, -44, -11, -56, 2, 216, -73, -97, 33, 50, -56, -209, -147, -108, 132, -158, -376, -59, -105, -159, 38, -169, 102, 34, 99, 85, 45, 171, 36, 97, -80, -59, 65, 54, -83, -191, -54, 232, 69, 29, -103, -46, 60, -137, 50]
6103E0r1K08k08J6m0r6L44O3j11l7k27m4K13k71L23j72k8m8K8J75k52k5K20J34
6127A24k45J10P0k12M19k56J18j85K02k45J6K0K8j10n7M6Q6L52l03j70K72j32
6149e2N0K24m03Q2L72k04n0O6k50L98lk67P3K00j60j03K13m46J83J35k63M40l21
6172h6L16j99Nk1j4Q4j76J26j64J34j15J21r6L05l06J47N6N7j12J1k55K77j1j61
6196g7k43K52j6J41l30K55k1n5K75j00P1r1lR2o9n2K50l28J06j05R7j43L47l01
6220d8J27j42K68j29K14k51j11Q7R6n5j04j9o8K98o1j32q9J86k27J47k84K16Q5
$$ y = [50, -41, 167, -41, -25, -65, -161, 183, 246, 135, 98, -129, -173, 40, -231, 92, -80, -108, -156, -128, 47, -205, -230, -10, 124, -121, -11, 59, -153, 266, 10, 128, -57, 145, -100, -84, -64, -36, -146, -203, -157, -71, 281, -22, -192, 80, -52, -2, 222, -181, -99, 273, 69, 19, 85, -165, 233, 230, -37, 36, 236, 76, -27, 186, -260, -77, 58, -205, 235, -86, 230, 31, 36, 15, 1, 85, -91, 35, -129, 5, -110, 11, -85, 220, -86, 61, 117, 174, 62, 73, -182, 95, 84, -77, -320, -68, -84, 57, -273, -18, -39, -94, 181, 81, 152, 61, 58, 150, 81, 29, 279, -49, 57, -48, 49, -94, 253, -48, 79, -63, 205, 76, 290, 39, -72, 15, 111, 56, -48, -67, -135, 163, 102, -30, -119, 67, -160, -13, -297, -81, 4]
$$ [...]
8191B15
##END NTUPLES=NMR FID
##END=
