##TITLE=1H ikalashn
T-2
13.12.2024
##JCAMPDX= 6.0         $$ Bruker NMR JCAMP-DX V2.0
##DATA TYPE= NMR FID
##DATA CLASS= NTUPLES
##ORIGIN= UXNMR, Bruker Analytische Messtechnik GmbH
##OWNER= root
$$ TOPSPIN		Version 1.3
$$ 2024-12-13 14:23:56.953 +0400  Irina@DPX200
$$ Compression mode = diff/dup
##.OBSERVE FREQUENCY= 200.131300845
##.OBSERVE NUCLEUS= ^1H
##.DELAY= (6, 6)
##.ACQUISITION MODE= SIMULTANEOUS
##.ACQUISITION SCHEME= undefined
##.AVERAGES= 32
##.DIGITISER RES= 18
##SPECTROMETER/DATA SYSTEM= spect
##.PULSE SEQUENCE= zg
##.SOLVENT NAME= CDCl3
##.SHIFT REFERENCE= INTERNAL, CDCl3, 1, 17.49637
##AUDIT TRAIL= $$ (NUMBER, WHEN, WHO, WHERE, WHAT)
$$ ##TITLE= Audit trail, TOPSPIN		Version 1.3
$$ ##JCAMPDX= 5.01
$$ ##ORIGIN= Bruker BioSpin GmbH
$$ ##OWNER= Irina
$$ $$ F:/spectra/data/iren/nmr/1H/4/audita.txt
$$ ##AUDIT TRAIL=  $$ (NUMBER, WHEN, WHO, WHERE, VERSION, WHAT)
(   1,<2024-12-13 14:23:21.687 +0400>,<Irina>,<DPX200>,<TOPSPIN 1.3>,
      <created by zg
	started at 2024-12-13 14:21:12.125 +0400,
	POWCHK disabled, PULCHK disabled
       terminated by command 'halt'
       configuration hash MD5:
       BE 6D 3F 07 2A EA 11 49 91 17 2B D3 AF B3 58 0D
       data hash MD5: 16K
       46 54 50 9D EC D9 5F 5A 15 08 AE 37 4F D5 F6 C0>)
$$ ##END=
$$ 
$$ $$ hash MD5
$$ $$ 13 D7 C4 40 43 68 1A 4A 7D 2B C3 39 75 F6 B2 BE
##$RELAX= 
##$RELAX= 
##$RELAX= 
##$RELAX= 
##$RELAX= 
##$RELAX= 
##$RELAX= 
##$RELAX= 
##$RELAX= 
$$ Bruker specific parameters
$$ --------------------------
##$DU= <F:/spectra>
##$EXPNO= 4
##$NAME= <1H>
##$PROCNO= 1
##$TYPE= <nmr>
##$USER= <iren>
##$AMP= (0..31)
100 100 100 100 100 100 100 100 100 100 100 100 100 100 100 100 100 100 
100 100 100 100 100 100 100 100 100 100 100 100 100 100 
##$ANAVPT= -1
##$AQSEQ= 0
##$AQ_mod= 1
##$AUNM= <au_zg>
##$AUTOPOS= <>
##$BF1= 200.13
##$BF2= 200.13
##$BF3= 200.13
##$BF4= 200.13
##$BF5= 200.13
##$BF6= 200.13
##$BF7= 200.13
##$BF8= 200.13
##$BYTORDA= 1
##$CFDGTYP= 0
##$CFRGTYP= 5
##$CHEMSTR= <none>
##$CNST= (0..63)
1 1 145 1 1 1 1 1 1 1 1 1 1 1 1 1 1 1 1 1 1 1 1 1 1 1 1 1 1 1 1 1 1 1 
1 1 1 1 1 1 1 1 1 1 1 1 1 1 1 1 1 1 1 1 1 1 1 1 1 1 1 1 1 1 
##$CPDPRG= <>
##$CPDPRG1= <>
##$CPDPRG2= <>
##$CPDPRG3= <>
##$CPDPRG4= <mlev>
##$CPDPRG5= <mlev>
##$CPDPRG6= <mlev>
##$CPDPRG7= <mlev>
##$CPDPRG8= <mlev>
##$CPDPRGB= <>
##$CPDPRGT= <>
##$D= (0..63)
0 2 0 0 0 0 0 0 0 0.06 0 0.03 0 0 0 0 0.0002 0 0 0 0 0 0 0 0 0 0 0 0 0 
0 0 0 0 0 0 0 0 0 0 0 0 0 0 0 0 0 0 0 0 0 0 0 0 0 0 0 0 0 0 0 0 0 0 
##$DATE= 1734085399
##$DBL= (0..7)
120 120 120 120 120 120 120 120 
##$DBP= (0..7)
150 150 150 150 150 150 150 150 
##$DBP07= 0
##$DBPNAM0= <>
##$DBPNAM1= <>
##$DBPNAM2= <>
##$DBPNAM3= <>
##$DBPNAM4= <>
##$DBPNAM5= <>
##$DBPNAM6= <>
##$DBPNAM7= <>
##$DBPOAL= (0..7)
0.5 0.5 0.5 0.5 0.5 0.5 0.5 0.5 
##$DBPOFFS= (0..7)
0 0 0 0 0 0 0 0 
##$DE= 6
##$DECBNUC= <off>
##$DECIM= 32
##$DECNUC= <off>
##$DECSTAT= 4
##$DIGMOD= 1
##$DIGTYP= 9
##$DL= (0..7)
0 120 120 120 120 120 120 120 
##$DP= (0..7)
150 150 150 150 150 150 150 150 
$$ [...]
##$SW= 21.9926040160658
##$SWIBOX= (0..15)
0 0 2 0 0 0 0 0 0 0 0 0 0 0 0 0 
##$SW_h= 4401.40845070422
##$TD= 16384
##$TD0= 1
##$TE= 300
##$TE2= 300
##$TE3= 300
##$TEG= 300
##$TL= (0..7)
0 120 120 120 120 120 120 120 
##$TP= (0..7)
150 150 150 150 150 150 150 150 
##$TP07= 0
##$TPNAME0= <>
##$TPNAME1= <>
##$TPNAME2= <>
##$TPNAME3= <>
##$TPNAME4= <>
##$TPNAME5= <>
##$TPNAME6= <>
##$TPNAME7= <>
##$TPOAL= (0..7)
0.5 0.5 0.5 0.5 0.5 0.5 0.5 0.5 
##$TPOFFS= (0..7)
0 0 0 0 0 0 0 0 
##$TUNHIN= 0
##$TUNHOUT= 0
##$TUNXOUT= 0
##$USERA1= <user>
##$USERA2= <user>
##$USERA3= <user>
##$USERA4= <user>
##$USERA5= <user>
##$V9= 5
##$VALIST= <valist>
##$VCLIST= <CCCCCCCCCCCCCCC>
##$VD= 0
##$VDLIST= <DDDDDDDDDDDDDDD>
##$VPLIST= <PPPPPPPPPPPPPPP>
##$VTLIST= <TTTTTTTTTTTTTTT>
##$WBST= 1024
##$WBSW= 25
##$XGAIN= (0..3)
0 0 0 0 
##$XL= 0
##$YL= 0
##$YMAX_a= 436978
##$YMIN_a= -630127
##$ZGOPTNS= <>
##$ZL1= 120
##$ZL2= 120
##$ZL3= 120
##$ZL4= 120
##$ABSF1= 10
##$ABSF2= 0
##$ABSG= 5
##$ABSL= 3
##$ALPHA= 0
##$AQORDER= 0
##$ASSFAC= 0
##$ASSFACI= 0
##$ASSFACX= 0
##$ASSWID= 0
##$AUNMP= <proc_1d>
##$AXLEFT= 0
##$AXRIGHT= 0
##$AXTYPE= 0
##$AXUNIT= <>
##$AZFE= 0.1
##$AZFW= 0.1
##$BCFW= 1
##$BC_mod= 2
##$BYTORDP= 1
##$COROFFS= 0
##$CY= 7568.61572265625
##$DATMOD= 1
##$DC= 2
##$DFILT= <>
##$DTYPP= 0
##$F1P= 17.9538593292236
##$F2P= -4.03888763876832
##$FCOR= 0.5
##$FTSIZE= 32768
##$FT_mod= 4
##$GAMMA= 1
##$GB= 1
##$INTBC= 1
##$INTSCL= 1
##$ISEN= 128
##$LB= 0.01
##$LEV0= 0
##$LPBIN= 0
##$MAXI= 945.577
##$MC2= 0
##$MEAN= 0
##$ME_mod= 0
##$MI= -402.1523
##$NCOEF= 0
##$NC_proc= 0
##$NLEV= 6
##$NOISF1= 8.587773
##$NOISF2= 6.764455
##$NSP= 1
##$NTH_PI= 0
##$NZP= 0
##$OFFSET= 17.49637
##$PC= 1
##$PHC0= -10.81236
##$PHC1= -25.59669
##$PH_mod= 0
##$PKNL= yes
##$PPARMOD= 0
##$PPDIAG= 0
##$PPIPTYP= 0
##$PPMPNUM= 100
##$PPRESOL= 1
##$PSCAL= 0
##$PSIGN= 0
##$REVERSE= no
##$SF= 200.13
##$SI= 32768
##$SIGF1= 18.5376
##$SIGF2= -6.396296
##$SINO= 400
##$SIOLD= 32768
##$SREGLST= <1H.CDCl3>
##$SSB= 3
##$STSI= 0
##$STSR= 0
##$SW_p= 4401.40845070422
##$SYMM= 0
##$S_DEV= 0
##$TDeff= 0
##$TDoff= 0
##$TI= <>
##$TILT= no
##$TM1= 0
##$TM2= 0
##$TOPLEV= 0
##$USERP1= <user>
##$USERP2= <user>
##$USERP3= <user>
##$USERP4= <user>
##$USERP5= <user>
##$WDW= 1
##$XDIM= 8192
##$YMAX_p= 0
##$YMIN_p= 0
$$ End of Bruker specific parameters
$$ ---------------------------------
##NTUPLES= NMR FID
##VAR_NAME=  TIME,          FID/REAL,        FID/IMAG
##SYMBOL=    X,             R,               I
##VAR_TYPE=  INDEPENDENT,   DEPENDENT,       DEPENDENT
##VAR_FORM=  AFFN,          ASDF,            ASDF
##VAR_DIM=   8192,          8192,            8192
##UNITS=     SECONDS,       ARBITRARY UNITS, ARBITRARY UNITS
##FACTOR=    0.0002272,     1,               1
##FIRST=     0,             0,               0
##LAST=      1.8609952,     6,               21
##MIN=       0,             -630127,         -630127
##MAX=       1.8609952,     436978,          436978
$$ Real data points
##PAGE= N=1
##DATA TABLE= (X++(R..R)), XYDATA
$$ [...]
$$ plain form
1370 -629 -1065 -1753 -486 1592 -143 -2849 -1133 1312 389 -1042 -47 442 345 776 10 -793 1340 2621
1388 2621 56 -1466 539 1664 514 -114 -564 -1191 85 967 -736 -1916 17 821 -1166 -1378
1404 -1378 -245 -23 354 654 -899 -1083 1488 2073 -521 -903 1121 1227 452 518 -33 -246 876 555
1422 555 -1439 -1031 1129 325 -1681 -1013 -75 -255 18 -120 -1248 -663 1408 507 -986 159 1375
1439 1375 438 -26 551 445 611 1440 280 -1360 152 1694 -164 -1488 -495 -20 -316 -101 -780 -1591
1457 -1591 -8 1097 -936 -1898 436 1337 -141 -327 213 164 1074 1586 -404 -955 1263 1752 -557
1474 -557 -827 352 213 -165 -9 -908 -1290 425 584 -1397 -1467 705 395 -857 -286 -198 -352 945 1053
1493 1053 -856 -511 1781 1347 -693 42 919 236 214 397 -644 -623 962 162 -1990 -690 898 -420
$$ packed form
1370f29m36o88J267K078j735k706J716K445r23j431R95M89r7M31p66q03K133J281
1388B621k565j522K005J125j150o28m50o27J276Q82j703j180J933Q04j987k12
1404a378J133K22L77L00j553j84K571N85k594l82K024J06p75O6n51k13J122l21
1422E55j994M08K160q04k006O68R38j80K73j38j128N85K071r01j493J145J216
1439A375r37m64N77j06J66Q29j160j640J512J542j858j324R93M75k96K15o79q11
1457a591J583J105k033r62K334R01j478j86N40m9R10N12j990n51K218M89k309
1474e57k70J179j39l78J56q99l82J715J59j981p0K172l10j252N71Q8j54J297J08
1493A053j909L45K292m34k040P35Q77o83k2J83j041K1J585q00k152J300J588j318
$$ plain form
1511 -420 -1304 -311 -365 -616 527 162 -1271 82 1764 255 -947 768 1217 184 456 447 -401 178
1529 178 1409 -125 -1355 218 898 -821 -1090 -19 -525 -481 288 -559 -1549 337 1320 -647 -1004 881
1547 881 825 -111 574 452 -144 889 1349 -511 -815 1144 989 -964 -504 113 -523 -248 191 -1012 -1398
1566 -1398 473 274 -1422 -725 826 86 -589 497 106 -182 1115 1129 -728 -265 1652 679 -503
1583 -503 374 416 -505 69 428 -867 -833 510 -463 -1593 -157 611 -729 -828 329 -101 -318 904 478
1602 478 -675 287 1421 95 -306 909 664 -162 249 360 -548 127 779 -642 -1309 143 355 -900
1620 -900 -671 -29 -733 -321 616 -212 -768 478 848 -449 -65 1101 378 52 779 307 -290 597 1063
1639 1063 -562 -590 578 24 -648 4 2 -992 -422 364 -439 -754 338 -28 -721 57 909 -30 -89 691
$$ packed form
1511d20q84R93n4k51J143l65j433J353J682j509j202J715M49j033K72rq48N79
1529A78J231j534j230J573O80j719k69J071n06M4P69q47r90J886R83j967l57J885
1547H81n6r36O85j22n96J033M60j860l04J959j55j953M60O17o36K75M39j203l86
1566a398J871j99j696O97J551p40o75J086l91k88J297J4j857M63J917r73j182
1583e03Q77M2r21N74L59j295L4J343r73j130J436P68j340r9J157m30k17J222m26
1602D78j153R62J134j326m01J215k45q26M11J11r08O75O52j421o67J452K12j255
1620i00K29O42p04M12R37q28n56J246L70j297L84J166p23l26P27m72n97Q87M66
1639A063j625k8J168n54o72O52kr94N70P86q03l15J092l66o93P78Q52r39n9P80
$$ plain form
1659 691 162 -112 718 757 -275 78 703 -375 -418 526 153 -778 -195 -56 -980 -301 479 -385 -1092 -173
1679 -173 145 -370 302 579 -331 -165 826 381 -6 726 592 -268 88 717 -9 -178 528 -140 -903 -398
1699 -398 91 -461 -332 45 -830 -934 214 364 -454 -256 236 -194 -50 1021 424 -322 523 623 -50
1718 -50 121 827 171 -137 190 -193 -549 127 579 -697 -1004 -114 -378 -448 192 -42 -893 -378 628 104
1738 104 -203 534 264 -141 601 880 -92 -44 863 57 -463 194 297 -283 93 42 -1163 -762 484 -21
1758 -21 -923 -540 -212 -331 176 567 -344 -723 627 771 112 126 478 23 313 736 -111 -497 667 617
1778 617 -724 -813 93 71 -144 4 -823 -1145 184 693 -567 -713 128 39 -189 785 317 -265 206 892
1798 892 7 -161 645 492 -121 197 130 -739 -54 764 -293 -1141 -410 58 -358 -33 158 -774 -561 577
$$ packed form
1659F91n29k74Q30L9j032L53O25j078m3R44l73r31N83J39r24O79P80q64p07R19
1679a73L18n15O72K77r10J66R91m45l87P32j34q60L56O29p26j69P06o68p63N05
1699c98M89n52J29L77q75j04J148J50q18J98M92m30J44J071n97p46Q45J00o73
1718e0J71P06o56l08L27l83l56O76M52j276l07Q90k64p0O40k34q51N15J006n24
1738A04l07P37k70m05P42K79r72M8R07q06n20O57J03n80L76n1j205M01J246n05
1758b1r02L83L28j19N07L91r11l79J350J44o59J4L52m55K90M23q47l86J164n0
1778F17j341q9R06k2k15J48q27l22J329N09j260j46Q41q9k28R74m68n82M71O86
1798H92q85j68Q06j53o13L18o7q69O85Q18j057q48P31M68m16L25J91r32K13J138
$$ plain form
1818 577 462 -390 244 396 -36 300 860 -91 -187 876 623 -535 -162 437 162 21 160 -723 -954 385
1838 385 671 -795 -956 -9 -156 -254 463 -77 -581 387 852 -192 -391 633 561 150 185 116 -183 600
1858 600 827 -584 -1039 242 437 -416 -223 -99 -655 -302 317 -352 -769 142 65 -467 -7 613 -58 66
1878 66 801 256 -435 251 852 -79 -197 305 -110 -194 567 230 -711 -482 69 -386 -316 164 -264 -843 19
1899 19 413 -328 -223 412 201 88 384 293 -97 625 894 -414 -566 562 546 -328 -120 -118 -515 -129 387
1920 387 -537 -920 200 156 -522 -261 154 -60 18 466 -173 -405 595 855 -160 -124 566 360 350 246
1940 246 -78 -527 265 480 -459 -418 252 -106 -571 -189 -78 -398 -64 259 -449 -206 554 315 -249 56
1960 56 421 12 172 546 47 -19 457 218 -494 22 429 -355 -554 52 -85 -503 15 -82 -705 -184 160
$$ packed form
1818E77j15q52O34J52m32L36N60r51r6J063k53j158L73N99k75j41J39q83k31J339
1838C85K86j466j61R47j47r8P17n40n04R68M65j044j99J024p2m11L5o9k99P83
1858F00K27j411m55J281J95q53J93J24n56L53O19o69m17R11p7n32M60O20o71J24
1878F6P35n45o91O86O01r31j18N02m15q4P61l37r41K29N51m55P0M80m28n79Q62
1899A9L94p41J05O35k11j13K96r1l90P22K69j308j52J128j6q74K08Kl97L86N16
1920C87r24l83J120m4o78K61M15k14P8M48o39k32J000K60j015L6O90k06j0j04
1940B46l24m49P92K15r39M1O70l58m65L82J11l20L34L23p08K43P60k39n64L05
1960E6L65m09J60L74m99o6M76k39p12N16M07p84j99O06j37m18N18r7o23N21L44
$$ plain form
1981 160 -273 -612 421 475 -122 32 283 61 334 375 -189 -378 535 682 -287 -285 250 -20 -240 131 -336
2002 -336 -514 -29 216 -547 -569 227 89 -299 106 -118 -265 397 639 -118 -76 606 409 -134 247 265 14
2023 14 41 160 -565 -354 324 -125 -857 -335 243 -355 -528 -64 -147 -242 90 22 -227 36 687 -1 -236 581
2045 581 292 -41 216 157 -323 163 378 -335 -540 160 224 -484 -345 -141 -306 -293 242 -268 -488 195 572
2066 572 -242 -320 317 234 165 307 108 -200 392 671 -203 -241 319 150 -299 -120 -8 -371 -83 -12 -469 -587
2088 -587 187 82 -360 -126 186 -124 118 337 86 0 497 363 -179 162 616 160 -136 243 71 -324
2108 -324 177 -3 -662 -238 272 -328 -735 -93 239 -306 -125 145 -107 -46 573 80 -393 368 711 -100
2128 -100 -36 361 118 28 336 -49 -471 232 198 -355 -516 96 -109 -404 -153 43 -542 90 334 -188 -359
$$ packed form
1981A60m33l39J033N4n97J54K51k22K73M1n64j89R13J47r69KN35k70k20L71m67
2002c36j78M85K45p63k2P96j38l88M05k24j47O62K42p57M2O82j97n43L81J8k51
2023A4K7J19p25K11O78m49p32N22N78n98j73M64q3r5L32o8k49K63O51o88k35Q17
2045E81k89l33K57n9m80M86K15p13k05P00O4p08J39K04j65J3N35n10k20O83L77
2066E72q14p8O37q3o9J42j99l08N92K79q74l8N60j69m49J79J12l63K88P1m57j18
2088e87P74j05m42K34L12l10K42K19k51q6M97j34n42L41M54m56k96L79j72l95
2108c24N01j80o59M24N10o00m07O42L32n45J81K70k52O1O19m93m73P61L43q11
2128a00O4L97k43r0L08l85m22P03l4n53j61O12k05k95K51J96n85O32K44n22j71
$$ plain form
2149 -359 428 453 -190 6 465 125 78 389 -85 -254 501 228 -406 -200 192 -71 -427 95 -234 -471 37
2170 37 190 -542 -325 351 -116 -367 104 464 106 255 454 -170 -12 733 372 -386 90 339 -223 -190 21
2191 21 -272 -364 146 -123 -493 -130 347 -244 -380 92 180 -169 171 235 -174 106 504 140 -144 454 531 -48
2213 -48 30 368 -17 50 178 -294 -503 216 164 -514 -362 109 -107 -338 84 -41 -173 234 283 -157 -91 730
2235 730 245 -109 193 226 18 245 360 -260 -331 446 70 -540 -287 -22 -222 -213 -99 -221 -404 159 91 -398
2257 -398 -10 468 67 -10 178 75 -51 413 310 -173 71 331 57 -287 153 37 -289 -108 -75 -272 -132
2278 -132 261 -148 -452 0 231 -305 -33 297 -80 -18 315 234 -128 273 408 -61 -64 230 208 -159 -67 -136
2300 -136 -307 54 163 -310 -376 11 39 -259 -34 215 -179 -29 198 27 -142 323 317 -104 68 374 43
$$ packed form
2149c59P87K5o43J96M59l40m7L11m74j69P55k73o34K06L92k63l56N22l29k37N08
2170C7J53p32K17O76m67k51M71L60l58J49J99o24J58P45l61p58M76K49n62L3K11
2191B1k93r2N10k69l70L63M77n91j36M72Q8l49L40O4m09K80L98l64k84N98P7n79
2213d8P8L38l85O7J28m72k09P19n2o78J52M71k16k31M22j25j32M07M9m40O6Q21
2235G30m85l54L02L3k08K27J15o20p1P77l76o10K53K65k00RJ14j22j83N63o8m89
2257c98L88M78m01p7J88j03j26M64j03m83K44K60k74l44M40j16l26J81L3j97J40
2278a32L93m09l04M52K31n36K72L30l77O2L33q1l62M01J35m69lK94k2l67R2o9
2300a36j71L61J09m73o6L87K8k98K25K49l94J50K27j71j69M65om21J72L06l31
$$ plain form
2321 43 137 284 -8 -185 21 168 -267 -68 66 -274 -406 -49 9 -333 -11 -47 -266 -82 300 69 -98
2342 -98 313 444 -110 131 324 193 39 209 27 -187 246 293 -253 -204 -12 -25 -282 108 -155 -385 -105
2363 -105 228 -346 -273 230 100 -62 60 75 -246 243 469 38 -346 293 138 76 96 58 -353 -258 288 -46
2385 -46 -501 -97 -4 -282 -210 17 -146 -136 288 117 -228 170 398 -58 71 243 145 -1 354 237 -222 -26
2407 -26 240 -110 -226 -97 -224 -364 81 90 -414 -291 159 -68 -206 -47 22 -197 154 348 -181 65 393
2428 393 174 -150 101 126 -89 172 263 -72 -334 14 72 -342 -93 66 -327 -287 108 -198 -257 84 197 -55
2450 -55 -19 155 13 92 411 176 -418 114 327 -76 -25 222 -56 -139 255 27 -531 -231 133 -242 -283 -110
2472 -110 -75 -82 109 78 -421 -190 403 81 -195 101 177 153 176 202 -268 -142 316 79 -139 -47 82 -214 -85
$$ packed form
2321D3R4J47k92j77K06J47m35J99J34l40j32L57N8l42L22l6k19J84L82k31j67
2342i8M11J31n54K41J93j31j54J70j82k14M33M7n46M9J92j3k57L90k63k30K80
2363a05L33n74P3N03j30j62J22J5l21M89K26m31l84O39j55o2K0l8m11R5N46l34
2385d6m55M04R3k78P2K27j63J0M24j71l45L98K28m56J29J72r8j46L55j17m59J96
2407b6K66l50j16J29j27j40M45Rn04J23M50k27j38J59O9k19L51J94n29K46L28
2428C93k19l24K51K5k15K61R1l35k62L48N8m14K49J59l93M0L95l06n9L41J13k52
2450e5L6J74j42P9L19k35n94N32K13m03N1K47k78q3L94k28n58L00L64l75m1J73
2472a10L5pJ91l1m99K31N93l22k76K96P6k4K3K6m70J26M58k37k18R2J29k96J29
$$ plain form
2495 -85 75 -282 -307 -6 -11 -410 47 98 -73 -60 148 61 -57 113 200 -15 82 198 -12 -167 273 313 -286
2518 -286 -117 59 -139 -67 40 -201 -268 136 -7 -374 -195 217 -143 -137 140 77 78 216 88 -165 58 360
2540 360 40 -43 24 127 26 84 34 -250 -144 130 48 -427 8 268 -106 -126 -10 -216 -47 270 198 -172
2562 -172 116 303 3 -47 251 143 -43 111 120 -163 -67 82 -295 -346 -72 -13 -240 6 -16 -214 -196 78 -215
2585 -215 -257 32 104 -82 49 142 159 49 277 105 8 240 125 -157 -65 151 -110 -130 -65 -112 -170 -59 49
2608 49 -273 -242 166 56 -182 -106 235 88 31 146 -31 39 302 166 -71 71 268 -98 43 137 -230 -247
2630 -247 9 125 -307 -118 87 -73 -300 -47 -29 -152 148 24 -123 -77 140 -186 -87 269 136 -22 -45
2651 -45 127 -136 -111 137 -155 -164 96 120 -250 -205 27 -136 -78 113 -74 -102 186 131 -158 -131 271 220 51 71
$$ packed form
2495h5J60l57k5L01nl99M57N1j71J3K08q7j18J70Q7k15R7J16k10j55M40M0n99
2518b86J69J76j98P2J07k41o7M04j43l67J79M12l60OK77o3JJ38j28k53K23L02
2540C60l20q3O7J03j01N8n0k84J06K74q2m75M35K60l74k0J16k06J69L17p2l70
2562a72K88J87l00n0K98j08j86J54Rk83R6J49l77n1K74N9k27K46k2j98J8K74k93
2585b15m2K89P2j86J31R3J7j10K28j72r7K32j15k82R2K16k61k0O5m7n8J11J08
2608D9l22L1M08j10k38P6L41j47n7J15j77P0K63j36k37J42J97l66J41R4l67j7
2630b47K56J16m32J89K05j60k27K53J8j23L00j24j47M6K17l26R9L56j33j58k3
2651d5J72k63K5K48k92rK60K4l70M5K32j63N8J91j87k8K88n5k89K7M02n1j69K0
$$ plain form
2675 71 200 -43 248 152 -75 -115 223 84 -248 -54 -38 -49 -77 -35 -143 -148 6 71 -293 -14 47 47 -60 256
2699 256 17 -132 119 270 -95 86 307 20 -12 160 50 -112 74 11 -246 -11 105 -136 -252 166 166
2720 166 -83 -164 72 35 -29 70 -10 -73 248 248 -34 -157 182 90 -186 34 73 75 3 95 -221 -234 -38 -36 -299 19
2746 19 72 -158 16 108 -165 -45 228 204 -171 27 237 17 -34 175 106 43 167 72 -79 -54 242 8 -155
2769 -155 116 99 -221 15 29 -224 33 222 -135 -208 206 187 -91 -16 154 16 -70 193 13 -99 143 220
2791 220 -119 -209 205 -47 -93 36 -83 -121 -16 103 -149 -174 47 156 -32 121 140 -15 116 248 -17 -106
2813 -106 186 64 92 40 113 -72 -86 44 -166 -167 24 -37 -199 -179 46 -40 -156 29 87 -208 -98 155 -22
2836 -22 41 292 -22 -104 154 173 5 66 181 -89 -102 144 -11 -203 -77 156 -87 -69 -23 -38 -91 39 139
$$ packed form
2675G1J29k43K91r6k27m0L38j39l32J94J6j1k8M2j08nJ54O5l64K79O1%j07L16
2699B56k39j49K51J51l65J81K21k87l2J72j10j62J86o3k57K35J16k41j16M18%
2720A66k49q1K36l7o4R9q0o3L21%k82j23L39r2k76K20L9Kp2R2l16j3J96Kk63L18
2746A9N3k30J74R2k73J20K73k4l75J98K10k20n1K09o9o3J24r5j51K5K96k34j63
2769a55K71j7l20K36J4k53K57J89l57p3M14j9k78P5J70j38q6K63j80j12K42P7
2791B20l39r0M14k52m6J29j19l8J05J19k52k5K21J09j88J53J9j55J31J32k65q9
2813a06K92j22K8n2P3j85j4J30k10jJ91o1j62K0K25q6j16J85N8k95J10K53j77
2836b2O3K51l14q2K58J9j68O1J15k70j3K46j55j92J26K33k43J8M6j5n3J30J00
$$ plain form
2859 139 -269 -7 175 -75 -78 250 17 105 149 167 -14 42 157 -102 -43 176 96 -175 -14 130 -151 -157 16
2882 16 -60 -151 70 25 -77 1 99 31 -131 92 41 -45 6 81 -125 71 107 38 -112 -43 -100 -166 -16 38 -91 17
2908 17 52 32 -176 4 97 -132 -123 77 27 27 150 75 -22 29 147 102 156 213 109 -75 137 -6 -102 -97 11 -121
2934 -121 -198 -140 -66 -297 -56 -113 -98 -201 60 117 -153 118 31 -48 -26 201 -9 -66 160 188 -29 30 41 -135
2958 -135 -163 87 55 -109 -112 120 -143 14 32 -66 -104 194 -90 -106 130 182 -3 79 137 151 28 118 158 -38 47
2983 47 166 171 -161 30 -124 -191 53 -115 -102 -129 99 -21 -111 109 130 -134 165 183 -57 70 165 120 -87 128
3007 128 156 47 29 150 2 -130 42 97 -154 -49 -74 -128 -10 128 -173 -193 44 54 -152 -14 -19 29 -97
3030 -97 208 11 -108 56 238 2 -23 177 -147 -73 51 36 -108 33 54 -62 -68 25 43 -114 15 25 -97
$$ packed form
2859A39m08K62J82k50lL28k33Q8M4J8j81N6J15k59N9K19q0k71J61J44k81oJ73
2882A6p6r1K21m5j02P8R8o8j62K23n1q6N1P5k06J96L6o9j50O9n7o6J50N4j29J08
2908A7L5k0k08J80R3k29RK00n0%J23p5r7N1J18m5N4N7j04j84K12j43r6NJ08j32
2934a21p7N8P4k31K41n7J5j03K61N7k70K71q7p9K2K27k10n7K26K8k17N9J1j76
2958a35k8K50l2j64lK32k63J57J8r8l8K98k84j6K36N2j85Q2N8J4j23R0M0j96Q5
2983D7J19Nl32J91j54o7K44j68J3k7K28j20r0K20K1k64K99J8k40J27R5m5k07K15
3007A28K8j09j8J21j48j32J72N5k51J05k5n4J18J38l01k0K37J0k06J38nM8j26
3030i7L05j97j19J64J82k36k5K00l24P4J24j5j44J41K1j16oR3J8j57J29J0j22
$$ plain form
3053 -97 -40 138 49 -2 120 106 -113 -40 278 19 -29 127 132 -115 124 -17 -130 169 80 -167 -13 29 -46 -96
3077 -96 37 -31 -83 13 95 -92 -162 25 58 102 36 120 4 0 187 -11 -71 121 107 -177 -85 -49 -30 -180 49 -8
3103 -8 -205 13 105 87 13 89 -105 108 271 160 19 69 71 34 5 14 58 -120 84 187 35 -131 40 165 -167
3128 -167 -36 38 -119 -17 118 -51 23 -18 131 -45 252 112 1 112 89 -93 -99 13 84 32 -35 48 -119
3151 -119 39 -59 -104 -159 49 -39 -70 -123 -8 7 51 61 -32 -85 157 16 34 -10 149 69 -63 81 65 -26 121
3176 121 27 -4 -11 16 69 -40 -10 -26 -95 -19 27 -29 -37 72 -20 -140 -75 105 42 -104 60 1 9 9 106 -84 -72 137
3204 137 -111 -80 133 -2 -109 -51 -173 -26 -21 6 -109 6 -61 103 73 -69 89 90 45 41 59 58 40 98 58 12
3230 12 181 -41 23 92 51 -74 101 28 -168 -161 -79 31 -195 40 95 -17 -45 -24 -72 83 36 82 -9 5 87 102
$$ packed form
3053i7N7J78q9n1J22j4k19P3L18k59m8J56Nk47K39j41j13K99q9k47J54M2p5n0
3077i6J33o8n2R6Q2j87p0J87L3M4o6Q4j16mJ87j98o0J92j4k84R2L6J9j50K29n7
3103hj97K18R2j8p4P6j94K13J63j11j41N0Kl7k9RM4j78K04J03j52j66J71J25l32
3128a67J31P4j57J02J35j69P4m1J49j76K97j40j11J11k3j82oJ12P1n2o7Q3j67
3151a19J58r8m5n5K08q8l1n3J15J5M4J0r3n3K42j41J8m4J59q0j32J44j6r1J47
3176A21r4l1pK7N3j09L0j6o9P6M6n6qJ09r2j20O5J80o3j46J64n9Q%R7j90J2K09
3204A37k48L1K13j35j07N8j22J47NK7j15J15o7J64l0j42J58Jm5mJ8jj8N8m0m6
3230A2J69k22O4O9m1j25J75p3j96PQ2J10k26K35N5j12k8K1m8J55m7M6r1J4Q2J5
$$ plain form
3256 102 57 34 -64 -97 -43 1 -159 13 156 -138 -81 -152 27 23 62 48 -25 -15 194 -34 20 17 55 67 94 88 -124
3283 -124 32 135 12 87 -7 42 -44 -170 54 -91 -66 -25 -73 -66 8 38 -223 -10 11 144 -180 73 -27 -44
3307 -44 92 16 -249 -19 228 56 -64 32 133 2 -60 -9 -6 -58 51 -27 23 -9 -28 -25 -16 74 -46 -50 161 96 -81
3334 -81 -64 207 38 39 174 34 -48 41 84 -140 -66 123 23 -181 -74 60 -51 -12 -47 -24 -7 42 -11 93 166
3359 166 159 43 -18 14 1 -18 82 -47 -41 -72 60 -153 -7 175 21 45 -21 -58 -120 -58 23 -98 -168 89 -63
3384 -63 58 45 134 26 19 3 53 71 103 80 -3 -104 35 -9 -7 128 44 -48 -23 43 -111 -35 91 -130 -172 -44 104
3411 104 57 107 60 14 116 52 100 48 79 84 27 -12 159 60 -33 54 34 -173 -115 96 -109 -80 74 2 -53 -14 -129
3438 -129 -125 130 70 -93 -63 20 -3 -104 121 109 172 -15 86 -70 -13 113 153 -119 -25 62 84 -135 -63 -84 -157
$$ packed form
3256A02m5k3r8l3N4M4j60J72J43k94N7p1J79mL9j4p3J0K09k28N4lL8J2K7ok12
3283a24J56J03j23P5r4M9q6j26K24j45K5M1m8PP4L0k61K13K1J33l24K53j00j7
3307d4J36p6k65K30K47j72j20R6J01j31o2N1Ln2J09p8N0l2j9LRR0j20mK11o5j77
3334h1J7K71j69JJ35j40q2Q9M3k24P4J89j00k04J07J34j11L9l5K3J7M9n3J04P3
3359A66pj16o1L2j3j9J00j29Ol1J32k13J46J82j54K4o6l7o2O2Q1j21p0K57j52
3384f3J21j3Q9j08pj6N0J8L2k3q3j01J39m4KJ35q4r2K5O6j54P6J26k21m2J28J48
3411A04m7N0m7m6J02o4M8n2L1Nn7l9J71r9r3Q7k0k07N8K11k05K9J54p2n5L9j15
3438a29MK55o0j63L0Q3k3j01K25j2O3j87J01j56N7J26M0k72R4Q7K2k19P2k1p3
$$ plain form
3463 -157 7 34 -156 -164 211 125 -62 75 43 61 15 62 56 118 96 48 -74 -36 86 36 -61 48 -38 -5 53 -17 -25
3490 -25 -46 49 -57 -51 -54 -55 -62 7 -10 -20 167 122 132 -114 24 63 -141 45 -75 -44 -46 -11 -203 -39 27 -46 -109 -56
3518 -56 -7 -86 63 -34 -56 -14 102 45 -8 -49 48 -99 -27 85 -71 40 113 32 -58 125 85 -22 -104 -23 -18 -67 -96
3545 -96 1 -164 3 72 124 -34 144 19 -75 -58 55 83 9 74 122 -72 8 -99 -44 45 49 -83 -24 -113 -125 -28
3571 -28 -45 51 -110 8 84 8 -31 10 -6 76 6 162 -48 143 68 26 -10 60 148 -38 -71 74 -199 -25 -77 -93
3597 -93 -11 -56 -35 -140 -132 21 17 -191 95 60 -46 -52 35 81 -12 -35 70 -18 98 38 110 -30 72 -89 130 -39
3623 -39 -38 -53 54 61 -73 -100 31 49 -80 -15 -13 42 -261 98 20 -41 41 24 1 43 55 7 -57 66 45 -132 -54 64
3651 64 -20 -76 -80 -60 38 99 -15 -40 -120 -157 112 12 -27 92 28 -44 46 -28 30 90 81 10 54 197 -146 -85 112 -123
$$ packed form
3463a57J64K7j90qL75q6j87J37l2J8m6M7oO2k2m8j22L8J22n0r7J09q6L3N8p0q
3490b5k1R5j06OljpO9j7j0J87m5J0k46J38L9k04J86j20L1kL5j92J64O6p3o3N3
3518e6M9p9J49r7k2M2J16n7n3m1R7j47P2J12j56J11P3q1r0J83m0j07q2Q1Nm9k9
3545i6R7j65J67O9N2j58J78j25r4J7J13K8p4O5M8j94Q0j07N5Q9Mj32N9q9j2R7
3571b8j7R6j61J18P6p6l9M1j6Q2p0J56k10J91p5m2l6P0Q8j86l3J45k73J74n2j6
3597i3Q2m5K1j05QJ53mk08K86l5j06oQ7M6r3k3J05q8J16o0P2j40J02j61K19j69
3623c9Jj5J07Pj34k7J31J8j29O5KN5l03L59p8o1Q2j7k3M2J2m8o4J23k1j77P8J18
3651F4q4n6mK0R8O1j14k5q0l7K69j00l9J19o4p2R0p4N8O0rp1M4J43l43O1J97k35
$$ plain form
3679 -123 -42 108 -99 -46 -10 102 67 -64 47 -83 116 36 53 -57 -13 47 -90 -34 132 43 -43 -16 28 -100
3703 -100 -31 -2 -93 -135 -98 -39 -100 -109 -108 -47 -42 54 -6 -39 92 -32 84 53 158 59 -119 42 88 14 -113 52 32
3730 32 -48 -13 -38 -20 -26 -46 82 -10 19 22 -100 110 12 -51 36 -44 -17 -41 127 -29 -23 213 84 -51 40 -31 -21 -107
3758 -107 1 -38 -145 -7 49 -124 -95 34 -67 27 106 44 -90 70 59 115 1 -13 -19 85 30 114 -176 5
3782 5 116 1 92 -26 -62 -46 -81 17 2 -44 169 16 6 82 -81 -75 -67 -57 -19 -32 -19 15 103 73 -117 14 -33 160
3810 160 -54 3 -74 -1 -51 -45 -110 -152 -30 -103 -49 -20 79 122 -132 -67 74 -90 72 87 36 -48 77 93 -14 13
3836 13 5 -39 100 98 -68 -88 -13 -48 -78 20 -83 16 -138 84 54 -7 -155 -75 -17 -56 -71 119 32 -37 101 -101 -59
3863 -59 -7 89 45 -113 31 -8 51 -19 29 36 43 -49 -24 34 -29 -111 170 136 146 -83 112 126 66 32 42 93 -90 210
$$ packed form
3679a23Q1J50k07N3L6J12l5j31J11j30J99q0J7j10M4O0j37N6J66q9q6K7M4j28
3703a00O9K9r1m2L7N9o1rJO1NR6o0l3J31j24J16l1J05r9j78J61M6p4j27J65k0
3730C2q0L5k5J8ok0J28r2K9Lj22K10r8o3Q7q0K7k4J68j56OK36j29j35R1p1J0q6
3758a07J08l9j07J38N6j73K9J29j01R4P9o2j34J60j1N6j14j4oJ04n5Q4k90J81
3782EJ11j15R1j18l6J6l5R8j5m6K13j53j0P6j63OQJ0L8j3J3L4Q8l0j90J31m7J93
3810A60k14N7p7P3n0Oo5m2J22p3N4K9R9M3k54O5J41j64J62J5n1q4J25J6j07K7
3836A3qm4J39kj66k0P5l5l0R8j03R9j54K22l0o1j48Q0N8l9j5J90q7o9J38k02M2
3863e9N2R6m4j58J44l9N9p0M8PPr2K5N8o3q2K81l4J0k29J95J4o0l4J0N1j83L00
$$ plain form
3891 210 76 -21 -55 122 32 16 50 55 10 -13 -106 -62 -52 46 4 -32 -30 81 -59 -49 102 25 -6 57 -64 -47 63
3918 63 74 -16 69 56 -152 -2 44 -14 -89 42 -67 -124 15 96 -51 -26 64 -7 -20 -15 60 102 6 121 6 -43 38
3945 38 -15 -105 103 17 72 -214 29 -91 -143 -71 51 -87 -38 -87 -73 58 68 -19 -43 -55 -90 -52 -117 15 70 34
3971 34 69 140 -16 -15 109 55 23 72 23 -86 65 51 -79 33 34 -3 -55 6 60 -16 -25 -159 76 39 -43 -66 -40 99
3999 99 -30 207 58 48 -10 -10 180 -145 -109 -86 20 -38 -112 21 -28 -24 -24 54 42 -53 31 5 -74 154 88 18 -13 23
4027 23 5 33 -50 55 -32 82 14 -36 12 -54 36 -100 -3 116 -58 49 33 179 -10 96 -3 10 -10 22 8 -2
4053 -2 -5 -12 -161 6 40 -87 -62 132 -71 -210 -45 35 4 43 45 6 14 28 54 57 -3 23 -18 77 22 -40 -39 168 -108
4082 -108 52 179 90 -4 106 66 24 115 13 -43 -161 142 67 -2 1 124 -15 -23 146 -13 10 -19 62 -30 -114 59
$$ packed form
3891B10j34r7l4J77r0j6L4Nm5k3r3M4J0R8m2l6KJ11j40J0J51p7l1O3j21J7J10
3918F3J1r0Q5j3k08J50M6n8p5J31j09n7J39Q1j47K5R0p1j3NP5M2r6J15j15m9Q1
3945C8n3r0K08q6N5k86K43j20n2P2J22j38M9m9J4J31J0q7k4j2l5L8o5J32N5l6
3971C4L5P1j56JJ24n4l2M9m9j09J51j4j30J12Jl7n2O1N4p6rj34K35l7q2k3K6J39
3999I9j29K37j49j0n8%J90l25L6K3J06n8p4J33m9M%P8j2r5Q4k6p9K28o6p0l1L6
4027B3j8K8q3J05q7J14o8n0M8o6R0j36R7J19j74J07j6J46j89J06r9J3k0L2j4j0
4053blpj49J67L4j27K5J94k03j39J65Q0l1L9Kl9QJ4K6Lo0K6m1R5n5o2JK07k76
4082a08J60J27q9r4J10m0m2R1j02n6j18L03p5o9LJ23j39qJ69j59K3k9Q1r2q4J73
$$ plain form
4108 59 26 -38 -1 -11 -73 104 2 -156 -27 82 -41 83 -19 -4 -123 -38 58 5 22 -30 -32 13 12 16 -82 37 214
4135 214 58 19 62 26 49 -31 56 -9 -16 129 106 -22 -34 35 -75 30 -6 -9 -45 136 -74 77 -29 59 63 1 52
4162 52 -82 25 105 95 -57 -57 32 -91 18 28 -16 33 -31 70 -95 95 8 -96 3 91 -65 -86 18 -26 -75
4187 -75 -128 113 4 -26 53 131 52 -35 63 5 3 7 8 35 -40 177 -108 -138 -76 -63 19 11 140 -10 -62 -48 -25 -59 153
4216 153 55 -11 44 169 32 -122 -44 -136 -110 4 42 -19 -47 76 -118 -88 51 -40 -76 -24 24 -96 -16 -19 109 -22
4242 -22 101 28 -62 99 38 67 -134 107 102 -173 29 13 31 27 -67 -32 7 -31 94 24 -58 53 19 -140 -41 -24 -37
4269 -37 95 106 -6 -14 56 42 68 -37 10 -127 43 -38 11 -78 71 -55 -122 -58 53 -65 -44 98 55 -99 60
4294 60 85 108 97 115 5 -23 192 48 -77 -37 85 2 65 13 110 23 -14 -39 73 -35 132 -139 -89 1 6 -56
$$ packed form
4108E9l3o4L7j0o2J77j02j58J29J09j23J24j02J5j19Q5R6n3J7n2kM5jMr8J19J77
4135B14j56l9M3l6K3q0Q7o5pJ45k3j28j2O9j10J05l6ll6J81k10J51j06Q8Mo2N1
4162E2j34J07Q0j0j52%Q9j23J09J0m4M9o4J01j65J90q7j04R9Q8j56k1J04m4m9
4187g5n3K41j09l0P9P8p9q7R8n8kMJK7p5K17k85l0O2J3Q2qJ29j50n2J4K3l4K12
4216A53r8o6N5J25j37j54P8r2K6J14L8o1k8J23j94L0J39r1l6N2M8j20Q0lJ28j31
4242b2J23p3r0J61o1K9k01K41nk75K02j6J8mr4L5L9l8J25p0q2J11l4j59R9J7j3
4269c7J32J1j12qP0j4K6j05M7j37J70q1M9q9J49j26o7O4J11j18K1J42m3j54J59
4294F0K5K3j1J8j10k8K15j44j25M0J22q3O3n2R7q7l7k5J12j08J67k71N0R0No2
$$ plain form
4320 -56 -14 142 34 16 2 -28 42 55 19 -22 -52 94 -85 -54 18 -16 -3 -28 102 -61 63 13 -1 -49 -36 8 -8
4347 -8 23 48 -19 49 -69 -78 23 -46 22 -11 30 50 4 -30 25 48 -154 -7 -1 -78 -39 -15 67 11 -10 -32 -68 -11 43 -55
4377 -55 -30 -40 -8 -123 93 -79 64 39 -13 -67 -177 19 79 -112 30 -45 -22 -34 105 -7 0 -22 -100 -25 27 124
4403 124 -153 54 70 -16 -109 58 75 -115 147 49 -46 -14 70 -7 -142 5 -37 -10 -276 -40 -96 101 -2 -54
4427 -54 -42 -25 7 75 78 4 -2 -12 59 54 16 120 89 -110 -8 58 24 1 -13 -97 -42 -91 70 90 4 -9 -62 58 -20
4456 -20 101 -109 -144 38 38 114 46 97 11 139 32 120 2 55 128 -19 -36 14 -4 -73 -157 3 -34 53 75 -49
4482 -49 -81 -48 -1 52 5 80 28 -18 125 -127 43 -4 123 -65 67 17 20 20 8 -78 -70 39 -72 -31 -44 79 13
4509 13 88 -11 -34 -56 155 -48 11 111 30 15 18 71 -36 15 -11 -17 -9 -83 127 -92 -159 42 -18 -32 -59 -39 -1 9
$$ packed form
4320e6M2J56j08j8j4l0P0J3l6m1l0J46j79L1P2l4J3k5J30j63J24n0j4m8J3M4j6
4347hL1K5o7O8j18rJ01o9O8l3M1K0m6l4N5K3k02J47Op7L9K4Q2n6k1k2l6N7N4r8
4377e5K5j0L2j15K16j72J43k5n2n4j10J96O0j91J42p5K3j2J39j12Pk2p8P5N2R7
4403A24k77K07J6q6r3J67J7j90K62r8r5L2Q4p7j35J47m2K7k66K36n6J97j03n2
4427e4J2J7L2O8Lp4oj0P1nl8J04l1j99J02O6l4k3j4q4N5m9J61K0q6j3n3J20p8
4456b0J21k10l5J82%P6o8N1q6J28j07Q8j18N3P3j47j7N0j8o9q4J60l7Q7K2j24
4482d9l2L3M7N3m7P5n2m6J43k52J70m7J27j88J32n0L%j2q6QJ09j11M1j3J23o6
4509A3P5r9k3k2K11k03N9J00q1j5LN3j07N1k6oQp4K10k19o7K01o0j4k7K0L8J0
$$ plain form
4537 9 11 26 12 -71 -15 76 79 49 57 124 -3 94 104 74 174 -76 -83 30 -4 -73 17 27 -24 -80 15 -59 -126 144 5 -142
4567 -142 -63 84 6 -40 68 139 -62 109 62 -47 -122 -34 32 58 28 -75 -98 -2 -37 -14 -52 -29 -58 12 67 -106
4593 -106 -81 21 112 -140 -76 -53 30 23 69 53 91 15 139 89 3 116 23 -34 -98 2 13 -137 -105 -64 -107 -19 -19 36
4621 36 -30 100 -103 -15 87 24 59 32 -87 65 -45 143 -1 -18 47 141 69 -98 161 -17 41 71 24 -34 9
4646 9 -9 15 -32 42 -31 -56 30 66 86 10 116 35 17 -6 -98 -15 121 70 34 -11 10 -45 64 -108 9 -26 31 36 9
4675 9 17 -106 -57 -35 88 67 -8 34 88 -1 12 60 88 -37 -67 -32 -86 34 -47 -10 124 -48 31 67 -66 -6 5 61
4703 61 63 86 -16 78 92 -87 -30 -5 37 -59 14 -105 51 62 2 -76 3 -115 -17 6 -76 -1 -78 -130 10 -83 22
4730 22 7 48 -38 -38 -30 -116 19 104 91 -85 43 42 -82 -83 -6 -113 -26 4 80 -66 112 -4 -8 23 -92 -46 -40 57 -93
$$ packed form
4537IKJ5j4q3N6R1Ll0QO7j27R7J0l0J00k50pJ13l4o9R0J0n1n6R5p4o7K70j39j47
4567a42P9J47p8m6J08P1k01J71m7j09p5Q8O6K6l0j03k3R6l5K3l8K3k9P0N5j73
4593a06K5J02R1k52O4K3Q3pM6j6L8p6J24n0q6J13r3n7o4J00J1j50L2M1m3Q8%N5
4621C6o6J30k03Q8J02o3L5k7j19J52j10J88j44j7O5R4p2j67K59j78N8L0m7n8M3
4646Ij8K4m7P4p3k5Q6L6K0p6J06q1j8k3r2Q3J36n1l6m5K1n5J09j72J17l5N7Nk7
4675IQj23M9K2J23k1p5M2N4q9J3M8K8j25l0L5n4J20q1L7J34j72P9L6j33O0J1N6
4703F1KK3j02R4J4j79N7K5M2r6P3j19J56J1o0p8P9j18R8K3q2P5p7n2J40r3J05
4730B2j5M1q6%Qq6J35Q5j3j76J28jj24jP7j07Q7L0P6j46J78j16mL1j15M6OR7j50
$$ plain form
4759 -93 -7 63 62 11 -35 110 -24 55 -12 -84 -52 38 76 53 -126 92 88 -80 -22 -5 -32 81 8 -128 -25 -44 -4
4786 -4 -52 22 57 2 -74 -32 63 -47 -35 -44 -14 15 109 14 -1 71 134 1 -6 22 -64 -64 34 47 -75 105 27 -117 -7
4815 -7 22 12 -59 63 99 36 44 24 -82 -22 180 -72 35 -118 73 6 -48 -24 -119 77 9 58 -92 -9 -18 -18 -36 3
4843 3 -29 23 68 -44 60 160 -15 17 -51 57 23 55 42 53 107 -92 9 33 -7 67 -3 -55 104 -48 82 -27
4869 -27 9 -41 81 29 188 42 81 12 -93 11 40 40 -42 22 91 -149 -28 -50 57 3 30 55 -85 -127 -2 -9
4895 -9 -45 -3 90 -7 -9 -14 15 1 -75 85 -59 -82 73 40 -13 22 61 -50 -16 13 54 -77 -116 -99 -82 -17 -102 104 -128
4924 -128 -46 -97 54 62 -31 -109 45 79 -51 193 -35 -69 -11 -33 50 61 83 -23 -115 -79 -68 -85 -25 -18 -79 11 -3 159
4952 159 -70 69 31 2 -57 17 26 -99 33 135 -85 -70 0 46 -64 -49 1 -99 -27 -99 -92 58 -14 -75 -60 3
$$ packed form
4759i3Q6P0jn1m6J45j34P9o7p2L2R0L8k3j79K18mj68N8J7k7J13p3j36J03j9M0
4786dm8P4L5n5p6M2R5j10J2rL0K9R4r5j5P2O3j33pK8q6%R8J3j22J80p8j44J10
4815gK9j0p1J22L6o3Qk0j06O0K02k52J07j53J91o7n4K4r5J96o8M9j50Q3r%j8L9
4843Cl2N2M5j12J04J00j75L2o8J08l4L2j3J1N4j99J01K4m0P4p0n2J59j52J30j09
4869b7L6n0J22n2J59j46L9o9j05J04K9%q2O4O9k40J21k2J07n4K7K5j40m2J25p
4895il6M2R3r7knK9j4p6J60j44k3J55l3n3L5L9j11L4K9M1j31l9J7J7O5q5K06k32
4924a28Q2n1J51Qr3p8J54L4j30K44k28l4N8k2Q3J1K2j06r2L6J1j7O0Po1R0j4J62
4952A59k29J39l8k9n9P4Rj25J32J02k20J5P0M6j10J5N0j00P2p2PJ50p2o1J5O3
$$ plain form
4978 3 -24 -37 0 130 -79 -31 22 130 -42 -86 -65 -44 -91 173 -170 -48 17 -69 27 -113 -60 26 -29 -181 47 42
5004 42 -8 85 -93 -65 124 92 67 193 45 -36 -28 111 74 -54 4 104 -89 87 0 -99 -104 11 103 -72 -1 20
5030 20 -40 -12 -169 -8 24 -87 148 -2 -26 -21 -7 -16 69 -26 -37 -42 22 18 -1 48 -7 -78 129 -2 -54 -31 46 -57
5058 -57 43 -27 11 -4 19 -35 -31 -20 75 -14 21 75 -144 1 -44 116 0 -27 148 -75 -44 -55 -55 16 90 -107 -57
5085 -57 -73 -45 -33 -75 25 152 37 81 34 -88 141 39 53 -92 -9 32 -97 -68 26 -54 -45 37 -97 -216 -103
5110 -103 -34 -78 -99 -10 27 -33 47 5 18 11 -15 -33 87 -18 -29 -110 23 19 37 -24 101 40 -42 -44 38 -90 59 62 -58
5139 -58 -118 31 -40 -117 81 -107 -137 83 -37 22 -57 46 3 -57 32 156 -32 -29 9 -44 -113 12 94 -26 -68 -41
5165 -41 -41 -142 -59 -200 -83 -27 -67 -91 -88 123 -21 -71 131 -35 13 24 50 -20 42 21 -69 -25 -109 -51 -33 -136 -24
$$ packed form
4978Ck7j3L7J30k09M8N3J08j72m4K1K1m7K64l43J22O5q6R6j40N3Q6n5j52K28n
5004D2n0R3j78K8J89l2k5J26j48q1QJ39l7j28N8J00j93J76q7r9nJ15R2j75P1K1
5030B0o0K8j57J61L2j11K35j50k4NJ4rQ5r5j1nO4mj9M9n5p1K07j31n2K3P7j03
5058e7J00p0L8j5K3n4MJ1R5q9L5N4k19J45m5J60j16k7J75k23L1j1%P1P4j97N0
5085e7j6K8J2m2J00J27j15M4m7j22K29j02J4j45Q3M1j29K9R4q0RQ2j34j19J13
5110a03O9m4k1Q9L7o0Q0m2J3pk6j8J20j05j1q1J33mJ8o1J25o1q2kQ2j28J49Lj20
5139e8o0J49p1p7J98j88l0K20j20N9p9J03m3o0Q9J24j88LL8n3o9J25Q2j20m2K7
5165d1%j01Q3j41J17N6m0k4LK11j44n0K02j66M8J1K6p0O2k1r0M4q4N8J8j03J12
$$ plain form
5192 -24 16 -94 -84 65 -73 -35 53 -77 40 25 -26 25 -6 137 65 -72 86 48 -32 -40 105 -84 -115 -2 -73
5217 -73 38 23 -15 -110 -51 75 -72 12 34 -2 -44 47 -55 -16 98 40 14 14 56 -89 -15 -37 50 22 -5 31 -78
5244 -78 -52 -5 6 -45 -181 -27 44 43 -52 -1 -147 -26 44 -86 -28 -27 12 -70 33 68 79 74 23 12 -27 -46 11 -86 13
5273 13 18 -146 -43 2 74 -72 -81 -64 63 49 -69 46 -7 74 54 101 -47 62 -157 -40 39 -42 41 56 -107 68
5299 68 -130 104 112 -86 86 40 -20 5 71 -144 -30 26 -26 35 74 14 25 25 34 -59 -63 113 11 -71 -128 33 -7 -83
5327 -83 -3 -66 -30 -37 -8 -4 124 16 28 3 27 45 -74 25 -2 -22 27 21 32 -151 65 -12 -13 58 -25 -8 -5 -44 -35 49 43
5358 43 36 -146 -5 116 11 -41 -63 -104 73 109 -26 120 75 28 -94 38 182 72 0 -33 25 18 -5 13 26 -97
5384 -97 5 -67 -67 106 -27 -44 -10 4 -172 21 122 -63 -34 -128 69 -11 -159 28 86 -43 -48 49 -54 -65 98
$$ packed form
5192b4M0j10J0J49j38L8Q8j30J17j5n1N1l1J43p2j37J58l8q0qJ45j89l1J13p1
5217g3J11j5l8r5N9J26j47Q4K2l6m2R1j02L9J14n8k6%M2j45P4k2Q7k8k7L6j09
5244g8K6M7J1n1j36J54P1jr5N1j46J21P0j30N8JL9q2J03L5J1nn1j1l9j9N7r7R9
5273A3Nj64J03M5P2j46rJ7J27j4j18J15n3Q1k0M7j48J09k19J17P9q1Q3J5j63J75
5299F8j98K34Qj98J72m6o0K5O6k15J14N6n2O1L9o0J1%Rr3mJ76j02q2n7J61m0p6
5327h3Q0o3L6pK9MJ28j08J2k5K4J8j19R9k7k0M9oJ1j83K16p7jP1q3J7Ll9RQ4o
5358D3pj82J41J21j05n2k2m1J77L6j35J46m5m7j22J32J44j10p2l3N8pk3J8J3j23
5384i7J02p2%J73j33j7L4J4j76J93J01j85K9r4J97q0j48J87N8j29nR7j03j1J63
$$ plain form
5409 98 80 -35 -85 50 -120 124 104 -39 117 60 75 -7 6 71 -29 -94 69 118 116 39 -32 -63 -34 8 -77 -123 52
5436 52 60 -29 65 93 -211 31 -41 39 40 93 26 -173 37 53 -46 65 16 128 -28 22 -41 -53 65 -81 145 -95
5462 -95 131 -72 34 -5 24 -4 -93 96 -87 19 25 -80 -12 3 29 -94 -5 160 -22 -12 -27 67 39 81 -17 -50
5488 -50 62 -67 46 3 -81 23 -63 -108 109 37 -16 58 99 11 -24 48 46 -14 100 4 32 113 -9 -68 -33 -103 -3
5515 -3 46 25 40 -17 -62 60 -3 52 43 -85 -11 -43 6 -100 25 -53 11 27 -50 -39 3 24 17 -20 54 -22 -89 36 81
5544 81 11 -7 -47 38 32 24 -75 47 -36 -77 -11 64 -121 -48 38 -39 42 -38 -84 25 -6 -22 21 -38 13 -36 -28 158 21
5573 21 -63 98 15 -36 59 -7 -94 -10 -17 68 -61 -4 116 -110 100 -71 -43 -19 -9 25 -8 5 -6 -73 -28 -29 -106 1
5601 1 102 -108 -60 1 -6 1 -60 76 -22 -28 24 -23 -39 -67 116 49 -147 50 -27 57 18 47 -68 -108 9 -43 -179 22
$$ packed form
5409I8j8j15n0J35j70K44k0j43J56n7J5q2J3O5j00o5J63M9kp7p1l1K9M2q5m6J75
5436E2Qq9R4K8l04K42p2Q0JN3o7j99K10J6r9J11m9J12j56N0o3j2J18j46K26k40
5462i5K26k03J06l9K9k8q9J89j83J06Oj05O8J5K6j23Q9J65j82J0j5R4k8M2r8l3
5488e0J12j29J13m3q4J04q6m5K17p2n3P4M1q8l5P2ko0J14r6K8Q1j22n9L5p0J00
5515cM9k1J5n7m5J22o3N5rj28P4l2M9j06J25p8O4J6p7J1M2K1pl7P4p6o7J25M5
5544H1p0j8m0Q5oqr9J22q3m1O6P5j85P3Q6p7Q1q0m6J09l1j6M3n9N1m9QJ86j37
5573B1q4J61q3n1R5o6q7Q4pQ5j29N7J20k26K10j71K8K4J0L4l3J3j1o7M5jp7J07
5601AJ01k10M8O1pPo1J36r8oN2m7j6k8J83o7j96J97p7Q4l9K9j15m0J17n2j36K01
$$ plain form
5629 22 -24 -177 -24 128 108 -95 21 47 -35 -56 133 79 -57 51 -1 -27 73 -83 -75 151 40 -26 30 16 4
5654 4 8 101 20 -86 -46 35 -53 -85 -69 -37 27 -50 115 -31 99 153 75 -24 -91 81 -24 -66 -30 18 -52 -36 -10 7
5682 7 65 -38 -33 -136 -136 -65 -96 4 29 32 101 -3 -79 36 -164 -20 -78 24 1 -71 -174 -39 26 -44 20 -100 -59
5709 -59 -23 -90 10 -73 25 58 -10 -103 74 -56 -1 57 6 37 104 32 35 129 105 -57 -38 -82 -30 -9 -31 34 -9 -71 -55
5738 -55 51 -69 -138 65 -138 -320 17 34 98 24 -63 73 -18 -25 49 46 -8 46 52 -160 -35 -61 6 41 -24 65 -15
5765 -15 -11 -86 95 192 23 -72 -18 62 14 -18 8 92 10 -19 78 1 -62 -82 -169 -81 -29 -14 64 75 37 -73 -44 29 -129
5794 -129 -57 58 -38 -4 54 153 -135 95 36 8 -23 79 104 -50 -53 -4 -120 7 -15 -99 -3 -37 -27 -204 105 -50
5820 -50 -81 19 3 68 57 34 -37 24 80 -27 92 40 -70 53 -61 -44 -49 -18 58 9 -56 43 -40 -18 -10 -25 30 -80
$$ packed form
5629B2m6j53J53J52k0k03J16K6q2k1J89n4j36J08n2k6J00j56QK26j11o6N6j4j2
5654DMR3q1j06M0Q1q8l2J6L2O4p7J65j46J30N4p8r9o7J72j05m2L6M8p0J6K6J7
5682GN8j03Nj03%P1l1J00K5LO9j04p6J15k00J44n8J02k3p2j03J35O5p0O4j20M1
5709e9L6o7J00q3R8L3o8r3J77j30N5N8n1L1O7p2LR4k4j62J9m4N2K1k2O5m3o2J6
5738e5J06j20o9K03k03j82L37J7O4p4q7J36r1pP4ln4N4Ok12J25k6O7L5o5Q9q0
5765a5Mp5J81R7j69r5N4Q0m8l2K6Q4q2k9R7p7o3k0q7Q8N2J5P8J1l8j10K9P3j58
5794a29P2J15r6L4N8R9k88K30n9k8l1J02K5j54lM9j16J27k2q4R6l4J0j77L09j55
5820e0l1J00j6O5j1k3p1O1N6j07J19n2j10J23j14J7nL1P6m9o5R9q3K2Qj5N5j10
$$ plain form
5848 -80 -72 -112 -58 20 112 27 -57 25 22 -98 18 -98 -52 153 101 -56 -97 -40 6 -1 74 -1 85 51 -87 -5 -27 44 -120
5877 -120 79 131 -73 58 37 106 -18 80 8 30 16 -113 16 -37 16 -8 70 8 -90 79 -86 -105 -47 74 69 -52
5903 -52 24 -47 -28 114 41 -98 21 -57 83 105 48 -49 11 88 79 9 71 34 -109 61 -19 40 -55 -34 -21 -45 75
5930 75 -48 29 22 40 37 -81 76 -28 70 -17 -13 14 -53 -36 18 -102 62 -68 -22 -40 -9 30 -60 30 -74 -40 43 -19
5958 -19 5 -151 17 133 9 -108 84 -110 -96 64 12 91 -42 -108 45 -90 12 -2 -7 -10 -13 46 -23 8 -54 -122
5984 -122 -5 -47 -91 16 44 57 -181 145 91 -126 -70 -36 -44 -54 22 85 49 -99 135 -69 63 -74 -73 -104 68
6009 68 20 15 -79 -100 -52 90 78 20 -105 101 63 -180 82 3 44 -5 -20 73 -154 -58 21 63 -126 -55 -83 -176 97
6036 97 -4 -48 9 -98 -203 -16 -45 39 -46 47 -37 5 15 -105 69 50 187 130 -72 2 -56 -84 30 -77 -23
$$ packed form
5848h0Qm0N4P8R2q5q4Q2lj20J16j16M6K05n2j57m1N7M6pP5p5Q6l4j38Q2k2P1j64
5877a20J99N2k04J31k1O9j24R8p2K2j4j29J29n3N3k4P8o2r8J69j65j9N8J21nj21
5903e2P6p1J9J42p3j39J19p8J40K2n7r7O0P7rp0O2l7j43J70q0N9r5K1J3k4J20
5930G5j23P7pJ8lj18J57j04R8q7MK7o7J7N4j20J64j30M6j8L1L9r0R0j04L4Q3o2
5958a9K4j56J68J16j24j17J92j94J4J60n2P9j33o6J53j35J02j4nllN9o9L1o2o8
5984a22J17m2m4J07K8J3k38L26n4k17N6L4qj0P6O3l6j48K34k04J32j37Jl1J72
6009F8m8nr4k1M8J42j2n8j25K06l8k43K62p9M1m9j5R3k27R6P9M2j89P1k8r3K73
6036I7j01m4N7j07j05J87k9Q4q5R3q4M2J0j20J74j9J37n7k02P4n8k8J14j07N4
$$ plain form
6061 -23 2 -17 18 -100 -124 -28 -80 87 -63 50 -118 -105 116 73 -13 61 66 -61 51 28 26 -164 -99 100 -10 64
6087 64 94 -27 75 5 111 -100 62 -29 -68 44 26 78 16 121 -124 26 50 -61 -234 -145 -21 -55 -29 -14
6111 -14 2 -131 74 132 -56 73 -5 -25 18 -121 32 -19 57 47 72 35 111 -3 4 61 100 -36 107 -21 20 -29
6137 -29 16 103 25 34 7 9 -39 -43 -42 -41 5 78 -74 -144 0 -25 -22 -3 -6 -28 -33 70 -133 94 -14 -65 7 -32 41 -24 20
6168 20 97 189 -8 39 109 130 6 -85 -78 85 17 23 31 2 165 -42 -83 -39 92 52 57 6 5 -12 -49 -30 -16 47 90 -25
6198 -25 113 -94 77 12 -76 -18 7 18 95 0 -3 -39 -174 -5 164 79 -9 26 -78 60 36 72 3 -4 -5 -137 -76
6225 -76 68 -2 -110 -58 -102 -93 16 -73 -118 -5 -37 103 25 1 22 -30 -95 46 -104 133 -29 44 -98 -106 -10 -108
6251 -108 89 -71 126 49 65 30 2 -69 -52 49 -49 -72 173 -58 -33 91 78 -121 -13 165 -82 -58 43 21
$$ packed form
6061b3K5j9L5j18k4R6n2J67j50J13j68J3K21m3q6P4Nj27J12k3kj90O5J99j10P4
6087F4L0j21J02p0J06k11J62r1l9J12j8N2o2J05k45J50K4j11j73Q9J24l4K6J5
6111a4J6j33K05N8j88J29p8k0M3j39J53n1P6j0K5l7P6j14PN7L9j36J43j28M1m9
6137b9M5Q7p8Rk7Km8mJJM6P3j52p0J44k5LJ9lk2nJ03k03K27j08n1P2l9P3o5M4
6168B0P7R2j97M7P0K1j24r1PJ63o8OQk9J63k07m1M4J31m0Nn1jj7l7J9J4O3M3j15
6198b5J38k07J71o5q8N8K5J1P7r5ll6j35J69J69q5q8L5j04J38k4L6o9pjj32O1
6225g6J44p0j08N2m4RJ09q9m5J13l2J40p8k4K1n2o5J41j50K37j62P3j42qR6r8
6251a08J97j60J97p7J6l5k8p1J7J01r8k3K45k31K5J24j3j99J08J78k47K4J01k2
$$ plain form
6275 21 59 -62 18 12 -31 26 -28 81 -23 38 -31 -23 17 -29 53 99 -16 -57 -45 -38 5 23 -138 24 72 49 11 -54 -62
6304 -62 93 0 -42 33 -122 -7 -29 -111 -116 -38 -23 -11 49 129 -54 18 -65 109 -115 -20 99 -121 32 114 -7 75
6330 75 -23 -26 2 -17 -6 -59 -53 38 1 -127 36 -77 62 50 25 -25 -85 81 -30 37 9 104 61 -69 126 -138 71
6357 71 62 -112 -96 -26 81 -24 36 -7 -25 -97 -55 33 -61 2 90 33 -133 120 14 -88 45 -4 -42 16 84 12 32
6384 32 29 87 -53 88 -9 -48 -108 -20 -11 -39 113 3 26 -102 6 21 -94 -60 84 19 3 151 14 19 45 52 29
6411 29 18 8 -11 -52 60 -72 -84 28 56 10 55 89 -67 -73 -77 -66 -4 -26 55 86 50 9 -39 59 44 -15 -33 0 59
6440 59 -13 35 -55 53 30 134 119 -16 -28 -59 37 -56 0 -119 25 -54 179 43 67 111 84 -3 48 21 39 130 3
6467 3 51 35 -19 -54 -43 -14 56 -112 96 101 -41 -134 -57 -43 -53 12 55 17 -17 101 68 12 75 49 19 -27 -20 -29 9 -3
$$ packed form
6275B1L8j21Q0om3N7n4J09j04O1o9QM0m6Q2M6j15m1J2PM3J8j61J62M8k3l8o5q
6304f2J55r3m2P5j55J15k2q2nP8J5J2O0Q0j83P2q3J74k24R5J19k20J53Q2j21Q2
6330G5r8lK8j9J1n3OR1l7j28J63j13J39j2k5n0o0J66j11O7k8R5m3j30J95k64K09
6357G1rj74J6P0J07j05O0m3j8p2M2Q8r4O3Q8n7j66K53j06j02J33m9l8N8O8p2K0
6384C2lN8j40J41r7l9o0Q8Rk8J52j10K3j28J08J5j15L4J44o5j6J48j37NK6Pk3
6411B9j1j0j9m1J12j32j2J12K8m6M5L4j56omJ1O2k2Q1L1l6m1m8R8j5n9j8L3N9
6440E9p2M8r0J08k3J04j5j35j2l1R6r3N6j19J44p9K33j36K4M4k7q7N1k7J8R1j27
6467CM8j6n4l5J1K9P0j68K08Nj42r3P7J4j0O5M3l8l4J18l3n6O3k6l0m6PrL8j2
$$ plain form
6497 -3 8 -111 6 164 35 -21 54 -9 114 53 140 41 47 66 59 -41 69 -52 -76 2 37 -123 43 22 -16 41 68
6524 68 1 -31 45 -62 16 -196 -47 113 -84 65 -93 -125 -73 52 92 -2 22 -30 -130 -42 87 5 -51 17 128
6549 128 -17 -53 4 -46 -20 -40 51 -27 39 9 -71 -9 23 -129 31 -56 -30 31 57 -15 -117 52 -96 168 33 90
6575 90 78 -37 -25 31 -15 -40 -70 -98 81 -7 28 -31 36 43 -70 -81 48 -53 3 107 124 22 -41 34 42 -141 -4
6602 -4 -121 50 69 -85 47 -134 36 -110 -156 -93 15 -40 -40 -56 -65 -60 69 -30 -100 -66 -63 108 69 -17 -116 -10 0
6629 0 -36 -72 104 29 39 -11 5 -24 -34 75 -68 -24 -160 -99 -58 -5 -25 59 57 -6 41 138 -7 -38 47 -57 -3 -42
6657 -42 -26 36 -92 109 -10 -45 17 -168 5 40 -18 122 7 -29 -29 85 28 0 -80 -23 13 -33 180 52 -81
6682 -81 -55 118 -70 -85 -59 42 -113 -37 121 2 -35 -32 76 25 92 73 -114 39 74 -84 30 35 52 77 118 69
$$ packed form
6497cJ1j19J17J58j29n6P5o3J23o1Q7r9OJ9pj00J10j21k4P8L5j60J66k1l8N7K7
6524F8o7l2P6j07P8k12J49J60j97J49j58l2N2J25M0r4K4n2j00Q8J29q2n6O8J11
6549A28j45l6N7n0K6k0R1p8O6l0q0O2L2j52J60q7K6O1K6p2j02J69j48K64j35N7
6575I0j2j15J2N6m6k5l0k8J79q8L5n9O7Pj13j1J29j01N6J04J7j02o3P5Qj83J37
6602dj17J71J9j54J32j81J70j46m6O3J08n5%j6rNJ29r9p0L4LJ71l9q6r9J06J0
6629@l6l6J76p5J0n0J6k9j0J09j43M4j36O1M1N3k0Q4ko3M7R7j45l1Q5j04N4l9
6657d2J6O2j28K01j19l5O2j85J73L5n8J40j15l6%J14n7k8q0N7L6m6K13j28j33
6682h1K6J73j88j5K6J01j55P6J58j19l7LJ08n1O7j9j87J53L5j58J14NJ7K5M1m9
$$ plain form
6708 69 47 -10 61 81 -45 150 35 93 39 -80 0 -55 30 44 -158 -75 116 -88 -2 53 -6 -93 102 40 -15 71
6734 71 3 -42 25 39 106 2 -23 74 -53 11 8 -13 24 -28 -43 -58 -141 -84 7 10 5 34 45 -40 5 -25 33 86 16 21 -79
6765 -79 -17 -26 70 -3 -10 14 -33 18 -91 -16 -6 -65 -25 61 -50 -23 -36 96 -96 -39 145 26 73 -51 -11 46 53 124
6793 124 -166 72 61 23 -24 26 7 -147 -73 -89 43 -94 66 -35 -124 57 -12 -49 16 76 -152 -84 88 -97
6817 -97 61 107 -33 -91 24 -80 1 -8 5 -20 -68 2 -22 -55 -118 26 -15 34 19 2 -5 138 61 3 -13 78 100 55
6845 55 -31 51 -66 41 46 -26 68 16 9 12 -103 -35 69 16 39 42 96 6 87 -199 20 106 125 -26 30 -75 -8 92
6873 92 17 51 -55 90 -101 -80 107 64 -36 -40 36 -148 86 72 38 -26 42 27 -137 127 159 -20 48 -68 86
6898 86 44 -56 59 13 80 28 -56 41 58 9 -97 12 66 -56 28 18 -2 -72 51 -34 -19 119 58 74 19 -20 62
$$ packed form
6708F9k2n7P1K0j26J95j15N8n4j19Q0n5Q5J4k02Q3J91k04Q6N5n9q7J95o2n5Q6
6734G1o8m5O7J4O7j04k5R7j27O4lk1L7n2j5j5q3N7R1LnK9J1q5M5l0N8N3p0Nj00
6765g9O2rR6p3pK4m7N1j09P5J0n9M0Q6j11K7j3J32j92N7J84j19M7j24M0N7PP1
6793A24k90K38j1l8m7N0j9j54P4j6J32j37J60j01q9J81o9l7O5O0k28O8J72j85
6817i7J58M6j40n8J15j04Q1rJ3k5m8P0k4l3o3J44m1M9j5j7pJ43p7n8j6R1K2m5
6845E5q6Q2j17J07Np2R4n2pLj15O8J04n3K3LN4r0Q1k86K19Q6J9j51N6j05O7J00
6873I2p5L4j06J45j91K1J87m3j00mP6j84K34j4l4o4O8j5j64K64L2j79O8j16J54
6898H6m2j00J15m6O7n2q4R7J7m9j06J09N4j22Q4j0k0p0J23q5J5J38o1J6n5l9Q2
$$ plain form
6925 62 -6 -24 -45 108 -126 -13 32 -26 -61 17 101 -89 -40 -86 -70 -6 -36 -56 7 80 11 -103 77 42 -13 121 43
6952 43 49 5 -67 53 34 14 60 -55 -39 50 -5 35 35 -104 -53 54 49 -34 -79 101 -29 -18 35 40 -44 -21 -46 19 77
6981 77 76 22 -29 -74 19 -33 70 69 -179 -65 9 53 73 21 93 12 -84 -37 61 -43 126 6 14 9 6 -27 -103 77 -65
7010 -65 -16 27 34 -63 -54 48 -125 -70 6 38 -112 7 70 4 -69 71 -53 -12 43 -33 -53 19 -23 -25 -28 100 129 4
7038 4 57 5 128 -67 -116 -9 99 -29 -13 -95 7 -106 -33 -124 2 115 134 -32 17 -40 -47 -7 -114 63 -16
7063 -16 -20 133 59 122 -48 -23 -70 52 -54 15 100 -98 27 -91 -75 -189 9 104 -94 133 156 -37 37 50 163
7088 163 34 -9 115 2 76 -1 85 -10 81 21 -94 -22 -85 -4 -116 8 -35 24 -57 23 98 94 -16 70 66 -12 45
7115 45 -43 66 25 -19 116 123 83 -14 76 126 -63 -4 -76 -53 61 6 53 -75 18 34 102 -52 138 27 -18 -55 31
$$ packed form
6925F2o8j8k1J53k34J13M5n8l5P8Q4j90M9m6J6O4l0k0O3P3o9j14J80l5n5J34p8
6952D3Om4p2J20j9k0M6j15J6Q9n5M0%j39N1J07nq3m5J80j30J1N3Nq4K3k5O5N8
6981G7jn4n1m5R3n2J03jk48J14P4M4K0n2P2q1r6M7R8j04J69j20Qnll3p6J80j42
7010f5M9M3Pr7RJ02j73N5P6L2j50J19O3o6p3J40j24M1N5p6k0P2m2klJ28K9j25
7038DN3n2J23j95m9J07J08j28J6q2J02j13P3r1J26J13J9j66M9n7pM0j07J77p9
7063a6mJ53p4O3j70K5m7J22j06O9Q5j98J25j18J6j14J98R5j98K27K3j93P4J3J13
7088A63j29m3J24j13P4p7Q6r5R1o0j15P2o3Q1j12J24m3N9q1Q0P5mj10Q6mp8N7
7115D5q8J09m1m4J35Pm0r7R0N0j89N9p2K3J14n5M7j28R3J6O8j54J90j11m5l7Q6
$$ plain form
7142 31 -6 36 131 49 43 114 5 14 79 -38 -13 -26 -10 54 -66 92 5 25 -59 53 -143 189 91 -54 -53 49 57 34
7170 34 -59 127 70 -38 -92 -49 37 -45 -115 -52 -63 -138 50 1 -8 -64 82 -26 -36 -58 -46 -26 0 -37 -44 99 -105 -20
7198 -20 -4 9 -19 70 -71 -7 38 -75 -110 -50 10 -14 -36 -71 68 -39 -42 11 19 -153 75 53 -44 56 47 86 123 -30
7226 -30 63 63 -44 108 47 39 65 -121 -11 -73 27 -34 -89 -29 -12 -108 13 -24 -16 169 37 -111 49 45 80 -14 -28
7253 -28 38 1 51 130 12 -59 51 -12 62 8 6 -42 114 -35 -111 -11 62 -20 -168 22 -51 -40 8 -5 2 4 38 -33
7281 -33 88 -38 158 -13 -37 -71 -87 30 10 -2 29 20 -47 -2 -92 -4 92 20 8 68 38 -73 28 -90 -4 -62 -37
7308 -37 3 33 94 174 -40 37 92 -134 -19 56 -54 -51 -11 -53 -138 31 0 -37 20 -88 -48 -85 -33 -65 4 101 -49
7335 -49 -36 -64 125 -78 -31 67 -2 -6 5 106 79 -99 13 22 -59 28 -137 -66 -82 46 -101 -48 106 53 -63 107
$$ packed form
7142C1l7M2R5q2oP1j09RO5j17K5j3J6O4j20J58q7K0q4J12j96L32r8j45JJ02Qk3
7170C4r3J86n7j08n4M3Q6q2p0O3j1p5J88m9rn6J46j08j0k2J2K0K6l7pJ43k04Q5
7198b0J6J3k8Q9j41O4M5j13l5O0O0k4k2l5J39j07lN3Qj72K28k2r7J00rL9L7j53
7226c0R3%j07J52o1qK6j86J10o2J00o1n5O0J7r6J21l7QJ85j32j48J60mL5r4j4
7253b8O6l7N0P9j18p1J10o3P4n4km8J56j49p6J00P3q2j48J90p3J1M8j3PKL4p1
7281c3J21j26J96j71k4l4j6J17k0j2L1ro7M5r0Q8R6p2j2O0l0j11J01j18Q6n8K5
7308c7M0L0O1Q0k14P7N5k26J15P5j10LM0m2q5J69l1l7N7j08M0l7N2l2O9R7j50
7335d9J3k8J89k03M7R8o9mJ1J01k7j78J12Rq1Q7j65P1j6J28j47N3J54n3j16J70
$$ plain form
7361 107 37 -26 42 96 83 -115 74 102 6 -42 -41 59 -8 -20 66 -20 -82 28 -140 -3 -23 -53 -15 57 41 -36 -86
7388 -86 47 -73 -70 30 89 149 59 55 67 -75 -64 32 67 -2 -91 89 -66 -42 -74 22 102 -14 -49 -69 73 11 31
7415 31 65 50 33 71 -15 55 205 75 -40 -11 -35 -6 -50 38 -72 -93 -61 2 65 52 -93 -42 0 -25 -18 -32 -53 -8
7443 -8 -31 20 111 17 -69 86 82 -157 -13 114 49 7 63 28 -84 -112 17 -13 -13 -9 52 -91 -83 8 91 -25 52 31 -27
7472 -27 94 36 -30 8 42 -76 6 2 90 -185 -151 -9 13 -179 -7 -150 -32 25 6 -42 -106 13 -51 10 47 58
7498 58 53 -131 43 -66 -43 84 -29 -18 27 -51 -109 48 -9 32 55 113 -23 -106 131 85 65 -11 19 -30 93 97 61
7525 61 -39 20 -23 -98 -72 142 -14 -120 81 -74 -161 -10 35 -55 111 15 12 -25 -17 -2 -35 -78 74 -96 -14 120
7551 120 66 1 -48 30 78 -82 32 -2 -42 64 89 -16 28 91 -86 66 -31 2 -53 121 -2 -16 51 -39 -36 85
$$ packed form
7361A07p0o3O8N4j3j98J89K8r6m8JJ00o7j2Q6q6o2J10j68J37k0l0L8P2j6p7n0
7388h6J33j20LJ00N9O0r0mJ2j42J1R6L5o9q9J80j55K4l2R6Q0j16l5k0J42o2K0
7415C1L4j5j7L8q6P0J50j30j15K9k4K9m4Q8j10k1L2O3O3j3j45N1M2k5Pj4k1M5
7443hk3N1R1r4q6J55mk39J44J27o5m2N6l5j12k8J29l0%MO1j43QR1Q3j16P7k1n8
7472b7J21n8o6L8L4j18Q2mQ8k75L4J42K2j92J72j43J18N7j9m8o4J19o4O1L7J1
7498E8nj84J74j09K3J27j13J1M5p8n8J57n7M1K3N8j36q3K37m6k0p6L0m9J23Ml6
7525F1j00N9m3p5K6K14j56j06K01j55q7J51M5r0J66r6ll7QJ5l3m3J52j70Q2J34
7551A20n4o5m9P8M8j60J14l4m0J06K5j05M4O3j77J52r7L3n5J74j23j4O7r0LJ21
$$ plain form
7577 85 40 -144 114 -12 24 31 -78 -29 103 -52 148 -41 -164 -17 92 -89 -17 144 -6 -19 5 -10 -73 -62
7601 -62 -1 0 104 46 157 -5 16 109 -65 -60 -30 20 -79 22 -2 -57 -29 -52 110 -53 28 -85 18 -96 -26 -19 -61
7628 -61 32 -3 -6 100 181 -10 -151 -21 31 23 84 -30 -42 49 59 -19 60 -27 -23 -46 69 72 -115 8 0 -127 -127 -71 -41
7657 -41 57 83 -114 145 49 28 -33 -39 71 70 8 -61 -23 -8 -102 -18 -13 -60 55 -43 -49 4 -25 -52 -20 -121 45 59 -47
7686 -47 13 89 -100 125 92 -27 -9 88 -163 54 46 -8 -24 -43 -65 -199 -50 89 -119 -16 -34 -46 -57 29 -109
7711 -109 -86 73 111 42 64 11 70 -23 120 114 80 91 54 115 -14 111 119 -12 -112 -2 8 -100 -84 64 -105 73
7737 73 125 -117 -41 -3 30 -13 -92 111 13 20 73 79 -110 40 108 -45 27 38 64 -42 -28 -75 41 72 71 -98 -45 15
7765 15 10 -57 76 19 49 -86 123 -74 103 93 -32 142 66 31 -39 52 85 45 35 69 -5 -2 18 14 65 -105 22
$$ packed form
7577H5m5j84K58j26L6Pj09M9J32j55K00j89j23J47J09j81P2J61j50j3K4j5o3J1
7601f2O1JJ04n8J11j62K1R3j74NL0N0r9J01k4n5K8k3J62j63Q1j13J03j14P0Pm2
7628f1R3l5lJ06Q1j91j41J30N2qO1j14j2R1J0p8P9q7Mk3J15Lj87J23qj27%N6L0
7657d1R8K6j97K59r6k1o1oJ10jo2o9L8J5r4Q4Nm7J15r8oN3k9k7L2j01J66J4j06
7686d7O0P6j89K25l3j19J8R7k51K17qn4j6j9k2j34J49J39k08J03j8j2j1Q6j38
7711a09K3J59L8o9K2n3N9r3J43ol4J1l7O1j29J25Qj31j00J10J0j08J6J48j69J78
7737G3N2k42P6L8L3m3p9K03r8PN3Oj89J50O8j53P2J1K6j06J4m7J16L1jj69N3O0
7765A5no7J33n7L0j35K09j97J77j0j25J74p6l5p0R1L3m0j0L4p4LK0mN1j70J27
$$ plain form
7792 22 -79 -92 62 -23 -19 23 -6 -25 56 -43 -43 -35 37 110 -32 42 149 -19 28 23 6 -63 -120 23 -106 -51 -40 103
7820 103 33 9 139 -137 52 83 69 -48 -46 -9 53 -6 73 -156 -4 6 -63 -47 38 -22 13 -147 54 -98 -134 27
7846 27 -21 -24 -29 5 -78 -41 114 -113 21 74 -55 -19 -59 -21 -82 -20 -49 -40 -24 -50 -16 -61 -65 -32 55 -24 101 49 29 -57
7876 -57 12 -26 0 82 39 -69 -17 -10 -31 -35 134 60 -40 82 -63 -6 -17 33 -40 -9 105 -56 -20 -36 -103 -93 -27 29
7904 29 -55 -2 52 74 -98 33 -66 -15 30 100 -6 9 -81 130 -32 -89 48 -78 -26 -39 76 -71 -28 16 -14 -40
7930 -40 55 -19 -41 231 -58 36 -11 99 -29 -56 47 138 -62 77 -6 10 117 -22 -67 -138 -142 64 -164 37 -37
7955 -37 -24 55 -77 -143 -11 48 -73 -95 -20 38 -125 -12 37 -77 -46 -49 84 -107 -109 -64 101 -49 28 -41 -91 6
7981 6 -63 43 -34 34 -59 33 8 40 -202 38 -122 128 39 115 -11 -113 35 11 105 -104 138 52 -2 -6 -180 22
$$ packed form
7792B2j01j3J54q5MM2k9j9Q1r9%QP2P3j42P4J07j68M7nj7o9n7J43j29N5J1J43
7820A03p0k4J30k76J89L1j4j17KL7O2n9P9k29J52J0o9J6Q5o0L5j60K01j52l6J61
7846B7m8lnL4q3L7J55k27J34N3j29L6m0L8o1O2k9RJ6k6L4m5mL3Q7p9J25n2k0q6
7876e7O9l8K6Q2m3j08N2Pk1mJ69p4j00J22j45N7j1N0p3L1J14j61L6j6o7J0O6N6
7904B9q4N3N4K2j72J31r9N1M5P0j06J5r0K11j62n7J37j26N2j3J15j47M3M4l0k6
7930d0R5p4k2K72k89R4m7J10j28k7J03R1k00J39q3J6J07j39m5p1mK06k28K01p4
7955c7J3P9j32o6J32N9j21k2P5N8j63J13M9j14L1lJ33j91kM5J65j50P7o9n0R7
7981Fo9J06p7O8r3R2k5L2k42K40j60K50q9P6j26j02J48k4R4k09K42q6n4mj74K02
$$ plain form
8007 22 -3 62 -107 6 -8 -3 -25 91 -3 -73 146 70 76 9 -17 83 16 199 128 98 67 20 -23 -132 -35 -5 104
8034 104 -84 54 43 -89 4 -8 -100 92 60 2 45 10 13 -71 47 -7 -145 8 38 27 -157 14 -1 25 106 -24
8060 -24 -112 -50 -67 -58 -43 -34 -61 -79 123 -5 -31 92 72 -70 -22 34 133 122 71 137 -31 46 -9 -14 -35 13 -2 -42 -93
8089 -93 21 -32 -31 127 120 3 -5 -95 25 -163 59 78 -176 -40 48 -49 -33 -5 -84 55 55 73 -98 -67 59 -74
8115 -74 -16 9 111 -159 -28 43 -73 19 -30 -85 48 20 25 -135 28 -7 2 -45 17 -27 -23 12 -85 17 -15 44 77 -37
8143 -37 39 100 79 69 157 -134 56 -34 -33 -27 -15 -64 -3 52 -88 -50 12 -16 -12 -56 -32 12 -69 -15 99 -4 -1 -54 46
8172 46 -102 8 82 162 -91 0 -9 -32 -27 -1 5 82 97 -44 -74 -55 37 -50 6
$$ packed form
8007B2k5O5j69J13j4Nk2J16r4p0K19p6Oo7k6J00o7J83p1l0l1m7m3j09R7L0J09
8034A04j88J38j1j32R3j2r2J92l2n8M3l5Lq4J18n4j38J53L0j1j84J71j5K6Q1j30
8060b4q8O2j7RJ5Rk7j8K02j28k6J23k0j42M8N6R9j1n1O6j68P7n5nk1M8j5m0n1
8089i3J14n3JJ58pj17qr0J20j88K22J9k54J36Q8r7J6K8p9J39%J8j71L1J26j33
8115g4N8K5J02k70J31P1j16R2m9n5J33k8Nj60J63l5Rm7O2m4ML5r7J02l2N9L3j14
8143c7P6O1k1j0Q8k91J90r0JOJ2m9O1N5j40L8O2k8Mm4K4M4q1N4J14j03Ln3J00
8172D6j48J10P4Q0k53R1rk3NK6OP7J5j41l0J9R2q7N6
8191F
$$ Imaginary data points
##PAGE= N=2
##DATA TABLE= (X++(I..I)), XYDATA
$$ plain form
0 0 0 0 0 0 0 0 0 0 0 0 0 0 0 0 0 0 0 -32 32 -32 32 -32 32 -64 64 -64 96 -96 121 -128 160 -161 192 -224 256
35 256 -284 319 -352 385 -427 481 -535 586 -647 723 -798 877 -967 1067 -1174 1296 -1426
52 -1426 1572 -1736 1919 -2131 2365 -2641 2961 -3345 3805 -4376 5108 -6084 7440 -9472 12878
67 12878 -19572 37862 -193791 -630127 -224729 325370 436978 20601 -295615 -254269 6845
78 6845 140856 71141 -11284 21814 -49249 -191577 -155469 71393 209261 102562 -166035
89 -166035 -293527 -118861 154320 179077 -40487 -197390 -126964 3279 44714 20483 -7743
100 -7743 -22288 -38405 -83741 -79426 44512 137528 27115 -143616 -129016 36343 120121 36164
112 36164 -88042 -94356 12930 67306 -14135 -75829 3441 72584 -10854 -108809 -51280 84527
$$ packed form
0@%%%%%%%%%%%%%%%%%l2O4o4O4o4O4r6J28j28J60j92K17k49K88l21L53m16M80
35B56n40O03o71P37q12R08j016J121j233J370j521J675j844K034k241K470k722
52a426K998l308L655m050M496n006N602o306P150q181R484j1192J3524j6912K2350
67A2878l2450N7434k31653m36336M05398N50099J11608m16377l16216M1346K61114
78F845J34011o9715q2425L3098p1063j42328L6108K26862J37868j06699k68597
89a66035j27492J74666K73181K4757k19564j56903P0426J30243M1435k4231k8226
100g743j4545j6117m5336M315J23938R3016j10413j70731J4600J65359Q3778q3957
112C6164j24206o314J07286N4376q1441o1694P9270O9143q3438r7955N7529J35807
$$ plain form
124 84527 111805 -12915 -136206 -77159 112489 166137 -4183 -145410 -59262 109465 129561
135 129561 2575 -90663 -29029 98650 95834 -44954 -98064 29735 135264 56440 -83503
146 -83503 -93717 27991 125895 77487 -52806 -84069 15474 82195 37666 -6359 17396 34369
158 34369 1493 -25379 5372 70830 87667 5585 -82967 -44610 72825 100563 13793 -57026
170 -57026 -39242 19229 44296 12927 -22662 -2456 31529 1783 -48671 -23817 45079 54992
182 54992 -1861 -48328 -33462 22661 47373 6218 -30967 -1801 29423 -7605 -49890 -16413
194 -16413 48108 50028 -22331 -89212 -61838 39366 80358 755 -85438 -66212 7367 35635
206 35635 8435 -24295 -27267 -7718 -6469 -27445 -16089 31767 35344 -26851 -67007 -30204 32165
$$ packed form
124H4527K7278j24720j23291N9047J89648N3648j70320j41227Q6148J68727K0096
135A29561j26986r3238O1634J27679k816j40788n3110J27799J05529p8824j39943
146h3503j0214J21708R7904m8408j30293l1263R9543O6721m4529m4025K3755J6973
158C4369l2876k6872L0751O5458J6837q2082q8552L8357J17435K7738q6770p0819
170e7026J7784N8471K5067l1369l5589K0206L3985k9746n0454K4854O8896R913
182E4992n6853m6467J4866N6123K4712m1155l7185K9166L1224l7028m2285L3477
194a6413O4521J920p2359o6881K7374J01204M0992p9603q6193J9226P3579K8268
206C5635k7200l2730k972J9549J249k0976J1356M7856L577o2195m0156L6803O2369
$$ plain form
219 32165 49396 4390 -54783 -55360 1233 31488 3885 -21798 -15928 -14459 -24655 -18278 6178
232 6178 22559 9221 -33763 -56488 -9723 55270 45322 -24909 -57907 -20842 33686 49185
244 49185 12594 -33317 -30344 9116 23546 8790 4736 5104 -12188 -22823 -4522 22361 29815
257 29815 6827 -32364 -37047 13199 52851 24820 -23672 -26699 5582 30233 28095 4760 -9527
270 -9527 6873 21661 6337 -4906 15000 26938 7183 -12486 -8499 9038 24394 17392 -12134
283 -12134 -21459 6878 23740 4650 -9471 1142 10075 7400 1865 -3078 4068 20605 15424
296 15424 -10926 -10856 17269 23225 1872 -9684 -3588 6833 13528 3244 -16654 -11183 13177
309 13177 10520 -14609 -17313 -829 5290 1122 -5663 -13075 -6555 9216 4317 -13024 -6454 10568
$$ packed form
219C2165J7231m5006n9173n77N6593L0255k7603k5683N870J469j0196O377K4456
232F178J6381j3338m2984k2725M6765O4993r948p0231l2998L7065N4528J5499
244D9185l6591m5911K973L9460J4430j4756m054L68j7292j0635J8301K6883P454
257B9815k2988l9191m683N0246L9652k8031m8492l027L2281K4651k138k3335j4287
270i527J6400J4788j5324j1243J9906J1938j9755j9669L987J7537J5356p002k9526
283a2134r325K8337J6862j9090j4121J0613Q933k675n535m943P146J6537n181
296A5424k6350P0K8125N956k1353j1556O096J0421O695j0284j9898N471K4360
309A3177k657k5129k704J6484O119m168o785p412O520J5771m899j7341O570J7022
$$ plain form
323 10568 3941 -9784 -6238 2378 4745 3418 -7616 -17013 -2717 13351 -1949 -21871 -12543
336 -12543 3222 113 -8424 -13343 -14168 -2553 7426 -6523 -20248 -6047 8989 426 -8165 -3665
350 -3665 -1853 -691 3894 -736 -6754 2541 6782 -8459 -12117 4630 9052 -4499 -11368 -9497
364 -9497 -4463 6889 7655 -11554 -18201 1192 11340 -263 -4784 143 -132 1786 6694 2352
378 2352 583 9804 8039 -6160 -2424 13330 11229 -855 -2835 -1495 723 9224 7590 -7208
392 -7208 -7655 6186 6128 -3052 111 4934 949 1348 4516 1083 3692 12493 6232 -5606 2121 14287
408 14287 9367 1737 1845 800 2058 9342 6012 -5139 -2469 5192 -397 -4555 2843 3327 -4245
423 -4245 -3360 49 -1499 2674 7327 -1665 -7932 2522 9238 2773 92 2061 -1055 256 6294
$$ packed form
323A0568o627j3725L546Q616K367j327j1034r397J4296J6068j5300j9922R328
336a2543J5765l109q537m919q25J1615R979j3949j3725J4201J5036q563q591M500
350c665J812J162M585m630o018R295M241j5241l658J6747M422j3551o869J871
364i497N034J1352P66j9209o647J9393J0148j1603m521M927k75J918M908m342
378B352j769R221j765j4199L736J5754k101j2084j980J340K218Q501j634j4798
392g208m47J3841n8r180L163M823l985L99L168l433K609Q801o261j1838P727J2166
408A4287m920p630J08j045J258P284l330j1151K670P661n589m158P398M84p572
423d245Q85L409j548M173M653q992o267J0454O716o465k681J969l116J311O038
$$ plain form
438 6294 2000 -4960 195 3277 -5174 -6064 1292 -369 -5823 -4477 -4674 -6624 -567 1863 -7303 -9071
454 -9071 409 2043 -3013 -979 618 -3886 -1817 3665 695 -1649 1965 -1043 -7352 -2270 4402
469 4402 293 -4313 -4547 -7879 -7579 1794 3943 -5091 -8676 -5653 -5517 -1537 6622 4240 -5947 -7376
485 -7376 -2979 1138 8854 11119 -1465 -11313 -3575 6535 7249 5630 1232 -7255 -7685 709 3523
500 3523 2205 3612 -1182 -10897 -9038 2801 8185 6101 1809 -6955 -10522 2283 14527 10221
514 10221 657 -2879 -3726 1112 10826 10678 1564 -1446 285 -2409 -798 7106 6863 -1330 -4659 -4842
530 -4842 -4352 3225 9383 2226 -6833 -5174 -98 3574 8443 6824 -3397 -5490 4063 7695 3896
545 3896 2876 1758 -864 1563 3707 -893 -1996 3919 2183 -5901 -5502 -36 1348 1500 -472 -8482
$$ packed form
438F294m294o960N155L082q451q90P356j661n454J346j97j950O057K430r166j768
454i071R480J634n056K034J597m504K069N482k970k344L614l008o309N082O672
469D402m109m606k34l332L00R373K149r034l585L023J36L980Q159k382j0187j429
485g376M397M117P716K265j2584r848P738J0110P14j619m398q487m30Q394K814
500C523j318J407m794r715J859J1839N384k084m292q764l567J2805J2244m306
514A0221r564l536q47M838R714j48r114l010J731k694J611P904k43q193l329j83
530d842M90P577O158p157r059J659N076L672M869j619j0221k093R553L632l799
545C896j020j118k622K427K144m600j103N915j736q084L99N466J384J52j972q010
$$ plain form
561 -8482 -9083 3465 9835 874 -7195 -6762 -1598 6850 10670 490 -9689 -3755 5381 3862 1584
576 1584 2395 -1900 -6071 -3924 -2442 -1128 5095 4052 -9642 -15962 -5100 6091 8096 3542 -8828
591 -8828 -17737 -6594 12013 13765 2266 -6355 -10356 -7057 6263 13928 6559 -2799 -6880 -10642
605 -10642 -6151 9380 14976 1913 -12045 -15493 -10398 4677 17770 9247 -12370 -19438 -8870
618 -8870 5650 16476 13281 -6184 -17790 -6159 9775 12306 8647 1892 -7935 -8745 1727 8171
632 8171 7823 6523 -1503 -13224 -9934 5996 11909 5147 -3850 -11793 -11422 4102 15932 7205 -6864
647 -6864 -8440 -3266 3406 10851 8511 -2117 -4185 1560 1744 2161 8418 6478 -4911 -8035 -1357
662 -1357 4228 7709 5335 -6949 -13958 -2514 9224 6339 -876 -5352 -8510 -3264 8665 9523
$$ packed form
561h482o01J2548O370q961q069M33N164Q448L820j0180j0179N934R136j519k278
576A584Q11m295m171K147J482J314O223j043j3694o320J0862J1191K005m554j2370
591h828q909J1143J8607J752j1499q621m001L299J3320P665p369r358m081l762
605a0642M491J5531N596j3063j3958l448N095J5075J3093q523k1617p068J0568
618h870J4520J0826l195j9465j1606J1631J5934K531l659o755r827q10J0472O444
632H171l48j300q026j1721L290J5930N913o762q997p943L71J5524J1830q727j4069
647f864j576N174O672P445k340j0628k068N745J84M17O257j940j1389l124O678
662a357N585L481k374j2284p009J1444J1738k885p215m476l158N246J1929Q58
$$ plain form
676 9523 -682 -4425 -2136 -1901 1936 8490 6402 -583 -2479 -4108 -4969 3504 11146 2989 -9471
691 -9471 -10126 -4330 2581 9159 5209 -9477 -14620 -4493 4904 7076 5810 -2263 -10714 -5941 5349
706 5349 7048 3918 2424 -3090 -8220 -2399 6922 7508 3306 -2641 -10577 -9744 3432 10129 2099
721 2099 -6188 -7893 -6950 -607 6938 3304 -5344 -4352 -130 -850 280 4495 3529 150 -488 -2586
737 -2586 -3666 4405 10191 2357 -6441 -5292 -664 2499 5035 1044 -7088 -6318 1006 2400 144
752 144 560 -983 -3795 -1049 1897 79 961 5217 2319 -3238 -1225 3347 4259 3951 1611 -3763
768 -3763 -3550 3708 5405 561 -1656 -2097 -4009 -1484 3691 2093 -2962 -2985 -1742 -1131 2363 4446
784 4446 40 -3318 -886 960 2177 6019 5078 -2616 -4724 698 4573 4616 2986 -2785 -6942 -1988
$$ packed form
676I523j0205l743K289K35L837O554k088o985j896j629q61Q473P642q157j2460
691i471o55N796O911O578l950j4686n143J0127R397K172j266q073q451M773J1290
706E349J699l130j494n514n130N821R321N86m202n947p936Q33J3176O697q030
721B099q287j705R43O343P545l634q648R92M222p20J130M215r66l379o38k098
737b586j080Q071N786p834q798J149M628L163K536l991q132P70P324J394k256
752A44M16j543k812K746K946j818Q82M256k898n557K013M572R12l08k340n374
768c763K13P258J697m844k217m41j912K525N175j598n055k3J243O11L494K083
784D446m406l358K432J846J217L842r41p694k108N422L875M3j630n771m157M954
$$ plain form
800 -1988 4865 3491 -1144 -3324 -5440 -4032 2560 4302 -1026 -3296 -1199 -1140 -405 3187 3152 39
816 39 -403 -679 -1680 1819 6164 2820 -3450 -3228 -534 262 2337 2001 -3175 -5315 -1721 -224 -825
833 -825 785 182 -3981 -3785 320 1220 788 2059 -132 -3291 -127 3998 2363 55 946 -397 -1325
850 -1325 1470 2060 -979 -728 446 -2406 -3365 573 1197 -2004 -1975 -1197 -2660 -872 2576 688 -1943
867 -1943 -71 734 -601 1852 4135 827 -1544 847 1313 663 2871 2086 -2858 -2762 1747 1391 -682
884 -682 -349 -1768 -3587 -280 2419 -936 -2302 527 -59 -1556 1731 3091 -220 -434 1779 809
900 809 836 3538 1688 -2046 312 2978 275 -1259 756 -429 -1972 495 423 -2912 -1507 1330
916 1330 -1032 -2587 440 796 -1305 209 1497 -837 419 3427 976 -1563 1474 2791 17
$$ packed form
800a988O853j374m635k180k116J408O592J742n328k270K097N9P35L592l5l113
816C9m42k76j001L499M345l344o270K22K694P96K075l36n176k140L594J497o01
833h25J610o03m163J96M105R00m32J271k191l159L164M125j635k308Q91j343r28
850a325K795N90l039K51J174k852r59L938O24l201K9P78j463J788L448j888k631
867a943J872Q05j335K453K283l308k371K391M66o50K208p85m944R6M509l56k073
884f82L33j419j819L307K699l355j366K829n86j497L287J360l311k14K213r70
900H09K7K702j850l734K358K666k703j534K015j185j543K467p2l335J405K837
916A330k362j555L027L56k101J514J288k334J256L008k451k539L037J317k774
$$ plain form
931 17 264 1585 -948 -1529 1591 608 -2575 -855 328 -2696 -2062 1257 -548 -2945 -564 178 -1695
948 -1695 578 2401 -933 -1922 1970 2173 -131 1186 1615 -1252 -315 2838 652 -1778 429 106
964 106 -2586 -630 1457 -1576 -3056 -267 -568 -2292 205 778 -2199 -1183 1964 240 -995 1788
980 1788 1812 -895 689 2534 7 -265 2397 525 -2100 456 1461 -1438 -1228 681 -1481 -2534
996 -2534 457 269 -2409 -789 857 -1504 -1105 2075 952 -1468 762 1981 80 1132 2818 171
1012 171 -1088 1722 1716 -692 502 1222 -1855 -1734 1227 136 -1835 -388 -520 -2780 -671 2013 -318
1029 -318 -1729 374 358 -786 1548 2716 -46 -384 1726 551 -52 2617 2101 -1487 -1450 659 -135
1046 -135 -187 1196 -894 -3581 -1110 792 -880 -425 723 -1692 -2666 528 2024 578 611 570 -1306
$$ packed form
931A7K47J321k533n81L120r83l183J720J183l024O34L319j805k397K381P42j873
948a695K273J823l334r89L892K03k304J317M29k867R37L153k186k430K207l23
964A06k692J956K087l033j480K789l01j724K497N73k977J016L147j724j235K783
980A788K4k707J584J845k527k72K662j872k625K556J005k899K10J909k162j053
996b534K991j88k678J620J646k361L99L180j123k420K230J219j901J052J686k647
1012A71j259K810ok408J194P20l077J21K961j091j971J447j32k260K109K684k331
1029c18j411K103j6j144K334J168k762l38K110j175o03K669n16l588L7K109p94
1046a35n2J383k090k687K471J902j672M55J148k415r74L194J496j446L3m1j876
$$ plain form
1063 -1306 -224 3182 2256 -551 78 780 -786 60 1591 -184 -1344 -45 -1133 -2613 -199 1554
1079 1554 -983 -2706 -1173 -666 -278 1742 437 -2279 -475 2371 843 -454 1481 1251 -310 624
1095 624 939 -348 621 1934 -899 -2737 -212 1141 -263 -896 -1224 -2482 -1032 1740 361 -2138
1111 -2138 -962 193 -423 636 2088 370 -576 814 844 171 2033 2123 -689 -1357 555 337 -298
1128 -298 1211 463 -2551 -2473 -260 322 900 946 -2264 -4099 -226 3247 1839 -356 -785 -1248 298
1145 298 3021 2187 -290 395 1590 -958 -1480 1626 2592 852 -907 -3180 -3672 1461 4590 118
1161 118 -5001 -3353 280 1588 1928 -96 -2829 -1087 2070 739 -542 1935 2692 -414 -1363 148
1177 148 708 1963 2955 -761 -4067 -1121 2301 1276 -158 -1223 -3330 -2399 1654 1918 -1357 -1592
$$ packed form
1063a306J082L406r26k807O29P02j566Q46J531j775j160J299j088j480K414J753
1079A554k537j723J533N07L88K020j305k716J804K846j528j297J935k30j561R34
1095F24L15j287R69J313k833j838K525J353j404o33l28j258J450K772j379k499
1111b138J176J155o16J059J452j718r46J390L0o73J862R0k812o68J912k18o35
1128b98J509p48l014P8K213N82N78M6l210j835L873L473j408k195m29m63J546
1145B98K723q34k477O85J195k548n22L106R66j740j759k273m92N133L129m472
1161A18n119J648L633J308L40k024k733J742L157j331j281K477P57l106r49J511
1177A48N60J255R92l716l306K946L422j025j434j065k107R31M053K64l275k35
$$ plain form
1193 -1592 -436 -884 -19 2232 752 -1280 370 1572 9 493 1987 468 -421 600 -642 -1747
1209 -1747 1587 2929 -1511 -4350 -1699 1136 1839 713 -2918 -4922 -87 4477 1353 -2945 -1385
1224 -1385 898 947 1253 549 -792 1250 3023 -383 -3120 687 3829 1309 -1512 -2743 -2301 1230
1240 1230 4152 67 -5284 -2937 1464 1183 -247 -219 -1359 -1113 1407 801 -968 1019 2773 -193
1256 -193 -1750 857 1680 855 1745 962 -2278 -1878 1210 959 -39 147 -1505 -3236 -277 2671 -36
1273 -36 -2317 -940 -479 -419 1495 1218 -1335 -15 2686 261 -1711 668 2517 1498 444 -943
1289 -943 -2277 799 4312 371 -4475 -2612 1610 1326 -254 -1323 -2239 -509 1978 -204 -2935 -68
1305 -68 2744 584 -1422 129 1129 1393 1998 179 -2612 93 3308 1339 -1497 -942 -240 -330 693
$$ packed form
1193a592J156m48Q65K251j480k032J650J202j563M84J494j519q89J021j242j105
1209a747L334J342m440k839K651K835P03j126l631k004M835M564l124m298J560
1224a385K283M9L06p04j341K042J773l406k737L807L142k520k821j231M42L531
1240A230K922m085n351K347M401k81j430K8j140K46K520o06j769J987J754k966
1256a93j557K607Q23q25Q90p83l240M00L088k51r98J86j652j731K959K948k707
1273c6k281J377M61O0J914k77k553J320K701k425j972K379J849j019j054j387
1289i43j334L076L513l941m846J863M222k84j580j069r16J730K487k182k731K867
1305f8K812k160k006J551J000K64O05j819k791K705L215j969k836N55P02r0J023
$$ plain form
1322 693 352 -2082 -1541 558 -815 -1805 528 1375 -1099 -1503 -10 407 757 1599 -104 -1196 1199
1339 1199 2085 -238 -279 1652 382 -1572 -486 868 504 447 -637 -2642 -1303 1680 741 -2182 -1448
1356 -1448 242 -85 104 626 -602 -447 1417 674 -1291 468 2670 1259 -581 -401 -176 709 1905
1373 1905 59 -2476 -890 1697 149 -1704 -800 30 -497 -463 -710 -1161 556 1716 -518 -1959 698
1390 698 2089 636 -414 76 52 1009 1748 -60 -1294 554 1390 -732 -1333 300 295 -344 -344 -1204 -1470
1409 -1470 634 1127 -1371 -1657 526 1195 -108 34 223 -12 877 1068 -428 -154 1886 1139 -1064
1426 -1064 -398 938 368 -246 -395 -1086 -775 705 53 -1885 -913 700 -495 -1106 -45 93 111 843
1444 843 226 -1062 498 2237 546 -1081 409 1215 396 154 -99 -775 251 1196 -812 -2031 2
$$ packed form
1322F93l41k434N41K099j373r90K333Q47k474m04J493M17L50Q42j703j092K395
1339A199Q86k323m1J931j270j954J086J354l64n7j084k005J339K983r39k923P34
1356a448J690l27J89N22j228J55J864p43j965J759K202j411j840J80K25Q85J196
1373A905j846k535J586K587j548j853R04Q30n27L4k47m51J717J160k234j441K657
1390F98J391j453j050M90k4R57P39j808j234J848Q36k122o01J633no39%q60k66
1409a470K104M93k498k86K183O69j303J42J89k35Q89J91j496K74K040p47k203
1426a064O66J336n70o14j49o91L11J480o52j938R72J613j195o11J061J38J8P32
1444H43o17j288J560J739j691j627J490Q06q19k42k53o76J026R45k008j219K033
$$ plain form
1461 2 1029 -898 -1503 -347 -236 80 481 -834 -1200 1195 1671 -543 -804 1073 1126 304 585 117 -383
1480 -383 993 1225 -779 -1267 944 689 -1076 -792 -202 -546 -143 182 -1374 -1251 1155 822 -1198 -559
1498 -559 1174 566 78 565 130 155 1469 882 -1124 -86 1763 390 -1064 -124 255 -604 -27 -73
1516 -73 -1302 -705 986 -361 -1749 -42 902 -221 -443 441 -56 326 1553 423 -984 629 1897
1533 1897 -135 -648 689 490 -225 293 -295 -1439 70 852 -1178 -1638 322 325 -958 -613 201 -529
1551 -529 215 977 -330 -761 1294 1438 -532 -242 914 487 99 689 -208 -795 602 664 -1305 -939
1569 -939 600 -11 -1285 -349 -28 -775 157 538 -1149 -820 1336 579 -788 233 902 -11 270 952
1587 952 221 -123 972 423 -1037 191 961 -448 -1031 -91 -281 -749 102 -89 -1321 -564 844 -200
$$ packed form
1461BJ027j927o05J156J11L16M01j315l66K395M76k214k61J877N3q22K81m68n00
1480c83J376K32k004m88K211k55j765K84N90l44M03L25j556J23K406l33k020O39
1498e59J733o08m88M87m35K5J314n87k006J038J849j373j454R40L79q59N77m6
1516g3j229N97J691j347j388J707R44j123k22Q84m97L82J227j130j407J613J268
1533A897k032n13J337j99p15N18n88j144J509P82k030m60J960Lj283L45Q14p30
1551e29P44P62j307m31K055J44j970K90J156m27l88N90q97n87J397O2j969L66
1569i39J539o11j274R36L21p47R32L81j687L29K156p57j367J021O69r13K81O82
1587I52p31l44J095n49j460J228P70j409n83R40j90m68Q51j91j232P57J408j044
$$ plain form
1605 -200 -920 538 682 -368 95 722 -50 349 1154 -25 -576 764 1238 -360 -448 350 -304 -441 343
1624 343 -315 -1134 -34 365 -1031 -849 469 -53 -606 222 302 -295 526 1010 -194 -250 1071 761 -259
1643 -259 377 579 -295 -181 747 -194 -710 255 33 -1171 -400 437 -573 -782 -80 -190 -743 309 482
1662 482 -434 -79 826 193 -162 906 728 -61 254 520 -203 153 840 -158 -1040 -123 289 -527 -243 -50
1682 -50 -717 -728 253 15 -503 112 250 -481 -193 848 257 54 702 533 -381 337 995 279 -107 291
1702 291 -237 -599 330 472 -734 -776 20 -588 -387 78 -133 -859 -64 459 -299 -165 727 482 -78 320
1722 320 460 -131 516 1053 -148 -564 310 512 -247 157 -311 -894 -364 263 -146 -850 -250 -62 -612 -22
1742 -22 494 -450 -289 656 344 -254 493 878 127 283 534 -189 -96 981 647 -874 -567 56 -258 -7
$$ packed form
1605b00p20J458J44j050M63O27p72L99Q05j179n51J340M74j598q8P98o54j37P84
1624C43o58q19J100L99j396J82J318n22n53Q28Q0n97Q21M84j204n6J321l10j020
1643b59O36K02q74J14R28r41n16R65k22j204P71Q37j010k09P02j10n53J052J73
1662D82r16L55R05o33l55J068j78p89L15K66p23L56O87r98q82R17M12q16K84J93
1682e0o67j1R81k38n18O15J38p31K88J041n91k03O48j69r14P18O58p16l86L98
1702B91n28l62R29J42j206m2P96o08K01M65k11p26P95N23p58J34Q92k45n60L98
1722C20J40n91O47N37j201m16Q74K02p59M04m68n83N30O27m09p04O00J88n50N90
1742b2N16r44J61R45l12n98P47L85p51J56K51p23R3J077l34j521L07O23l14K51
$$ plain form
1762 -7 160 -722 -1222 43 443 -416 -506 125 -116 -59 519 45 -390 752 912 -510 -456 963 764 111
1782 111 199 -319 -611 364 826 -605 -1130 -106 -108 -640 144 9 -865 -352 635 -87 -447 492 563 -133 207
1803 207 487 -198 392 1161 190 -665 89 744 -82 -8 59 -681 -734 437 103 -804 -396 -61 -616 -219 463
1824 463 -323 -560 692 684 -540 -178 864 517 164 370 -55 -197 761 843 -680 -811 237 261 -308 -150
1844 -150 -312 -969 -35 578 -553 -855 309 457 -355 -77 169 71 505 837 -150 -742 632 1183 -127
1863 -127 -163 206 -62 -80 404 -118 -908 -255 128 -721 -431 280 -210 -595 135 20 -686 72 890 5 -356
1884 -356 539 411 55 625 414 -466 -91 624 104 -269 280 9 -846 -211 392 -470 -789 50 -146 -399
1904 -399 -65 80 -445 181 626 -350 -479 793 976 -64 -54 169 149 299 667 -231 -599 387 455 -612
$$ packed form
1762gJ67q82n00J265M00q59r0O31k41N7N78m74m35J142J60j422N4J419j99o53
1782A11Q8n18k92R75M62j431n25J024kn32P84j35q74N13R87p22l60R39P1o96L40
1803B07K80o85N90P69r71q55P54O55q26P4O7p40n3J171l34r07M08L35n55L97O82
1824D63p86k37J252qj224L62J042l47l53K06m25j42R58Q2j523j31J048K4n69J58
1844a50j62o57R34O13j131l02J164J48q12K78K46r8M34L32r87n92J374N51j310
1863a27l6L69k68j8M84n22p90O53L83q49K90P11m90l85P30j15p06P58Q18q85l61
1884c56Q95j28l56N70k11q80L75P15n20l73N49k71q55O35O03q62l19Q39j96k53
1904c99L34J45n25O26M45r76j29J272J83j040J0K23k0J50L68q98l68R86O8j067
$$ plain form
1924 -612 -479 155 -315 -446 28 -357 -776 385 489 -492 -478 407 435 8 228 8 -252 538 948 -106
1944 -106 -175 639 353 -484 -40 311 -184 -205 -52 -379 -630 168 139 -597 -317 171 -212 -258 332 203 -247
1965 -247 448 288 -45 273 705 84 -281 402 470 23 37 -53 -530 -243 149 -385 -633 157 240 -470 -522 -83
1987 -83 20 -113 198 -109 -261 658 782 -132 -136 485 361 35 241 113 -158 186 329 -406 -533 219 -76
2008 -76 -431 -430 -262 -416 79 339 -431 -638 594 329 -348 -49 444 238 228 350 103 73 595 436 -569
2029 -569 -91 397 -55 -357 -52 -111 -237 29 -103 -711 -141 263 -219 -556 234 194 -205 -133 327 34 302
2050 302 693 79 -334 440 644 -166 -123 264 -113 -126 104 -227 -615 -10 163 -556 -619 136 116 -256 103
2071 103 7 -250 360 661 -47 -139 503 448 -57 156 272 6 188 313 -297 -480 365 98 -566 -211 150
$$ packed form
1924f12J33O34m70j31M74l85m19J161J04r81J4Q85K8m27K20k20k60P90M10j054
1944a06o9Q14k86q37M44L51m95k1J53l27k51P98k9p36K80M88l83m6N90j29m50
1965b47O95j60l33L18M32o21l65O83O8m47J4r0m77K87L92n34k48P90Q3p10n2M39
1987h3J03j33L11l07j52R19J24r14mO21j24l26K06j28k71L44J43p35j27P52k95
2008g6l55JJ68j54M95K60p70k07J232k65o77K99M93k06j0J22k47l0N22j59j005
2029e69M78M88m52l02L05n9j26K66j32o08N70M04m82l37P90m0l99P2M60k93K68
2050C02L91o14m13P74K04q10M3L87l77j3K30l31l88O05J73p19o3P55k0l72L59
2071A03r6k57O10L01p08r2O42n5n05K13J16k66J82J25o10j83Q45k67o64L55L61
$$ plain form
2092 150 -339 -416 74 -211 -455 148 224 -479 -22 559 -23 -340 377 416 24 347 447 -249 37 498 35
2113 35 -470 9 256 -377 -268 19 -389 -489 226 -120 -617 1 523 -184 -333 219 289 -28 403 150 -177
2134 -177 323 632 25 -264 533 430 -351 -34 144 -373 -10 199 -306 -687 182 155 -513 -297 264 -54
2154 -54 -250 352 5 -117 438 399 -327 -2 626 202 -213 162 124 -145 119 321 -388 -283 269 -40 -612
2175 -612 -155 85 -276 -203 139 -228 -171 457 80 -366 -9 647 55 41 339 282 -5 456 272 -367 -64
2196 -64 413 -168 -507 -2 74 -358 -242 -93 -492 -146 234 -149 -510 137 339 -272 -104 518 117 8 323
2217 323 201 -102 281 474 -256 -260 334 67 -312 -76 -119 -411 -51 21 -398 -291 260 198 -353 -70 208 33
2239 33 151 211 -30 -54 539 336 -228 -55 368 -23 -129 19 -43 -221 100 -89 -462 -327 78 -7 -487 -143
$$ packed form
2092A50m89p7M90k85k44O03P6p03M57N81n82l17P17L9l92L23J00o96K86M61m63
2113C5n05M79K47o33J09K87m08j00P15l46m97O18N22p07j49N52P0l17M31k53l27
2134a77N00L09o07k89P97j03p81L17J78n17L63K09n05l81Q69k7o68K16N61l18
2154e4j96O02l47j22N55l9p26L25O28m24m15L75l8k69K64K02p09J05N52l09n72
2175f12M57K40l61P3L42l67N7O28l77m46L57O56n92j4K98n7k87M61j84o39L03
2196f4M77n81l39N05P6m32J16J49l99L46L80l83l61O47K02o11J68O22m01j09L15
2217C23j22l03L83J93p30mN94k67l79K36m3k92L60P2m19J07N51o2n51K83K78j75
2239C3J18O0k41k4N93k03n64J73M23l91j06J48o2j78L21j89l73J35M05q5m80L44
$$ plain form
2261 -143 -38 -161 92 214 -208 53 413 91 -33 199 374 88 -34 209 72 -46 80 -165 -325 82
2281 82 134 -257 -442 147 -171 -384 68 -151 -166 58 269 -196 -168 315 332 -89 128 252 -30 294 435 -46
2303 -46 -202 410 234 -287 -72 2 -144 -133 -94 -92 -385 19 159 -321 -214 162 55 -169 185 155 -54 152
2325 152 266 2 35 281 59 -105 269 227 -285 -167 144 -257 -218 74 -148 -365 -101 156 -333 -163 280
2346 280 36 -88 263 175 -141 283 417 -18 -158 359 249 -47 121 29 -282 -35 247 -292 -411 63 -49
2367 -49 -432 -95 -60 -169 -141 205 -19 -344 246 317 126 89 317 -61 120 521 159 -217 96 115 104 -100
2389 -100 -63 -301 -154 42 14 -499 -94 152 -246 -221 129 21 -167 270 131 -288 -90 502 116 -42 238
2410 238 144 -93 300 301 -221 -348 238 -23 -305 -92 -52 -297 -143 10 -342 -281 51 193 -250 81 247 -1
$$ packed form
2261a43J05j23K53J22m22K61L60l22j24K32J75k86j22K43j37j18J26k45j60M07
2281H2N2l91j85N89l18k13M52k19j5K24K11m65K8M83J7m21K17J24k82L24J41m81
2303d6j56O12j76n21K15P4j46J1L9Kk93M04J40m80J07L76j07k24L54l0k09K06
2325A52J14k64L3K46k22j64L74m2n12J18L11m01L9K92k22k17K64K57m89J70M43
2346B80k44j24L51q8l16M24J34m35j40N17j10k96J68r2l11K47K82n39j19M74j12
2367d9l83L37L5j09K8L46k24l25N90P1j91l7K28l78J81M01l62l76L13J9j1k04
2389a00L7k38J47J96k8n13M05K46l98K5L50j08j88M37j39m19J98N92l86j58K80
2410B38r4k37L93Jn22j27N86k61k82K13M0k45J54J53l52O1L32J42m43L31J66k48
$$ plain form
2432 -1 90 382 59 -261 317 393 -79 120 234 -111 -178 285 125 -399 -60 62 -238 -232 -19 -128 -215 266 -18
2455 -18 -318 85 379 58 -84 287 188 44 381 276 -356 -34 247 112 -337 32 -53 -182 -130 127 -280
2476 -280 -231 327 119 -427 -9 222 5 11 299 -56 -45 324 397 -230 48 326 3 6 147 117 -21 178 140
2499 140 -370 -150 64 -157 -295 -21 -194 -378 41 61 -224 -236 260 30 -244 300 191 -149 57 232 34
2520 34 72 99 -12 -144 110 122 -412 -19 228 32 -308 -41 -38 -146 -4 -25 -288 -228 418 127 -212 55 342
2543 342 64 172 274 -21 -68 295 238 -397 -7 131 -209 -278 -92 -188 -99 75 -47 -361 -211 317 -95 -202
2565 -202 24 224 -31 147 204 -3 102 228 61 -98 225 85 -104 13 108 32 -187 85 -178 -307 -3
2586 -3 51 -156 -242 63 -70 -106 2 -112 -120 154 260 -88 -182 378 150 -26 158 11 75 -5 133 -34 -112 164
$$ packed form
2432aR1K92l23l20N78P6m72J99J14l45o7M63j60n24L39J22l00OK13j09q7M81k84
2455a8l00M03K94l21j42L71r9j44L37j05o32L22K81j35m49L69q5j29N2K57m07
2476b80M9N58k08n46M18K31k17OK88l55J1L69P3o27K78K78l23LJ41l0j38J99l8
2499A40n10K20K14k21j38K74j73j84M19K0k85j2M96k30k74N44j09l40K06J75j98
2520C4L8K7j11j32K54J2n34L93K47j96l40K67Lj08J42k1k63O0O46k91l39K67K87
2543C42k78J08J02k95m7L63n7o35L90J38l40o9J86r6Q9J74j22l14J50N28m12j07
2565b02K26K00k55J78N7k07J05J26j67j59L23j40j89J17R5p6k19K72k63j29L04
2586cN4k07q6L05j33l6J08j14qK74J06l48r4N60k28j76J84j47O4q0J38j67p8K76
$$ plain form
2610 164 4 -245 -187 1 -112 -199 1 -125 -127 144 160 -93 -73 75 133 -3 138 144 -52 243 158 -87 136
2633 136 265 90 -210 99 20 -253 -58 -49 -108 -159 48 -127 -315 68 205 -104 -4 346 60 -17 193 12
2655 12 -65 139 98 -33 -13 158 55 -242 -91 22 -109 -67 25 -229 -194 162 -70 -348 -81 31 -37 -43 70
2678 70 -165 -79 206 151 -146 -29 223 19 23 74 76 -147 57 -15 -136 -170 193 -187 -189 -18 -88 -134 8 11 -81 123
2704 123 191 38 -152 209 234 119 180 132 4 34 221 82 -239 52 173 -65 -76 17 -56 -59 -136 81 -297 85
2728 85 49 -18 -224 290 280 0 32 32 21 98 207 -52 -53 89 170 -230 -135 75 -133 -180 184 -280 -326 -10 119
2753 119 -350 -76 148 -113 -175 149 57 -118 124 125 -63 60 167 53 -105 165 75 -149 -130 87 5 -163
2775 -163 43 -94 -320 -57 179 -198 -264 134 232 -37 18 51 -109 24 294 11 56 262 203 64 79 39 -128
$$ packed form
2610A64j60k49N8J88j13q7K00j26kK71J6k53K0J48N8j36J41Oj96K95q5k45K23
2633A36J29j75l00L09p9k73J95Rn9n1K07j75j88L83J37l09J00L50k86p7K10j81
2655A2p7K04m1j31K0J71j03k97J51J13j31M2R2k54L5L56k32k78K67J12o8oJ13
2678G0k35Q6K85n5k97J17K52k04MN1Kk23K04p2j21l4L63l80kJ71p0m6J42Lr2K04
2704A23O8j53j90L61K5j15O1m8j28L0J87j39l21K91J21k38j1R3p3lp7K17l78L82
2728H5l6o7k06N14j0k80L2%j1P7J09k59jJ42Q1m00R5K10k08m7L64m64m6L16J29
2753A19m69K74K24k61o2L24r2j75K42Jj88J23J07j14j58K70r0k24J9K17q2j68
2775a63K06j37k26K63K36l77o6L98R8k69N5L3j60J33K70k83M5K06n9j39J5m0j67
$$ plain form
2798 -128 118 183 -168 -242 132 144 -107 -126 -24 19 -57 87 1 -90 196 170 -102 39 147 120 -116 139 130 -34
2822 -34 10 138 104 -106 159 71 -179 -81 169 -78 -116 152 -140 -136 35 183 -157 36 172 4 -52 25 111 -60
2846 -60 184 47 -63 19 166 -15 -172 23 45 -39 -49 122 -87 -26 142 -91 -213 155 22 -66 52 -24 -63
2869 -63 -136 94 56 -11 204 208 17 -4 91 85 -54 88 173 -50 -41 80 -112 -73 -24 23 -102 18 -18 -58 -88 1 -132
2896 -132 61 168 108 -83 -14 288 -1 -59 167 114 21 155 68 -39 -10 -14 -45 -91 -35 -197 -176 -5 26 -158 3
2921 3 160 -50 -137 65 -43 -99 189 118 -77 -75 89 119 -95 78 258 -142 107 26 -161 -147 -2 104 -101
2944 -101 -26 48 -102 -109 -83 -139 -20 195 -19 -16 119 4 -92 -87 208 -16 -1 63 150 29 -11 5 -22 -82 -150 -55 -104
2971 -104 72 95 15 -25 15 -75 -127 43 48 -199 78 104 84 39 122 79 -76 93 76 -129 -100 65 -12 -178 -140 -30
$$ packed form
2798a28K46O5l51p4L74J2k51j9J02M3p6J44q6r1K86k6k72J41J08k7k36K55rj64
2822c4M4J28l4k10K65q8k50R8K50k47l8K68k92MJ71J48l40J93J36j68n6P7Q6j71
2846f0K44j37j10Q2J47j81j57J95K2q4j0J71k09O1J68k33j22L68j33q8J18p6l9
2869f3p3K30l8o7K15Mj91k1R5oj39J42Q5k23RJ21j92L9M9M7j25J20l6m0l0Q9j33
2896a32J93J07o0j91O9L02k89n8K26n3r3J34q7j07K9ml1m6N6j62K1J71L1j84J61
2921CJ57k10q7K02j08n6K88p1j95KJ64L0k14J73J80m00K49q1j87J4J45J06k05
2944a01P5P4j50pK6n6J19K15k14LJ35j15r6NK95k24J5O4Q7j21m0J6k7o0o8R5m9
2971a04J76K3q0m0M0r0n2J70Nk47K77K6k0m5Q3m3j55J69j7k05K9J65p7j66L8J10
$$ plain form
2997 -30 -125 -16 4 -81 -187 81 20 -105 -36 72 -87 5 170 119 -125 43 13 73 11 55 -100 -26 -4 -53 -136
3022 -136 71 161 -249 -36 -6 -25 -13 17 -22 -179 87 26 105 63 88 56 15 250 107 -133 -69 251 49 54 31
3047 31 71 -198 -66 -61 -75 -44 70 -21 -131 124 -21 -99 90 43 10 -58 180 100 41 17 162 -34 -27 121 4
3072 4 -149 74 3 -63 -57 84 -197 -27 83 -97 -144 134 99 -38 -21 19 -39 1 6 24 -74 189 128 -98 5 -7
3098 -7 18 0 19 84 -178 -50 -19 -10 -169 10 -45 -53 50 67 -126 -106 121 29 -13 82 -57 -165 63 142 66 -71
3124 -71 225 7 0 10 34 -123 -60 51 -76 -65 129 -13 -201 -88 -113 -101 -127 117 -29 80 98 110 96 63 89
3149 89 -8 23 172 48 -82 171 156 -31 -36 38 -42 -100 60 -50 -140 -42 181 -184 -104 95 158 -138 28 117 -12
3174 -12 28 130 67 -11 133 44 -27 30 43 -18 -37 -9 -59 -56 -45 -17 -182 -149 87 -52 -63 106 -32 -164 22 -83
$$ packed form
2997c0r5J09K0q5j06K68o1j25O9J08j59R2J65n1k44J68l0O0o2M4j55P4K2m9q3
3022a36K07R0m10K13L0j9J2L0l9j57K66o1P9m2K5l2m1K35j43k40O4L20k02Nk3
3047C1M0k69J32Nj4L1J14r1j10K55j45p8J89m7l3o8K38q0n9k4J45j96PJ48j17
3072Dj53K23p1o6OJ41k81J70J10j80m7K78l5j37J7M0n8M0NJ8r8K63o1k26J03j2
3098gK5j8J9O5k62J28L1Rj59J79n5qJ03J7j93K0K27r2m2R5j39j08K28P9p6j37
3124g1K96k18pJ0K4j57O3J11j27J1J94j42j88J13k5J2k6K44j46J09J8J2j4l3K6
3149H9r7L1J49j24j30K53j5j87nP4q0n8J60j10r0R8K23l65Q0J99O3k96J66Q9j29
3174a2M0J02o3p8J44q9p1N7J3o1j9K8n0LJ1K8j65L3K36j39j1J69j38j32J86j05
$$ plain form
3200 -83 -72 -22 104 6 -51 128 82 -40 -128 40 59 -122 173 -133 -265 -42 41 -104 -88 -1 -115 -162 -48 -97
3224 -97 20 21 14 16 -52 151 11 -27 91 -81 -47 42 111 -65 -62 67 -9 -173 -79 -25 40 -48 103 19 -61 39 -45
3251 -45 0 -49 27 -4 -45 169 -9 -10 26 -2 44 -12 167 28 -88 35 -55 -67 22 47 37 -114 -126 -74 -147 42 40
3278 40 -47 -77 47 -78 47 184 98 -12 77 60 -5 50 75 39 -18 -43 -73 -4 -84 71 -11 -101 10 35 -51 -26 126
3305 126 -98 7 43 -17 -13 69 160 -14 71 91 -24 93 171 -28 21 115 17 -119 -33 37 -72 -160 -122 56 -41 24
3331 24 -20 -114 -99 36 -5 -66 82 171 159 38 6 125 19 -22 -73 -176 -56 110 2 -111 40 4 -52 25 29
3356 29 -75 -112 157 -76 -90 17 91 75 -76 -2 -136 9 92 29 -100 174 -24 22 13 87 -126 59 51 -90 -64
3381 -64 -47 97 -276 -75 -19 -127 54 78 -12 -91 -20 -1 -102 -44 -100 91 108 49 38 77 50 -53 2 -3 76 80 -81
$$ packed form
3200h3J1N0J26r8n7J79m6j22q8J68J9j81K95l06j32K23Q3j45J6Q7j14m7J14m9
3224i7J17JpKo8K03j40l8J18j72L4Q9O9j76LJ29p6j64R4N4O5q8J51q4q0J00q4
3251d5M5m9P6l1m1K14j78jL6k8M6n6J79j39j16J23r0j2Q9K5j0j51j2N2p3J89k
3278D0q7l0J24j25J25J37q6j10Q9j7o5N5K5l6n7k5l0O9q0J55q2r0J11K5q6K5J52
3305A26k24J05L6o0MQ2R1j74Q5K0j15J17P8j99M9R4r8j36Q6P0j09q8L8J78r7O5
3331B4m4r4J5J35m1o1J48Q9j2j21l2J19j06m1n1j03J20J66j08j13J51l6n6P7M
3356B9j04l7K69k33j4J07P4j6j51P4j34J45Q3o3j29K74j98M6rP4k13J85qj41K6
3381f4J7J44l73K01N6j08J81K4r0p9P1J9j01N8n6J91J7n9j1L9k7j03N5nP9Mj61
$$ plain form
3408 -81 6 55 -11 -139 71 -79 69 83 -92 6 -25 109 -52 35 184 71 -27 28 -2 -47 45 31 -4 -48 42 3
3434 3 -72 -20 39 -54 -49 -47 -42 -176 21 0 -198 -10 89 -54 -98 14 6 -100 64 121 5 -48 110 -67 -44 63 37
3461 37 60 -33 44 -182 -7 23 4 -74 73 49 -27 -39 -42 17 -16 119 85 -164 -19 16 105 -73 44 93 -43 69
3487 69 1 8 -219 182 -47 -111 12 -59 -66 -61 103 -48 31 29 -74 -19 124 38 -82 -84 -18 31 -45 182 1 -25 8
3514 8 12 -46 -94 -1 109 -20 -4 -16 -101 47 -30 -40 -194 43 112 57 -12 55 -94 142 154 26 17 -17 10 -30 67 -143
3542 -143 79 -46 -6 17 -20 71 -77 -60 -93 58 -129 -83 141 103 -45 -12 146 -59 116 152 -98 -23 52 -87
3566 -87 -5 -21 54 99 119 -18 -10 -32 72 3 -123 -110 42 16 -6 -13 -105 11 52 171 14 -16 70 16 110 -49 -70
3593 -70 -74 2 73 -119 -31 49 -69 -155 24 -103 -75 -21 15 -55 -15 19 -29 -62 5 68 -11 11 -62 29 -73 63 68 72 81
$$ packed form
3408h1Q7M9o6j28K10j50J48J4j75R8l1J34j61Q7J49j13r8N5l0m5R2j4l5m4R0l9
3434Cp5N2N9r3NKNj34J97k1j98J88R9j43m4J12qj06J64N7j16n3J58j77K3J07k6
3461C7K3r3P7k26J75L0j9p8J47k4p6j2lN9l3J35l4k49J45L5Q9j78J17M9j36J12
3487F9o8Pk27M01k29o4J23p1pNJ64j51P9kj03N5J43q6j20kO6M9p6K27j81k6L3
3514HMn8m8R3J10j29J6j2q5J48p7j0j54K37O9n5o9O7j49K36J2j28rl4K7m0R7k10
3542a43K22j25M0K3l7R1j48J7l3J51j87M6K24l8j48L3J58k05J75L6k50P5P5j39
3566h7Q2j6P5M5K0j37Qk2J04o9j26J3J52k6k2pr2J16M1J19j57l0Q6n4R4j59k1
3593g0mP6P1j92Q8Q0j18q6J79j27K8N4L6p0M0L4m8l3O7O3p9K2p3R1j02J36NMR
$$ plain form
3622 81 64 -53 16 85 59 -28 -53 39 12 -233 -101 10 -103 130 39 -60 79 76 -84 18 134 68 105 86 49 -77
3648 -77 -46 164 -75 -12 28 -70 -93 48 79 -100 -106 126 -50 -208 42 -77 -48 13 58 -32 -35 171 51 21 21 12 28
3675 28 -57 93 -77 -70 108 128 74 -21 55 -72 40 85 89 24 37 108 -41 -35 49 -15 -12 12 107 7 -17 45 29 -55 22
3704 22 -46 -33 30 42 -95 -24 95 -83 -31 21 -156 -46 -3 -15 -34 -2 -17 96 -96 162 -14 -51 92 -16 -8
3729 -8 11 29 155 -16 -87 55 -60 -119 2 38 -52 -16 -54 -21 4 38 -108 110 151 11 -70 107 136 -40 -23 67
3755 67 138 0 30 80 -145 -110 169 -50 -10 23 -92 -41 -69 109 -172 -84 74 -18 -66 53 -28 -146 -5 216
3779 216 -42 28 44 33 89 30 -47 15 -29 139 -52 -27 35 -113 16 -144 36 -80 -22 53 39 -80 73 93 -15
3804 -15 44 124 -109 -39 2 67 41 -49 124 29 41 154 -23 117 -11 9 -48 -189 94 -90 -92 -142 -131 -80 -72 -198
$$ packed form
3622H1j7j17O9O9k6q7k5R2k7k45J32J11j13K33r1r9J39lj60J02J16o6L7j9l7j26
3648g7L1K10k39O3M0r8k3J41L1j79oK32j76j58K50j19K9O1M5r0lK06j20l0%rJ6
3675B8q5J50j70PJ78K0n4r5P6j27J12M5Mo5J3P1j49OQ4o4LK4R5j00k4O2j6q4P7
3704B2o8J3O3J2j37P1J19j78N2N2j77J10M3j2j9L2j5J13j92K58j76l7J43j08Q
3729hJ9J8J26j71p1J42j15n9J21L6r0L6l8L3K5L4j46K18M1j40q1J77K9j76J7R0
3755F7P1j38L0N0k25L5K79k19M0L3j15N1k8J78k81Q8J58r2m8J19q1j18J41K21
3779B16k58P0J6j1N6n9p7O2m4J68j91K5O2j48J29j60J80j16N8P5j4j19J53K0j08
3804a5N9Q0k33P0M1O5k6r0J73r5J2J13j77J40j28K0n7j41K83j84kn0J1N1Qj26
$$ plain form
3830 -198 -28 -11 163 -49 97 88 -55 47 120 79 33 111 119 20 -127 91 -115 -4 -19 38 -49 53 73 105 0
3855 0 -56 -14 59 -111 72 90 -28 -36 52 -50 7 82 -158 -145 86 63 87 11 -47 -38 69 23 -84 -75 -6 22 -86 18
3883 18 2 -63 -102 -7 23 -103 43 28 73 9 116 -79 56 -78 -118 -88 93 -23 -82 49 64 -73 -22 -47 -47 -64
3909 -64 2 -84 -145 -55 11 22 -43 -59 28 -73 -90 160 21 27 144 161 -125 88 108 31 20 -10 25 31 -9 55 27 12
3937 12 63 -81 88 95 -70 -106 9 54 -41 17 138 60 45 118 -94 -69 68 129 -94 -53 -103 -48 -97 31 70 13
3963 13 -105 117 53 61 7 -58 -18 5 4 40 58 90 -66 -14 67 93 -35 67 10 -20 56 -46 108 -118 -27 -49 104
3990 104 -165 43 50 -3 147 -41 -20 161 -56 41 58 86 -11 -4 -25 5 7 -82 131 17 42 -7 -87 -96 63 28 93
4017 93 68 126 24 -55 -10 -114 54 -10 78 -18 10 -24 2 -35 -3 109 -8 13 1 -15 -23 58 -79 -70 -37 -117 -87 64
$$ packed form
3830a98J70J7J74k12J46rj43J02P3m1m6P8Qr9j47K18k06J11j5N7q7J02K0L2j05
3855@n6M2P3j70J83J8j18qQ8j02N7P5k40J3K31k3K4p6n8RJ07m6j07RO9K8j08J04
3883A8j6o5l9R5L0j26J46j5M5o4J07j95J35j34m0L0J81j16n9J31J5j37N1k5%j7
3909f4O6q6o1R0O6J1o5j6Q7j01j7K50j39OJ17J7k86K13K0p7j1l0L5Om0O4k8j5
3937A2N1j44J69Pj65l6J15M5r5N8J21p8j5P3k12K5J37O1k23M1n0N5m9J28L9n7
3963A3j18K22o4Qn4o5M0K3jL6J8L2j56N2Q1K6j28J02n7l0P6j02J54k26R1k2J53
3990A04k69K08Pn3J50j88K1J81k17R7J7K8r7Pk1L0Kq9K13j14K5m9q0rJ59l5O5
4017I3k5N8j02p9M5j04J68o4Q8r6K8l4K6l7L2J12j17K1j2j6qQ1j37RL3q0L0J51
$$ plain form
4045 64 135 -35 -95 -2 141 -17 -40 20 65 -106 85 53 -46 118 60 57 -25 38 34 -13 -41 -32 -8 10 106 -28 -102 -33
4073 -33 -24 -28 -74 19 -79 71 -10 -18 2 72 -14 120 140 106 31 -63 -139 27 34 -87 -44 -123 -21 10 -53 24 74 16 -6 18
4103 18 141 -8 -149 111 89 -68 58 16 -10 59 -6 -55 -92 135 -94 -170 -122 -37 33 -91 -32 94 -75 19 67
4128 67 -45 -13 -59 -96 -120 118 72 16 35 117 47 105 -26 -35 -56 58 52 -116 44 -2 -26 21 25 -98 -155 -17 26 -27
4156 -27 19 41 -99 32 121 87 48 -9 -7 -20 53 13 -6 -48 16 -54 -8 20 2 119 -78 89 -62 -10 -39 -35 -61 -53 34
4185 34 -61 26 49 -6 -4 -61 106 -22 -37 77 75 89 76 -58 1 62 137 -30 -47 -32 -61 -121 -67 133 -68 -128 126
4212 126 -56 -73 -101 79 -22 -16 53 39 -16 50 21 -98 -120 -50 -9 48 -68 76 -74 45 -22 24 16 219 -43 1
4238 1 -6 -82 18 -94 56 -41 -77 103 9 6 -14 -75 -93 -48 177 31 2 92 -30 122 101 62 -71 40 91 -33
$$ packed form
4045F4P1j70o0R3J43j58k3O0M5j71J91l2r9J64n8lq2O3mm7k8RK4J8R6j34p4O9
4073c3Rmm6R3r8J50q1qK0P0q6J34K0l4p5r4p6J66Pj21M3p9J02L1o3P7N0n8k2K4
4103A8J23j49j41K60k2j57J26m2k6O9o5m9l7K27k29p6M8Q5P0j24N9J26j69R4M8
4128F7j12L2m6l7k4K38m6n6J9Q2p0N8j31rk1J14oj68J60m6k4M7Mj23n7J38M3n3
4156b7M6K2j40J31Q9l4l9n7Kj3P3m0j9m2O4p0M6K8j8J17j97J67j51N2k9Mk6QQ7
4185C4r5Q7K3n5Kn7J67j28j5J14kJ4j3j34N9O1P5j67j7J5k9o0N4K00k01o0K54
4212A26j82j7k8J80j01OO9j4n5O6k9j19k2P0M1N7j16J44j50J19o7M6qK03k62M4
4238App6J00j12J50r7l6J80r4lk0o1j8M5K25j46k9R0j22J52k1l9j33J11N1j24
$$ plain form
4264 -33 10 -67 53 -64 22 -91 -51 9 69 32 -20 58 98 19 16 -24 76 16 10 -67 87 63 107 -62 47 19 14 -52
4292 -52 -71 80 -66 -23 9 -2 -116 173 104 -20 -14 124 1 -110 206 120 124 -6 66 76 -58 -68 -9 -79 -15 21
4318 21 -104 68 72 -24 -121 13 29 -48 133 -67 -24 12 -30 -36 -10 -23 47 43 88 4 95 -24 155 -47 -39 68 -112
4345 -112 -10 -123 56 -50 -76 -26 -12 -98 18 31 -32 -27 45 59 -18 -14 22 -22 34 -95 -33 -82 40 85 -46 16 -44
4372 -44 -62 -39 -13 47 54 -56 -109 -65 -7 -34 71 21 -71 22 93 137 152 45 91 -9 -31 78 -18 -28 -39 101 -6
4399 -6 23 -36 -29 -49 -71 66 -24 1 -17 -108 7 -22 94 20 -81 29 0 -12 -7 56 -5 -35 216 -33 -159 -47 62
4426 62 5 124 -51 74 -38 -8 -45 -10 28 70 36 21 -30 15 61 36 124 -59 -131 0 53 -177 -2 116 -84
4451 -84 57 15 -158 -58 -18 -81 -152 -48 -21 12 96 76 31 58 -1 112 -95 -30 134 6 9 93 -59 -38 60 -67
$$ packed form
4264c3M3p7J20j17Q6j13M0O0O0l7n2P8M0p9lm0J00o0op7J54k4M4j69J09k8no6
4292e2j9J51j46M3L2j1j14K89o9j24OJ38j23j11L16q6Mj30P2J0j34j0N9p0O4L6
4318B1j25J72Mr6r7J34J6p7J81k00M3L6m2oK6j3P0mM5q4R1j19J79k02QJ07j80
4345a12J02j13J79j06k6N0J4q6J16J3o3NP2J4p7ML6m4N6j29O2m9J22M5j31O2o0
4372d4j8K3K6O0Pj10n3M4N8k7J05n0r2R3P1M4J5j07M6j00k2J09r6j0j1J40j07
4399fK9n9Pk0k2J37r0K5j8r1J15k9J16p4j01J10k9j2NO3o1l0K51k49j26J12J09
4426F2n7J19j75J25j12L0l7L5L8M2l4j5n1M5M6k5Q8j83p2J31N3k30J75J18k00
4451h4J41m2j73J00M0o3p1J04K7L3Q4k0m5K7n9J13k07O5J64j28LQ4j52K1R8j27
$$ plain form
4477 -67 -19 -88 -66 -63 14 -26 42 -52 20 -6 -79 -25 -108 -115 -1 -87 11 -45 -3 89 65 145 110 -4 -22 183 -15 7 -29
4506 -29 10 35 72 36 -59 -47 143 90 -24 29 33 -15 -11 -12 35 -42 -50 132 43 37 -11 92 67 120 122 -16 24 -14 7 -83 -65
4537 -65 -8 -107 -65 65 -50 29 107 -38 -51 43 72 129 128 -21 23 -116 56 16 -39 -6 8 -49 41 59 -43 56 -7
4564 -7 -58 -57 32 52 -38 -91 5 1 134 61 136 -112 37 115 -17 -25 6 50 -150 -20 29 81 23 160 -44 -106 -53 39
4592 39 -20 20 104 -40 54 7 85 -69 -47 -36 10 80 -40 -56 6 -28 20 53 18 8 86 -20 -44 63 -4 30 167
4619 167 81 -119 81 -35 -84 -117 -12 -12 7 47 -46 -25 62 -11 20 -97 -125 1 82 49 -103 -28 76 115 -37 63
4645 63 38 -131 21 60 71 54 -53 45 -87 -40 -2 10 -42 217 106 -99 67 7 -32 45 -5 -24 -24 87 -6 15
4671 15 73 10 90 137 50 -79 -76 16 43 -41 -97 20 101 10 86 13 22 -34 138 -107 -78 17 -43 -10 -94 -60 -12 78 -89
$$ packed form
4477f7M8o9K2LP7m0O8r4P2k6p3N4q3pJ14q6R8n6M2R2k4Q0l5j14j8K05j98K2l6
4506b9L9K5L7l6r5J2J90n3j14N3Mm8MjM7p7qJ82q9om8J03k5N3Kj38M0l8K1r0J8
4537f5N7r9M2J30j15P9P8j45j3R4K9N7jj49M4j39J72m0n5L3J4n7R0J8j02R9o3
4564gn1JQ9K0r0n3R6mJ33p3P5k48J49P8j32qL1M4k00J30M9N2n8J37k04o2N3R2
4592C9n9M0Q4j44R4m7P8j54K2J1M6P0j20j6O2l4M8L3l5j0P8j06k4J07o7L4J37
4619A67q6k00K00j16m9l3J05%J9M0r3K1Q7p3L1j17k8J26Q1l3j52P5J04L9j52J00
4645F3k5j69J52L9J1j7j07R8j32M7L8J2n2K59j11k05J66o0l9P7n0j9%J11r3K1
4671A5N8o3Q0M7q7j29LR2K7q4n6J17Q1r1P6p3Rn6J72k45K9R5o0L3q4L4M8R0j67
$$ plain form
4700 -89 68 -57 35 52 -32 57 -1 -2 -91 -74 33 85 24 -115 -23 25 -1 -36 85 62 91 59 10 29 -50 2 7 1 1 -106
4730 -106 10 -44 38 -70 -19 -70 5 197 -85 76 68 -10 -3 -47 22 10 9 102 -53 -63 -99 -19 -137 37 21 -101 -91
4757 -91 79 65 -34 12 -86 18 -21 0 -42 44 -45 -57 20 71 46 144 -152 2 -14 -71 42 19 -101 -4 10 26 -37
4784 -37 22 29 76 2 -17 -95 -54 -97 9 10 68 144 -110 95 -38 -17 -95 38 -34 66 110 68 1 108 -60 22 51
4811 51 -55 -28 20 6 52 -242 -42 51 63 142 88 -97 61 -80 5 -44 -31 16 97 -70 91 42 -37 41 -107 82
4837 82 -39 -10 79 -5 36 4 -61 -57 72 96 19 75 88 -30 -71 33 67 122 46 -4 -117 70 -38 -157 26 133
4863 133 108 -150 -76 -60 -2 4 -43 -53 15 101 9 11 -1 -30 -56 29 123 56 93 94 46 -56 70 21 25 9 -14 83 16 59
4893 59 -63 -69 17 110 -25 3 59 -135 133 108 -41 -99 0 18 -92 56 34 -3 101 46 127 -56 -32 80 85 113
$$ packed form
4700h9J57j25R2J7q4Q9n8jq9J7J07N2o1j39R2M8k6l5J21k3K9l2m9J9p9N2No%j07
4730a06J16n4Q2j08N1n1P5J92k82J61qp8Pm4O9j2jR3j55j0l6Q0j18J74j6j22J0
4757i1J70j4r9M6r8J04l9K1m2Q6q9j2P7N1k5R8k96J54j6n7J13k3j20R7J4J6o3
4784c7N9PM7p4j9p8M1m3J06JN8P6k54K05j33K1p8J33p2J00M4m2o7J07j68Q2K9
4811E1j06K7M8j4M6k94K00R3J2P9n4j85J58j41Q5m9J3M7Q1j67J61m9p9P8j48J89
4837H2j21K9Q9q4M1l2o5MJ29K4p7N6J3j18m1J04L4N5p6n0j13J87j08j19J83J07
4863A33k5k58P4J6N8Om7j0O8Q6r2Kj2k9k6Q5R4o7L7Jm8j02J26m9Mj6k3R7o7M3
4893E9j22oQ6R3j35K8N6j94K68k5j49n8R9J8j10J48k2l7J04n5Q1j83K4J12NK8
$$ plain form
4919 113 15 101 -10 121 7 80 -87 80 -65 -185 42 -8 -42 27 72 -32 74 -6 66 -50 -26 53 -16 25
4943 25 15 -71 -25 11 46 -44 123 95 -116 -49 40 -4 130 -91 30 26 -78 52 -40 4 -10 58 -34 126 46 -9 138
4970 138 -26 -61 -3 -67 0 -14 35 62 126 62 41 1 54 -70 -34 70 -70 29 -16 -42 90 53 -8 -6 -24 59 -14 -4
4998 -4 -2 -122 -22 -26 7 142 113 -112 -55 44 -107 -50 -97 12 50 10 63 -66 -112 4 -16 -66 47 26 -26 -21 85
5025 85 10 -33 75 73 18 58 94 -130 25 -29 -158 -5 39 48 55 20 14 22 -44 -7 -30 14 -163 106 48 -7 -15 -25 220
5054 220 107 -106 -63 -86 41 -72 15 60 54 -78 16 6 10 32 84 47 34 101 -5 -54 92 118 -63 61 55 -4 -130
5081 -130 67 -51 3 79 -25 -29 82 72 -112 -166 -106 -145 -29 62 6 -140 -34 -52 26 11 13 42 -3 -10 -13 36 -48 16
5109 16 96 -31 -36 2 -133 56 -129 97 21 -120 83 22 48 17 90 64 16 83 79 -10 164 46 61 94 31 95 91
$$ packed form
4919A13r8Q6j11J31j14P3j67J67j45j20K27n0l4O9M5j04J06q0P2j16K4P9o9M1
4943B5j0q6M6L6L5r0J67k8k11O7Q9m4J34k21J21mj04J30r2M4j4O8r2J60q0n5J47
4970A38j64l5N8o4O7j4M9K7O4o4k1m0N3j24L6J04j40R9m5k6J32l7o1Kj8Q3p3J0
4998dKj20J00mL3J35k9k25N7R9j51N7m7J09L8m0N3j29m6J16k0n0J13k1n2NJ06
5025H5p5m3J08kn5M0L6k24J55n4j29J53M4RPl5oQo6L7k3M4j77K69n8n5qj0K45
5054B20j13k13M3k3J27j13Q7M5oj32R4j0MK2N2l7j3O7j06m9J46K6j81J24on9j26
5081a30J97j18N4P6j04mJ11j0j84n4O0l9J16R1n6j46J06j8P8j5KK9m5plM9q4O4
5109A6Q0j27nL8j35J89j85K26p6j41K03o1K6l1P3k6m8O7mq9J74j18J5L3o3O4m
$$ plain form
5136 91 -16 -43 76 4 37 -17 -50 75 18 -102 -15 -54 -49 -32 86 -20 -65 -44 30 -53 79 96 -9 2 6 -6 -22
5163 -22 16 -24 -64 81 156 -102 -41 -53 93 -71 -101 -5 12 -42 16 136 -161 53 -78 109 -13 108 23 168
5187 168 -54 -54 -86 -68 169 -54 11 47 1 -156 172 26 -85 -22 45 -19 34 -3 -113 42 -27 -61 117 -9 -56
5212 -56 36 14 52 8 -225 10 -1 -103 8 106 -2 -80 -82 55 -84 -23 -12 -69 -32 125 -13 -19 -62 -61 2 -61 -36
5239 -36 69 -8 -7 133 4 1 97 37 -41 57 74 -96 169 9 5 104 34 -116 10 31 63 -57 74 42 -132 -2
5265 -2 3 23 54 91 -33 -70 40 -1 3 -13 -3 -19 -77 -60 -74 -121 30 -5 3 -46 162 13 94 -27 -13 -112 -54 46 -36
5294 -36 39 136 42 -61 50 -21 -109 93 20 -5 45 67 -95 -83 -15 14 -96 -29 -42 -1 -82 65 48 42 -12 -71 -12 -41
5322 -41 33 22 87 -5 76 -21 4 70 9 16 -105 114 -42 88 -55 39 -31 99 22 -84 11 127 23 -171 5
$$ packed form
5136I1j07k7J19p2L3n4l3J25n7j20Q7l9NJ7J18j06m5K1P4q3J32J7j05J1Mj2j6
5163b2L8m0m0J45P5k58O1j2J46j64l0R6J7n4N8J20k97K14j31J87j22J21q5J45
5187A68k22%l2J8K37k23O5L6m6j57L28j46j11O3O7o4N3l7j10J55o9l4J78j26m7
5212e6R2k2L8m4k33K35j1j02J11R8j08p8kJ37j39O1J1n7L7J57j38om3JO3o3K5
5239c6J05p7JJ40j29lR6o0p8R8J7j70K65j60mR9p0j50J26K1L2j20J31l2j74J30
5265bNK0L1L7j24l7J10m1Mj6J0j6n8J7j4m7J51l5Qm9K08j49Q1j21J4r9N8J00q2
5294c6P5R7r4j03J11p1q8K02p3k5N0K2j62J2O8K9j10O7j3M1q1J47j7on4n9N9k9
5322d1P4j1O5r2Q1r7K5O6o1Pj21K19j56J30j43R4p0J30p7j06R5J16j04j94J76
$$ plain form
5347 5 170 -24 -15 68 -93 10 3 49 69 23 -39 -96 -25 110 -71 76 20 -2 -25 -28 70 -45 104 -86 8 36 137
5374 137 4 -128 47 -4 -79 28 50 -19 -19 8 -37 -79 45 -89 -18 25 -36 54 -84 141 71 4 64 106 9 8 27
5401 27 1 19 37 71 15 17 -41 5 18 -8 -11 -72 42 -24 6 61 30 -55 -40 102 14 -101 -104 58 -14 28 56 105 -41
5430 -41 18 -23 73 47 46 -32 -94 0 51 -111 29 -1 51 -27 -22 46 -63 -83 -49 -99 5 7 96 -71 -28 117 -47 19
5458 19 100 -94 -22 109 51 -35 -48 62 -149 -34 -35 15 -85 25 0 -60 -70 -23 58 58 69 -43 107 103 -156 25
5484 25 -57 27 58 -61 53 -28 -16 31 89 -68 4 31 48 30 84 -55 -56 60 0 -81 -118 77 -33 32 -54 -40 -41 -98
5512 -98 -37 81 40 -98 -20 -45 -1 22 -22 -67 10 78 33 -39 -24 -51 -53 66 57 -56 57 -123 20 88 50 94 57 -6
5540 -6 13 58 -2 34 0 -142 72 -93 -82 4 -17 47 -100 -55 -62 -75 54 9 59 14 -29 11 -70 -61 -51 23 -27 37 13
$$ packed form
5347EJ65j94RQ3j61J03pM6K0m6o2n7P1J35j81J47n6k2k3lR8j15J49j90R4K8J01
5374A37j33j32J75n1p5J07K2o9%K7m5m2J24j34P1M3o1R0j38K25p0o7O0M2r7jJ9
5401B7k6J8J8L4n6Kn8M6J3k6lo1J14o6L0N5l1q5J5J42q8j15lJ62p2M2K8M9j46
5430d1N9m1R6k6jp8o2R4N1j62J40l0N2p8NO8j09k0L4n0J04KQ9j67M3J45j64O6
5458A9Q1j94P2J31n8q6j3J10k11J15jN0j00J10k5o0j0M7Q1%J1j12J50mk59J81
5484B5q2Q4L1j19J14q1J2M7N8j57P2K7J7j8N4j39jJ16o0q1l7J95j10O5q6J4jn7
5512i8O1J18m1j38P8k5M4K3m4m5P7O8m5p2J5k7kJ19rj13J13j80J43O8l8M4l7o3
5540fJ9M5o0L6l4j42K14j65J1Q6k1O4j47M5pj3J29m5N0m5m3M0q1RJ0P4n0O4k4
$$ plain form
5569 13 98 -104 -113 -40 90 -56 -112 -52 85 28 -4 -32 91 -27 38 -30 -42 -185 -18 19 78 28 78 1 -17 167
5595 167 -26 -70 -71 18 -201 159 -37 -12 -72 20 -64 -107 24 65 -32 -96 -51 -145 19 65 -29 -42 -38 187 38 63 -55
5622 -55 -51 -21 43 -47 -56 -39 40 38 32 43 -17 -22 47 -121 43 -105 -27 -29 -190 -15 -29 -11 76 21 13 73 24 -68 -78 23 -16
5653 -16 55 73 -2 59 -89 41 -20 -67 71 114 -45 -44 50 50 -99 105 35 -201 106 -38 -60 -87 -18 -92 -67 6 -10
5680 -10 66 6 -55 -24 -34 -52 -10 -144 39 -28 -44 -46 112 -79 76 75 94 28 -31 40 19 59 113 43 -56 -34 63 -67
5708 -67 54 -120 -77 -155 -38 -65 -38 49 89 -54 -44 24 -44 -39 -72 -60 -37 31 1 46 -130 56 -11 18 19 67 92 -55
5736 -55 118 74 22 -78 169 -130 85 -122 -160 -283 -162 -124 193 128 79 150 61 -11 29 -61 68 25 -65 -16 16
5761 16 28 -70 21 -79 -31 25 -54 47 -56 50 -79 -6 141 28 -9 -51 -108 -7 -55 -82 79 -125 119 148 -53
$$ packed form
5569A3Q5k02rP3J30j46n6O0J37n7l2k8J23j18O5o8j2j43J67L7N9n0N0p7j8J84
5595A67j93m4jQ9k19L60j96K5o0R2q4m3J31M1r7o4M5r4J64M6r4j3MK25j49K5j18
5622e5ML0O4r0rJ7P9koJ1o0nO9j68J64j48P8kj61J75j4J8Q7n5qO0m9r2j0J01l9
5653a6P1J8p5O1j48J30o1m7J38M3j59JR4%j49K04p0k36L07j44k2k7O9p4K5P3j6
5680a0P6o0o1L1j0j8M2j34J83o7j6kJ58j91J55jJ9o6n9P1k1M0N4p0r9K2R7j30
5708f7J21j74M3p8J17k7K7Q7M0j43J0O8o8Nl3J2K3O8l0M5j76J86o7K9JM8K5j47
5736e5J73m4n2j00K47k99K15k07l8j23J21L8L17o5m9P1q9p2M0r0J29m3r0M9L2
5761A6J2r8R1j00M8N6p9J01j03J06j29P3J47j13l7m2n7J01m8k7J61k04K44K9k01
$$ plain form
5786 -53 -57 -2 27 143 44 -101 -3 48 47 31 -115 -47 -38 -71 31 74 17 31 -38 65 -81 -25 -147 -88 19 96 80 -31
5814 -31 -54 -5 67 -122 61 -112 -25 -34 -28 -70 -10 23 -14 -215 20 4 -28 16 -39 -63 76 57 101 121 -17 10 -16 -51
5842 -51 20 -25 25 57 -22 -62 101 -55 49 99 87 50 -55 22 33 -31 62 -19 -58 54 -45 -74 22 124 -8 24 -66
5869 -66 59 -5 -22 -76 -14 -7 105 -30 -35 -121 -17 -53 -74 22 -206 -49 -51 78 -60 5 80 -61 -11 -77 42 14 -58
5896 -58 -40 -72 49 -26 -71 -49 -13 6 -74 -5 19 -14 -29 -81 -36 -32 108 -73 49 97 56 15 -29 -4 50 45 -69 11 -141
5925 -141 -7 70 -142 22 3 -33 -10 138 57 -53 33 -131 8 -103 24 4 67 -67 176 28 39 136 76 33
5949 33 -75 116 -68 10 -8 28 -92 120 36 -29 59 108 -155 39 -63 -68 16 53 55 -142 -28 78 -32 -61 -1
5974 -1 -96 -7 56 -7 19 13 -31 -13 -177 -11 -5 -48 51 9 128 -131 84 66 46 -61 -94 11 16 -60 -104 -43 73 115
$$ packed form
5786e3mN5K9J16r9j45R8N1jj6j46O8Rl3J02M3n7J4o9J03j46N6j22N9J07P7j6j11
5814c1k3M9P2j89J83j73Q7rOm2O0L3l7k01K35j6l2M4n5k4J39j9M4K0j38K7k6l5
5842e1P1m5N0L2p9m0J63j56J04N0j2l7j05P7J1o4R3q1l9J12r9k9R6J02j32L2r0
5869f6J25o4j7n4O2PJ12j35nq6J04l6k1R6k28J57kJ29j38O5P5j41N0o6J19k8p2
5896e8J8l2J21p5m5K2L6J9q0O9K4l3j5n2M5MJ40j81J22M8m1m1m4K5N4nj14Q0j52
5925a41J34P7k12J64j9l6K3J48q1j10Q6j64J39j11J27k0O3j34K43j48J1R7o0m3
5949C3j08J91j84P8j8L6j20K12q4o5Q8M9k63J94j02nQ4L7Kj97J14J06j10k9O0
5974ar5Q9O3o3K6om4J8j64J66Om3R9m2J19k59K15j8k0j07l3J05Np6m4O1J16M2
$$ plain form
6002 115 28 31 42 -53 -107 -40 75 -93 51 93 -175 -99 75 64 -81 -116 29 -36 30 -127 36 -29 33 -109 -131
6027 -131 85 33 -48 -43 33 -10 -31 -114 12 -24 16 68 96 -99 47 -109 53 79 153 -102 0 73 101 52 -88 153
6053 153 0 -114 35 16 -66 111 -33 -93 -4 -60 -97 -12 66 26 19 82 -116 -68 158 -17 -106 -32 4 -9 -72 -103
6079 -103 -103 -60 -78 -47 -24 23 102 28 -76 10 149 -114 -120 91 -82 36 -45 -82 8 -68 48 11 76 -9 -32 9 -97
6106 -97 -84 -10 63 -37 -26 36 13 25 -6 -74 46 -23 5 0 -86 35 115 -52 6 -44 51 30 46 -67 -138 79 21 60
6134 60 -43 -96 153 40 24 46 -115 -39 93 4 6 27 81 13 -35 -29 5 -22 60 -23 -57 -87 52 97 -28 6 74 -99
6162 -99 -6 79 -87 -71 -21 20 86 -13 91 -128 -13 83 -32 -15 -34 25 -90 -43 -41 -109 11 -41 -58 37 -17 92 -2
$$ packed form
6002A15q7LJ1r5n4O7J15j68J44M2k68P6J74j1j45l5J45o5O6j57J63o5O2j42k2
6027a31K16n2q1NP6m3k1q3J26l6M0N2K8j95J46j56J62K6P4k55J02P3K8m9j40K41
6053A53j53j14J49j9q2J77j44o0Q9n6l7Q5P8m0pO3j98M8K26j75q9P4L6j3o3l1
6079a03%M3j8L1K3M7P9p4j04Q6J39k63oK11j73J18q1l7R0p6J16l7O5q5k3M1j06
6106i7J3P4P3j00J1O2k3J2l1o8J20o9K8nq6J21Q0j67N8n0R5k1J6j13p1K17n8L9
6134F0j03n3K49j13j6K2j61P6J32q9KK1N4o8m8OL4k7Q2q3l4l0J39M5j25L4O8j73
6162i9R3Q5j66J6N0M1O6r9J04k19J15R6j15J7j9N9j15M7Ko8J20n2j7R5n4J09r4
$$ [...]
8191B1
##END NTUPLES=NMR FID
##END=
