##TITLE=1H ikalashn
T-1
13.12.2024
##JCAMPDX= 6.0         $$ Bruker NMR JCAMP-DX V2.0
##DATA TYPE= NMR FID
##DATA CLASS= NTUPLES
##ORIGIN= UXNMR, Bruker Analytische Messtechnik GmbH
##OWNER= root
$$ TOPSPIN		Version 1.3
$$ 2024-12-13 11:27:16.171 +0400  Irina@DPX200
$$ Compression mode = diff/dup
##.OBSERVE FREQUENCY= 200.131300845
##.OBSERVE NUCLEUS= ^1H
##.DELAY= (6, 6)
##.ACQUISITION MODE= SIMULTANEOUS
##.ACQUISITION SCHEME= undefined
##.AVERAGES= 8
##.DIGITISER RES= 18
##SPECTROMETER/DATA SYSTEM= spect
##.PULSE SEQUENCE= zg
##.SOLVENT NAME= CDCl3
##.SHIFT REFERENCE= INTERNAL, CDCl3, 1, 17.49637
##AUDIT TRAIL= $$ (NUMBER, WHEN, WHO, WHERE, WHAT)
$$ ##TITLE= Audit trail, TOPSPIN		Version 1.3
$$ ##JCAMPDX= 5.01
$$ ##ORIGIN= Bruker BioSpin GmbH
$$ ##OWNER= Irina
$$ $$ F:/spectra/data/iren/nmr/1H/4/audita.txt
$$ ##AUDIT TRAIL=  $$ (NUMBER, WHEN, WHO, WHERE, VERSION, WHAT)
(   1,<2024-12-13 11:26:44.984 +0400>,<Irina>,<DPX200>,<TOPSPIN 1.3>,
      <created by zg
	started at 2024-12-13 11:26:07.562 +0400,
	POWCHK disabled, PULCHK disabled
       configuration hash MD5:
       BE 6D 3F 07 2A EA 11 49 91 17 2B D3 AF B3 58 0D
       data hash MD5: 16K
       06 A4 5A 2E 9C 0A D2 2D 84 74 BA 2D 67 99 71 10>)
$$ ##END=
$$ 
$$ $$ hash MD5
$$ $$ 18 62 2A 20 D5 77 24 06 47 48 B4 1D F0 FE 04 E7
##$RELAX= 
##$RELAX= 
##$RELAX= 
##$RELAX= 
##$RELAX= 
##$RELAX= 
##$RELAX= 
##$RELAX= 
##$RELAX= 
$$ Bruker specific parameters
$$ --------------------------
##$DU= <F:/spectra>
##$EXPNO= 4
##$NAME= <1H>
##$PROCNO= 1
##$TYPE= <nmr>
##$USER= <iren>
##$AMP= (0..31)
100 100 100 100 100 100 100 100 100 100 100 100 100 100 100 100 100 100 
100 100 100 100 100 100 100 100 100 100 100 100 100 100 
##$ANAVPT= -1
##$AQSEQ= 0
##$AQ_mod= 1
##$AUNM= <au_zg>
##$AUTOPOS= <>
##$BF1= 200.13
##$BF2= 200.13
##$BF3= 200.13
##$BF4= 200.13
##$BF5= 200.13
##$BF6= 200.13
##$BF7= 200.13
##$BF8= 200.13
##$BYTORDA= 1
##$CFDGTYP= 0
##$CFRGTYP= 5
##$CHEMSTR= <none>
##$CNST= (0..63)
1 1 145 1 1 1 1 1 1 1 1 1 1 1 1 1 1 1 1 1 1 1 1 1 1 1 1 1 1 1 1 1 1 1 
1 1 1 1 1 1 1 1 1 1 1 1 1 1 1 1 1 1 1 1 1 1 1 1 1 1 1 1 1 1 
##$CPDPRG= <>
##$CPDPRG1= <>
##$CPDPRG2= <>
##$CPDPRG3= <>
##$CPDPRG4= <mlev>
##$CPDPRG5= <mlev>
##$CPDPRG6= <mlev>
##$CPDPRG7= <mlev>
##$CPDPRG8= <mlev>
##$CPDPRGB= <>
##$CPDPRGT= <>
##$D= (0..63)
0 2 0 0 0 0 0 0 0 0.06 0 0.03 0 0 0 0 0.0002 0 0 0 0 0 0 0 0 0 0 0 0 0 
0 0 0 0 0 0 0 0 0 0 0 0 0 0 0 0 0 0 0 0 0 0 0 0 0 0 0 0 0 0 0 0 0 0 
##$DATE= 1734074801
##$DBL= (0..7)
120 120 120 120 120 120 120 120 
##$DBP= (0..7)
150 150 150 150 150 150 150 150 
##$DBP07= 0
##$DBPNAM0= <>
##$DBPNAM1= <>
##$DBPNAM2= <>
##$DBPNAM3= <>
##$DBPNAM4= <>
##$DBPNAM5= <>
##$DBPNAM6= <>
##$DBPNAM7= <>
##$DBPOAL= (0..7)
0.5 0.5 0.5 0.5 0.5 0.5 0.5 0.5 
##$DBPOFFS= (0..7)
0 0 0 0 0 0 0 0 
##$DE= 6
##$DECBNUC= <off>
##$DECIM= 32
##$DECNUC= <off>
##$DECSTAT= 4
##$DIGMOD= 1
##$DIGTYP= 9
##$DL= (0..7)
0 120 120 120 120 120 120 120 
##$DP= (0..7)
150 150 150 150 150 150 150 150 
##$DP07= 0
##$DPNAME0= <>
$$ [...]
##$SW= 21.9926040160658
##$SWIBOX= (0..15)
0 0 2 0 0 0 0 0 0 0 0 0 0 0 0 0 
##$SW_h= 4401.40845070422
##$TD= 16384
##$TD0= 1
##$TE= 300
##$TE2= 300
##$TE3= 300
##$TEG= 300
##$TL= (0..7)
0 120 120 120 120 120 120 120 
##$TP= (0..7)
150 150 150 150 150 150 150 150 
##$TP07= 0
##$TPNAME0= <>
##$TPNAME1= <>
##$TPNAME2= <>
##$TPNAME3= <>
##$TPNAME4= <>
##$TPNAME5= <>
##$TPNAME6= <>
##$TPNAME7= <>
##$TPOAL= (0..7)
0.5 0.5 0.5 0.5 0.5 0.5 0.5 0.5 
##$TPOFFS= (0..7)
0 0 0 0 0 0 0 0 
##$TUNHIN= 0
##$TUNHOUT= 0
##$TUNXOUT= 0
##$USERA1= <user>
##$USERA2= <user>
##$USERA3= <user>
##$USERA4= <user>
##$USERA5= <user>
##$V9= 5
##$VALIST= <valist>
##$VCLIST= <CCCCCCCCCCCCCCC>
##$VD= 0
##$VDLIST= <DDDDDDDDDDDDDDD>
##$VPLIST= <PPPPPPPPPPPPPPP>
##$VTLIST= <TTTTTTTTTTTTTTT>
##$WBST= 1024
##$WBSW= 25
##$XGAIN= (0..3)
0 0 0 0 
##$XL= 0
##$YL= 0
##$YMAX_a= 376625
##$YMIN_a= -585969
##$ZGOPTNS= <>
##$ZL1= 120
##$ZL2= 120
##$ZL3= 120
##$ZL4= 120
##$ABSF1= 10
##$ABSF2= 0
##$ABSG= 5
##$ABSL= 3
##$ALPHA= 0
##$AQORDER= 0
##$ASSFAC= 0
##$ASSFACI= 0
##$ASSFACX= 0
##$ASSWID= 0
##$AUNMP= <proc_1d>
##$AXLEFT= 0
##$AXRIGHT= 0
##$AXTYPE= 0
##$AXUNIT= <>
##$AZFE= 0.1
##$AZFW= 0.1
##$BCFW= 1
##$BC_mod= 2
##$BYTORDP= 1
##$COROFFS= 0
##$CY= 7568.61572265625
##$DATMOD= 1
##$DC= 2
##$DFILT= <>
##$DTYPP= 0
##$F1P= 17.9538593292236
##$F2P= -4.03888763876832
##$FCOR= 0.5
##$FTSIZE= 32768
##$FT_mod= 4
##$GAMMA= 1
##$GB= 1
##$INTBC= 1
##$INTSCL= 1
##$ISEN= 128
##$LB= -0.5
##$LEV0= 0
##$LPBIN= 0
##$MAXI= 945.577
##$MC2= 0
##$MEAN= 0
##$ME_mod= 0
##$MI= -402.1523
##$NCOEF= 0
##$NC_proc= 0
##$NLEV= 6
##$NOISF1= 8.587773
##$NOISF2= 6.764455
##$NSP= 1
##$NTH_PI= 0
##$NZP= 0
##$OFFSET= 17.49637
##$PC= 1
##$PHC0= -36.42325
##$PHC1= 11.55268
##$PH_mod= 0
##$PKNL= yes
##$PPARMOD= 0
##$PPDIAG= 0
##$PPIPTYP= 0
##$PPMPNUM= 100
##$PPRESOL= 1
##$PSCAL= 0
##$PSIGN= 0
##$REVERSE= no
##$SF= 200.13
##$SI= 32768
##$SIGF1= 18.5376
##$SIGF2= -6.396296
##$SINO= 400
##$SIOLD= 32768
##$SREGLST= <1H.CDCl3>
##$SSB= 3
##$STSI= 0
##$STSR= 0
##$SW_p= 4401.40845070422
##$SYMM= 0
##$S_DEV= 0
##$TDeff= 0
##$TDoff= 0
##$TI= <>
##$TILT= no
##$TM1= 0
##$TM2= 0
##$TOPLEV= 0
##$USERP1= <user>
##$USERP2= <user>
##$USERP3= <user>
##$USERP4= <user>
##$USERP5= <user>
##$WDW= 1
##$XDIM= 8192
##$YMAX_p= 0
##$YMIN_p= 0
$$ End of Bruker specific parameters
$$ ---------------------------------
##NTUPLES= NMR FID
##VAR_NAME=  TIME,          FID/REAL,        FID/IMAG
##SYMBOL=    X,             R,               I
##VAR_TYPE=  INDEPENDENT,   DEPENDENT,       DEPENDENT
##VAR_FORM=  AFFN,          ASDF,            ASDF
##VAR_DIM=   8192,          8192,            8192
##UNITS=     SECONDS,       ARBITRARY UNITS, ARBITRARY UNITS
##FACTOR=    0.0002272,     1,               1
##FIRST=     0,             0,               0
##LAST=      1.8609952,     32,              24
##MIN=       0,             -585969,         -585969
##MAX=       1.8609952,     376625,          376625
$$ Real data points
##PAGE= N=1
##DATA TABLE= (X++(R..R)), XYDATA
0 0 0 0 0 0 0 0 0 0 0 0 -8 8 -8 16 -16 16 -24 32 -40 41 -54 64 -72 88 -104 120 -137 161 -185 216 -247 280
32 280 -319 361 -407 457 -513 577 -642 720 -800 889 -986 1090 -1209 1336 -1474 1626 -1789
49 -1789 1971 -2171 2393 -2638 2911 -3216 3559 -3952 4401 -4921 5535 -6272 7174 -8308
63 -8308 9785 -11798 14714 -19347 27843 -48583 206297 74233 -499158 -316427 138977
74 138977 376625 93952 -223900 -266503 -36729 97527 95125 62810 82565 6069 -114855
85 -114855 -115547 75942 211570 98095 -181811 -284849 -84611 181650 182165 -29782 -158950
96 -158950 -64907 86138 131636 72551 11958 -21098 -55322 -84533 -34416 70899 83029 -54697
108 -54697 -162062 -74422 111403 164940 38796 -90781 -66917 45028 73155 -5227 -54017
119 -54017 -22884 -9805 -54539 -57583 30339 101858 50760 -58958 -67243 55040 138066 45808
131 45808 -106465 -108464 27319 87029 -17365 -124013 -66511 83258 113654 -19276 -114958
142 -114958 -20053 132245 116952 -48443 -139620 -50805 76902 70957 -43191 -97461 -25097
153 -25097 58857 48719 -681 5260 40356 24546 -28659 -35725 16743 44335 -10954 -83396
165 -83396 -67695 21587 65557 16630 -39257 -21321 35683 49642 9614 -21388 -5981 13108
177 13108 -12188 -47370 -28114 25800 35715 -10539 -38928 -1630 53867 53417 3 -32680 -10176
190 -10176 15951 -1550 -30597 -22792 3601 285 -26341 -23381 22942 55335 24214 -29617 -27225
203 -27225 26930 46861 -2154 -51623 -35336 16191 26292 -15225 -38017 2878 52926 37673
215 37673 -21148 -36958 11374 51117 22025 -42181 -61883 -16885 29098 20240 -16951 -25418
227 -25418 -2109 16787 19406 19819 19556 5276 -20413 -28911 -1570 30355 17033 -32556 -50873
240 -50873 -8261 43390 44064 1075 -28702 -12508 21516 25521 -1013 -19253 -15705 -12643 -16293
253 -16293 -8966 10103 18048 2888 -16121 -9041 23425 40468 14161 -24309 -27844 -1276 15053
266 15053 4872 -12964 -16870 -5796 4948 7225 11021 17791 9599 -12775 -18407 3293 20164
279 20164 5061 -26262 -36248 -9659 24106 23592 -6294 -19258 2471 25108 21035 1783 -9729
292 -9729 -6921 -163 -2119 -8602 -5893 1444 -1915 -7764 1253 15666 14496 228 -8466 -3420 6880
307 6880 5330 -11196 -20536 -7628 7187 3004 -6909 -2684 10431 15617 8430 -1926 -1558 8295
321 8295 7794 -8224 -16951 -6450 4239 1195 -6412 -5968 2781 11303 9068 -804 -2535 4161 2506
336 2506 -7689 -9875 -3270 -776 -4886 -6899 -1715 8521 13574 5458 -3141 3017 12655 7212 -6353
351 -6353 -10635 -5438 -416 -1665 -7467 -7995 2080 9409 3721 -2600 2373 8249 4372 -3804 -8055
366 -8055 -6028 -685 -171 -6369 -6907 2375 8120 4724 3136 6760 7928 4016 -1152 -3797 -1923 208
382 208 -5372 -12588 -8002 3365 5711 -564 -3033 1605 7722 8681 1573 -6194 -4668 958 -581
397 -581 -5977 -5557 -1208 1600 2991 4168 5027 6606 5923 1164 -1444 1499 1313 -5652 -10428 -7339
413 -7339 -1673 789 -849 -3240 -568 6325 8153 2830 -727 777 944 -2124 -4038 -3738 -1872 -58
429 -58 -647 -1590 2411 7701 7121 2401 238 696 623 -882 -3938 -6755 -6143 -3879 -3516 -2511 1681 4570
447 4570 3166 1257 1970 4244 5269 2396 -3689 -6328 -2910 414 -102 -1090 -395 812 2468 4247
463 4247 4562 3717 2024 -2000 -5453 -4419 -1377 -1528 -4198 -5674 -4697 -494 4997 6916 4217 1407
479 1407 583 880 2970 4277 618 -5580 -7610 -3976 1743 5522 3459 -2591 -3785 2194 6860 5056
495 5056 62 -4686 -6860 -4645 -1137 -498 -1573 -1994 -2970 -1828 4086 8941 6906 1656 -1539 -1544 1108
512 1108 3675 754 -5189 -6251 -2484 395 1784 2589 1359 112 890 674 -851 465 1799 -2109
528 -2109 -6793 -6033 -1940 2073 4081 1898 -2023 -573 5065 7171 4962 1686 -2522 -5162 -2433
543 -2433 1265 271 -2258 -2767 -3259 -2401 1979 5216 4009 836 -2681 -5158 -2103 4571 4672 -3250
559 -3250 -9022 -6732 1083 9065 9370 398 -6494 -2087 6399 8481 3905 -3520 -8571 -6134 795
574 795 3109 533 -1663 -3602 -4736 -515 6581 7697 1726 -4843 -7066 -2327 5763 6628 -2366 -8891
590 -8891 -5179 3020 7719 6637 536 -4118 -1250 3970 3579 15 -2070 -3597 -4466 -2721 -193 557
606 557 897 30 -2509 -1941 3321 5786 2261 -2012 -3358 -2322 907 3012 288 -3133 -1870 1696
622 1696 3310 3095 1273 -1083 -275 2147 598 -3371 -3310 -391 408 -1378 -3336 -3291 425 4750 3620
639 3620 -1038 -2402 512 2843 2826 702 -2707 -3748 -745 1807 1650 1227 938 -707 -1399 702 2968
656 2968 2829 -34 -4279 -5755 -1376 3578 2194 -3233 -5162 -1881 3081 5363 3091 -1132 -2211
671 -2211 98 1827 1663 762 -930 -2608 -1928 359 1911 2254 1181 -1261 -2365 -70 2500 2240
687 2240 -687 -3591 -4157 -1335 2047 1732 -1184 -2544 -1019 1896 4054 3283 -133 -2171 -609 1606
703 1606 1557 -291 -1900 -1850 57 1176 350 -425 375 727 124 -397 -498 -673 -512 -654 -1350 -1393 -515 164
723 164 456 1162 1467 898 584 643 666 955 954 -433 -1983 -1489 437 1228 183 -1171 -1692 -214 1739
742 1739 1531 -313 -1159 -909 -838 -529 -29 -191 -666 -544 -247 612 2160 2386 751 -449 -294 343 939
761 939 1090 -539 -2462 -2093 122 1291 876 -392 -1635 -1212 1126 2128 473 -1334 -1781 -1287 273
778 273 1414 417 -1264 -869 790 1752 1926 1265 -242 -700 504 919 -14 -642 -997 -1602 -893 349
796 349 240 -580 -217 205 52 423 515 -373 -706 47 -172 -635 71 741 298 383 1007 743 611 1093 571
817 571 -628 -353 127 -410 -882 -841 -1252 -990 499 586 -578 -609 477 672 621 536 -470 -1250 -38 1046
837 1046 453 -173 -28 -160 471 1777 1337 -311 -488 154 -96 -205 -148 -1148 -1953 -840 166 -70 -35
856 -35 129 -393 -63 1264 984 -209 -101 176 -234 -122 616 385 -85 361 264 -107 711 1186 -71 -891
876 -891 -520 -632 -699 -20 -337 -1607 -1422 -4 632 646 712 -70 -429 745 1619 764 -289 -418 -642 -139
896 -139 1144 800 -730 -850 210 663 531 329 -605 -1228 -354 26 -580 -757 -520 -849 -584 521 865
915 865 355 484 653 316 594 999 352 -354 -178 -51 -327 8 203 -307 -474 7 90 -104 223 -78 -914
936 -914 -858 -190 34 -288 -297 -407 -200 787 1195 578 297 592 556 468 561 50 -700 -600 -197 -180 -230 -191 -511
959 -511 -501 147 351 -198 -428 -346 -334 -53 91 -291 -477 99 579 500 453 600 453 549 665 224 -104 -64 -105
982 -105 -553 -531 -360 -481 -392 -198 -188 -191 140 206 -144 -26 71 -143 -192 153 206 7 124 357 330 607 765 283
1006 283 -47 191 162 -219 -299 -444 -826 -504 -163 -400 -452 26 55 -229 39 486 292 92 141 -133 -145 519
1028 519 489 -53 -33 311 205 260 548 334 -179 -242 -301 -610 -209 91 -644 -1062 -435 76 272 403 87 -476
1050 -476 -107 862 788 165 66 -178 -350 302 786 301 -249 -144 -177 -12 626 393 -665 -823 -253 -261 -257 -38
1072 -38 -329 -754 -270 212 166 514 732 42 -374 280 808 481 187 -172 -565 -186 726 387 -410 -267 -30
1093 -30 -223 -124 184 -200 -415 -149 -437 -707 24 681 42 -449 -113 169 580 998 531 -388 -234 418 239
1114 239 169 260 -260 -755 -199 246 83 65 14 -607 -764 19 439 66 -139 -462 -799 -233 927 960 124
1135 124 -387 -328 181 1118 1235 -167 -1104 -434 393 503 277 -374 -914 -508 241 146 -55 127 -74 -687
1155 -687 -487 210 611 458 -222 -1011 -641 1004 1560 373 -668 -505 277 917 903 -199 -969 -380 172
1174 172 -30 -165 -161 -270 -282 -329 -319 53 635 442 -591 -843 26 765 654 101 -540 -481 451 1084 497 -68
1196 -68 -224 -162 54 431 139 -378 -337 -104 -323 -505 -117 235 184 -213 -739 -514 629 1251 247 -1051
1216 -1051 -918 244 1150 941 -196 -892 -208 842 886 133 -268 -250 -177 -143 -338 -162 279 124 -864 -1249
1236 -1249 -74 1192 985 -460 -1400 -580 1118 1521 136 -1160 -725 479 971 634 -99 -366 -130
1253 -130 212 77 98 300 7 -592 -762 -336 199 477 -74 -959 -969 191 998 644 -49 -508 -463 424 886
1274 886 481 -287 -448 -106 328 646 311 -445 -378 239 158 -328 -284 86 57 -370 -666 -574 175 846 123 -855
1296 -855 -503 613 924 408 -259 -453 72 850 336 -506 -179 487 242 -403 -510 -33 468 403 -598 -1230
1316 -1230 -146 916 369 -914 -893 -191 468 576 182 -326 81 543 72 -33 523 465 -220 -318 -47 137
1336 137 348 180 -560 -793 -9 423 30 -173 -228 -541 -304 259 249 -77 -104 -222 -247 439 1037 281 -432
1357 -432 -132 426 468 322 -12 -415 -18 294 -192 -544 51 233 -363 -599 -100 252 339 -52 -653 -569 412
1378 412 760 -154 -453 224 519 370 222 -7 55 522 364 -531 -406 443 352 -513 -600 -215 7 158 -55
1399 -55 -653 -325 516 161 -520 -233 360 316 -45 -47 75 344 667 70 -424 114 616 101 -349 -97 96
1420 96 -57 -47 -310 -449 -75 144 -328 -516 203 372 0 -196 -17 178 418 264 -195 -164 482 499 -86
1441 -86 -151 273 281 37 -151 -119 -23 147 -216 -583 -238 179 -78 -576 -335 108 197 141 -194 -164 433 543 53
1464 53 -298 152 506 296 -98 -199 3 354 225 -331 -423 190 265 -269 -534 -330 38 95 -186 -421 -204
1485 -204 409 344 -206 -80 307 336 78 24 40 258 305 9 -279 -4 294 46 -335 -236 39 25 -119 -246
1507 -246 -344 -16 47 -264 -343 77 255 92 -73 11 201 431 250 -121 -94 352 352 -135 -154 46 118 -82 -146
1530 -146 -243 9 103 -214 -525 -133 187 94 -295 -266 -53 227 259 29 -174 214 409 140 -63 112 242 91
1552 91 5 -111 -122 68 114 -367 -397 158 115 -243 -250 -173 -81 119 75 -277 -139 247 220 -121 29 321 199 60
1576 60 96 142 163 304 -17 -302 -142 227 -20 -301 -134 -149 -124 14 -71 -303 -102 192 -37 -158 217 162 -56
1599 -56 -1 219 127 202 276 -68 -100 222 163 -213 -96 58 -196 -214 -38 -92 -155 15 -92 -339 -82 252 48
1622 48 -219 -6 146 106 252 76 -117 184 380 94 -123 139 189 -53 -43 -36 -123 -39 69 -239 -414 -31 167
1645 167 -111 -194 -23 -75 -21 227 62 -48 152 196 -77 31 290 118 -38 116 83 -58 82 147 -147 -289
1667 -289 -79 -101 -190 33 -52 -290 -157 29 3 -52 92 -68 -152 101 302 135 59 111 14 48 264 134 -84
1690 -84 -47 54 -54 -155 93 -98 -235 -151 -103 -185 -69 60 -197 -304 48 147 89 165 144 -75 24 315 168
1713 168 80 20 34 -43 33 95 -88 -76 -63 -227 -147 -38 40 -165 -190 -183 -235 24 181 55 -106 -8 81 235 298 278
1739 278 -24 -83 150 131 53 30 -14 -120 -107 51 -32 -99 -67 -117 -237 -107 104 -14 -23 -118 -195 -1 303 259 15
1764 15 -44 36 210 364 273 -101 -92 121 145 -79 -70 -54 -109 -140 -157 -220 -83 159 -46 -343 -200 69 104 80 -62
1789 -62 -148 29 356 337 -27 -2 138 124 217 67 -63 36 134 -80 -286 -107 -9 -99 -272 -165 -240 -65 184 72
1813 72 -200 -194 67 95 119 125 0 -14 264 299 76 9 50 11 -51 60 -30 -121 19 60 -262 -290 -58 63 -43 -92
1839 -92 -217 -216 167 439 -24 -157 19 236 220 133 1 -84 168 265 -45 -148 70 192 -107 -240 -176 -41 43
1862 43 5 -339 -403 83 219 -28 -140 -14 -11 150 308 28 -99 214 273 -41 3 157 108 -60 -31 -72 -112 31
1886 31 87 -298 -220 -16 -121 -249 -16 27 -161 -93 80 182 93 140 -41 -68 215 225 -83 13 232 16 -97
1909 -97 -14 -5 -61 72 -71 -323 -188 117 20 -241 -210 -103 -21 141 98 -175 -37 328 170 -135 -20 238 165
1932 165 -25 2 -29 108 220 -33 -323 -75 191 62 -161 -134 -128 -60 12 -90 -245 -26 194 -86 -114 212 167
1955 167 168 88 -26 7 199 232 -91 -106 138 131 -49 -84 -74 -76 -126 -158 -102 -58 67 -118 -213 -50 214 73 -69 -11
1981 -11 65 112 225 32 2 117 167 15 -116 135 144 24 -17 -193 -110 25 54 -253 -218 -19 69 -36 -209 -48
2005 -48 45 95 72 -57 105 298 164 -36 -111 147 227 84 -138 -55 52 143 -74 -230 -127 54 -88 -235 -133
2028 -133 -73 37 26 -102 -108 105 191 -15 34 112 119 169 113 60 26 67 47 -78 28 185 9 -161 -120 -76 -14 -61
2054 -61 -163 -156 -65 78 -55 -176 -48 119 19 -26 26 98 195 113 -2 -92 172 261 -50 -154 -8 90 13 -84 -163
2079 -163 -138 47 9 -217 -166 10 -2 -8 -87 -73 94 145 99 -169 33 262 106 -83 29 137 62 48 24 -157
2103 -157 28 134 -106 -257 -19 40 -147 -138 -60 6 5 -1 -98 -120 125 195 -68 6 168 148 97 78 38 -27 168 92
2129 92 -121 -166 126 43 -196 -180 15 -101 -13 -66 -152 -59 121 35 -146 48 165 79 -29 45 21 166 157 38 -124
2154 -124 112 108 -69 -193 -25 11 -57 -67 -78 -142 -51 84 -151 -195 38 100 -55 -35 16 133 112 106 15 -73 219 146
2180 146 -102 32 123 74 -55 -41 -72 -91 68 -40 -190 -125 134 -69 -185 -45 70 9 133 13 -47 43 228
2203 228 48 -97 138 153 -5 -10 0 -31 31 -24 -47 -126 6 -29 -153 -212 37 2 -71 -74 -131 -20 143 53 -85 -59
2229 -59 203 120 45 32 100 130 140 -24 -56 34 108 -69 -250 -105 -21 -34 -155 -155 -108 22 30 -90 -118 34 174 -23
2255 -23 -5 82 98 20 43 19 32 122 104 -84 -42 1 14 -38 -82 -47 -23 -1 -92 -166 -38 14 -32 -104 -3 131 -11 59
2283 59 -16 -71 111 170 69 1 38 113 59 1 -38 -54 22 28 -141 -90 49 -15 -77 -117 -71 9 -12 48 -63 -27 81 93
2311 93 -9 90 87 -25 -11 92 -17 47 49 -35 -57 -27 38 -99 -139 -25 -60 -142 -21 4 -67 6 -11 -30 78 97 73
2338 73 11 90 105 44 113 64 77 -63 36 49 -98 -4 6 -96 -31 -69 -68 3 27 -27 -165 -23 63 -19 -51 3 30 -8
2366 -8 148 173 -10 90 177 51 -21 46 -13 4 -34 -13 -88 2 53 -18 -125 -17 -20 -35 34 -1 -137 -63 90 78 6
2393 6 28 62 65 37 109 14 20 103 155 -81 -7 3 -41 -40 -96 -95 -64 53 8 -139 -138 -51 10 -28 62 -8 -68 99 74 7 35
2424 35 74 32 -4 83 54 -20 101 37 -96 -55 8 -23 -44 -11 -19 -105 -69 6 -68 -63 55 3 -33 16 42 -29 86 129 66
2453 66 -35 143 82 35 -18 -7 -60 34 61 -50 -162 -41 33 -50 -27 -70 -58 4 33 34 -85 130 75 51 30 60 63 40
2481 40 90 -10 -4 59 87 -114 -13 12 20 -15 -14 -75 -111 -37 61 -35 -107 39 -3 49 22 15 42 133 114 50 87 55 28 36 10
2512 10 -3 -38 8 31 0 -8 -28 -49 -69 24 0 -80 -74 8 4 -8 2 -2 37 136 33 -1 35 151 89 22 21 74 40 72 -38
2543 -38 -117 -23 20 -28 -70 -39 6 -86 -37 -62 -58 -6 73 3 -40 25 49 58 64 44 66 51 104 -20 -35 30 111 34 -45 8 -27
2574 -27 26 -33 -66 -82 43 10 -68 4 54 -25 -17 64 54 42 56 34 16 70 96 -48 -75 81 15 -86 -60 -119 -30 -44 -22
2603 -22 -78 -94 -9 46 -48 22 90 33 100 50 -33 58 99 88 -43 -22 69 29 44 13 -2 -35 41 -5 -105 -34 84 -45
2631 -45 -55 -93 -8 -26 22 62 -62 -46 84 58 17 49 40 15 77 95 -9 19 42 -6 -122 19 49 -94 -22 16 -27 -83
2659 -83 80 -22 -28 17 1 -57 15 101 22 -74 -20 73 46 32 59 -11 40 90 37 -48 -46 49 10 -39 5 -50 -129 61 -63
2688 -63 -83 18 -12 2 -30 60 39 26 54 65 35 82 83 -13 7 96 6 -19 -70 -56 -66 -48 19 -126 -42 -5 6 -62 28 48
2718 48 -72 2 94 38 44 56 73 -12 79 64 -7 20 90 40 -82 13 7 -143 -37 22 -56 -118 -82 49 -51 50 -9 -19
2746 -19 124 25 13 34 102 72 -1 40 62 44 27 6 12 -31 -11 -23 -81 -64 -7 -46 -84 42 -48 31 66 26 -14 -20 28 4
2776 4 -73 23 50 47 13 37 45 45 45 -23 -8 49 17 -103 -61 -32 -44 -17 -85 -50 -56 5 11 -20 -28 71 -27 -39 61 52 35 73 38 -41
2810 -41 47 23 82 -34 36 -80 -12 -42 22 -26 38 -29 -52 -24 29 3 -4 -9 -4 22 0 63 -61 79 54 21 -57 58 77
2839 77 -23 32 45 -20 7 61 -27 -25 27 10 -12 -49 -31 -36 -5 7 -37 13 31 65 17 54 -15 50 59 89 -14 -5 75 34 19
2870 19 3 31 -27 17 6 54 -48 -3 -46 -31 -71 9 -19 -34 38 65 5 39 94 -26 32 104 57 -58 57 81 21 2
2898 2 23 5 -29 -3 -30 -18 -39 19 -44 -5 -8 81 1 59 -12 6 92 39 -14 -72 110 37 -22 -2 20 7 16 -44 -42 -53 -1 11
2930 11 -44 -13 6 -51 -71 -22 -34 37 61 22 24 69 125 38 -49 104 -4 18 0 23 -27 16 9 -54 28 55 -29 -44 13 49
2960 49 -83 -30 -74 -5 -13 9 41 -41 15 20 49 45 126 18 2 18 2 -112 -19 51 26 5 56 -50 -34 -33 24 -98 -44 -15
2990 -15 5 11 11 17 21 -14 58 4 2 126 13 -52 86 9 -21 -46 2 -19 36 -33 -53 -75 8 -65 -69 -29 -37 -44 -34 44 -14 -14 38
3023 38 64 -6 -12 48 -12 -17 14 -14 -16 11 89 19 -31 4 -85 -10 -35 29 -22 -36 7 -13 -69 7 -40 -5 -28 17 34 3 34 27
3055 27 19 26 14 38 23 11 -53 -17 -12 -21 -40 38 -19 -52 -11 22 -104 -70 49 -18 34 56 -15 10 33 29 66 31 2 -21 62 26
3087 26 5 -42 -24 -8 -28 -69 4 -3 -14 -20 11 -15 -19 -47 -88 -42 78 45 72 53 37 9 29 -13 -4 4 26 -8 -29 8 39 -55
3119 -55 -30 -66 -14 -104 -47 -68 -42 97 27 6 -78 1 39 46 24 41 25 36 88 -8 1 71 23 -99 8 29 13 -6 -35 -58
3149 -58 -49 44 32 -71 -72 33 21 -49 19 83 -25 69 -22 -9 12 45 -28 -44 4 29 -1 99 35 -44 73 63 -15 -44 -16
3178 -16 22 -22 -9 -3 -15 -23 22 42 -66 10 25 28 28 64 52 -35 73 0 -22 17 20 -40 8 47 -70 -34 50 15 -17 -47 -46 -71
3210 -71 -4 25 -22 -23 -31 16 -41 47 35 43 14 47 34 -1 -88 85 -13 -66 26 45 28 -36 -47 -37 50 -3 -4 -53 7 -45 -10 -28
3242 -28 22 -8 35 51 63 -102 34 -5 11 79 -27 23 -6 -11 26 -35 9 27 -59 30 -40 4 -32 13 -9 18 -23 85 15
3271 15 -10 65 -35 18 80 21 37 -28 -95 -12 -38 38 -23 -60 -20 42 -29 -8 -47 5 27 53 6 4 54 18 24 -16 5 18 31
3302 31 8 -54 30 83 46 31 -2 14 22 -90 -4 -79 34 -19 -45 -52 -31 37 -53 2 54 57 88 27 -16 44 46 39 -13 -6 33 -4
3334 -4 -13 20 -20 3 -43 -89 -45 11 -41 29 46 -14 23 -30 60 69 -6 19 -68 -10 -6 28 14 38 18 1 62 -43 -5 -19 -52 -3
3366 -3 43 0 -26 50 -7 -92 -74 -35 43 -29 3 -66 51 28 -10 3 53 49 40 17 0 9 -9 3 -30 25 -9 25 -24 -8 -24 -42
3398 -42 -7 -3 28 -10 0 30 1 -8 91 83 9 -44 34 -2 61 65 -27 -13 23 65 -62 14 55 33 -17 -34 -5 -7 26 4 -1 -2 71
3431 71 -25 39 32 -13 40 -20 65 -28 15 61 14 -4 27 6 -59 27 29 -52 22 56 -28 14 -40 -15 -20 51 -36 -15 32 4 -13 26
3463 26 60 162 36 -3 -3 -51 11 25 1 6 14 -43 -66 53 44 9 -88 -1 10 3 -4 9 39 15 38 31 -18 22 -47 -56 23 2 -4
3496 -4 -31 47 17 1 17 15 -22 -43 -4 7 -26 -15 -46 11 40 33 -37 -10 -37 14 -7 45 -2 -53 4 74 25 13 31 -17 2 -69
3528 -69 -65 -17 8 -19 -38 -27 13 -13 -74 -35 29 15 -39 22 50 1 43 -14 -16 72 49 28 -31 59 -20 41 36 23 -64 -74 7 -61
3560 -61 -36 27 -32 -30 -12 29 17 1 32 -5 30 65 31 -34 -15 50 -2 36 -31 20 -16 -49 25 -1 -15 -91 -86 -23 -27 -8 36 -41
3592 -41 -35 -6 57 -42 34 5 35 35 22 -21 24 -32 21 14 -17 44 6 29 -23 -27 59 -10 -43 -20 -66 -22 17 8 -31 1 -55 5 3
3625 3 32 15 2 45 36 -29 21 10 -42 -17 11 -10 1 -14 -27 -15 -21 -12 -40 18 21 9 8 -30 49 -56 14 11 -8 47 55 18 66 6
3659 6 84 52 -43 -21 -43 29 44 -6 -51 -47 -15 -98 12 -5 -39 34 63 -8 -9 42 14 -24 -28 8 -11 -10 36 -20 -88 39 -28 16
3691 16 2 -44 -4 1 -1 -14 -65 -45 40 28 -81 -29 15 -19 -7 16 -28 19 -8 44 -9 15 4 84 -31 13 -65 6 20 -9
3721 -9 28 -35 -37 -89 -14 -22 -8 -44 -3 24 56 31 -11 42 -12 52 -15 32 5 32 -16 -55 4 -40 -34 -6 2 -56 -13 2 -2 -33 22
3754 22 -36 -28 7 -32 -1 -8 27 -18 47 -77 -14 48 22 20 87 11 53 -86 -43 13 -16 -24 -23 -30 -10 51 -7 -7 -63 -41 1 -54 -51
3787 -51 -1 3 13 54 34 -14 60 -1 16 35 -1 -10 -56 -80 -30 6 -25 40 -8 -50 28 34 2 71 -90 -54 -20 18 24 45 7 -15
3819 -15 53 28 39 -41 18 -2 -7 21 -16 -33 -34 -30 25 18 -43 -25 28 -6 -6 3 -67 15 5 20 41 44 -12 8 0 -44 -24 -2 -23 -32 4
3854 4 16 -8 -12 -1 15 6 -8 -53 16 78 -42 -7 39 27 14 29 10 -20 46 17 -71 12 39 -33 -10 29 31 0 55 -29 40 -9
3886 -9 -30 20 -40 -21 -29 -25 19 -22 59 -17 0 38 42 -43 29 2 -43 39 -2 36 5 -3 20 -43 -47 68 44 16 -18 11 -25 -12 -83
3919 -83 54 32 28 -9 38 11 -41 29 -6 58 -13 -3 62 64 -21 -11 31 -41 45 -54 -44 -16 -21 20 9 41 6 -38 -37 17 -57 -17
3951 -17 -4 -86 5 35 36 -9 28 50 36 28 -22 -8 -29 11 9 7 -25 -1 -34 29 41 -8 12 -5 -37 -11 -45 24 47 8 40 47 -28
3984 -28 31 77 -37 38 64 2 -44 4 59 31 62 61 -32 -16 6 18 -5 45 18 -23 16 -54 -14 -22 33 61 -84 94 35 -23
4014 -23 -21 24 71 -54 12 11 48 -36 -16 -17 0 19 -42 -86 -14 -37 -79 -39 36 -10 10 -50 28 -34 -39 9 -34 63 34 -2 -59 -3
4046 -3 35 -11 22 13 0 6 -19 -39 -12 -73 -22 4 -27 18 0 41 25 7 43 5 76 36 -5 7 2 -51 6 -21 -19 -18 33 -9 24
4079 24 18 22 -52 48 10 -48 -44 57 43 17 48 3 5 -27 -25 -5 3 60 21 -47 47 24 -20 -14 2 -12 -18 -57 38 -33 -24 24 -64 -23
4113 -23 -21 2 69 58 -70 -13 14 34 0 15 37 21 -14 46 -11 22 -31 -8 -26 -63 -39 4 5 -20 -23 32 -7 -27 29 96 17
4144 17 -12 -22 -40 48 -1 26 -2 -2 -40 -3 41 31 -3 27 -38 -57 -31 6 -21 15 20 -49 4 -34 -67 -26 7 -17 -19 24 -20 43
4176 43 23 85 12 34 59 20 -50 5 59 -42 20 -52 -1 10 -3 -27 -56 -63 2 37 0 -32 46 17 -19 -26 -18 7 -44 -17 14
4207 14 -15 -44 -56 47 0 9 6 33 5 -1 40 13 -52 31 50 -49 11 0 -22 -44 6 44 26 4 -19 39 52 -25 -33 49 -19 -13
4239 -13 2 -9 -13 -77 2 -53 -30 -62 48 -12 -45 71 -37 -36 -16 61 7 -27 -37 -54 36 93 59 13 10 -33 28 61 -17 38
4269 38 -59 -56 32 -3 -12 -10 44 -5 -24 37 -49 43 18 37 -27 35 -16 41 30 -36 -28 1 6 -68 -4 38 33 -4 -2 33 -17 -27 -31 29
4303 29 -23 -29 19 -8 61 19 -33 12 -7 -6 -3 14 37 -61 23 21 39 53 16 -14 -58 -38 -6 21 -14 20 19 -14 -30 35 -13 1 -7
4336 -7 23 18 60 14 30 -18 31 -10 17 45 -19 36 58 -9 -27 -40 38 -1 -33 -1 13 28 18 -3 42 -58 -28 -6 95 12
4366 12 20 -19 48 -32 20 22 0 -23 -63 -4 -14 -78 15 -35 -29 -3 6 -40 -34 9 20 21 25 8 21 37 -5 30 -47 12 16 29 -6 -5 -31
4401 -31 5 -13 -7 20 -21 0 -29 15 -66 -53 27 -23 -44 -81 39 -49 21 23 14 -2 8 5 87 47 31 19 16 19 35 -11 -36 33 -10
4434 -10 7 20 -63 -12 -5 27 13 2 -38 -9 7 18 -44 -21 -15 60 46 1 -59 50 49 5 49 -73 -61 3 35 -5 -32 3 -12
4465 -12 -68 16 -18 -9 28 62 11 48 24 -2 10 -5 2 7 -18 55 19 51 40 -12 44 -49 -1 -14 40 -31 -32 -20 13 -9 -5 41 40
4498 40 10 -38 -41 -73 18 57 -28 -32 57 54 38 30 -54 19 -9 -7 -38 -53 -30 -18 43 16 -11 -20 -10 -26 -1 7 42 61 4 -50 21 36
4532 36 -3 5 -48 28 46 -29 -21 20 15 -23 48 -2 31 -13 -13 -5 13 -54 8 21 -26 -2 29 17 59 0 -13 21 30 -16 19 -27 -3
4565 -3 -12 -9 50 -42 89 28 20 -58 -10 4 -10 -33 48 -18 27 -4 57 86 -21 50 45 -14 23 -16 -1 22 -57 53 -24 51 32
4596 32 -3 20 1 -32 -39 -7 16 -31 -15 -43 -24 43 -41 -29 -4 73 47 -13 17 -10 49 -37 -7 11 32 -6 -42 4 21 35 -25
4627 -25 78 68 7 2 15 11 1 -64 15 -2 18 20 -70 48 18 20 27 18 7 39 31 -2 42 -30 1 10 -52 52 -53 19 -11 -60
4659 -60 -11 -27 28 0 -18 32 54 -39 29 54 52 4 -28 16 32 33 -63 -66 56 -44 -10 67 0 24 -20 34 -56 12 12 -16 39
4690 39 39 35 8 -4 -32 25 -40 19 -14 69 -5 15 -36 -41 45 39 21 -31 14 22 -51 -47 41 43 45 -23 -4 35 -39 5 -39 -27 54 8
4724 8 58 22 5 -27 59 34 -16 35 -48 -58 -30 -2 23 34 -9 6 -11 32 30 20 -19 49 -29 53 20 -12 -24 59 48 11 27
4755 27 26 33 -20 -42 19 1 -22 28 -22 10 -11 84 -30 15 -30 12 3 -22 25 -31 13 16 -5 8 1 21 -21 -54 -79 -40 -48 1 -21
4788 -21 -2 38 14 17 74 23 -1 14 -25 -23 23 -15 -20 -24 -25 12 55 -42 4 9 31 -15 -34 -5 1 46 -12 -51 -9 41 -7 2 -17 -39
4822 -39 -52 -2 -2 -51 43 12 -15 32 -27 50 -46 -58 77 -20 -32 -18 32 -13 -52 14 28 4 -7 31 10 -43 -27 -31 4 17 14
4853 14 42 45 16 27 32 -20 20 -5 25 -37 -13 6 -9 37 -23 20 -15 14 20 0 -41 -42 -51 50 -1 -27 -29 14 34 12 11 25 40
4886 40 2 19 -25 -67 12 33 46 12 39 7 25 70 -45 24 4 -22 25 87 -51 33 109 -34 20 38 7 1 94 30 37 11
4916 11 5 16 -9 68 -16 -46 26 -31 26 -59 6 3 -70 -46 3 -60 -13 13 -34 54 -18 -42 6 -2 -48 11 73 24 7 13 25 33 -20
4949 -20 -29 19 46 -33 40 -1 -28 -6 -50 22 3 61 44 -23 -50 11 -47 83 45 25 16 -41 -19 34 18 11 39 46 -24 -20 -20 14 38
4982 38 20 36 21 -1 -8 27 18 -52 19 18 -28 -21 53 -29 6 -30 45 1 -27 -3 24 106 2 16 6 33 -14 9 -13 11 34 17
5014 17 5 -71 -75 57 36 -29 0 15 38 11 12 -8 43 24 7 -29 -67 62 38 -36 -51 45 20 52 -60 13 -42 3 25 12
5044 12 -42 15 -18 -45 -48 37 -5 -33 38 -12 -15 -7 15 -48 44 63 67 2 -7 28 18 -3 -52 -14 1 32 11 9 11 25 1 25 -14 0
5078 0 83 -20 -60 -27 -41 -7 11 -47 17 -58 18 17 -38 -44 40 0 -37 -9 -59 0 12 29 -20 31 56 59 -21 -17 -60 15 34 64
5110 64 -2 58 13 8 -43 52 -8 2 -5 -31 -32 14 39 -35 -86 -22 -22 20 -31 27 82 7 18 66 38 -6 9 2 28 -4 -32 20 21
5143 21 30 -41 28 7 -20 15 36 -4 -14 -19 -45 0 -24 -22 -6 -51 -7 5 -32 -41 2 95 69 -10 4 57 33 6 76 -13 -66 -22
5175 -22 55 -62 7 8 0 11 44 -62 30 1 7 -6 -110 38 70 -103 -17 -17 53 7 14 10 -2 7 26 23 -54 -2 -62 -11 0 21
5207 21 -33 -7 -10 0 11 11 6 4 4 26 -10 21 -3 73 57 -6 -2 -1 -25 44 -33 -40 27 11 -35 -81 49 -38 33 -22 48 36 80 56
5241 56 2 -8 -46 33 29 61 31 40 6 27 16 16 -12 16 -25 17 20 26 -25 -3 12 34 17 -12 -26 2 13 5 -8 34 1 -35 -20
5274 -20 -43 -32 15 -7 1 -32 9 19 -21 -1 -4 8 -41 -15 28 1 19 -26 -9 3 41 45 -54 60 8 -1 33 25 4 53 6 -20
5306 -20 -7 7 -64 -51 79 21 -45 -15 24 6 -90 -10 23 -38 26 14 34 20 22 15 -2 50 16 18 22 1 -4 88 47 -62 -46 -35
5338 -35 -39 32 -9 37 30 47 14 89 35 35 17 -5 63 -45 64 -14 -2 48 27 28 -4 34 53 -13 80 4 40 11 50 15 10 36
5370 36 -14 -84 47 33 26 30 -34 -33 20 -30 12 -6 20 23 61 4 -12 -5 -25 61 46 -24 -24 -1 6 20 63 -98 -57 44 14 -12
5402 -12 48 -33 -2 16 16 55 39 -41 -34 -8 33 9 2 26 37 26 22 -11 -30 17 -26 -20 32 23 -34 -10 37 -10 2 -61 -60 5 -31 -68
5436 -68 -24 44 -4 55 -8 -62 8 12 35 -7 -1 -57 -5 -51 10 -33 4 -16 2 64 -33 -12 18 6 10 18 35 2 1 52 -12 -30 -40
5469 -40 30 5 47 -81 -14 32 3 6 -7 -31 23 3 21 27 17 1 28 -19 -22 -7 -50 15 21 -78 15 -26 2 9 -28 14 5 34 18
5502 18 -23 -64 24 -44 12 -21 28 -73 -34 14 -4 -10 -26 51 -21 -27 9 62 -66 -14 15 -1 31 11 -46 23 -21 -4 -35 -10
5532 -10 9 10 -17 0 1 18 10 25 44 38 4 -40 20 21 4 96 41 15 38 12 -22 -4 -6 49 -1 -46 -55 -61 2 -13 23 -41 46 43 31
5567 31 19 -38 4 74 -2 5 59 -54 9 -19 -4 20 -6 -31 11 6 -44 -8 -4 111 28 20 -20 -16 33 -65 43 -50 30 46 22
5598 22 4 16 29 0 -15 -33 22 4 -11 23 17 29 -20 -11 47 30 -21 -22 -37 14 7 57 3 -16 45 -53 55 20 14 36 -47 20
5630 20 6 -13 -11 -41 -2 -10 41 -16 -6 21 1 2 -48 31 1 26 28 -74 4 -55 14 56 -38 51 -14 -47 28 27 5 21 63 -9
5662 -9 5 14 28 -17 -25 24 -7 44 -22 88 -24 5 15 -33 -17 20 30 -24 0 -19 -28 60 39 -2 23 4 52 17 -33 -34 -9 33
5694 33 32 36 -39 1 -30 42 90 -15 23 -21 0 -50 11 28 -54 6 26 9 -18 -29 -4 0 6 36 30 -37 -39 -4 9 33 -60 -3 -13
5727 -13 -18 18 -23 -3 2 3 -48 -1 -4 50 42 -7 9 66 58 -57 75 -13 -42 -45 45 29 9 6 22 -7 25 47 -11 23 -49 15 9 15
5761 15 -17 41 -51 20 47 34 -3 -38 55 6 -6 -20 11 20 18 -71 49 37 -3 -20 9 -38 -8 10 45 -14 15 -6 8 19 45
5792 45 -33 -69 45 -12 4 1 -6 33 1 22 91 44 -40 30 3 -6 6 16 26 -34 -17 -7 -34 -6 68 23 -1 6 -34 10 -19 -22
5824 -22 37 25 69 0 -1 40 -62 -58 -12 -29 4 -2 -17 -31 52 -6 10 -29 32 65 -7 12 31 17 65 11 -29 -18 15 -19 -16 -22
5856 -22 -34 -13 -37 58 -57 57 -16 -11 42 -17 -48 46 -17 -25 -17 -6 5 -77 40 -17 19 -28 -72 49 19 10 14 -35 -50 64
5886 64 -22 -31 9 -20 20 17 -3 -25 8 -27 76 -43 -4 -28 -4 47 0 98 5 53 -24 3 34 -32 -19 -92 45 -95 -14
5915 -14 28 58 24 -53 -8 -43 90 -3 34 8 -3 71 -20 -50 -42 57 -69 2 -27 -24 19 -41 0 1 3 -45 -41 -56 -16 39 0 6
5947 6 65 13 -52 -3 16 69 47 7 73 2 -33 66 -9 -1 -6 -47 -34 9 42 -15 -26 39 27 49 -28 75 27 -42 11 18 21 19 -27
5980 -27 -11 -58 27 36 45 -77 -19 23 9 -40 -66 4 -65 52 68 63 -24 39 -29 -45 -32 6 -23 33 53 23 -34 -35 -32 -61 -24 49
6012 49 -16 -49 -16 -28 35 52 54 39 -28 17 -9 0 -33 -24 -59 -6 17 -18 -24 37 8 -17 3 -34 97 67 -39 5 -13 -15 13 19
6044 19 58 -14 -12 40 -40 64 -21 15 -35 16 -13 36 22 44 16 27 68 -5 20 -28 3 -22 56 -6 17 -35 13 42 9 70
6074 70 -15 -3 -4 20 1 -30 -41 54 -37 -35 91 12 -56 51 -14 33 -21 -19 17 37 -18 33 8 35 -5 -38 -36 -13 46 6 -33
6105 -33 8 0 48 -15 33 -16 -1 22 5 6 -30 -35 55 61 13 9 -11 -25 24 -7 1 22 -16 -6 -29 75 -47 38 54 -18 33 56
6137 56 26 -32 -10 41 38 -13 -41 -46 7 -8 50 9 -70 -28 -15 -61 20 -34 7 0 -26 4 -42 49 -11 4 8 21 53 38 7 -27
6169 -27 -2 30 31 -2 -11 -12 3 14 38 5 -7 20 16 -42 26 -22 17 -28 -12 -40 15 -46 -1 5 23 8 11 28 -37 -9 18 -12 64
6202 64 19 -48 20 64 37 8 10 14 -23 15 18 -59 57 31 14 34 56 -41 8 3 -37 -30 -37 57 45 7 -12 -26 21 -22 38 0 43
6235 43 52 7 -15 11 -22 51 25 10 19 -37 -26 -22 -65 14 22 -97 18 -6 6 25 -50 45 -64 -14 17 3 10 0 25 -5 11
6266 11 23 18 9 3 -20 59 6 -14 -6 -4 54 19 -53 10 41 -22 7 19 45 -4 -9 5 -33 -30 27 32 -15 21 -43 -45 14 50 -11 31 23
6301 23 -14 0 -33 -16 -29 4 29 9 35 64 14 17 18 25 -43 71 7 5 34 -29 28 43 25 -9 -3 -40 16 8 -9 45 -24 27 11
6334 11 -25 47 -13 -1 27 -20 0 -17 57 -18 19 -7 0 41 55 14 -43 -27 -25 -33 86 39 -49 47 8 12 6 31 4 -23 -1 19
6366 19 -40 -97 -18 -82 4 -18 42 -13 36 46 -10 40 60 -15 -20 25 -10 -28 -52 -26 -14 36 -26 -21 9 35 12 -37 85 0 6
6397 6 -14 -30 13 -26 27 20 82 29 23 16 -56 30 -4 9 -45 -63 38 -40 17 -43 -14 -17 62 68 22 -12 16 0 73 -38 -21 2
6429 2 -41 -2 3 -1 44 39 5 -82 -28 57 -21 3 39 9 -26 -27 -62 -70 -9 33 10 46 14 20 19 42 -47 -27 74 57 -30 96 16
6462 16 31 23 -38 -17 -1 -2 6 97 34 45 15 8 -34 7 38 -7 6 -52 32 50 -28 -28 -3 84 16 2 24 -3 -6 -36 -23 6 -27
6495 -27 49 -41 19 -7 25 57 -4 20 -26 40 -49 -28 -59 0 -2 -54 24 32 -33 39 18 51 -64 4 -26 -58 54 -3 -25 -39
6525 -39 -27 70 -98 -16 -41 12 8 -64 -29 11 -19 9 34 -21 23 1 24 26 -17 7 -25 -14 -32 19 5 0 66 -32 -44 2 1 -1
6557 -1 28 46 30 73 34 4 -18 1 63 5 67 -12 5 17 0 12 2 -28 14 -2 -53 40 -17 42 -43 -61 20 46 70 48 -13
6588 -13 -36 -33 15 98 3 42 -24 -31 -12 -21 -12 -14 11 55 -38 -34 14 6 21 18 -59 -49 56 -28 -47 -44 28 33 8 -5 -5 -7 -45 -6 6 1
6624 1 39 -20 23 -11 16 5 -14 38 48 -34 -54 -60 8 -26 22 41 -7 -5 45 33 -21 44 17 -36 48 30 26 24 57 32 12 0 -21
6657 -21 -29 -9 -68 -5 2 -34 -6 -10 -36 -60 67 5 19 -14 -8 -16 56 8 45 51 -21 -29 42 -34 53 6 -37 12 -14 -6 0 -11 6 24
6691 24 1 -8 -24 54 28 -40 -1 -18 -3 -31 9 -6 60 -29 -50 5 -59 -24 25 17 -60 63 24 31 61 -39 21 23 17 6 12 82
6723 82 32 -2 18 17 -23 28 -47 9 -40 20 92 -11 -16 -60 65 3 -4 4 47 41 -31 11 9 -21 20 -10 14 -34 -23 18 -6 42
6755 42 -58 55 -27 12 -11 -6 48 -52 -37 -34 42 62 17 41 -48 -49 32 -18 -18 11 26 3 -3 10 -43 -4 3 -6 -20 1 32 13
6787 13 28 -3 0 16 -41 -12 -22 -22 -7 4 -3 -22 -14 -63 -53 9 -66 42 -41 -51 -26 -44 32 -4 -93 -4 -42 61 -21 24 32 -31
6819 -31 33 -23 0 11 -23 22 65 -18 44 -68 61 -16 44 -4 23 12 -27 -15 -18 31 -36 8 37 -10 48 -13 -27 44 -31 -8
6849 -8 -69 -20 -3 -24 2 -2 19 40 -25 45 -77 -28 -63 16 -34 -24 -11 25 25 -23 -63 22 -44 -2 2 -28 -13 39 -7 45 21 -19
6881 -19 -10 -28 -27 -2 10 -54 -71 -29 7 -43 15 -12 18 11 -46 38 -21 -19 -48 -6 25 20 26 35 -6 24 18 44 -50 -34 -35 -5 32 28 -7
6916 -7 12 -13 -24 -47 61 28 46 21 -19 39 20 43 8 -2 -18 45 -46 24 16 -13 35 40 29 63 -52 10 -13 18 -4 -1 16
6947 16 4 -26 34 -18 58 -23 11 -9 -37 -15 23 59 9 25 27 21 6 20 31 5 42 12 -77 -8 -4 -48 -33 1 46 37 63 -6
6979 -6 -36 -9 -20 34 -2 -26 -39 36 13 46 -60 -28 -11 -61 32 7 -39 26 -30 -40 51 -3 2 15 -24 32 -22 -8 -35 -4 54
7010 54 -8 4 -1 -45 -68 13 -44 -60 17 -35 -24 -14 -12 15 -1 14 15 -52 -28 -50 33 30 -45 63 -4 -4 -8 57 30 35 43 -13 -12 28
7044 28 -11 -19 -7 11 -11 72 -7 -65 -33 2 -47 -27 -42 -23 -12 -6 3 -38 1 2 26 -16 -2 48 28 79 -1 38 40 -32 -27 16 9 2
7078 2 44 4 20 -2 -45 -27 -57 19 -41 -58 -10 6 -33 -2 60 64 42 -20 -29 -11 15 0 -16 15 15 21 26 -22 -75 -11 -16 -61 24 15
7112 15 -101 -28 -3 -52 16 20 -5 59 30 -30 31 -50 -43 -56 -1 -41 3 9 -17 5 21 15 2 3 47 -20 -18 0 -27 59 -7 36 15
7145 15 -14 -62 -7 36 -9 48 -20 -31 21 -11 -45 5 -26 11 57 40 27 14 -26 -24 -15 69 -63 -22 -29 -11 -17 31 71 -18 -20 21
7177 21 10 48 -9 -24 40 -27 -33 -22 -44 -35 -52 30 -10 4 -8 23 18 2 7 -22 -33 -14 19 -59 24 25 -28 -39 66 -30 17 17 8
7210 8 -36 36 -71 -63 -3 8 6 83 11 48 4 0 32 13 39 15 -17 67 26 24 -38 -35 -14 35 31 23 42 35 28 -3 33 28 44 15 -21
7245 -21 53 -16 4 2 -52 2 27 44 20 -24 9 33 1 9 6 -10 50 0 -37 -4 4 -14 -16 -28 -6 -36 -18 -9 35 -28 68 0 104
7278 104 75 16 -15 -56 7 31 1 -17 -5 -15 -31 -35 -5 25 -10 -12 24 -15 30 -17 -23 -59 -34 2 29 -42 -12 11 -6 3 -32 -9
7310 -9 -81 -34 -34 -12 -15 6 -1 11 -5 5 -41 -25 6 -15 29 15 -44 13 24 4 -35 12 -5 -7 -20 34 -16 40 -46 62 11 15 18
7343 18 -63 -14 -7 -20 32 1 -29 10 5 -7 46 25 -39 27 -22 4 23 -32 -23 2 -45 1 -8 -32 44 8 22 -1 -29 -9 -30 -13
7375 -13 4 -29 -48 36 4 -43 -71 16 -17 8 47 -34 -23 13 -46 -49 12 -30 21 -9 -17 -37 -8 1 -64 30 -52 -31 -2 11 -2 2
7407 2 -64 -9 -5 -19 10 13 49 33 15 28 -23 -19 -31 38 13 7 19 -35 -79 43 71 -43 14 20 -51 -55 11 19 20 33 -43 -12 -19 -13 -54
7442 -54 -4 46 2 -17 30 27 -52 -15 16 59 65 47 10 -11 -30 -56 -37 -19 -5 43 11 -21 52 55 58 -28 -20 14 8 27 27 -44 61
7475 61 17 -35 41 28 -5 93 14 13 -45 -14 38 23 -48 -20 -15 34 2 25 11 5 -21 60 33 7 56 9 40 -14 -11 27 34 -60 2
7508 2 48 80 -31 31 9 10 43 -21 -52 22 33 -79 2 -16 4 -13 40 0 -17 11 -40 -1 -10 48 55 41 41 64 87 30 36 -29
7540 -29 89 -11 61 -9 87 46 13 13 29 -42 58 28 -38 -16 25 -49 0 -21 29 46 84 -1 -27 22 -29 1 37 64 -1
7569 -1 67 30 -12 97 -54 -24 25 -19 -29 55 7 -50 -17 -56 38 -22 40 -15 22 -48 -16 2 -36 -2 46 75 -6 32 -22 -37
7599 -37 110 14 5 48 -41 -6 66 6 2 -31 -47 5 33 55 -80 16 48 -36 -3 -16 15 3 -18 -6 -27 -48 -43 -53 18 14 -57
7630 -57 3 -49 46 -21 52 20 -14 31 -36 -42 -27 1 -52 41 -4 -12 -13 36 51 18 11 19 38 40 -25 -28 -3 27 -71 42 44 22 60 2
7664 2 -4 -52 53 35 -20 -60 -31 26 11 -26 5 -89 -18 0 -46 28 40 14 -7 25 31 22 -13 -11 21 3 25 20 -2 3 -8 45 27
7697 27 -21 35 -20 18 -11 45 2 50 6 8 53 -22 -2 34 -31 25 -5 -9 -44 -20 -8 12 1 -6 -22 -15 -13 -42 23 -23 -39 14 -9
7730 -9 -63 33 -10 45 21 -22 -7 -10 -26 34 15 -27 38 -20 -28 4 -4 17 2 -17 30 72 11 15 42 50 -67 38 -39 34 -44 -11
7762 -11 -1 -15 -15 11 -3 69 14 -5 23 10 47 5 33 0 -33 -52 15 -32 -17 3 -5 -34 -31 14 26 -4 9 -13 24 25 13 -31
7794 -31 49 14 -8 -27 -6 13 -37 -43 -8 50 -1 13 35 -32 8 23 -60 10 -16 -19 20 -11 12 -8 14 -37 42 9 -4 -35 -56
7825 -56 45 71 23 -59 58 -26 15 35 16 -8 11 -31 20 -16 0 64 -21 0 -10 -51 -43 -12 -17 9 0 -32 10 25 -45 22 24
7856 24 8 -32 74 19 1 27 -8 31 3 -16 61 -43 -20 23 32 14 16 49 4 38 -45 47 9 30 29 -43 35 3 -56 -34 -55
7887 -55 6 9 -41 37 65 58 -13 -94 22 17 3 -30 4 -21 -66 -27 -33 70 -28 11 -22 -16 -28 31 -34 36 -12 -6 3 -18 -18 42 -37
7920 -37 45 -7 35 -22 14 -20 51 -5 6 69 27 47 -62 27 2 -48 24 -6 30 5 4 16 -19 -23 -64 34 41 23 25 41 16 36
7952 36 -9 23 -3 -25 22 4 -14 22 -58 -2 24 22 10 -19 -8 -26 -9 19 27 -16 30 -8 -9 31 -45 33 1 13 -51 -56 20 5
7984 5 -49 28 49 -33 -21 -49 -20 -41 1 45 -48 -27 -18 2 -32 -7 16 31 94 59 1 26 -25 53 -8 18 -25 36 25 -8 21
8015 21 -2 17 27 17 -33 -15 -15 -8 4 19 -13 -49 -10 -20 -28 59 -1 -34 29 27 -1 14 31 4 55 59 14 -6 40 7 20 22 26 -6
8049 -6 5 -14 11 20 25 31 -16 -10 20 73 -26 -20 -9 -19 -4 -27 12 33 -6 22 -2 -38 49 29 19 63 12 -40 -37 -20 -71 -8 -51 -1
8083 -1 -27 30 5 -37 29 -20 -37 -50 71 22 17 -13 41 38 3 21 15 -30 25 -4 -9 -68 37 -53 -10 48 41 8 15 -47 -51 -12 32
8116 32 6 16 -46 54 -8 -22 -41 -73 42 -37 -9 46 1 -9 46 10 28 29 52 23 -10 -79 43 -5 22 2 47 42 -22 -22
8146 -22 -13 25 14 19 3 27 26 13 11 32 -7 -3 -8 41 -2 47 25 45 -31 13 40 50 22 15 -21 -22 14 47 10 4 16 102 37 75 3
8181 3 7 10 -40 32 -22 -22 1 88 11 32
8191C2
$$ Imaginary data points
##PAGE= N=2
##DATA TABLE= (X++(I..I)), XYDATA
0 0 0 0 0 0 0 0 0 0 0 0 0 0 8 -8 8 -8 16 -16 21 -24 32 -32 40 -48 56 -64 76 -88 100 -114 132 -149 169 -193
34 -193 217 -243 272 -304 342 -381 422 -470 519 -574 634 -701 772 -852 938 -1034 1140 -1255
52 -1255 1386 -1530 1692 -1873 2085 -2327 2610 -2950 3358 -3868 4520 -5387 6602 -8433 11492
67 11492 -17563 34251 -177848 -585969 -191370 313930 370920 -43188 -324203 -197884 126256
78 126256 233760 118436 1342 -5321 -38663 -98402 -58226 96706 144690 -22727 -235840
89 -235840 -210585 53946 255653 148314 -103507 -173231 -7382 143219 116837 -7177 -79141
100 -79141 -75105 -54690 -40080 12607 81962 60914 -61180 -112336 13187 166260 140574 -32329
112 -32329 -137482 -65178 58545 60720 -40451 -84564 -28428 11316 -14729 -12416 58769 94085
124 94085 18933 -75258 -53943 61816 101988 -15054 -138502 -89655 63189 98947 -20861
135 -20861 -101918 -13668 121068 106065 -43522 -112799 1116 124854 61845 -108911 -151628
146 -151628 -17918 102297 60397 -61408 -85637 13305 90614 52951 -16688 -15231 20407
157 20407 4860 -40832 -35629 18231 35012 -19998 -67970 -25774 63196 80767 8519 -47003
169 -47003 -17136 38022 34054 -18649 -46034 -21400 3620 -13970 -36034 -7453 42218 39451
181 39451 -10821 -29439 13979 55969 33395 -27602 -49221 -12851 18131 302 -25819 -11763
193 -11763 17592 13997 -9650 -3840 33298 44924 539 -47569 -32767 21487 29532 -23824 -58639
206 -58639 -22530 33380 34744 -9317 -23962 18713 54852 23410 -35208 -37345 16287 42516
218 42516 -190 -55530 -49748 10462 48999 23722 -19897 -21266 9854 25412 14917 2124
230 2124 -4907 -16667 -29934 -23747 6841 29056 8189 -32751 -31830 20309 59173 36398 -16320
243 -16320 -36219 -7795 24976 18465 -14885 -29059 -14434 -1165 -581 4980 17636 16631 -2312
256 -2312 -16246 -4397 21417 24190 -9398 -40435 -28404 7738 21161 4375 -12211 -8486 8049
269 8049 18207 14748 9583 8168 -1633 -18460 -17278 5488 16245 -3894 -28727 -23787 9181
282 9181 34082 20691 -13287 -21048 4903 23023 8776 -14755 -20453 -9501 1531 1589 -3312
295 -3312 282 8345 6431 832 7488 16792 9231 -7800 -13628 -5017 3914 48 -13541 -16562 77
310 77 14233 6852 -5039 -507 10739 10373 -1013 -10150 -7352 2364 1777 -11018 -14018 1343 13061
325 13061 7513 -971 1120 9169 12569 5395 -6040 -7925 -952 -1568 -10394 -10186 -843 2599 -1559
340 -1559 -2192 3684 10392 10014 -213 -8080 -1816 6779 92 -12106 -11175 -397 5734 3965 -456
355 -456 591 8916 12743 3837 -4528 -747 3841 -2153 -10430 -11038 -5412 531 1142 -3482 -2774 6204
371 6204 10249 3854 -453 2205 2565 -2315 -5929 -5350 -1723 1131 -1777 -5415 1033 11460 10548 1062
387 1062 -2307 2193 5256 1943 -6379 -11959 -7810 -312 -939 -5426 -3248 3056 5468 4857 4455 3824
403 3824 3217 1498 -2592 -4334 -941 139 -4758 -6411 -167 6132 6402 2796 90 1626 5675 4202
419 4202 -3455 -7524 -4832 -3262 -5193 -5405 -2547 569 2697 2711 2187 4970 8024 5022 -1256 -3014
435 -3014 -1069 -544 -1878 -3469 -4000 -1652 1820 2461 2280 4254 4691 978 -2405 -2025 -642 -1269 -4340
452 -4340 -7929 -7167 -1048 3686 2738 1370 2701 4129 4739 4760 3375 783 -1575 -4084 -5429 -2727
468 -2727 1006 544 -2188 -2357 129 3652 6086 4383 -876 -4362 -3906 -2356 -705 -335 -3211 -6628
484 -6628 -4526 2306 7643 8228 4053 -1502 -1428 4517 6975 1835 -4626 -7164 -5872 -1867 1770 1408
500 1408 -905 -1218 -833 661 4422 6142 1125 -5130 -6080 -3342 130 2053 -632 -4463 -2749 3276
516 3276 6158 5328 4072 1904 -20 275 112 -1671 -1663 -932 -3891 -6858 -3720 1785 4266 3373 200
533 200 -3028 -1019 4084 4381 -251 -3833 -4995 -4383 50 4172 2763 -318 54 1322 2426 4870
549 4870 5558 1362 -3280 -5257 -5109 -1466 3339 1500 -6209 -8837 -2304 5973 9485 5381 -4118 -8126
565 -8126 -1011 7373 6155 -1240 -6962 -7239 -1280 6044 6520 1508 -1503 -1492 -782 2695 6659 3967
581 3967 -4164 -8968 -6949 -474 5398 3441 -5503 -9050 -1349 7406 8488 3477 -2803 -5207 -560
596 -560 4780 3101 -1799 -3178 -2265 -1291 1087 3230 2669 1258 -29 -1733 -1013 2740 3096 -2085 -6015
613 -6015 -4913 -1794 1332 2429 -319 -2903 -340 3671 4169 2183 50 -1449 -371 1849 441
628 441 -2972 -2187 1524 1924 -545 -1909 -815 2300 4272 1392 -3732 -4116 -305 1645 169 -2267
644 -2267 -3963 -2929 1234 3790 2565 990 721 -33 -206 1736 3057 1290 -1999 -4303 -3404 1327
660 1327 4830 1709 -3936 -4157 614 4439 3824 -317 -4304 -3925 -354 1442 439 -752 -1576 -1784
676 -1784 122 2781 3419 2238 586 -1103 -1402 1018 2883 1209 -2206 -3809 -2580 728 3051 1363
692 1363 -2022 -2574 -81 2313 2571 292 -2797 -3573 -890 1573 1091 -770 -1457 -180 1961 2715 1340
709 1340 194 712 1067 81 -781 -662 -678 -683 -767 -1124 -915 52 562 395 410 333 -354 -773 -384 -137 -55 -54 -836
732 -836 -1351 -11 2054 2173 695 -417 -343 1140 2290 1102 -1400 -1972 -1083 -747 -524 -168 -369 -841
750 -841 -539 118 791 1418 1016 -817 -1664 -672 526 835 637 -571 -1524 -234 2188 2633 1117 -488
768 -488 -1121 -299 1477 1449 -888 -2682 -2101 -728 448 885 -330 -1729 -828 1263 1635 836 -86 -1036
786 -1036 -901 578 1126 -27 -544 -208 -101 548 1611 1127 -94 1 389 -133 -384 -452 -1260 -1512 -544
805 -544 -342 -716 -115 653 148 36 771 645 180 510 324 -671 -216 685 246 -307 46 156 279 1207
825 1207 1090 -520 -873 206 168 -687 -904 -1464 -1708 -335 829 56 -568 -17 354 816 1631 979 -667
844 -667 -567 538 495 19 125 -482 -920 240 1237 510 -76 -49 -618 -558 314 -135 -1431 -1291 -368 -534
864 -534 -385 580 510 -46 562 825 541 908 1270 79 -778 -138 188 -124 116 -64 -1014 -732 775 928
884 928 72 -298 -825 -1113 -90 699 -418 -1391 -907 -247 367 1387 1010 -388 -166 1280 1455 716 251
903 251 -531 -853 32 473 -375 -790 -362 -426 -333 444 460 -417 -529 -190 -342 -265 163 -278 -757 -166 485 410
925 410 638 986 527 222 711 726 146 120 -191 -921 -831 -93 -74 -558 -638 -492 -232 524 610 -289 -636 -113
947 -113 191 92 159 -9 -405 45 718 711 509 508 285 179 593 451 -381 -776 -565 -464 -414 -313 -610 -743 -108
970 -108 301 133 -83 144 129 160 327 17 -243 126 377 72 109 470 402 261 390 271 16 -22 -80 -535
992 -535 -639 -461 -587 -702 -225 -147 -248 -58 283 269 428 582 126 -127 339 483 63 -51 89 -93 158
1013 158 459 169 -85 171 61 -434 -346 -99 -415 -690 -550 -520 -466 220 377 -182 -102 556 516 356 628 446
1035 446 -174 3 226 19 148 345 -259 -718 -25 541 227 -108 -477 -854 -433 369 132 -675 -667 -312 -185
1056 -185 413 845 306 -150 237 484 446 836 465 -421 -561 158 238 -67 -40 -259 -651 -224 308 89 -158
1077 -158 -43 -518 -883 -99 515 24 -365 -350 -250 301 1031 710 -159 -64 461 245 184 284 -125 -461 -253
1098 -253 -236 -575 11 533 -243 -854 -316 136 243 394 -122 -830 -422 492 497 86 201 75 -221 367 822
1119 822 564 78 48 -366 -514 245 434 -188 -616 -599 -645 -143 783 497 -595 -792 -251 288 898 604 -702
1140 -702 -1159 35 1012 825 297 -235 -423 69 862 487 -133 -88 -204 -678 -502 231 295 -208 -842 -1061
1160 -1061 -388 1031 1138 -354 -1182 -407 668 1019 501 -495 -812 70 857 461 44 193 122 -182 -25
1179 -25 71 87 282 -77 -974 -972 126 578 91 -568 -740 -397 594 911 159 -473 -288 180 341 529 235
1200 235 -220 -165 254 66 -64 234 366 28 -479 -674 -319 546 682 -543 -1524 -778 471 1065 401 -702
1220 -702 -913 131 1098 814 -162 -406 -9 258 267 107 165 405 190 -685 -818 394 1272 402 -1179 -1546
1240 -1546 -334 1092 971 -748 -1607 -611 732 993 261 -361 -460 109 641 404 157 326 194 -303 -419
1259 -419 208 524 396 -261 -926 -682 451 843 71 -793 -925 -495 265 621 88 -646 -446 229 636 632
1279 632 247 -343 -117 586 404 -128 -106 351 148 -282 -454 -301 336 585 -296 -1128 -490 596 606 -189
1299 -189 -707 -621 98 681 272 -522 -161 681 450 -236 -108 490 746 354 -525 -823 217 1097 111 -1192
1319 -1192 -885 133 510 312 -388 -722 -327 321 -49 -302 246 340 -250 -308 320 495 483 302 -271 -365 465
1340 465 780 91 -332 -268 -397 -184 298 156 -415 -465 -281 -272 271 540 -231 -877 -207 462 477 56 -108 -230
1362 -230 256 561 178 -233 343 551 -206 -338 197 399 60 -393 -753 -580 360 443 -484 -829 13 447
1382 447 73 -143 -123 38 388 347 -304 -185 726 528 -329 -279 273 464 193 -180 -465 -225 436 3 -786
1403 -786 -469 233 15 -438 -315 15 145 327 -105 -416 222 709 238 -357 104 362 233 132 -34 -175
1423 -175 180 347 -234 -356 177 338 -283 -517 -239 -67 -26 -85 -475 -304 346 410 -201 -174 385 417 47 31
1445 31 159 211 389 51 -305 8 398 67 -508 -271 207 71 -266 -460 -442 71 215 -247 -592 -21 403
1466 403 143 -201 -27 264 537 325 -59 -64 452 524 -168 -369 -13 222 96 -226 -446 -237 276 133 -499
1487 -499 -411 123 82 -212 -187 -114 162 257 13 -131 234 575 257 -89 -9 288 215 41 -186 -190 33 43 -260
1510 -260 -404 -7 145 -204 -361 -169 24 83 -15 -275 -13 304 259 -108 -25 347 289 158 77 54 251 262 -84
1533 -84 -369 -30 257 -54 -532 -279 -88 40 -30 -330 -389 31 220 14 -243 113 308 67 13 58 113 241
1555 241 269 -149 -103 328 344 -94 -228 -59 -8 -32 -106 -364 -234 109 -7 -310 -215 161 64 -120 -6 68 140
1578 140 265 144 -249 93 470 184 -150 11 176 98 56 -33 -226 -119 61 -115 -345 -101 51 -335 -218
1599 -218 62 -34 27 102 -121 -56 308 241 -78 -20 319 112 -13 90 149 -11 72 -29 -265 -91 229 -167 -406
1622 -406 -179 -14 -74 -44 -81 -244 15 254 82 -155 172 301 60 -30 156 152 148 205 -9 -262 109 323 -129
1645 -129 -263 -71 -37 -173 16 -113 -293 -106 -10 -166 -89 213 65 -90 92 229 72 188 261 -60 -44 180
1667 180 216 6 82 38 -184 -128 60 -2 -217 -84 -179 -297 -28 170 -111 -252 -52 -27 45 232 140 26 31 265
1691 265 89 110 158 108 -128 -36 81 11 26 46 -205 -298 20 0 -103 -98 -172 -225 -72 174 117 -61 -8 44 44 138
1717 138 214 113 98 151 45 -34 90 168 -150 -181 -99 -140 -32 55 -85 -322 -177 -17 -17 -2 -2 -183 -117 203 270
1742 270 107 73 98 82 126 199 178 83 107 -59 -148 -30 145 -62 -254 -203 -197 -109 107 22 -290 -274 -39 145 217
1767 217 93 -220 -37 262 270 91 43 159 148 35 -17 64 57 191 -21 -291 -237 76 65 -123 -180 -214 -152 169
1791 169 106 -261 -228 82 120 99 108 2 42 288 116 -142 77 296 106 -145 -109 -52 49 96 -77 -378 -277
1814 -277 -6 -89 -67 -46 -192 -177 58 224 -18 -35 109 102 121 158 200 66 212 192 -52 -59 75 183 -52 -100 -117
1839 -117 -161 82 176 -271 -435 -135 162 60 -50 -47 -50 192 251 -9 -66 226 309 -44 -87 64 174 113 24 -195
1863 -195 -258 174 213 -180 -323 -152 -158 -14 -5 -179 -215 -5 191 -102 -85 189 223 -7 34 153 106 189 209 -100
1887 -100 -157 169 44 -171 -25 32 -201 -157 -5 -54 -119 -115 -207 -246 132 172 -126 -89 219 93 -20 83 219 152
1911 152 151 158 -137 -30 183 56 -210 -160 -17 6 5 -20 -235 -164 152 -16 -255 -131 148 72 -74 32 31 223
1935 223 233 -35 -152 98 355 149 -113 18 89 36 38 -151 -235 -57 59 -125 -290 -51 31 -121 -176 -60 -5
1958 -5 168 164 -42 -89 169 286 57 -14 128 144 34 -17 -68 10 100 -58 -202 -125 66 -49 -188 -124 -48 -44 -51 -40
1984 -40 -11 89 150 -44 -21 160 238 13 -32 57 135 141 108 -91 -128 150 76 -67 -191 -1 -39 -52 -142 -193 -110 143
2010 143 33 -183 -121 160 170 21 -55 10 162 228 35 -140 21 186 96 -16 -35 76 67 -20 -149 -165 -18 32
2034 32 -209 -155 -14 13 4 -53 -42 36 144 72 9 66 173 148 -20 -5 193 99 95 46 -103 -13 127 -106 -200 -136 40
2061 40 -105 -267 -59 10 117 54 -103 -68 115 200 -78 -46 127 226 72 49 25 -5 127 78 -190 -79 146 52
2085 52 -138 -120 -56 -51 3 -47 -159 -102 173 6 -173 -9 182 112 1 115 10 140 232 24 -144 41 154
2108 154 -11 -182 -7 77 -55 -23 -109 -213 17 8 -122 -185 27 22 -141 -33 19 40 128 152 -58 -6 229 182 -108
2133 -108 23 109 -2 -41 4 -141 -91 57 -148 -273 -106 134 -70 -233 -124 58 41 25 11 -63 108 208 -20
2156 -20 -69 164 229 95 -5 44 26 102 88 -249 -176 31 37 -213 -164 -78 -8 -36 9 -104 -90 127 42 -83 -22 259
2182 259 251 9 35 146 90 105 48 -154 -37 228 13 -233 -87 52 -86 -145 -116 -128 -39 73 -83 -118 68 172
2206 172 19 -92 4 107 33 133 17 19 81 150 -35 -60 69 63 -44 -140 -83 -80 69 -62 -194 -153 111 25 -99
2231 -99 -89 71 83 80 112 0 95 158 48 -38 99 148 106 -3 -57 -81 61 53 -139 -165 -13 -1 -114 -109 -31 -44 -12
2258 -12 -31 -37 -40 74 81 21 -29 122 134 38 31 -59 29 35 43 -93 -4 67 -99 -142 -55 -39 -8 -91 -119 -81 72 99 -36 -116
2288 -116 57 142 95 68 45 78 114 126 24 -29 125 87 -72 -57 -33 36 -33 -59 -127 -114 -65 -20 -75 -66 -9 -11 -47 77
2316 77 4 47 56 -1 -10 80 90 22 60 23 -10 -112 14 57 -96 -136 -29 -82 -126 30 -52 -138 -112 61 7 25 88 -27
2344 -27 -38 61 144 -48 63 136 40 11 -5 72 31 32 -28 -147 -71 93 -59 -158 -102 -43 -1 -14 -17 -128 -104 62 11 -66
2372 -66 96 63 -11 63 65 -11 -7 169 10 -98 -5 45 -54 -22 5 -109 -114 7 -2 -98 -107 18 -19 -26 13 -51 -87 136 167
2401 167 -12 25 106 87 6 29 -52 9 128 29 -129 -120 62 -34 -74 -48 -85 -57 -15 47 -57 -44 94 -32 -117 57
2427 57 75 58 106 42 -36 -40 163 113 -25 -9 12 -25 60 -66 -88 -90 -21 6 -61 16 -30 -79 -51 84 14 -39 2 79 -16
2456 -16 17 55 65 75 87 28 -84 99 123 -19 -70 -9 -19 -41 -11 -69 -122 33 5 -51 -61 53 -25 -23 79 20 4 100
2484 100 120 81 -68 45 94 48 -2 -30 2 90 50 -91 -5 14 -12 -88 -101 -41 -44 -17 29 -20 -45 86 10 -68 83 62
2512 62 24 -8 69 43 16 83 -30 -35 20 -25 -84 -46 34 10 -144 -103 -14 -90 -3 -28 -73 12 74 87 -76 40 105 125 26
2541 26 -8 0 61 165 -8 -22 36 12 -29 -41 -60 -6 -54 -48 -55 -127 -7 -10 -51 4 19 58 8 38 30 3 108 48 54 83 81 12
2573 12 4 -4 -11 -34 -6 -65 -90 -43 5 -86 -28 10 7 -35 -26 -10 -12 59 66 -25 61 134 22 -24 3 84 36 34 -22 -66 -36 65 31
2606 31 -53 -99 -41 -3 -21 -62 -48 -34 101 114 -17 29 54 31 -10 71 19 74 112 59 -26 24 91 23 -140 40 -69 -109
2634 -109 -77 -4 -39 -62 -13 -46 -88 12 112 -51 10 59 -19 31 176 59 31 71 97 26 -11 81 -13 -60 -39 -28 -53
2661 -53 -50 -1 -74 -65 11 -32 -114 18 -2 20 -37 -22 27 72 163 56 -63 83 115 -8 74 30 -10 -6 -23 6 -101 -11 70
2690 70 -31 -82 25 38 -8 -57 -19 -22 34 38 -14 22 97 141 -38 -11 131 11 25 62 -43 -37 99 22 -35 -7 20 -66
2718 -66 -73 -26 -57 -21 2 11 -164 -8 108 62 1 91 44 22 0 56 -23 -14 80 -26 5 35 38 -87 -50 -3 -37 -13 -35 -46
2748 -46 -39 61 34 -16 -21 77 -6 40 111 80 -7 82 -12 -4 82 52 -44 -30 -19 -17 -57 -9 -22 -38 -30 30 -64 -56 -67 10 -36 14 -37
2781 -37 -18 82 50 57 26 13 56 25 10 -9 -7 41 17 -42 -54 41 26 -25 -11 -5 0 -12 -100 -4 29 34 62 -58 35 31 19 92
2813 92 47 26 29 20 -18 -80 -29 60 -4 17 15 41 -58 -4 25 -89 4 -22 -58 -22 18 1 -76 10 17 -18 -56 59 3 2 26 22
2845 22 -26 40 41 -23 -22 5 15 38 -5 -39 -71 -6 32 -62 -61 -63 10 -5 3 79 34 11 69 1 24 19 4 7 46 106 -28 -15 35
2878 35 -63 -29 -41 -12 -88 -42 14 -48 -80 26 -12 -84 8 64 -7 3 66 4 29 93 52 -10 -24 54 5 61 105 -76 -52
2907 -52 64 -52 -2 -57 -16 -45 -94 46 -41 -36 -21 -19 -25 57 -19 24 -10 35 46 23 17 28 -2 23 -11 -58 21 20 -23 -52 -10
2938 -10 -9 -81 -5 -12 7 61 -6 25 -31 53 25 -14 32 -19 45 20 43 40 46 22 34 -10 -88 -30 -1 -99 -47 -67 -22 9 25 -81
2970 -81 -56 10 24 -56 64 32 -66 18 26 8 18 105 -3 -11 29 -71 -15 -47 63 29 -99 -40 -16 -133 -14 -35 -70 -10
2998 -10 21 17 -10 -1 43 -20 23 64 -10 32 24 39 -6 99 139 17 -13 24 35 -50 -3 -51 -48 -49 51 42 -32 -101 -64 -47 -2 46
3030 46 -68 -35 37 34 -42 18 -13 0 16 72 -22 -34 -18 -72 -41 -12 -16 -17 -79 -17 -4 5 47 16 47 20 36 0 58 5 58 -2
3062 -2 81 52 32 28 -58 -7 -10 6 -21 -76 -37 -5 -13 -11 -32 -55 -12 56 -60 -17 14 1 -19 16 63 31 28 19 8 -44 106 35 -18
3095 -18 -4 -41 -10 32 -13 -92 -61 33 4 -52 -55 6 34 19 15 41 5 26 37 -33 46 59 -40 -45 4 12 37 -21 -12 -20 -26 24 -7 -32
3129 -32 -4 15 -90 15 11 -24 -32 49 29 21 67 10 67 -2 55 42 20 -9 15 74 63 20 -82 -7 8 -10 17 19 -15 -4 61
3160 61 29 -30 -18 12 53 -60 75 90 38 54 43 -52 42 70 -25 -44 25 5 -8 -51 -18 -34 -13 -32 -10 -24 -59 -16 -61
3189 -61 -21 10 0 -11 -5 2 30 -26 18 -41 29 69 32 11 41 -13 4 -10 42 28 37 20 40 -64 -53 -19 -39 37 31 43 5 17
3221 17 32 32 43 75 -11 -3 73 16 -34 11 -34 17 0 -34 -17 -22 8 -12 30 -8 -105 -43 -6 -24 -5 46 -48 91 20 -9 65
3252 65 11 8 -37 4 -36 -23 37 -18 7 15 -1 -15 -86 -53 -83 27 18 -59 -40 -32 0 -17 37 13 1 -12 21 26 3 90 -37 5
3284 5 41 7 -39 -25 -66 -29 -33 17 -85 -31 -36 -36 -32 -11 31 -2 44 -53 25 -19 46 4 0 24 3 -7 -43 49 -20 -9 0 -23 22
3317 22 -38 19 15 -11 44 -18 -47 -29 6 -19 -19 33 -52 -16 -32 52 1 11 85 21 12 -40 -92 0 5 32 -109 -89 35 47 -15
3348 -15 -5 -30 -22 0 -30 -47 31 12 -29 -9 37 -16 18 9 -55 -32 43 -26 -17 -24 -1 32 34 -31 38 -17 -5 40 -73 -29 41 -29
3380 -29 -3 -32 -8 19 -1 67 62 14 23 29 -22 -70 13 42 -37 20 -8 -45 53 -21 16 -29 -44 -116 -30 -17 -28 -14 -48 -28 1 8
3412 8 33 -36 39 40 37 -15 -26 -13 75 42 13 -54 49 53 -12 -62 -18 6 -73 -21 -2 -56 -15 54 -45 -21 -8 -8 -38 -6 31 83
3444 83 45 41 -6 5 29 23 -42 -25 -5 -4 -9 -76 50 -20 -80 4 -8 3 3 23 -28 -43 7 -24 10 21 -16 18 10 31 -19 -30 44
3477 44 -71 -74 -33 -13 -21 -24 -19 -47 2 16 -15 -28 66 68 -73 -50 38 -19 11 -9 14 -29 37 7 -1 -20 -8 44 -2 -62 12 -19
3509 -19 19 17 -38 -7 -7 19 -70 -10 -20 63 -48 18 -34 25 101 5 19 47 73 -14 -27 -41 -2 -22 -23 -9 -62 -54 6 -82 -8 -4
3541 -4 -6 35 -45 2 -48 13 0 -7 -32 41 8 32 -18 30 56 53 56 28 19 -42 5 9 22 -9 -47 -44 -1 8 -12 38 -42 0 3 31 -2
3576 -2 -25 3 86 46 6 -24 22 57 -39 19 -27 -7 -26 -31 -38 -61 51 -29 34 -30 -67 31 -2 -73 -79 3 32 39 29 24 13 74 28
3609 28 -95 24 40 -12 22 -29 -75 3 -21 -48 -7 -11 27 3 -8 20 -14 7 4 -18 21 55 -17 38 49 59 27 5 74 22
3639 22 22 7 0 14 -7 0 -4 -10 -29 -20 -22 -19 -26 4 19 -17 19 19 64 6 10 -60 -15 24 -17 8 -54 -40 60 21 11 69 56 31 11
3674 11 53 4 -77 1 50 -42 -59 23 11 33 -54 10 31 -1 73 40 -3 75 24 -23 -15 21 -49 -2 72 -21 -60 23 12 -102
3704 -102 1 -19 -7 -56 19 6 -54 63 43 -21 9 81 8 2 67 -15 25 23 7 -16 -7 -13 -14 -105 31 -21 -80 5 0 -21 -32
3735 -32 -44 -33 19 61 -7 -1 35 29 52 36 11 76 -45 60 55 -9 65 -22 3 3 -41 -18 -20 3 3 -11 -70 9 -15 29 -29 -7
3767 -7 -62 32 70 -6 44 49 56 25 48 48 -29 50 33 -61 5 -17 3 -6 -23 82 15 -49 -34 -19 -19 -41 22 3 -27 70 7 -14 42
3800 42 -35 19 27 82 -11 -37 2 -70 -18 47 -73 -27 -26 -34 -51 -11 9 -4 -49 35 15 64 -5 10 16 10 34 20 9 47 -2 -3 28
3833 28 26 4 -5 -11 -41 -24 8 0 0 17 25 -34 14 -40 -61 -7 1 28 17 81 57 24 17 70 86 13 21 9 -17 -17 18 -11 -4 28 -21 50
3869 50 -9 11 5 55 59 -35 -2 15 27 17 -76 -13 62 -14 -2 31 -66 58 10 -41 -37 13 -55 -19 44 5 -58 -28 0 9 38 11
3901 11 -40 25 0 -32 -22 58 -16 32 32 18 43 -10 -11 -6 -73 2 13 51 -22 4 -15 -5 -27 16 4 0 14 8 38 8 28 -17 8
3934 8 -9 -14 -35 83 46 10 -53 -2 6 29 -25 -46 36 42 39 -3 12 -13 -59 52 -75 -34 -18 -12 -31 -20 62 5 49 -44 31 30
3966 30 -49 53 2 -59 23 -2 23 -3 0 -48 -43 -23 -28 -7 50 -7 -114 39 18 -43 -32 -22 3 -61 89 -6 25 -11 63 25
3996 25 -9 54 -17 0 -27 42 -10 -25 28 -3 -20 -20 7 -53 48 59 -37 -4 41 -27 14 50 -13 -44 15 27 2 66 83 40
4026 40 12 -4 71 -52 -4 -50 -10 81 -2 -10 3 -18 -96 -15 -6 18 -5 -8 36 8 14 25 48 -7 32 98 -42 53 -32 22 22 29
4058 29 -15 -14 -136 -71 -3 10 9 -21 -26 18 7 23 -15 4 49 -52 -67 18 -30 55 -37 5 26 70 -10 -78 37 59 -33 -27 -25
4089 -25 26 16 24 18 -10 3 41 -16 -25 18 -8 -55 1 -28 -17 -8 14 3 -60 15 0 44 70 0 22 42 -32 -8 -34 63 18 -9
4121 -9 -6 15 -50 19 24 45 -27 55 17 -9 40 28 12 -11 -10 6 -15 1 -41 44 -97 -21 -13 -118 33 -25 -31 12 34 -46 27 29
4153 29 -44 29 12 48 15 -20 25 18 -67 27 -8 14 4 25 -14 -10 45 4 20 -64 2 -13 100 56 27 71 52 30 42 -21 39
4184 39 -32 63 46 10 49 22 10 30 30 -35 -33 10 -23 -17 15 -40 -13 50 19 52 -59 61 -47 14 -8 -12 53 25 0 21 -16
4215 -16 -23 47 -23 7 29 -10 -21 17 -34 40 -25 -2 -3 -17 3 20 -41 43 22 18 -69 30 91 -21 33 28 28 -21 -27 21 85 -62
4247 -62 24 -9 -13 41 -55 -26 -50 52 -64 -3 -61 -63 -8 61 13 -59 -35 70 1 -31 -3 22 6 -41 -20 23 -25 -30 -28 20 34
4278 34 -5 -34 -3 -17 -32 33 -23 -46 16 18 -27 -31 59 43 13 -41 23 50 30 60 -19 -16 -40 15 -8 -13 15 10 29 33 24 -9 4 3
4312 3 -54 -26 59 80 18 60 16 -22 -41 40 -17 10 37 67 7 5 -20 40 36 -92 41 10 -58 -40 -27 33 14 -6 48 -40 -7
4343 -7 20 26 -33 -13 -15 12 3 21 11 -38 63 -6 27 14 4 -13 -73 -15 -64 -39 -17 -37 6 13 48 16 -35 -6 1 -28 4 8 33
4376 33 -23 64 27 29 33 76 57 14 -26 -65 -12 112 14 -74 42 40 70 -30 -35 7 -26 -12 28 20 2 -22 -21 -18 64 17 -27 -34 -27
4409 -27 -28 -22 -17 0 45 -31 -25 -36 -37 5 -31 -25 -4 -19 -36 59 18 27 81 27 15 -28 63 97 6 7 15 31 1 48 -9 -37 -38 -18 -84
4444 -84 6 8 -7 -27 -24 3 18 -26 11 58 -10 5 1 -9 -5 -18 21 23 60 29 31 -32 -87 -1 34 -18 -53 -45 -10 -20 1 -10 -22 41
4478 41 47 47 -9 3 24 -25 56 74 -2 -9 11 35 59 50 48 55 -20 6 7 51 20 -31 -44 -6 -19 -5 6 -41 -8 8 -7 -40 -19 -74
4512 -74 56 53 -10 -18 18 24 33 11 26 37 11 14 -58 -12 -35 -82 12 -3 7 -33 37 -13 -8 32 57 16 -4 7 -17 26 52 2 35
4545 35 32 -40 -2 -38 -14 28 -14 -12 28 -29 -23 58 12 45 19 -23 -9 17 57 2 59 41 46 23 52 -35 6 31 11 -1 81 68
4577 68 -25 -44 -62 -17 -11 -28 11 -19 -3 -10 22 -35 3 22 3 -29 -23 18 21 111 61 15 -60 -13 -13 17 29 -9 -10 26 -12 19 -18
4610 -18 -14 39 -17 22 -9 -7 55 66 22 -15 22 21 17 -8 24 13 -23 4 -20 -13 6 -30 -53 -29 -11 9 9 -57 -3 28 -26 -9 -40
4643 -40 0 -19 11 -2 9 -12 -4 -24 -22 29 -26 26 -22 -38 -15 -3 9 24 46 -16 -5 -44 52 16 6 12 8 -50 3 -12 5 -30
4675 -30 47 -28 -2 -3 -5 12 -15 69 26 -39 -54 1 18 -37 -5 32 14 -42 20 37 13 -7 3 -63 45 -28 -29 9 4 40 -6 -4
4707 -4 8 -28 -7 -9 95 37 23 -7 20 44 -24 -2 -29 -27 14 -30 -55 -23 5 31 -5 -25 10 -20 -9 -24 22 -12 16 70 26
4738 26 23 -8 -16 26 2 8 7 27 -42 -12 -7 -16 5 -13 -14 28 6 -8 3 18 -25 -9 -17 26 -11 -40 15 33 -33 6 112 -4 -46
4771 -46 8 12 56 17 -1 20 -7 18 70 -17 -3 39 -16 8 67 -61 -17 42 23 29 26 76 -7 -23 8 -22 -76 32 -64 -12 10
4802 10 -47 -29 -30 -18 22 -7 54 -12 7 -45 24 -57 25 -52 36 -10 -8 -61 -22 -21 -69 -10 -43 -87 -32 18 -16 -22 -9 -14 59 49 21
4835 21 29 49 5 49 34 -9 30 -8 40 20 -52 -39 19 9 32 29 13 9 78 6 8 -43 -20 32 -6 19 27 15 22 -43 -34 6 -45 77
4869 77 1 -22 63 21 -29 -26 -59 -14 -1 18 21 19 -28 2 -47 -40 48 -51 -13 -24 71 -29 25 20 0 17 12 11 15 64 -52 18 -20
4902 -20 -41 28 -2 36 12 48 62 19 -80 -80 -29 8 -72 59 -74 -27 8 46 68 -28 43 -8 20 15 21 -53 -12 -26 26 27 31 2
4934 2 -20 -52 -34 -31 35 -3 -7 39 41 6 -7 14 75 50 -32 36 30 -17 16 37 11 -17 9 -1 13 30 21 33 -5 36 8 -6 -38
4967 -38 25 -42 -49 10 92 10 31 1 13 -8 -38 -39 16 -6 -38 -13 56 12 0 23 15 -4 -21 6 79 -6 28 5 -48 66 35
4998 35 -3 27 -2 28 -31 41 13 -39 47 -68 28 -7 -5 17 -10 -82 8 24 -62 -8 -11 -17 -31 -12 6 -59 20 16 -29 -14 10 39
5030 39 3 -40 -20 7 27 -11 25 55 24 -2 -28 -25 8 -40 2 64 8 20 -24 -20 -22 29 -26 13 44 -3 -19 10 40 -10 -18 70
5062 70 -11 29 16 -30 -33 -40 -62 8 -24 49 -5 18 87 6 -38 0 -10 46 12 -48 11 -29 22 5 -40 46 -10 19 32 60 -8
5093 -8 -2 -43 -18 11 39 -10 -43 18 -21 -14 40 -60 27 15 35 -18 -13 -3 -34 5 -81 -31 7 -12 28 49 15 31 15 -9 -46 -13
5125 -13 13 18 20 -23 4 67 0 35 -27 22 63 -52 -52 32 35 52 10 12 -4 0 -19 -1 7 -3 -31 -21 -74 22 53 20 12 -23 -12 -37
5159 -37 20 2 6 18 23 31 29 -4 -21 12 -34 56 -77 -6 -44 -56 -29 -7 -16 29 -19 -12 -2 -54 27 24 38 8 -75 28 59 11 69
5192 69 31 -10 24 34 57 3 44 34 -4 -45 -3 3 -37 30 -1 9 5 -34 -20 37 -18 -40 21 -51 17 -26 -5 35 -27 -8 9
5223 9 -34 38 -34 7 -56 13 -24 -55 -42 -14 56 9 32 -19 -24 -5 -57 4 -10 8 -30 7 -21 -45 6 8 55 -58 -50 60 21
5254 21 10 -32 -11 -19 -22 47 -9 28 1 55 -26 22 45 -45 32 -81 1 -17 9 24 1 10 -55 25 17 76 -36 -73 23 -3 -90
5285 -90 -9 -36 66 -48 32 23 -48 22 -52 14 60 -26 -20 4 21 42 49 1 -15 -16 21 2 -11 -3 27 30 19 1 25 -23 -71 -36
5317 -36 -30 51 36 -13 21 27 45 -29 -9 5 -13 -44 -38 -5 -13 39 -7 10 -10 34 27 18 24 51 10 8 7 -12 27 -18 16 21 -39 60 -18
5352 -18 19 24 12 -20 31 12 -4 -59 4 6 49 -24 100 27 -28 -81 7 38 -23 -15 22 27 -3 4 -16 75 -58 -10 -6 20 -9 -23
5384 -23 36 37 -5 -19 1 -11 64 14 -24 15 6 25 -20 1 3 -12 -11 53 2 23 -32 1 24 51 -11 -22 36 19 23 -7 36 -34 -58
5417 -58 9 56 -13 44 56 -3 38 14 38 24 -7 26 0 -10 10 55 -125 20 61 109 -3 -2 -47 33 -7 48 6 35 12
5446 12 -3 51 38 10 70 -16 5 14 37 -17 -8 -23 -56 59 -33 -9 -8 -4 6 25 61 34 10 36 2 -14 16 -25 -19 -91 20 28
5478 28 4 18 53 -37 -42 30 45 -34 -9 -23 43 -7 -29 45 5 13 -37 -48 -51 -22 44 -2 -29 27 60 -35 5 -78 -38 15 -22 29
5510 29 10 -16 8 6 -20 52 -18 -28 -56 -18 -6 9 31 40 -21 -5 -18 30 -36 22 -4 -4 -22 1 -41 0 25 -50 16 -1 -22 31
5542 31 -86 -28 30 59 81 33 15 16 9 26 -74 -6 -29 14 -80 32 -3 -4 -37 -42 48 -31 12 6 -12 -25 -24 -20 -42 -39 32 27 24 25
5576 25 -24 -13 44 7 38 23 -9 -38 23 13 -5 20 73 -32 -11 -33 -17 44 -65 -49 23 -9 -5 23 75 -21 -34 14 -19 -1
5606 -1 -48 10 -13 1 -9 58 24 0 -53 13 -6 -31 -23 -7 -14 21 -18 7 -10 -40 19 43 -26 -2 45 32 52 11 -15 -62 31 35
5638 35 38 -16 18 30 28 -2 -12 -55 32 -27 53 -15 -14 39 -30 54 12 44 -7 18 46 5 44 27 59 0 -25 15 62 3 29 21
5670 21 68 29 -34 23 -22 34 55 13 0 62 33 -16 -9 -68 33 -20 -18 3 44 11 35 13 8 7 6 -1 -27 -61 -16 69 26 -30 58
5703 58 2 18 -27 -32 54 5 48 39 17 96 33 -4 24 9 54 40 0 26 18 -24 -18 -32 26 -63 -36 -1 14 -59 -77 72 -12 -29
5735 -29 40 -6 -66 53 15 38 -49 -46 -22 5 27 -27 53 7 31 47 49 -20 0 -8 29 -22 17 -8 -5 -12 9 -53 41 24 65 -10
5767 -10 -42 -4 -12 11 -2 29 -12 30 -13 -1 -55 10 -54 -40 17 -22 3 -7 3 21 8 -26 -10 -7 6 52 -37 13 71 -31 58
5798 58 27 -11 -43 -52 -36 -1 14 42 -4 -3 3 7 -21 -33 -32 33 4 4 -12 80 -24 15 15 2 45 55 1 56 3 87 -4 8 12 33
5832 33 35 -1 41 -24 64 48 10 -22 -85 27 17 -84 -22 20 -9 -49 53 6 -13 -14 44 -22 25 -10 -54 30 -38 57 -67
5861 -67 10 -5 85 -67 23 8 -44 13 35 -36 -1 5 27 -42 -10 -11 24 -23 -7 5 5 -19 20 -64 42 20 -18 37 -36 18 5
5892 5 -16 18 -52 28 12 -10 -42 -5 -28 57 33 -46 34 -26 1 -22 -22 2 16 -20 30 -3 29 -23 -14 48 -73 48 -29 32 2
5923 2 14 2 2 19 -29 -11 10 8 -69 24 3 -18 -2 23 9 66 -40 -3 -8 -28 6 7 -50 -36 8 57 -43 35 51 36 57 27
5955 27 -38 -34 48 11 -10 -13 4 -28 13 16 25 -10 -24 -26 5 17 9 -17 14 34 -6 -39 58 -1 37 53 -23 37 -20 -39 -53 10 -1
5988 -1 -13 25 -3 3 8 6 26 49 -18 -17 82 38 -63 -48 -47 -58 47 39 6 56 59 65 65 -25 54 -23 55 22 -12 26 6 38 -15 52
6022 52 -12 2 28 7 24 -32 -20 -6 29 -31 -31 54 19 -2 7 -18 -42 6 -38 -24 -18 54 1 14 40 -40 -15 34 -39 -36 -7 11
6054 11 50 48 -27 -28 -3 -19 44 -10 52 1 8 1 43 67 12 63 3 -62 -4 18 -35 3 -9 40 46 -5 42 4 55 1 -17 67 -47
6087 -47 9 -5 -38 -57 -14 33 -9 -52 -31 25 -53 -28 -22 10 4 7 -43 -14 2 -11 -3 -12 6 38 62 -5 -32 -5 -13 82 -28 21 3
6120 3 -12 -22 26 -2 85 -5 -55 54 49 9 41 44 -13 4 27 73 37 32 -17 1 -29 30 72 -12 -6 20 14 16 3 -8 24 -16 33
6153 33 -52 47 26 -26 65 28 69 8 54 -22 30 25 -13 28 21 8 26 20 -4 -25 -26 8 11 70 68 -2 -51 30 14 -62 14 -4 0 -12
6187 -12 6 -14 14 -13 -23 -46 20 57 -1 39 2 -23 71 56 -2 -13 -10 -3 9 11 22 53 38 -44 -10 -18 13 37 18 54 -70 -20
6219 -20 54 12 -32 -3 -36 26 -8 -12 -17 47 -25 15 -12 -19 -4 -48 -29 17 42 -5 29 46 34 -49 -74 -25 45 58 18 -2 -6 -55
6251 -55 -5 11 44 -11 -51 32 -34 -60 20 7 -15 27 27 -37 4 -35 73 -2 13 -25 -53 10 -9 -10 -20 -33 -7 23 51 -53
6281 -53 -9 34 -7 -4 -38 64 44 53 85 -46 10 24 -14 30 -44 6 37 43 35 -35 15 52 17 11 69 46 -9 80 -25 -12 35
6312 35 -7 -21 -15 14 22 78 -26 69 12 -2 45 -76 -6 -81 -3 0 -18 75 -23 -65 17 1 31 -20 -9 -1 -9 25 -11 57 28 -4
6344 -4 -3 -12 -27 24 -10 28 -7 -14 22 18 -38 -3 34 98 12 -16 43 -10 20 -45 16 -13 -12 -7 33 -32 22 52 -24 96 42 -44 -22
6377 -22 8 -18 47 -1 25 -19 -27 -4 9 -30 24 -5 -9 32 23 10 -43 -12 -3 15 -6 -8 46 -30 58 29 -34 29 -36 33 -1 -7 -15 -14
6411 -14 -26 -6 -37 51 29 -52 -13 41 64 -6 -52 7 16 -12 16 -62 -6 -1 -1 -31 54 1 16 17 -29 15 5 65 52 1 12 -10
6443 -10 6 24 36 -16 40 -18 0 0 11 6 43 -22 10 18 3 36 -45 17 -6 -24 -61 -51 1 10 30 19 1 18 55 -38 -13 5
6475 5 55 12 46 17 33 -49 3 -33 26 -36 9 1 -37 -28 -23 28 -18 59 -11 15 -14 -4 33 17 17 64 25 -2 -43 -18 -4 28 -11
6508 -11 -2 3 28 25 -16 -28 4 -2 -59 -20 28 9 -84 -7 58 -1 7 -29 0 62 -14 43 11 -61 29 57 15 42 -1 5 -15 35 -29
6541 -29 39 -12 -6 23 54 75 -31 -3 -50 -48 -37 -45 -48 22 -40 -52 -38 -59 3 22 -43 10 66 -55 28 -21 -6 25 4 -16 -2
6572 -2 84 -54 -23 -32 -9 22 -51 -22 41 -15 -4 46 -28 -21 -7 -48 -16 -19 -15 -12 -20 20 -57 0 -28 -1 -55 25 45 -12 58 37 -104
6605 -104 -18 -39 -43 72 -2 54 -31 -41 19 6 55 -5 -11 -20 -40 -12 -27 29 -12 -14 40 -37 37 -34 -46 -4 3 -4 -33 0 -18 -12 -26
6638 -26 35 27 -24 -36 26 -44 0 -18 24 -3 10 39 6 30 -36 -39 51 59 -20 -21 -6 -48 54 -33 63 39 -3 39 66 36 1 6
6670 6 48 36 -43 -12 -35 -15 68 26 -26 -44 33 15 -22 -34 -2 14 -20 7 -29 3 -31 9 47 -15 -11 47 -7 40 -35 -47 -38 52
6702 52 -21 -23 -29 -13 38 27 -31 20 -20 -51 -32 -31 -59 -69 -42 -58 -21 46 16 -40 6 16 -56 -28 26 23 17 27 -47 34 33 -66 7
6735 7 -21 33 -1 -15 -28 -68 -9 4 4 -26 83 -53 -14 9 -51 1 -49 73 -19 -15 -23 14 11 41 50 -12 -30 -6 28 -26 -12 -37
6767 -37 -68 -49 -45 50 45 -20 -31 -23 -27 -3 69 -39 25 15 -34 33 -56 7 2 -56 23 -17 -73 14 -30 -12 -46 24 -51 -21 -41 4
6799 4 69 25 78 -44 10 -22 15 -3 -68 4 -3 24 -14 -54 -22 7 -45 -8 -23 -90 -59 -1 -9 -35 -19 14 41 -15 -56 39 46 36
6831 36 -9 -43 -19 -21 34 -16 14 -44 -20 24 -31 27 8 -27 9 36 11 -18 -65 -36 62 -14 -64 68 20 -47 35 -71 11 -57
6861 -57 32 23 -42 6 60 -19 1 9 -5 48 4 5 -3 -24 -45 -52 87 -7 -11 -1 -8 -33 -32 23 -2 52 -60 15 0 -8 -21 45 -40 -12
6895 -12 -69 28 23 46 8 -31 40 -31 -18 13 -19 -22 52 27 10 -17 -13 9 4 0 62 11 55 11 -10 -34 82 -9 -13 31 -17 -66 -66
6928 -66 5 -1 12 44 -18 -42 -4 -57 1 -25 -73 -10 55 -6 30 4 -23 11 7 -62 -11 -114 -65 5 8 -16 -14 2 26 -25 -11 5
6960 5 34 29 -10 16 7 12 18 -24 -14 30 -23 13 -5 -28 32 15 39 -31 2 58 73 -47 -46 54 51 -9 29 28 10 -9 -16 -70 -12 14
6994 14 -42 -16 -33 -9 -35 -73 -32 16 24 -19 62 62 14 8 36 -41 -62 1 -10 46 -26 -23 -8 -6 -2 0 86 -68 -9 -8 -40 0 -11 34
7028 34 68 7 3 22 84 -31 -63 -15 -28 16 7 -22 29 -68 26 -7 31 29 -15 10 -21 -6 -49 3 11 63 -30 15 82 -16 -67 19
7060 19 -11 4 39 35 -13 -24 9 33 56 2 3 9 38 -37 -15 -37 -16 28 54 -25 -15 -17 -96 15 3 -37 -43 -55 25 4 -32 -24 -16
7093 -16 -51 10 59 14 -20 -31 15 57 -14 20 -4 -27 24 32 -15 8 5 53 -76 40 -41 2 -9 -19 -29 -69 34 18 18 -5
7123 -5 53 -36 32 -2 -47 -20 7 -72 43 54 -13 5 -30 56 30 -9 50 16 -63 9 25 39 33 -44 31 -17 24 63 8 27 8
7154 8 -11 5 4 12 -71 11 20 -39 -38 -4 -14 -15 -105 -24 -17 -58 38 -27 19 8 11 -13 -28 6 -64 -7 -68 2 15 -31 16 -57 -18 -1
7188 -1 -13 -5 50 10 26 33 3 -49 46 7 23 34 -27 5 -10 12 -11 -48 -23 22 -21 -39 -29 25 27 -9 55 -13 -16 -13 -26 28 15
7221 15 29 53 12 7 -39 -24 -100 4 35 2 -39 -10 -4 -5 31 -6 -4 -41 -12 -67 10 -26 62 -37 -9 -47 13 -13 9 16 16 41 -40
7254 -40 27 -34 -6 -4 18 30 4 -11 -41 36 -25 14 18 -65 35 -1 58 21 14 11 -65 -35 16 -30 1 -31 -12 -44 36 54 51 -3
7286 -3 -9 -34 21 26 -39 20 -27 23 -6 18 -8 56 9 -54 -39 -1 11 9 -94 -29 -12 66 -44 51 35 35 -8 1 -83 -25 -79 17
7318 17 37 -57 5 -16 -5 -30 -17 1 46 15 12 -7 25 -4 -28 -84 -61 11 -52 32 -2 -35 1 -38 -1 14 -31 32 -11 29 15
7349 15 -61 9 -8 -15 -16 -33 -36 63 8 18 -22 7 -68 69 -22 6 -33 -32 50 32 79 -7 26 -14 -7 -21 -3 -22 29 17 -59 15
7381 15 -31 -48 -6 24 30 -13 -1 3 -9 40 5 -14 32 -21 22 35 -13 -37 -36 14 -33 34 -16 -59 1 -13 -26 -29 -29 2 21 -5 -6
7414 -6 -6 9 15 -28 -6 -55 -1 -25 -32 -4 -30 -52 -30 -7 -3 32 -2 -49 30 -22 -58 -7 -42 -15 10 42 -25 -32 17 -101 -28 78
7446 78 -10 9 28 0 62 76 -27 41 57 -16 41 29 -23 36 -16 -18 31 -11 -37 -28 48 21 19 -21 15 31 -52 23 14 14 27 24 6
7479 6 -29 45 -18 69 -72 -24 -14 -43 12 43 -6 26 -9 0 -7 -56 -45 -26 6 2 38 64 45 -29 70 -33 33 -29 -59 -35 61
7510 61 32 -18 62 13 -84 23 41 1 20 6 54 37 5 5 7 21 -5 77 13 8 0 22 6 -16 -7 -10 33 -8 -17 -38 -55 -20 -20 -11
7544 -11 -1 23 47 -16 5 38 4 -47 5 14 29 -12 -65 11 21 -8 31 47 -23 65 1 -48 -34 42 -35 15 54 -3 6 -31 -13
7575 -13 -43 15 -24 -1 11 -22 -19 -17 -23 -19 8 -6 25 22 -17 1 8 -15 -20 -64 16 -5 -59 7 -24 -25 -2 12 63 12 -52 -8 -101 -9
7609 -9 17 14 -50 -37 -14 25 11 -21 -7 -100 0 -18 70 41 -13 0 15 -39 -68 -14 -31 5 -34 28 -13 -9 6 21 48 -42 -49 15
7641 15 -65 -76 12 21 -6 -70 -6 3 41 -8 -22 26 52 -9 -62 -31 17 21 55 11 51 31 -34 5 -28 -49 27 52 -14 20 -32 -12
7673 -12 -39 -30 -11 7 23 -30 33 56 28 -34 34 71 31 4 -12 -4 10 17 -54 -8 -11 -73 -11 6 -24 21 10 -53 20 20 -41 -12 -87
7706 -87 -17 -57 37 -37 58 3 -15 -14 -32 -30 97 40 -11 20 -34 1 9 3 33 37 4 22 -36 -32 5 35 -2 45 -8 -35 23 -3 -7
7739 -7 74 28 48 -15 -1 -39 -59 11 1 -68 -55 -3 12 5 -19 11 50 11 22 -17 12 11 27 -62 -6 -49 -11 -6 -31 31 -11 -39
7771 -39 -32 36 -21 -16 -44 -16 -6 -68 -16 -2 -22 24 37 -47 -18 42 -43 -21 -30 -21 7 -80 53 -38 -67 -58 -2 -40 -14 -2 -17 6
7803 6 -6 6 -5 -28 28 -22 25 -46 -8 13 -9 4 -124 46 -19 12 -11 -19 -17 -3 37 -34 -16 -12 -45 2 18 16 -18 -37 -6 -7
7835 -7 35 -35 -67 -29 88 -21 6 30 -44 2 -13 58 22 9 91 -18 38 -35 -3 41 25 21 -31 -47 -8 -56 -3 58 -7 -17
7865 -17 -43 -16 -18 -10 27 23 39 36 31 44 -12 -28 58 -43 16 -43 9 9 28 -20 -31 -31 55 47 28 36 -62 -35 17 16 16 18 -36 -81 36
7900 36 -54 -69 65 58 18 63 -12 -18 35 19 -27 17 -10 2 -20 1 -18 -11 30 -30 -26 -29 22 -69 18 35 78 18 29 -5 -15 -28
7932 -28 -86 -7 -54 -3 7 -65 18 35 -3 -56 -52 -18 -8 -17 28 54 -7 -14 -17 -45 -19 -43 -75 32 -39 -17 -40 -42 -30 -15 -12 60 6
7965 6 -6 0 1 -2 -3 -1 -17 10 -42 9 14 -15 -52 8 65 47 50 -26 4 3 6 17 -16 15 -15 18 18 31 -23 -14 67 -2 30 -31 -49 -7
8001 -7 37 -90 14 83 29 33 -20 -18 -38 -24 -16 18 -1 14 4 20 -75 -1 12 4 25 -44 63 -43 -32 -3 -16 11 -2 -6 -2 -10
8033 -10 29 -25 -38 -28 -42 -20 -4 -16 -17 58 40 -37 19 20 -68 -67 -11 -55 19 25 29 18 9 -40 -41 1 31 15 11 -12 -7 41 -8 48 -29
8068 -29 23 -10 -5 -10 -25 11 17 48 -47 38 -29 33 -48 -75 11 -31 2 -7 -49 11 12 23 -26 -2 25 -14 -41 62 26 45 -52 22
8100 22 22 28 17 -2 -34 32 -4 -33 -35 13 38 12 -29 -8 3 14 -12 -35 32 -11 -46 -51 17 -42 -10 -36 42 -4 -25 -22 19 37 -24
8133 -24 -35 46 29 -27 -34 13 -19 -6 -42 -30 45 -77 34 24 -57 -39 -62 -4 -5 24 37 24 -49 -6 -62 16 -27 -76 49 -50
8163 -50 -59 34 2 28 -3 -70 -12 -36 26 38 -22 -23 47 -16 34 -6 61 19 -47 9 25 19 -39 6 -31 -29 0 24
8191B4
##END NTUPLES=NMR FID
##END=
