##TITLE=1H ikalashn
NCS-E
24.10.2024
##JCAMPDX= 6.0         $$ Bruker NMR JCAMP-DX V2.0
##DATA TYPE= NMR FID
##DATA CLASS= NTUPLES
##ORIGIN= UXNMR, Bruker Analytische Messtechnik GmbH
##OWNER= root
$$ TOPSPIN		Version 1.3
$$ 2024-10-24 14:50:15.046 +0400  Irina@DPX200
$$ Compression mode = diff/dup
##.OBSERVE FREQUENCY= 200.131300845
##.OBSERVE NUCLEUS= ^1H
##.DELAY= (6, 6)
##.ACQUISITION MODE= SIMULTANEOUS
##.ACQUISITION SCHEME= undefined
##.AVERAGES= 16
##.DIGITISER RES= 18
##SPECTROMETER/DATA SYSTEM= spect
##.PULSE SEQUENCE= zg
##.SOLVENT NAME= CDCl3
##.SHIFT REFERENCE= INTERNAL, CDCl3, 1, 17.49637
##AUDIT TRAIL= $$ (NUMBER, WHEN, WHO, WHERE, WHAT)
$$ ##TITLE= Audit trail, TOPSPIN		Version 1.3
$$ ##JCAMPDX= 5.01
$$ ##ORIGIN= Bruker BioSpin GmbH
$$ ##OWNER= Irina
$$ $$ F:/spectra/data/iren/nmr/1H/4/audita.txt
$$ ##AUDIT TRAIL=  $$ (NUMBER, WHEN, WHO, WHERE, VERSION, WHAT)
(   1,<2024-10-24 14:50:04.562 +0400>,<Irina>,<DPX200>,<TOPSPIN 1.3>,
      <created by zg
	started at 2024-10-24 14:48:56.703 +0400,
	POWCHK disabled, PULCHK disabled
       configuration hash MD5:
       BE 6D 3F 07 2A EA 11 49 91 17 2B D3 AF B3 58 0D
       data hash MD5: 16K
       E1 60 F5 F1 6E F0 9C 4F 30 21 B3 D9 C5 4F 1C 82>)
$$ ##END=
$$ 
$$ $$ hash MD5
$$ $$ 4B FB F8 47 EA FE 72 E6 24 7E 1F 7B 8F 3D 4D 5A
##$RELAX= 
##$RELAX= 
##$RELAX= 
##$RELAX= 
##$RELAX= 
##$RELAX= 
##$RELAX= 
##$RELAX= 
##$RELAX= 
$$ Bruker specific parameters
$$ --------------------------
##$DU= <F:/spectra>
##$EXPNO= 4
##$NAME= <1H>
##$PROCNO= 1
##$TYPE= <nmr>
##$USER= <iren>
##$AMP= (0..31)
100 100 100 100 100 100 100 100 100 100 100 100 100 100 100 100 100 100 
100 100 100 100 100 100 100 100 100 100 100 100 100 100 
##$ANAVPT= -1
##$AQSEQ= 0
##$AQ_mod= 1
##$AUNM= <au_zg>
##$AUTOPOS= <>
##$BF1= 200.13
##$BF2= 200.13
##$BF3= 200.13
##$BF4= 200.13
##$BF5= 200.13
##$BF6= 200.13
##$BF7= 200.13
##$BF8= 200.13
##$BYTORDA= 1
##$CFDGTYP= 0
##$CFRGTYP= 5
##$CHEMSTR= <none>
##$CNST= (0..63)
1 1 145 1 1 1 1 1 1 1 1 1 1 1 1 1 1 1 1 1 1 1 1 1 1 1 1 1 1 1 1 1 1 1 
1 1 1 1 1 1 1 1 1 1 1 1 1 1 1 1 1 1 1 1 1 1 1 1 1 1 1 1 1 1 
##$CPDPRG= <>
##$CPDPRG1= <>
##$CPDPRG2= <>
##$CPDPRG3= <>
##$CPDPRG4= <mlev>
##$CPDPRG5= <mlev>
##$CPDPRG6= <mlev>
##$CPDPRG7= <mlev>
##$CPDPRG8= <mlev>
##$CPDPRGB= <>
##$CPDPRGT= <>
##$D= (0..63)
0 2 0 0 0 0 0 0 0 0.06 0 0.03 0 0 0 0 0.0002 0 0 0 0 0 0 0 0 0 0 0 0 0 
0 0 0 0 0 0 0 0 0 0 0 0 0 0 0 0 0 0 0 0 0 0 0 0 0 0 0 0 0 0 0 0 0 0 
##$DATE= 1729767001
##$DBL= (0..7)
120 120 120 120 120 120 120 120 
##$DBP= (0..7)
150 150 150 150 150 150 150 150 
##$DBP07= 0
##$DBPNAM0= <>
##$DBPNAM1= <>
##$DBPNAM2= <>
##$DBPNAM3= <>
##$DBPNAM4= <>
##$DBPNAM5= <>
##$DBPNAM6= <>
##$DBPNAM7= <>
##$DBPOAL= (0..7)
0.5 0.5 0.5 0.5 0.5 0.5 0.5 0.5 
##$DBPOFFS= (0..7)
0 0 0 0 0 0 0 0 
##$DE= 6
##$DECBNUC= <off>
##$DECIM= 32
##$DECNUC= <off>
##$DECSTAT= 4
##$DIGMOD= 1
##$DIGTYP= 9
##$DL= (0..7)
0 120 120 120 120 120 120 120 
##$DP= (0..7)
150 150 150 150 150 150 150 150 
##$DP07= 0
##$DPNAME0= <>
$$ [...]
##$SW= 21.9926040160658
##$SWIBOX= (0..15)
0 0 2 0 0 0 0 0 0 0 0 0 0 0 0 0 
##$SW_h= 4401.40845070422
##$TD= 16384
##$TD0= 1
##$TE= 300
##$TE2= 300
##$TE3= 300
##$TEG= 300
##$TL= (0..7)
0 120 120 120 120 120 120 120 
##$TP= (0..7)
150 150 150 150 150 150 150 150 
##$TP07= 0
##$TPNAME0= <>
##$TPNAME1= <>
##$TPNAME2= <>
##$TPNAME3= <>
##$TPNAME4= <>
##$TPNAME5= <>
##$TPNAME6= <>
##$TPNAME7= <>
##$TPOAL= (0..7)
0.5 0.5 0.5 0.5 0.5 0.5 0.5 0.5 
##$TPOFFS= (0..7)
0 0 0 0 0 0 0 0 
##$TUNHIN= 0
##$TUNHOUT= 0
##$TUNXOUT= 0
##$USERA1= <user>
##$USERA2= <user>
##$USERA3= <user>
##$USERA4= <user>
##$USERA5= <user>
##$V9= 5
##$VALIST= <valist>
##$VCLIST= <CCCCCCCCCCCCCCC>
##$VD= 0
##$VDLIST= <DDDDDDDDDDDDDDD>
##$VPLIST= <PPPPPPPPPPPPPPP>
##$VTLIST= <TTTTTTTTTTTTTTT>
##$WBST= 1024
##$WBSW= 25
##$XGAIN= (0..3)
0 0 0 0 
##$XL= 0
##$YL= 0
##$YMAX_a= 551641
##$YMIN_a= -758552
##$ZGOPTNS= <>
##$ZL1= 120
##$ZL2= 120
##$ZL3= 120
##$ZL4= 120
##$ABSF1= 10
##$ABSF2= 0
##$ABSG= 5
##$ABSL= 3
##$ALPHA= 0
##$AQORDER= 0
##$ASSFAC= 0
##$ASSFACI= 0
##$ASSFACX= 0
##$ASSWID= 0
##$AUNMP= <proc_1d>
##$AXLEFT= 0
##$AXRIGHT= 0
##$AXTYPE= 0
##$AXUNIT= <>
##$AZFE= 0.1
##$AZFW= 0.1
##$BCFW= 1
##$BC_mod= 2
##$BYTORDP= 1
##$COROFFS= 0
##$CY= 7568.61572265625
##$DATMOD= 1
##$DC= 2
##$DFILT= <>
##$DTYPP= 0
##$F1P= 17.9538593292236
##$F2P= -4.03888763876832
##$FCOR= 0.5
##$FTSIZE= 32768
##$FT_mod= 4
##$GAMMA= 1
##$GB= 1
##$INTBC= 1
##$INTSCL= 1
##$ISEN= 128
##$LB= 0.02
##$LEV0= 0
##$LPBIN= 0
##$MAXI= 945.577
##$MC2= 0
##$MEAN= 0
##$ME_mod= 0
##$MI= -402.1523
##$NCOEF= 0
##$NC_proc= 0
##$NLEV= 6
##$NOISF1= 8.587773
##$NOISF2= 6.764455
##$NSP= 1
##$NTH_PI= 0
##$NZP= 0
##$OFFSET= 17.49637
##$PC= 1
##$PHC0= -43.30347
##$PHC1= 11.72053
##$PH_mod= 0
##$PKNL= yes
##$PPARMOD= 0
##$PPDIAG= 0
##$PPIPTYP= 0
##$PPMPNUM= 100
##$PPRESOL= 1
##$PSCAL= 0
##$PSIGN= 0
##$REVERSE= no
##$SF= 200.13
##$SI= 32768
##$SIGF1= 18.5376
##$SIGF2= -6.396296
##$SINO= 400
##$SIOLD= 32768
##$SREGLST= <1H.CDCl3>
##$SSB= 3
##$STSI= 0
##$STSR= 0
##$SW_p= 4401.40845070422
##$SYMM= 0
##$S_DEV= 0
##$TDeff= 0
##$TDoff= 0
##$TI= <>
##$TILT= no
##$TM1= 0
##$TM2= 0
##$TOPLEV= 0
##$USERP1= <user>
##$USERP2= <user>
##$USERP3= <user>
##$USERP4= <user>
##$USERP5= <user>
##$WDW= 1
##$XDIM= 8192
##$YMAX_p= 0
##$YMIN_p= 0
$$ End of Bruker specific parameters
$$ ---------------------------------
##NTUPLES= NMR FID
##VAR_NAME=  TIME,          FID/REAL,        FID/IMAG
##SYMBOL=    X,             R,               I
##VAR_TYPE=  INDEPENDENT,   DEPENDENT,       DEPENDENT
##VAR_FORM=  AFFN,          ASDF,            ASDF
##VAR_DIM=   8192,          8192,            8192
##UNITS=     SECONDS,       ARBITRARY UNITS, ARBITRARY UNITS
##FACTOR=    0.0002272,     1,               1
##FIRST=     0,             0,               0
##LAST=      1.8609952,     4,               26
##MIN=       0,             -758552,         -758552
##MAX=       1.8609952,     551641,          551641
$$ Real data points
##PAGE= N=1
##DATA TABLE= (X++(R..R)), XYDATA
$$ [...]
1675c28q21L27Q60O32m64o49k89N14L61L68j45m74K05L69j96l4J18L57k98o33
$$ -328 -1149 -822 38 670 206 -443 -732 -218 143 511 366 -108 97 466 270 236 354 711 413 -220
1695b20k56L93N73K4m89q21j56N70R91j41r70o76M48R48N31n18n16oM21N23j96
$$ -220 -476 -83 490 514 25 -796 -952 -382 609 468 -502 -1178 -730 218 749 231 -285 -291 130 653 457
1716D57m79L14K45k82n50NO09O04m11r50p86P75J157p4q56j002K02J018R85m24
$$ 457 -22 292 537 255 -295 -290 319 923 512 -438 -1224 -449 708 634 -222 -1224 -1022 -4 981 557
1736E57j119k26Q16M72j60j47N9j39K36j5k39J03N48Lq47o40j65Q89J180m34j670
$$ 557 -562 -788 28 500 340 193 252 113 349 334 95 198 746 749 -98 -738 -903 -14 1166 732 -938
1757i38p24Q40J600L18j248j310N66J454O13p71j230N24Q91J05o01k21K44R29
$$ -938 -1662 -822 778 1096 -152 -1462 -896 558 1171 400 -830 -306 585 690 89 -132 112 1041
1775A041j67j206j202J254J819j06k018j295Q43J942O86j818j674M64J997Q02
$$ 1041 874 -332 -1534 -280 1539 1433 -585 -1880 -1037 905 1591 -227 -1901 -1437 560 1362
1791A362j157j131O83Q68N4o08m99L99J032q3j403m37P22J340N6j144j568K26
$$ 1362 205 -926 -243 625 679 71 -428 -29 1003 920 -483 -920 -198 1142 1198 54 -1514 -1288
1809a288J663R35j206j403M6J111O63n3n77p21N55Q63l22k42oJ35M81l32l33m49
$$ -1288 375 1310 104 -1299 -1253 -142 521 468 -109 -830 -275 588 266 24 18 153 634 302 -31 -480
1829d80Q33Q36j22j648q70J196J436J84j837j313P47J866M58j485j025K54J207
$$ -480 353 1189 1067 -581 -1451 -255 1181 1365 -472 -1785 -1038 828 1286 -199 -1224 -970 237
1846B37N64m66j055M90J104K17j343p21J049J488l32j844r33J091K010qk037j293
$$ 237 801 335 -720 -230 874 1091 -252 -973 76 1564 1232 -612 -1545 -454 1556 1548 -489 -1782
1864a782R64J609k7j252p20N22J085K1o74k65P90M07o17o35L85Q59J20j65r00
$$ -1782 -818 791 764 -488 -1208 -686 399 420 -254 -519 271 678 61 -574 -189 670 790 625 -275
1883b75j82N66R20l32n90m83j71K10P03j13m95m68K56M09J80K59m94l08K07M82
$$ -275 -457 109 1029 697 107 -376 -547 -337 366 253 -242 -710 -454 -45 135 394 -100 -408 -201 281
1903B81l18k62M20N58n1m62l64O9Q54M41j200j180N52J254O47j277j100M91J267
$$ 281 -37 -299 121 679 628 166 -198 -129 725 1166 -34 -1214 -662 592 1239 -38 -1138 -647 620
1922F20K49j227q92O37J222j37j299K43J015Q65o50j465j28J482Q84q07j301k9
$$ 620 869 -358 -1250 -613 609 472 -827 -584 431 1296 646 -819 -947 535 1419 612 -689 -718
1940g18J159O92o45j086qP95J14l57q81O09Q93j43j051m54J003Q65j23j370l7
$$ -718 441 1133 488 -598 -606 189 303 -54 -935 -326 567 424 -627 -1081 -78 787 664 -706 -743
1959g43Q52Q07n72n70K35N27rm55j29K78K89m54p32L95M28L08o25n45K79O37j6
$$ -743 109 916 344 -226 9 536 527 72 -57 221 510 56 -676 -281 147 455 -170 -715 -436 201 185
1980A85o10n7K23M98l56j36L34M12N25r12m65K99Q74k6q84o97O37R33M0j205m26
$$ 185 -425 -482 -259 239 -117 -253 81 493 1018 106 -359 -60 814 788 -96 -793 -156 777 817 -388 -814
2001h14Q16N13l57j011QJ012M16o55r77N18J221J30r77p91O39J143J36j042m20
$$ -814 2 515 158 -853 -845 167 583 -72 -1049 -531 690 820 -157 -948 -309 834 970 -72 -492
2020d92N41O53j67q17j94O18N85p23q25J91R36J07n75o19K17R58Q9o44l81N26
$$ -492 49 702 535 -282 -476 142 727 4 -821 -630 306 413 -162 -781 -564 394 483 -161 -542 -16
2040a6N16k02p35J49Q66J37n48m14K9P63m7p27m06O11N62l62p91J05O10O7k97
$$ -16 500 298 -437 -288 578 715 167 -247 -218 545 498 -229 -635 -24 538 176 -615 -510 100 167 -130
2061a30o74M26O01J35o89m11O38R23l77q67N1M33O93l19p14k91R66M82p98o75
$$ -130 -804 -378 223 358 -331 -742 -104 819 442 -425 -374 59 752 433 -281 -572 394 876 78 -597
2081e97K80R08n7q99k36J11P74J30r12m12O21Q59j72p02q3N53M00j63o74J88O56
$$ -597 -317 591 534 -365 -601 -490 284 414 -498 -910 -289 570 398 -304 -387 166 566 403 -271 -83 573
2102E73K54p79o06O16N77k66n91m46M93N59k58o52l9M98L14m24m17M81L90Q8m50
$$ 573 827 48 -558 58 635 369 -222 -668 -175 384 126 -526 -565 -67 247 -177 -594 -113 277 365 -85
2123h5k42K29P63k01p83j04P61L35n39o12K39N04J40o06l26M2R22j62q25q8M33
$$ -85 -327 -98 665 464 -319 -423 338 673 134 -478 -239 265 405 -201 -527 -485 437 275 -550 -638 -205
2144b05N18q1n91j90N26O73l53n18j5O99J09n79k44L27N77k14n42n10O21N73m33
$$ -205 313 232 -359 -549 -23 650 297 -221 -236 463 572 -7 -251 76 653 439 -103 -613 8 581 148
2165A48j003L48O62L76n19n55L4N86K63n62n66Q56N77l39o22q6P13N01m49r63
$$ 148 -855 -507 155 531 12 -543 -509 77 340 -222 -788 68 645 306 -316 -402 311 812 363 -600
2185f00J60O98N45n22q50K96N14J33k15o84K25L03J98n92k63N42N32j87q82J93
$$ -600 -440 258 803 281 -569 -273 241 374 159 -525 -300 3 201 -391 -654 -112 420 233 -649 -456
2205d56P26K66j66m32q7N56J27m28j56J70K22m59l11J11N06K65n61p30K97O47
$$ -456 270 536 370 -62 -149 407 534 106 -50 120 342 -117 -428 -317 189 454 -107 -837 -540 107
2225A07K56o03m68L86Q42l25m26k2N52K24k67o20L11O32R5l95q10K13O68L26o99
$$ 107 363 -240 -708 -322 520 195 -231 -253 299 523 256 -364 -53 579 674 279 -531 -318 350 676 -23
2246b3p57M76M69jl72l62O57J12j99m67Q4N90K86m26n28L14M16M12n09n43K40
$$ -23 -780 -304 165 164 -208 -570 87 199 0 -467 -383 207 493 67 -461 -147 269 681 172 -371 -131
2267a31L02K63l65k24J1L72m31k44M21K53rn11l80M90L98k4k77n10M43N18j48
$$ -131 171 434 69 -155 -144 228 -203 -447 -26 227 218 -293 -673 -183 215 191 -86 -596 -153 365 217
2288B17j91n7K97K24l32l17K53M67l2p81l18L83N47J00o40l26J24O51n4l75k47
$$ 217 26 -31 266 490 158 -159 94 561 529 -252 -570 -187 360 460 -180 -506 -382 269 215 -160 -407
2309d07K25K91J0l00J0M51L57k50o65K19K07L54j60m57oK30L41j16m40j70O1J21
$$ -407 -182 109 119 -181 -171 280 637 387 -278 -59 148 502 342 -115 -121 109 450 334 -106 -276 -215 -94
2331i4N7J18j15k89m6K85K20j41r3l6N6J74Pk62L22L46l07k06k86J60N66j3l34
$$ -94 -37 81 -34 -323 -369 -84 136 -5 -98 -134 -78 96 103 -159 163 509 202 -4 -290 -130 436 423 89
2354H9m68J98K57K47l45m22j6L73L36k80l49n2N65J38l87j58L88N04l50k07m55
$$ 89 -379 -181 76 323 -22 -444 -460 -87 249 -31 -380 -432 133 271 -116 -274 114 618 268 61 -394
2375c94J13P98l3m96m92K87M78K70l24n58k30L40N13k73n10J13L52K23qm32o1
$$ -394 -281 517 484 -12 -504 -217 261 531 207 -351 -581 -241 272 -1 -511 -398 -46 177 169 -263 -324
2396c24O82K58m63n37J88M52N70o32l20k43N16L42k91l92l47N90L59l56j72j52
$$ -324 358 616 153 -384 -196 256 826 194 -126 -369 147 489 198 -194 -541 49 408 52 -120 -272
2416b72p3O33j30l75k5K75K66k55m05Q9M65M22j68o11j5L82K42k82k89j68J45
$$ -272 -345 288 158 -217 -242 33 299 44 -361 -272 193 615 447 -164 -179 203 445 163 -126 -294 -149
2437a49L03J26m23l9O3O9O0l7k18k09M19J85k20l17L10M30K04k79n31j38L67O78
$$ -149 154 280 -143 -182 -119 -50 10 -27 -245 -454 -35 150 -70 -387 -77 353 557 278 -253 -391 -24 654
2459F54k81n14J8L44J50k29l18l44K25N53J2q26NN96L13l23m97O5O07L95m76o47
$$ 654 373 -141 -123 221 371 142 -176 -520 -295 258 270 -556 -551 45 358 35 -462 -397 210 605 129 -518
2481e18J23J120J20o73p02M02M74J9k45l73m4M94m7l46l06K98K32J65l24k90K84
$$ -518 -395 725 845 172 -530 -128 346 365 120 -253 -297 197 150 -196 -502 -204 28 193 -131 -421 -137
2502a37J99J29l43k79M73K96j65j17k30K05K75k04r2J08K56n86J6J59K70k08l63
$$ -137 62 191 -152 -431 42 338 173 56 -174 31 306 102 10 118 374 -212 -196 -37 233 25 -338
2523c38o2N55l5k71j08P9M40r3l93o1O13K95l13n77O5L94M06l56n65L0M35L47
$$ -338 -400 155 120 -151 -259 -180 260 167 -226 -287 326 621 308 -269 -204 190 596 240 -325 -295 140 487
2545D87k19p03O7M52K17l90m48K74K48M77q08k30K23P36J5l99o31N73M52l2l23
$$ 487 268 -435 -368 84 301 -89 -537 -263 -15 462 -346 -576 -353 383 398 -1 -632 -59 393 361 38
2566C8m87O76K32j59m85n8K53K62k54l58P2N07n3l34k83L40L13k40k37J89O3P4
$$ 38 -449 227 459 300 -185 -243 10 272 18 -340 -268 239 186 -148 -431 -91 222 -18 -255 -66 -3 71
2588G1Q1j17K3K98p0k19l7J52J74j45n70L16L86j19l33k97J83L21J97o39j79L56
$$ 71 152 35 58 356 286 67 30 182 356 211 -359 -43 343 224 -109 -406 -223 98 295 -344 -523 -167
2610a67M32L8p47k04Q24N70p26o33L32M85M21m30m21N5N07J41n95l18K47L64J4
$$ -167 265 303 -444 -648 176 746 20 -613 -281 204 625 195 -226 -171 336 477 -118 -436 -189 175 189
2631A89m30l34K65L63O9l62k09M76j7L5k57j36N24O7j08l34J51N06k02l52j26
$$ 189 -241 -575 -310 53 122 -240 -449 27 10 45 -212 -348 176 243 135 -199 -48 458 256 -96 -222
2652b22M15J08l46o0QK35J46l28m38K79L78j53n70L19L19K30l03k94m1N11L95
$$ -222 193 301 -45 -105 -97 138 284 -44 -482 -203 175 22 -548 -229 90 320 17 -277 -318 193 588
2673E88m62l94L06L96o4k87l54J70M89J23n13m38M12J61n1n09j34O90J32k73l88
$$ 588 126 -268 38 434 370 83 -271 -101 388 511 -2 -440 -28 133 82 -427 -561 129 261 -12 -400
2694d00p8P49L9n20n2k7O44jn28p0K66K20L1l05m16N02L14k64l31K15J91j9k15
$$ -400 -478 271 310 -210 -262 -289 355 354 -174 -244 22 242 273 -32 -448 54 368 104 -227 -12 179 160 -55
2717e5k93J67L40j69l67j23O18K35k72j72p7K63K84k86l38L21K64j39m35p0L71
$$ -55 -348 -181 159 -10 -377 -500 118 353 81 -91 -168 95 379 93 -245 76 340 201 -234 -304 67
2738F7J84j72k74j98L69K79l87l75N3P20j6l90k60L44J26M49m77k99J96L48J6
$$ 67 251 79 -195 -393 -24 255 -132 -507 -454 266 250 -140 -400 -56 70 519 42 -257 -61 287 303
2759C03l61J01J34l1j43m80N22P7K00l48m23L10K82m6k60j6j03N36m30M7j14K99
$$ 303 -58 43 177 146 3 -477 45 122 322 -26 -449 -139 143 97 -163 -179 -282 254 -176 -129 -243 56
2781E6L57k38l04KM63Jk03l03L53J47j64k53k82J71L52n28J70p2M06R9k66m50
$$ 56 413 175 -129 -127 336 337 134 -169 184 331 167 -86 -368 -197 155 -373 -203 -275 131 230 -36 -486
2803d86L75K03J66k75l04Q6N46Kk40k9n6K62Ok19l2K01j05j22j50Q7J62j85Q6
$$ -486 -111 92 258 -17 -321 -235 311 313 73 44 -12 250 256 37 5 206 101 -21 -171 -84 78 -107 -21
2826b1k85K47K01j80k90K10K63j48N1l29K81Q8N2j02k42L99J77j92m38J92K51
$$ -21 -306 -59 142 -38 -328 -118 145 -3 48 -281 0 88 140 38 -204 195 372 180 -258 -66 185
2847A85MK0l56kJ19N9j27j57J80l8J65j33p7K93R4l6k72KK40K79k37j66j98L47
$$ 185 189 209 -147 -149 -30 29 -98 -255 -75 -113 52 -81 -158 135 229 193 -79 -77 163 442 205 39 -159 188
2871A88P6K3l67o5J79J01j34M9o0j17N6j9l2J40n9N0j41N4P2j81Q2K0J22K07k01
$$ 188 264 287 -80 -145 34 135 1 50 -10 -127 -71 -90 -122 18 -41 9 -132 -78 -6 -187 -105 -85 37 244 43
2896D3k77K54%N4j66M6m6K26o9k37j77N0K88L0k01j56L31P5o9l90J49M38Q7j51
$$ 43 -234 20 20 74 -92 -46 -92 134 65 -172 -349 -299 -11 19 -182 -338 -7 68 -1 -391 -242 196 283 132
2920A32j82l8K95J13j87k49m8L69J8o4k54J31r2L8j14J3L4n8L2Jp9J12K1J28j05
$$ 132 -50 -88 207 320 133 -116 -164 205 223 159 -95 36 -56 -18 -132 -119 -85 -143 -111 -110 -189 -77 -56 72 -33
2945c3o4k0J40K93j64ok31LJ67J10j75j04QR4%N1k70J26nJ08o5j63K4J30N0j26
$$ -33 -97 -117 23 316 152 146 -85 -82 85 195 20 -84 -76 18 18 69 -201 -75 -80 28 -37 -200 -176 -46 4 -122
2971a22O5r3J73L82k64k35K8K67J57j75k51q4M9K97N4k30l19L73j9o9j52j95K49
$$ -122 -57 -150 23 405 141 -94 -66 201 358 183 -68 -152 -103 194 248 18 -301 72 53 -16 -168 -363 -114
2994a14K90r7l18l1K54J83l7j49k57K60L51j77j47r4K06J18J63k90k06l1P0m1
$$ -114 176 79 -239 -270 -16 167 130 -19 -276 -16 335 158 11 -83 123 241 404 114 -92 -123 -53 -94
3016i4P9j29J71qN1j60k2k23K68L39l94O5J33J40Qj71N3k34K24J26j50r6j59L58
$$ -94 -15 -144 27 19 70 -90 -112 -335 -67 272 -122 -57 76 216 224 53 106 -128 96 222 72 -24 -183 175
3040A75j37j50l0J11j17K66j33j46j12L07K7k13r7R6J20J91m9M3k50Q4K56p3l31
$$ 175 38 -112 -142 -31 -148 118 -15 -161 -273 34 61 -152 -249 -153 -33 158 109 152 -98 -14 242 169 -162
3063a62K52j39K05P7k76Mj01K08k88J86j81o2L55O1k45j23R0j8M18k38j49r6L02
$$ -162 90 -49 156 233 -43 -39 -140 68 -220 -34 -215 -277 78 139 -106 -229 -139 -157 261 23 -126 -222 80
3086H0L45l41k02J28K90j28k73P5j34K26J79l75j5j08M81o9m27mL29J27j02M6
$$ 80 425 84 -118 10 300 172 -101 -26 -160 66 245 -130 -145 -253 228 159 -268 -272 57 184 82 128
3108A28k67J65K6Q4j81k00O8M76j05j7m12K08L47l44j22J47n6mp4O0J0j41L09
$$ 128 -139 26 52 136 -45 -245 -177 299 194 177 -235 -27 320 -24 -146 1 -55 -59 -133 -73 -63 -204 105
3131A05k11K64n6r6j95J55M6M7r7K8K20J12j61j60k47L33J83j92m29J89N2J42
$$ 105 -106 158 102 6 -189 -34 12 59 -38 -10 210 322 161 1 -246 87 270 78 -351 -162 -110 32
3153C2J01j53j69J61J22j45j27j80L31L46k59k58k1K47K61l13j4m7J57K00k02
$$ 32 133 -20 -189 -28 94 -51 -178 -358 -27 319 60 -198 -219 28 289 -24 -38 -85 72 272 70
3174G0j97J00Q5M8p2l20L87J36k19j61J4J03J38M5k63l1M14j74M0j02K0K34o6
$$ 70 -127 -27 58 106 34 -286 101 237 18 -143 -129 -26 112 157 -106 -137 277 103 143 41 61 295 229
3197B29j18k67J44R8k04L6j9J11J06j64l1j23L00k13q1m7M33j41p3k04R7L21J7
$$ 229 111 -156 -12 86 -118 -82 -101 10 116 -48 -79 -202 98 -115 -196 -243 190 49 -24 -228 -131 190 207
3220B07k94n8P8L11L9l45j45K36K23N4n03K2M15k14R4j45k82L08J39k88j91J79
$$ 207 -87 -145 -67 244 283 -62 -207 29 252 306 -197 -175 240 26 120 -25 -307 1 140 -148 -339 -160
3242a60K40J29j92k07K18N9R8k03j03K25Q7J13m04K19L9p3Q3l43L4J08K58m59
$$ -160 80 209 17 -190 28 87 185 -18 -121 104 191 304 -100 119 158 85 168 -175 -141 -33 225 -234
3264b34r3M16j6q6j91L11m9l0j49j0L39J22j08l56N0J44K40r2k24j09J76J90k92
$$ -234 -327 89 73 -13 -204 107 58 28 -121 -131 208 330 222 -134 -84 60 300 208 -16 -125 51 241 -51
3287e1k02O9J37K15l11r1J71J73j95r2j46J0O35k51j75j0L48M3j58k12J6K88M8
$$ -51 -253 -184 -47 168 -143 -234 -63 110 -85 -177 -323 -313 322 71 -104 -114 234 277 119 -93 -77 211 259
3310B59k20j85N7K01J7l09n6J43J41m3k78K41j11J73K4k70K30J02J09j32k9K36
$$ 259 39 -146 -89 112 129 -180 -236 -93 48 5 -273 -32 -143 30 54 -216 14 116 225 93 64 300
3332C00j50J00k51j15L03n9p1q0j10J76M2k76m0J46K40l1k14r6L5L92j91k77J64
$$ 300 150 250 -1 -116 187 128 57 -23 -133 43 85 -191 -231 -85 155 124 -90 -186 -151 241 50 -227 -63
3355f3K38J41k15k09p4L33Jj49j67K52J49Q8l06j74J4L40j80j87p4J40K36j8j62
$$ -63 175 316 101 -108 -182 151 152 3 -164 88 237 325 19 -155 -141 199 19 -168 -242 -102 134 116 -46
3378d6l2K08K20n13J62J38N3L9k70j59K03J44k3j71J77R9j82k9r1J38m5q0R6m39
$$ -46 -78 130 350 -163 -1 137 190 229 -41 -200 3 147 124 -47 130 229 47 18 -73 65 20 -60 36 -403
3402d03M27m7j3j94OJ54J49K4j26l56L34K84q8m82K68L57r2j34k53J60K16j47
$$ -403 24 -23 -36 -230 -224 -70 79 103 -23 -379 -45 239 151 -331 -63 294 202 68 -185 -25 191 44
3424D4k48K4K69J20j92j77j30K81J73j36n1q0k2K79k18r1K47R1k10n8J15K50j00
$$ 44 -204 -180 89 209 17 -160 -290 -9 164 28 -23 -103 -125 154 -64 -155 92 183 -27 -85 30 280 180
3447A80m0l02J59J44P1m89J07j20K86m7r6J78L9J38l21l9K2L14R0j97m13K56L38
$$ 180 140 -162 -3 141 212 -277 -170 -290 -4 -51 -147 31 70 208 -113 -152 -130 184 274 77 -336 -80 258
3470B58n1l30m7O7M18k65k93P9J56J54kk82j23L18j44J72k12J2J39K8j36m8q7
$$ 258 207 -123 -170 -103 315 50 -243 -164 -8 146 144 -138 -261 57 -87 85 -127 -115 24 52 -84 -132 -219
3493b19J73K95k14n2O2L4K5m0j52J67J83k55q3k5J45J39l15ll1K80k62J49mo4
$$ -219 -46 249 35 -17 45 79 104 64 -88 79 262 7 -76 -101 44 183 -132 -135 -166 114 -148 1 -3 -67
3517f7k2j8J4Q4L9J6j9j91K54L1j53J04k50K54J20j35j51j34J98j07J24j79J30
$$ -67 -89 -107 -93 -9 30 46 27 -164 90 121 -32 72 -178 76 196 61 -90 -224 -26 -133 -9 -188 -58
3540e8p5K86j88k74L67J17j70J42k32J21J38p7j34l3J98j9p6k40J80r1J46j84
$$ -58 -133 153 -35 -309 58 175 5 147 -85 36 174 97 -37 -70 128 109 33 -207 -27 -118 28 -156
3562a56M6N5MK23k04j60J26J56j66j14K27q7m7K59j28j2K38j49k13K69j42K00
$$ -156 -110 -55 -51 172 -32 -192 -66 90 -76 -190 37 -50 -97 162 34 22 260 111 -102 167 25 225
3584B25m30K62j6L6J52k19j18O9O2j1k36JR5J04J3pk08L40j95R5j37J20O2Rj7
$$ 225 -205 57 41 77 229 10 -108 -39 23 12 -224 -223 -128 -24 -11 -18 -226 114 -81 14 -123 -3 59 68 51
3609E1j70l1J55J41j70p9O6M1J48j11Kk39K37J60k44J39j89K28l24J71l8R8p4
$$ 51 -119 -150 5 146 -24 -103 -37 4 152 41 43 -196 41 201 -43 96 -93 135 -189 -18 -56 42 -32
3632c2J6M8Jk07K31p2J0j64J35j47K36j17J57j34L7J76k55J85j87M4L4J34K8j18
$$ -32 -16 32 33 -174 57 -15 -5 -169 -34 -181 55 -62 95 -39 -2 174 -81 104 -83 -39 -5 129 157 39
3656C9j39J1K20j53J49j80J72o9P9q2Ol9N8j15ok2J58j66J17j10N2J10R0j90k03
$$ 39 -100 -89 131 -22 127 -53 119 50 129 47 53 14 72 -43 -49 -71 87 -79 38 -72 -20 90 180 -10 -213
3681b13Q1K03j83K22j98n8R4N3K05j87j5j72L86k59NJ49M0o6j50J42j19r9J43
$$ -213 -132 71 -112 110 -88 -146 -52 1 206 19 4 -168 218 -41 -36 113 153 87 -63 79 -40 -139 4
3704DJ5j32L7p6J23J5Q8k02q2K49P1m3r8k7K17k14R6j18L5l5N2J25j26j7n4J07
$$ 4 19 -113 -76 -152 -29 -14 74 -128 -210 39 110 67 -31 -58 159 -55 41 -77 -42 -77 -25 100 -26 -43 -97 10
3730A0J32k50j32K99k52J63J57k31J0J79j79K4J67N9j60J86k46O5P7j68J73j20
$$ 10 142 -108 -240 59 -193 -30 127 -104 -94 85 -94 -70 97 156 -4 182 -64 1 78 -90 83 -37
3752c7N6j15K3PK5Q0k88J82Lk6K9q8J34R9J7m4p8j2J80k6j16k1L20j52m6k16L4
$$ -37 19 -96 -73 -66 -41 39 -249 -67 -64 -90 -61 -149 -15 84 101 57 -21 -33 147 121 5 -16 304 152 106 -110 -76
3779g6n5K20p0j24q2J90m7J5K7k8R8j78J13l5j18K34K0o8j52J75O2j28P6N9n3
$$ -76 -131 89 19 -105 -187 3 -44 -29 -2 -30 68 -110 3 -32 -150 84 104 36 -116 59 121 -7 69 128 75
3804G5m0J39j2l15K46j89J5m8K86k48P5j16J07L6M0L9k35R7M3J04j59o7J35q3
$$ 75 35 174 162 -153 93 -96 -81 -129 157 -91 -16 -132 -25 11 51 90 -145 -48 -5 99 -60 -127 8 -75
3828g5K91k25L3K29k63j03J7J90j09Q4j91r5K43N9m7k29O0P0J01Q9j89J11O0J6
$$ -75 216 -9 24 253 -10 -113 -96 94 -15 69 -122 -217 26 85 38 -191 -131 -61 40 129 -60 51 111 127
3852A27l01J77J11j86K35K1k41j04K32j17L7n6j13J40j29J76j61P5o9J73j17J08
$$ 127 -174 3 114 -72 163 184 -57 -161 71 -46 -9 -65 -178 -38 -167 9 -152 -77 -146 27 -90 18
3874A8j45J26j43J52J12j52J06P3m3k2J06j79J74o4j05o8P2j62J04%j41J90n0
$$ 18 -127 -1 -144 8 120 -32 74 147 104 82 188 9 183 119 14 -54 18 -144 -40 -40 -181 9 -41
3897d1J57J14j67j96K5J89R0k3j36K0J53O4k16j98M08l19j4o5N2M9K06k06o6N9
$$ -41 116 230 63 -133 -108 81 171 148 12 32 185 249 33 -165 243 -76 -90 -155 -103 -54 152 -54 -120 -61
3921f1J87j19N5j65o3K58N2j68k13K89R3M0nk20J10r7J79j88J8Q2j92K60l2pj
$$ -61 126 7 62 -103 -166 92 144 -24 -237 52 145 185 180 -40 70 -27 152 -36 -18 64 -128 132 100 93 92
3946I2L3l59J56J89m5r1k18J20K08M5r2j03lJ47r2r8K8J79j4p5J23l4k5P1j19
$$ 92 125 -234 -78 111 66 -25 -243 -123 85 130 38 -65 -68 79 -13 -111 -83 96 82 7 130 96 71 142 23
3971B3k30J32J84n8j8j36J67ln2j90k8K7L13j11j65M5N6K10J4r8j38j48K29Qn8
$$ 23 -207 -75 109 51 33 -103 64 61 9 -181 -209 -182 131 20 -145 -100 -44 166 180 82 -56 -204 25 33 -25
3996b5j03J44j4M3M1j32q6J21l7j7M9J17j11j49J12J37m3m6L7l6JJ5R4j4J23j48
$$ -25 -128 16 2 45 86 -46 -132 -11 -48 -65 -16 101 -10 -159 -47 90 47 1 38 2 3 18 112 98 221 73
4022G3o6J00O0l4o7q6p4J61l8QQ2m51J16J85o6k02P2J67J3jN2O5M8r7J77q9r3
$$ 73 7 107 167 133 66 -20 -94 67 29 37 119 -332 -216 -31 -97 -299 -227 -60 -47 -48 4 69 117 20 197 108 15
4049A5ol2j60J99j27L2j1J10n4m8l3J0R5N6j38N4N1oj32J19K1n1N4j65L44j42
$$ 15 9 -23 -183 16 -111 -79 -90 20 -34 -82 -115 -105 -10 46 -92 -38 13 7 -125 -6 15 -36 18 -147 197 55
4075E5j0K1j22Q0j47J1J88k11J36K0j04K7kK8L5j48J08j07L03j09l2K19j16k05
$$ 55 45 66 -56 24 -123 -112 76 -135 1 21 -83 -56 -58 -30 5 -143 -35 -142 161 52 20 239 123 -82
4099h2j83O4K81Nq6j53J87k1N2p8P6k24K60Op2m6J7p1q9J55k6Q0n3L7j01O1Q9
$$ -82 -265 -201 80 85 -1 -154 33 12 64 -14 62 -162 98 104 32 -14 3 -68 -157 -2 -28 52 -1 36 -65 -4 85
4126H5k20J67Q1j49J35M9l5j69KM4j43M1J34k25J42r1J89k52K60m7j1J91j66p0
$$ 85 -135 32 113 -36 99 148 113 -56 -54 -10 -153 -112 22 -203 -61 -152 37 -215 45 -2 -13 178 12 -58
4150e8J89l2j23L15l80K58q0j36L1l0M3J5j23J25Q0l3Oj13R4K3k32LJ56k7N2K7
$$ -58 131 99 -24 291 -89 169 89 -47 -16 -46 -3 12 -111 14 94 61 67 -46 48 71 -161 -158 -2 -29 23 50
4176E0j5j53K47j11Rm1j2Q8k30O4J5J57l0N6j65n6J01K5k36L63r5N9j74j81L66
$$ 50 35 -118 129 18 27 -14 -26 62 -168 -104 -89 68 38 94 -71 -127 -26 -1 -237 126 31 90 -84 -265 101
4201A01j14m3j53J47q1J81J59j62K38k03J00j81N5j90K54o2k99M5K16o3J03m8
$$ 101 -13 -56 -209 -62 -143 38 197 35 273 70 170 -11 44 -146 108 46 -253 -208 8 -55 48 0
4223@q1K71j54K05k91j24M0J69k42K56K4j35J43j29J55j18K07j89pQ7j49L5J39
$$ 0 -81 190 36 241 -50 -174 -134 35 -207 49 73 -62 81 -48 107 -11 196 7 0 87 -62 -27 112
4246A12k28J91K4p9m1L9j48N8K35k18J84k42o1K5J01oJ06j17M7J61k18J11J19
$$ 112 -116 75 99 20 -21 18 -130 -72 163 -55 129 -113 -174 -149 -48 -54 52 -65 -18 143 -75 36 155
4269A55k18J16n7k5r4J87j34K07k7j83m3N9J09jl0K9P2j86J07k7n3Q4J36k21J3
$$ 155 -63 53 -4 -29 -123 64 -70 137 110 -73 -116 -57 52 51 21 50 122 -64 43 16 -37 47 183 -38 -25
4294b5o2L57j16j05r3NN6j08J20J08j94O2Q4kj61o6J02M2O9m2M1l8J9j6r7J47
$$ -25 -87 270 154 49 -44 -39 17 -91 29 137 -57 5 89 87 -74 -140 -38 4 73 31 72 34 53 37 -60 87
4320H7J15m71L89k10K00j12J2p4K32j93M4j32J64R7k80j17K20j8M0R6k49J93k
$$ 87 202 -269 120 -90 110 -2 10 -64 168 -25 19 -113 51 148 -132 -249 -29 -47 -7 89 -160 33 31
4343C1Ql9O3j66J65n4J45j00M7o9j08q0L0K01n6J28j87j03O5N1J93j71o7N4J7
$$ 31 39 0 63 -103 62 8 153 53 100 31 -77 -157 -127 74 18 146 -41 -144 -79 -28 165 -6 -73 -19 -2
4368bMJ63j59m8Q0J06q9j3j84L30j90m1J53p8Q1r2K3n2p9J47mn2j05RjJ57r9J97
$$ -2 2 165 6 -42 38 144 55 42 -142 188 -2 -43 110 32 113 21 44 -8 -87 60 56 4 -101 -92 -93 64 -35 162
4396A62k09J37j48J9j47K1K61j50L3k6J90j5j29j5P7j03K8p6J05j3J1P9n0r5L7
$$ 162 -47 90 -58 -39 -186 -165 96 -54 -21 -47 143 128 -1 -16 61 -42 -14 -90 15 2 13 92 42 -53 -16
4421a6L11l48k45L93j24O3o0M7r4J29j17PJ21O1j40o0QJ86j30O6j58R3L5k1L5
$$ -16 295 -53 -298 95 -29 34 -26 21 -73 56 -61 -54 67 128 -12 -72 -64 122 -8 58 -100 -7 28 7 42
4446D2j8j03J21m6K3l5o6L8L5rk51K95P6N8j10L4k17j72L21J03j97J34M4j00L3
$$ 42 24 -79 42 -4 19 -16 -82 -44 -9 -18 -269 26 102 160 50 84 -133 -305 16 119 -78 56 100 0 33
4471C3j09n2J98j91M8O8J45j68K6J07j48J76P6m2%j38J01k17J78k00J51j12m9
$$ 33 -76 -128 70 -121 -73 -5 140 -28 -2 105 -43 133 209 167 167 29 130 -87 91 -109 42 -70 -119
4494a19K22j41R6k39K99k67M8K12j77o6k6R2P1k4Q0n1j4J76K4k32J41o0O7L8k31
$$ -119 103 -38 58 -181 118 -149 -101 111 -66 -132 -158 -66 5 -19 61 10 -4 172 196 -36 105 45 112 150 -81
4519h1J7jJ17L5j25o6K07k33J90l7j25J45K4j86J83r0J35j57J26k70K49M9j79
$$ -81 -64 -65 52 87 -38 -104 103 -130 60 23 -102 43 67 -119 64 -26 109 -48 78 -192 57 106 -73
4542g3n5K78r0j15j1J80p7l7N9k04LJ28J02k26J24q0J14k6J4o9P4K7q0RJ38o6
$$ -73 -128 150 60 -55 -66 114 37 0 59 -145 -142 -14 88 -138 -14 -94 20 -6 8 -61 13 40 -40 -31 107 41
4568D1R0j05%k36J46p3Q6Q5K18j12j43qj85K21o7R1j41m6J71p2k41L87p2q2J1
$$ 41 131 26 26 -210 -64 -137 -51 34 252 140 -3 -11 -196 25 -42 49 -92 -138 33 -39 -280 107 35 -47 -36
4593c6j00j4K06r8l7K2K6n3M6J47k11N9o4J84j7k18L5J01J23p0k0m0Q8J1l2j16
$$ -36 -136 -150 56 -42 -79 -57 -31 -84 -38 109 -102 -43 -107 77 60 -158 -123 -22 101 31 11 -29 59 70 38 -78
4619g8J09L6k6M9k06L53k50J5J9q9K71j87O9k39p8J72R0j68P6J69n1p8j39L19
$$ -78 31 67 41 90 -116 237 -13 2 21 -68 203 16 85 -154 -232 -60 30 -138 -62 107 56 -22 -161 158
4643A58j20R8p3p9m6Q1J10j16j02k0P5j63J49j40K08J7j31n5O2J75K0j15j8P7
$$ 158 38 136 63 -16 -62 19 129 13 -89 -109 -34 -197 -48 -188 20 37 -94 -149 -87 88 108 -7 -25 52
4667E2o8J24r2m2J32K8n9J28k47o1O1K10p5m1J64n23K10J92k88J19Q0l3L5J9l8
$$ 52 -16 108 16 -26 106 134 75 203 -44 -105 -44 166 91 50 214 -309 -99 93 -195 -76 4 -29 6 25 -13
4692a3Mj27J18J19J7k03Q7J07j76J86l3j95K05L2Pj99J58k37K6J34j9O6j88J37
$$ -13 -9 -136 -18 101 118 -85 2 109 -67 119 86 -109 96 128 135 -64 94 -143 -117 17 -2 64 -124 13
4716A3N9j74J48J5j54J61j35J47k5J43k22j37R1N4k02J33P6j03P5p7L14k56l1
$$ 13 72 -102 46 61 -93 68 -67 80 55 198 -24 -161 -70 -16 -218 -85 -9 -112 -37 -114 200 -56 -87
4739h7J12m0Q0n4j3M5j74J75j84N3m8J29j33J15J72n7k85L09k3NRk20J90R3M8
$$ -87 25 -15 65 11 -2 43 -131 44 -140 -87 -135 -6 -139 -24 148 91 -194 115 92 97 106 -114 76 169 217
4764B17k73J17j89K32k95P9Q5O2k6J16j47N5j20J00J0R9j92Q1R0j20J58j22N1
$$ 217 -56 61 -128 104 -191 -112 -27 35 9 125 -22 33 -87 13 23 122 -70 11 101 -19 139 17 68
4787F8K17m85J64J23r7L3J20m9j68j9N2J46p5p0J7o2k0O3R5j83JJ70j21Q4M1n9
$$ 68 285 -200 -36 87 -10 23 143 94 -74 -93 -41 105 30 -40 -23 -85 -105 -42 53 -130 -129 41 -80 4 45 -14
4813a4P8O2j45JR8k7P9l46N8J79r3J17P0j17MJ11k15K00j89O3R1J49k92L8P0L9
$$ -14 64 126 -19 -18 80 53 132 -214 -156 23 -70 47 117 0 4 115 -100 100 -89 -26 65 214 -78 -40 30 69
4839F9J1k12Q6O3j18K94j74j46K9J03Q3j22j05K9J21l9K2j72J30q7o2K80L1j6
$$ 69 80 -132 -46 17 -101 193 19 -127 -98 5 88 -34 -139 -110 11 -28 -6 -178 -48 -135 -197 83 114 98
4863I8m9J0K3O8k83l6J36k6L7J16J11l7k73P2l0o9j21L34k4q9P3r2k9N0J70l9
$$ 98 49 59 82 150 -133 -169 -33 -59 -22 94 205 168 -105 -33 -63 -132 -253 81 57 -32 41 -51 -80 -30 140 101
4889A01p6O8k8J83k11l9K0l4J92l07K34k09K67k15L1J10n6j17J20m7J4P1j02j05
$$ 101 25 93 65 248 37 -2 18 -16 176 -131 103 -106 161 -54 -23 87 31 -86 34 -13 1 72 -30 -135
4913a35J63P5n1o1j20j06L01J42k35L6q8P6j4R3j43K14j12nn4J01k52J84k02K14
$$ -135 28 103 52 -9 -129 -235 66 208 -27 9 -79 -3 -17 76 -67 147 35 30 -24 77 -175 9 -193 21
4937B1k1n8J44l8j07j23pJ33J02j42K32j78J38J35j58k43J02k8J88pJ6j89pj8
$$ 21 0 -58 86 48 -59 -182 -189 -56 46 -96 136 -42 96 231 73 -170 -68 -96 92 85 101 -88 -95 -113
4961a13J04L8k3q5R7O8q2j51Q9J14j4pk0N6K3r3J65P8j87j00l8J92n1j31J24l8
$$ -113 -9 29 6 -79 18 86 4 -147 -58 56 42 35 15 71 94 1 166 244 57 -43 -81 111 60 -71 53 15
4987A5P9l58L21j03K09k47R0o2j4J80j75L8l4N6j6Q2J01k20L5K2K5J48j40m5j58
$$ 15 94 -264 57 -46 163 -84 6 -56 -70 110 -65 -27 -61 -5 -21 61 162 -58 -23 -1 24 172 32 -13 -171
5012a71J16J24r8j24K66J62k43j8l0N1q2K04k20J82k02p5L28l03L25j28K5J3J8
$$ -171 -55 69 -29 -153 113 275 32 14 -16 35 -47 157 -63 119 -83 -158 170 -133 192 64 89 102 120
5035A20j20Pl3k5Q7nmj14K2m6l3J20k5k9J68j09j91J13J14j94L7K89j74K82l10
$$ 120 0 7 -26 -51 36 31 27 -87 -65 -111 -144 -24 -49 -78 90 -19 -210 -97 17 -177 -140 149 -25 257 -53
5060e3J15qj00l7J41j79J02j58K91q5j40o4L23k33m7R6J51j30J36L5M8k31Q9r9
$$ -53 62 54 -46 -83 58 -121 -19 -177 114 29 -111 -175 148 -85 -132 -36 115 -15 121 156 204 -27 62 -37
5084c7J37K8k52J83k13K03P3j04j16O4k38J08K54r0K4Nq0K2n3J46o5l2N3q6j05
$$ -37 100 128 -124 59 -154 49 122 18 -98 -34 -272 -164 90 0 24 29 -51 -29 -82 64 -1 -33 20 -66 -171
5109a71J72l6M6o6j5K02k57Q3r7J57q5J98j93J31m6P1r6J41j22R4k07R6J8O3P3
$$ -171 1 -35 11 -55 -70 132 -125 -42 -139 18 -67 131 -62 69 23 94 -2 139 17 111 -96 0 18 81 154
5134A54n3O1k66K01n8L1o5p0Q3O0k43K09J13j18R5p1j09N2m7P3m7j26J81Q6j2
$$ 154 101 162 -104 97 39 70 5 -65 18 78 -165 44 157 39 134 63 -46 6 -41 32 -15 -141 40 126 114
5159A14j48j16J63k1K11k31j84K59j22K01O2j81j23l4K73j20J2m7J24Lj82P1O8
$$ 114 -34 -150 13 -8 203 -28 -212 47 -75 126 188 7 -116 -150 123 3 15 -32 92 95 -87 -16 52
5182E2k07k8K21k73J40R6oQ4J49j73O0j35l7J1R5p9n4%L8Q5Nj75J15J9r1J38l2
$$ 52 -155 -183 38 -235 -95 1 -5 79 228 55 115 -20 -57 -46 49 -30 -84 -84 -46 39 44 -131 -16 3 -88 50 18
5209A8n7K2k5J7K5R5p0o0J01K2j1j10p8J89R8r8j36j0L7J48J00k03O3j73O4K08
$$ 18 -39 -17 -42 -25 0 95 25 -35 66 88 77 -33 -111 78 176 78 -58 -68 -31 117 217 14 77 -96 -32 176
5235A76k06N9l8o2J50q2Qj27j6J13M6j03M4M0Q4j27m6M1K8Q1j22K16p6p9j16L07
$$ 176 -30 29 -9 -71 79 -3 5 -122 -138 -25 21 -82 -38 2 86 -41 -87 -46 -18 63 -59 157 81 2 -114 193
5261A93l78J68o7J4M7n8r6K61j85OJ01p9M1O3o8J78j36m2J95j21r9K3o7OJ85o7
$$ 193 -185 -17 -84 -70 -23 -81 -177 84 -101 -95 6 -73 -32 31 -37 141 5 -37 158 37 -62 -39 -106 -100 85 18
5287A8L5j48J39Kn3r2P5j44O9j36K07O7j61J43r3J22M0l0qO2k78J10J01j00P2
$$ 18 53 -95 44 46 -7 -99 -24 -168 -99 -235 -28 39 -122 21 -72 50 90 60 52 114 -164 -54 47 -53 19
5312A9j54J78P6k18k7J03R2lM2l5p5pP2j90J83p%J02j93P6j3Lq8K04m0j00O5p8
$$ 19 -135 43 119 -99 -126 -23 69 66 108 73 -2 -9 63 -127 56 49 49 151 -42 34 21 24 -64 140 100 0 65 -13
5340a3o3J99k44R8N2K1j24M5j0m3K03k11K49j60j51L30j91J23K1j34Q2j43J07
$$ -13 -76 123 -121 -23 29 50 -74 -29 -39 -82 121 -90 159 -1 -152 178 -13 110 131 -3 79 -64 43
5363D3%m3k26J74l1Jj1K74k40M2O3j51Q3J87k78m2KL47r1p7J91k20J00k34N3O5
$$ 43 43 0 -226 -52 -83 -82 -93 181 -59 -17 46 -105 -22 165 -113 -155 -153 194 103 26 217 -3 97 -137 -84 -19
5389a9J60l5L5r0n5m5K7J43r9J08l33K67N4n4k25K81N4k84K15j30O7J33j27p2
$$ -19 141 106 141 51 -4 -49 -22 121 22 130 -203 64 118 64 -161 120 174 -110 105 -25 42 175 48 -24
5413b4oJ19pl16L38l41O5L75l0k31J2j69J89j23Q8J54j10o2OO2L9M1j55M4P5q8
$$ -24 -30 89 82 -234 104 -237 -172 203 173 -58 -46 -215 -26 -149 -61 93 -17 -79 -73 -11 28 69 -86 -42 33 -55
5439e5R7Q3j08J22k70J72k7J48j68K3k4J53l60L40q2r5J07p6J54j46J57N6k84
$$ -55 42 125 17 139 -131 41 14 162 -6 17 -7 146 -214 126 44 -51 56 -20 134 -12 145 201 -83
5462h3N2nJ05K2j9n1j35J58j50J72j94R4q5R0O5m0J9l1R3M5k63J48j20K52j23
$$ -83 -31 -36 69 91 72 21 -114 44 -106 66 -128 -34 -119 -29 36 -4 15 -16 77 122 -141 7 -113 139 16
5487A6p8J02Q6j42L5O3q1J12j49O7J69k30L1KJ5K2l6J64j37N4j79K7J56j82J57
$$ 16 -62 40 126 -16 19 82 1 113 -36 31 200 -30 1 3 18 40 4 168 31 85 -94 -67 89 -93 64
5512F4j22N3j40O7p4L4J24L5K9j09Q8J20k39J17j66J28m2K4r6J90m8n3J41k68
$$ 64 -58 -5 -145 -78 -152 -118 6 41 70 -39 49 169 -70 47 -119 9 -33 -9 -105 85 37 -16 125 -143
5536a43K55K8k50R4k0K0Q1r6L8n5P2L5J96k68L0J77j77O8Q7q8%J02j94Jj09J20
$$ -143 112 140 -110 -16 -36 -16 65 -31 7 -48 24 59 255 -13 17 194 17 85 172 84 84 186 -8 -7 -116 4
5562DMM4M0Nj71J15J2p9P4O2j76Q1n1K20k23J79k57J39n5m5K02k05J92r6Q5j89
$$ 4 8 52 92 97 -74 41 53 -26 48 110 -66 15 -36 184 -39 140 -117 22 -33 -78 124 -81 111 15 100 -89
5588h9J00p0m5K81j74p1k0M4J06j07o0J10K97l35P1J3j4L9p7k4nJ64j79P7j19
$$ -89 11 -59 -104 177 3 -68 -88 -44 62 -45 -105 5 302 -33 38 51 37 76 -1 -25 -30 134 -45 32 -87
5613h7J1J95j33K9J5l1Q2k9j67J36k01K06P3j81J95j90J8J8K85j84k37L06j19
$$ -87 -76 119 -14 15 30 -1 81 52 -115 21 -180 26 99 -82 113 -77 -59 -41 244 60 -177 129 10
5636A0omO8j49R1k05K41j15k35J96Q1J21m5o0L1r8m9J04L1O7n3m9K04o9j46j9
$$ 10 4 0 68 -81 10 -195 46 -69 -304 -108 -27 94 49 -11 20 -78 -127 -23 8 75 22 -27 177 108 -38 -57
5662e7j6Q7R5j00J9j44j12L66j12p4RL6k43L27l0r8j9J12j39Q9l9L8r8K21k25
$$ -57 -73 14 109 9 28 -116 -228 138 26 -48 -39 -3 -246 81 51 -47 -66 46 -93 -4 -43 -5 -103 118 -107
5687a07J90k1l7j7j15J34r7rK25j00M5o4J13O7q0j22L5k1L6J67k11j67L25j35
$$ -107 83 62 25 8 -107 27 -70 -79 146 46 91 27 140 207 127 5 40 19 55 222 11 -156 169 34
5711C4J6n4j49L13k63J42m4L7Q8J34j92r7j42J04J01o2J55j63J58k58J01Jp3K23
$$ 34 50 -4 -153 160 -103 39 -5 32 120 254 62 -35 -177 -73 28 -34 121 -42 116 -142 -41 -40 -113 110
5735A10j46P7j1j0p8L00k76j5J32l1j47O9O4j69J15R7n2l4np5R1p3P3l9K42m57
$$ 110 -36 41 30 20 -58 242 -34 -49 83 52 -95 -26 38 -131 -16 81 29 -5 -10 -85 6 -67 6 -33 209 -248
5761b48K20j7P4k83M44j57j63J43J06j55M8l4l6J15o4J42k12P0J14o6m3m9qk1
$$ -248 -28 -45 29 -254 190 33 -130 13 119 -36 12 -22 -58 57 -7 135 -77 -7 107 41 -2 -51 -59 -80
5785h0q3N7k0Q6J2Q5j23m1m0L04j03n7N2J6k0m1Q5o2J2m9Q4j35M0n7j27L02j83
$$ -80 -163 -106 -126 -40 -28 57 -66 -107 -147 157 54 -3 49 65 45 4 89 27 39 -10 74 -61 -21 -78 -205 97 -86
5812h6J72L7j61o3K3Mm5J08J54l33J26N7M2L5j60K61j97J31j51J06j14j8NPm4
$$ -86 86 123 -38 -101 -78 -74 -119 -11 143 -190 -64 -7 35 70 -90 171 -26 105 -46 60 -54 -72 -67 -60 -104
5837a04J83k1j40J37q4K00j26R6k28N6q0J33Q2m4o7k5P8r2Q3oj09K38k07r6R4
$$ -104 79 58 -82 55 -29 171 45 141 -87 -31 -111 22 104 60 -7 -32 46 -46 37 31 -78 160 -47 -143 -49
5862d9o2N5j14K28j91J07j15K08j02J84j91P4L9j8k2m6l6Q1OJ58j24N4j16K66
$$ -49 -111 -56 -170 58 -133 -26 -141 67 -35 149 -42 32 71 53 31 -15 -51 30 36 194 70 124 8 274
5886B74l37K2J0M8J99m4j11j73J2Q3J12k23J97n0K34j51k16K55j99M4K36l01J25
$$ 274 -63 -41 -31 17 216 172 61 -112 -100 -17 95 -128 69 19 253 102 -114 141 -58 -14 222 -79 46
5909D6j1J5L6p9P2o6j38K59j70K6j94K06o2J80j73mo0J93j23R1o9J16l5J80j85
$$ 46 35 50 86 7 79 13 -125 134 -36 -10 -204 2 -60 120 -53 -57 -117 76 -47 44 -25 91 56 236 51
5934E1j72J89q1kl3Q7m9K0k63K46j83J01K8K49l30K8M1kJ72Ok00J58N8j43M2J8
$$ 51 -121 68 -13 -15 -48 39 -10 10 -253 -7 -190 -89 -61 188 -142 -114 -73 -75 97 103 -97 61 119 -24 18 36
5960C6Q7j12R4L7j61N9L5o5M7j2j54K13j32p0J91m4r3M7P7j58J24O7r2N8%r8j6
$$ 36 123 11 105 142 -19 40 75 10 57 45 -109 104 -28 -98 93 49 -44 3 80 -78 46 113 21 79 79 -19 -35
5987c5n6J71K9n1j34J15j30j3J14k01K95j58M9l5l2j53K59o1J75j44p3%J36LR3
$$ -35 -91 80 109 58 -76 39 -91 -104 10 -191 104 -54 -5 -40 -72 -225 34 -27 148 4 -69 -69 67 70 163
6012A63l02J43j09L9N3Q9k3j89K93J4k62J0N3NP7q9K01k25j18L21nj43o8J23l
$$ 163 -139 4 -105 -66 -13 76 53 -136 157 171 -91 -81 -28 -23 54 -35 166 -59 -177 144 139 -4 -72 51 48
6037D8j12J42k71J60L0oO4J9m1j8j53L4Q1J40k01mR1N4r6P9j4p7J05P8j24l1J25
$$ 48 -64 78 -193 -33 -3 -9 55 74 33 15 -138 -104 -23 117 -84 -88 3 57 -39 40 26 -51 54 132 8 -23 102
6064A02L1k8j66J98r7P7n8K8j94J42m0k4qJ28j94R0m7j8PM2J04k35Q8K7o0L7O4
$$ 102 133 105 -61 137 40 117 59 87 -107 35 -5 -29 -37 91 -103 -13 -60 -78 -71 -29 75 -160 -72 -45 -105 -68 -4
6091dn3J03j39j13M5K7J80l9J22j38M0Q8j70J68j69M2r1K05p7J30j95L4K08k73
$$ -4 -57 46 -93 -206 -161 -134 46 7 129 -9 31 119 -51 117 -52 -10 -101 104 27 157 -38 -4 204 -69
6115f9k0m4J69J04j8j54J04J02k24M6J41j82K20j90N5K08k07m0j88J65L9o3M8
$$ -69 -89 -133 36 140 122 -32 72 174 -50 -4 137 -45 175 -15 40 248 41 1 -187 -22 17 -46 2
6138Bj31P9m6J65J0j79O2N4k1L8r3j1M5R2M3k13oJ79l2l0j8J74k69O6r5L7J24
$$ 2 -129 -50 -96 69 79 -100 -38 16 -5 33 -60 -71 -26 66 109 -104 -110 69 37 7 -11 163 -106 -40 -135 -98 26
6165B6Q6K3k55J03j01J43J0J21j77P2J4M9m6oQ6j02n5j31J00J38k4k1j50K56m3
$$ 26 112 135 -120 -17 -118 25 35 156 -21 51 65 114 68 62 148 46 -9 -140 -40 98 74 53 -97 159 116
6190A16j67P7j18P2k49M18k71JP9l1J96j18L9j28J31j10P0P9q6k0mk8J64k3j78
$$ 116 -51 26 -92 -20 -269 149 -122 -121 -42 -73 123 5 44 -84 47 -63 7 86 0 -20 -24 -52 112 89 -89
6215h9MR1j5j36J04J6o4N1R2lL0n3R9k49K15n2l3p2J07q6qP7j85J02Q0J6o9R7
$$ -89 -85 6 -9 -145 -41 -25 -89 -38 54 51 81 28 127 -122 93 41 8 -64 43 -43 -51 26 -159 -57 23 39 -30 67
6243F7m7L3j79O0J43j12m7l6j9OK37j49L4p9J99oj18M8J22r0pj45J68j7o9K4J65
$$ 67 20 53 -126 -66 77 -35 -82 -118 -137 -131 106 -43 -9 -88 111 105 -13 35 157 67 60 -85 83 66 -3 21 186
6270A86o5k8n2j36j23K79r5J60j55N0j83J69l6n3K1k16L58j6j24K42q7k03L11
$$ 186 121 93 41 -95 -218 61 -34 126 -29 21 -162 7 -29 -82 -61 -277 81 65 -59 183 96 -107 204
6293B04l56Q8K23j98o5J88K2j54Q6K0M9j25j5J53k18J34j4k12J67K6MJ39r4j9
$$ 204 -152 -64 159 -39 -104 84 106 -48 38 58 107 -18 -33 120 -98 36 22 -190 -23 3 7 146 52 33
6317C3RM3k26M5k3J22N6K1k28J95p9J16j47o5K01p9J50j76k6m9Q4K8n7MM8k1M4
$$ 33 42 85 -141 -96 -119 3 59 80 -148 47 -32 84 -63 -128 73 -6 144 -32 -58 -107 -23 5 -52 -48 0 -21 23
6344B3J30k75J14J52j69m8M0o5j1J33L9J6m0R0j57k5p6J53l8L2j5l9k2J65Q3j34
$$ 23 153 -122 -8 144 -25 -73 -33 -98 -109 24 63 79 39 129 -28 -53 -129 24 -14 18 3 -36 -58 107 190 56
6370E6j18J24q8O7M2q4j8P5p4K51j73k33J47r3Q2J51j48L4j17J32N9J3j46o2J70
$$ 56 -62 62 -26 41 83 -1 -19 56 -18 233 60 -173 -26 -119 -37 114 -34 0 -117 15 74 87 -59 -121 49
6395D9k0n3L0L7O3Q7j48j00n1J90j15J03m5p7K42j60l34K79j08O2k5p5K02l5r5
$$ 49 29 -24 6 43 106 193 45 -55 -106 84 -31 72 27 -50 192 32 -302 -23 -131 -69 -94 -169 33 -2 -97
6420i7P4j56K00Q4j70Q7j86L13j69L5J8K68l82K06k37K62n9k89K89j81N1Q6j5
$$ -97 -23 -179 21 105 -65 22 -164 149 -20 15 33 301 -81 125 -112 150 91 -198 91 -90 -39 47 32
6443C2o4o5J28p6k19K53J51j21l2J06k55J02M9k8R3P1j18P4p2j13J41j61K92r0
$$ 32 -32 -97 31 -45 -264 -11 140 19 -13 93 -162 -60 -11 -39 54 125 7 81 9 -104 37 -124 168 78
6467G8l9k8J2k0J21j71k1j23K65m0r8J46j32J56o7R3j67J14o3R0m1K9p5J2M3m7
$$ 78 39 11 23 3 124 -47 -68 -191 74 34 -64 82 -50 106 39 132 -35 79 16 106 65 94 19 31 74 27
6493B7l5r2J28k52K65p4K25j96O8k08M3J22M8l31K76Rj00P2O2k62N3K12p3j3n4
$$ 27 -8 -100 28 -224 41 -33 192 -4 64 -144 -101 21 69 -262 14 23 -77 -5 57 -205 -152 60 -13 -26 -80
6518h0k9J7j9j1R2j3J2J22P5j84q6K19mk20L3k5J20K7j30j03R7J37K8l2J42j44
$$ -80 -109 -92 -111 -122 -30 -43 -31 91 166 -18 -104 115 111 -109 -76 -101 19 46 -84 -187 -90 47 75 43 185 41
6544D1J09j11J37j40KM1l3j88K49q7k08K45p2j51J05P7N6o0R8k7o8l3m0Q6j31
$$ 41 150 39 176 36 38 79 46 -142 107 20 -188 57 -15 -166 -61 16 72 12 110 83 15 -18 -58 28 -103
6569a03K62j07Q7l7k08R4j11J63j41R1K8Ol7k2O6p7K79j39j57L0J81j25J94q0
$$ -103 159 52 139 102 -106 -12 -123 40 -101 -10 18 24 -13 -35 31 -46 233 94 -63 -33 148 23 217 137
6593A37qj62ML9J8k06J47Q7oR6j78j43K21q2k5j7m4%J04M2p3J40k34K8K08j75
$$ 137 129 -33 -29 10 28 -178 -31 56 50 146 -32 -175 46 -36 -61 -78 -122 -122 -18 24 -49 91 -143 -115 93 -82
6619h2k4J65k24J04R3M5lq2N1K5q9l4k1r5R3n8O4K13j83M0K4K7K8j3r0J88j38
$$ -82 -106 59 -165 -61 32 77 74 -8 43 68 -21 -55 -76 -171 -78 -136 -72 141 -42 -2 22 49 77 64 -26 162 24
6646B4M5r5J71j17N5k7j10J62k13J44k29J54lj2P9l56J57J70K9j2O7j86J4K4L
$$ 24 69 -26 145 28 83 56 -54 108 -105 39 -190 -36 -39 -51 28 -328 -171 -1 28 16 83 -103 -89 -65 -62
6671f2J16o2r5J65j10N2N6l42L34m0Q8m1k7m3M6O9k8k02J62k2j03J7J35j97K21
$$ -62 54 -8 -103 62 -48 4 60 -282 52 12 100 59 32 -11 35 104 76 -126 36 14 -89 -72 63 -134 87
6696H7r4PP6m0oR5q1Rr8O3K6P7k63p5R5K61k16nl8J54j67K79k1k78K50KKr5J19
$$ 87 -7 0 76 36 30 125 44 53 -45 18 44 121 -142 -217 -122 139 -77 -82 -120 34 -133 146 125 -153 97 99 101 6 125
6725A25m7L9j35K42j97j57K20j44O5l7K5K1P7l2j37M0N7k24K08K8J02n1k43J69
$$ 125 78 117 -18 224 27 -130 90 -54 11 -26 -1 20 97 65 -72 -32 25 -199 9 37 139 88 -155 14
6749A4lK4k2l1m4J55n0r2J57j97J42j53J09O3j61P0k19J88K5J07j03J17ok1k21
$$ 14 11 35 13 -18 -62 93 43 -49 108 -89 53 -100 9 72 -89 -19 -238 -50 -25 82 -21 96 90 69 -152
6774a52K02Qo6M1o6K1K52k52J42m0P8j89K17n1j21l1n5J64l4J4k14L4J47q8Q5
$$ -152 50 58 -8 33 -33 -12 240 -12 130 90 168 -21 196 145 24 -7 -62 102 68 82 -132 -98 49 -39 46
6799D6j0R3k90J95m5J43j35j49J96j07m3J86j02p7J93j39q7L37l04K76k15JM1
$$ 46 36 129 -161 34 -11 132 -3 -152 44 -63 -106 80 -22 -99 94 -45 -132 205 -99 177 -38 -37 4
6822DrN0q2N6j32J12J3J64k69J22q3K35k14J44j2m8N0j44N8K9j27J59n8K3j41
$$ 4 -5 45 -37 19 -113 -1 12 176 -93 29 -54 181 -33 111 99 51 101 -43 15 44 -83 76 18 41 -100
6847a00q1J42J05j14J4M4p6M5JO6k08K47l99K31J21j19K21j31R7k07j7l2K33K5
$$ -100 -181 -39 66 -48 -34 10 -66 -21 -20 46 -162 85 -314 -83 38 -81 140 9 106 -101 -118 -150 83 108
6871A08L9r1j32J76L1r8k1J1j81J58p2J30j08P8M6j36J40Q3K6j37l6n4J18J8j25
$$ 108 147 56 -76 100 131 33 12 23 -158 0 -72 58 -50 28 74 -62 78 161 187 50 14 -40 78 96 -29
6896b9J80j83K69Mj81n9k6O9J16p5l02K48j55K88j77q0m0j5Q2R4j1l1J46J8j55
$$ -29 151 -32 237 241 60 1 -25 44 160 85 -217 31 -124 164 -13 -93 -133 -148 -66 28 17 -14 132 150 -5
6921eJ01P1k24N4K31j35r5P5R2j59j83Q0Q5j75P1K8q8K70j22J77j95J72j43n1
$$ -5 96 167 -57 -3 228 93 -2 73 165 6 -177 -97 -12 -187 -116 -88 -176 94 -28 149 -46 126 -17 -68
6945f8K19k22J04j28K13j33j12J48P9j1j39N3o7m0J1q9L11N1P4k22L9n8j92K35
$$ -68 151 -71 33 -95 118 -15 -127 21 100 89 -50 3 -64 -104 -93 -182 129 180 254 32 71 13 -179 56
6969E6j84J9J25k0j23K4J88J43k18k3j57L29j53J3J3N5k8kKp4m4J61O5j11k9L7
$$ 56 -128 -109 16 -4 -127 -103 85 228 10 -13 -170 159 6 19 32 87 59 57 59 -15 -59 102 167 56 27 64
6995F4J71j46m6K9L8j66Q3J13n5j25R7n2k6J96Ok09k8J42o8lQj29J08O8j9n1M4
$$ 64 235 89 43 72 110 -56 27 140 85 -40 57 5 -21 175 181 -28 -56 86 18 15 23 -106 2 70 51 0 44
7022D4K1j96J94J65k40K45j07j7r2K2p1J05J8j08J15Qq5J12j17K9p7p8J30P6j97
$$ 44 65 -131 63 228 -12 233 126 109 17 39 -32 73 91 -17 98 106 21 133 16 45 -32 -110 20 96 -101
7047a01O7J55j00o1P5l0OJ9R3k04P1J39j34L9j80K06j39Q2j37J47j17j51K46r6
$$ -101 -34 121 21 -40 35 5 11 30 123 -81 -10 129 -5 34 -146 60 -79 3 -134 13 -104 -255 -9 -105
7071a05K56kk36K9j79K43K1K4j53J58J4j05J1K8M7r4L8p2K32j2n3p8q6M8l4K07
$$ -105 151 149 -87 -58 -237 6 27 51 -102 56 70 -35 -24 4 51 -43 -5 -77 155 143 90 12 -74 -26 -60 147
7097A47j88n4Q5r0P6J04K5j30nj1Q4k28J22M1K23j0j76M1q3J72j51k1j29K94l28
$$ 147 -41 -95 -10 -100 -24 80 105 -25 -30 -41 43 -185 -63 -22 201 191 15 56 -27 145 -6 -27 -156 138 -190
7122a90J79J50k71L0O4k2K9R3p8m3l9J37l7J70j34J4j23J46N9k1R4j32j03J02
$$ -190 -11 139 -132 -102 -38 -60 -31 62 -16 -59 -98 39 2 172 38 52 -71 75 134 113 207 75 -28 74
7146G4j56JN3J30j03k1L15l43J28o3P3R0j74J98j20r8M8M0j49R4o7p6K34j35K3
$$ 74 -82 -81 -28 102 -1 -22 293 -50 78 15 88 178 4 202 82 -16 32 72 -77 17 -50 -126 108 -27 -4
7171dn5J53j13q3J19q5K4K1J40j13Q7J25p9k28J26J6j3Op0qQ8J27K5j24k3j05
$$ -4 -59 94 -19 -102 17 -68 -44 -23 117 4 91 216 137 -91 35 51 38 44 -26 -34 54 181 206 82 59 -46
7197d6K3J04K1o7L3l1R7n9N9k19j3J20R8j69j07K48j23J8J81j15o6p8L0K1P7O6
$$ -46 -23 81 102 35 68 37 134 75 134 -85 -98 22 120 -49 -156 92 -31 -13 168 53 -13 -91 -61 -40 37 103
7223A03l1j22M8O2lM0L1q9j83Q9j52J82m1K0P8nJ0Rl13K54L1j23J67l3L2k1N1
$$ 103 72 -50 -2 60 57 97 128 39 -144 -55 -207 -25 -66 -46 32 27 37 46 -267 -13 18 -105 62 29 61 40 91
7250I1j40P6r7K62j06lj78P7j27L8J18nm6Nk5j84L93k00J43R2j74O3k08J59Q3
$$ 91 -49 27 -70 192 86 83 -95 -18 -145 -107 11 6 -40 -35 -60 -244 149 -51 92 184 10 73 -135 24 107
7275A07l59J50J01M7j31O8J5M1j19J57o5k44K42p1l9J29k0J57l43K22r9O3j12
$$ 107 -252 -102 -1 46 -85 -17 -2 39 -80 77 12 -232 10 -61 -100 29 9 166 -177 45 -54 9 -103
7298a03J58l2J5j10J3OK9p4J09q5M5j58J22J69j51O3o5k4K22j63q5P7J12rj67
$$ -103 55 23 38 -72 -59 -53 -24 -98 11 -74 -29 -187 -65 104 -47 16 -49 -73 149 -14 -99 -22 90 81 -86
7323h6J7J93m0M2l58K02J13o1K9j72J06kr1J51Kp8M1J09j69P9M8K0n6k20J58k4
$$ -86 -69 124 84 126 -232 -30 83 22 51 -121 -15 -17 -108 43 45 -33 8 117 -52 27 75 95 39 -181 -23 -47
7349d7j24J87J66k00L0j37K51m2Mj99M9N4p0K8J00J01j00j51L3Q5P0O7k38R3m
$$ -47 -171 16 182 -18 12 -125 126 84 88 -111 -62 -8 -78 -50 50 151 51 -100 -67 18 88 155 -83 10 6
7374Fj83L13k75J22J45o2N%n5j25J14M8l6m5J48q6J76l49J4K6J76j35P8qm2K2
$$ 6 -177 136 -139 -17 128 66 71 71 16 -109 5 53 17 -28 120 34 210 -139 -125 -99 77 -58 20 12 -30 -8
7400hQ3J7m9n3L1j44K25m0o5j3mj38K37j98K86j37n6Q8n6j25J39n4M7k3O9k93
$$ -8 75 92 43 -10 21 -123 102 62 -3 -16 -20 -158 79 -119 167 30 -26 62 6 -119 20 -34 13 -10 59 -234
7426b34J99j6j36J83j44K20j19M2J4n2P6R8n5Nq6M5K18m07K08L6o9m6P4r7N5p2
$$ -234 -35 -51 -187 -4 -148 72 -47 -5 9 -43 33 131 76 81 -5 40 258 -149 59 95 26 -20 54 -43 12 -60
7452f0N6m3p1L7J87j15R1j63M4n7M7k3J92o1k6K26m27K17Q1q6o6O0O2rj61q1J96
$$ -60 -4 -47 -118 -81 106 -9 82 -81 -37 -94 -47 -70 122 61 35 261 -166 51 132 46 -20 40 102 93 -68 -149 47
7479D7r9nJ9q6K5K02j87R3M3jk97K85r5P0n7l2K58j30o0k0L7L5j57J41j02j8J55
$$ 47 -52 -57 -38 -124 -99 103 -84 9 52 51 -246 39 -56 14 -43 -75 183 53 -7 -27 10 45 -112 29 -73 -91 64
7506F4j97K39j49J4k8k3K3n2J29j60K14N0q7L4j21j8P4M5M1o6J39k09J41j74j43
$$ 64 -133 106 -43 -29 -57 -80 -57 -109 20 -140 74 124 37 71 -50 -68 6 51 92 26 165 -44 97 -77 -220
7531b20J85j9J63k09M4l2l7J93j21j5Q0J15k92n5L82r0j39R7Q2o0j21P4J97q0
$$ -220 -35 -54 109 -100 -56 -88 -125 68 -53 -68 12 127 -165 -220 162 72 -67 30 112 52 -69 5 202 122
7555A22p2j32P7oq2L4J57k44L55j64J7M7j4o0K8O3k38P0J09n9K2OQ0k8j50J3L5
$$ 122 50 -82 -5 -11 -93 -59 98 -146 209 45 62 109 95 35 63 126 -112 -42 67 8 30 36 116 88 -62 -49 -14
7582a4N4K6n2J15q8j48J74p5j43J11o2K94k67J04j41J15L9l10L74j35J78l5j95
$$ -14 40 66 14 129 41 -107 67 -8 -151 -40 -102 192 -75 29 -112 3 42 -268 106 -29 149 114 -81
7605h1j21L62j39J61j20j48K55k41O8J15j12j39J73p3J79j95L8R7M0M5r5j15j08
$$ -81 -202 160 21 182 62 -86 169 -72 -4 111 -1 -140 33 -40 139 -56 -18 79 119 164 69 -46 -154
7628a54OJ44J55k42O2J34j80K17j46R6o6M2Nj38K08j29O9l0j11J26j20K1N6M8
$$ -154 -148 -4 151 -91 -29 105 -75 142 -4 92 26 68 73 -65 143 14 83 53 -58 68 -52 -31 25 73
7652G3j35J44j02J47j8j45J67qq3N5j16j20K29P8k75J31Q1J9k63k9K2M31m33J09
$$ 73 -62 82 -20 127 109 -36 131 123 40 95 -21 -141 88 166 -109 22 103 122 -141 -170 -148 283 -150 -41
7676d1N2j91P4p8K60k89K83j17lN5k9J65k99J76j2N2j16O4Q2j91R9M3K7J83j70
$$ -41 11 -180 -106 -184 76 -213 70 -47 -50 5 -24 141 -158 18 6 58 -58 6 88 -103 -4 39 66 249 79
7701G9P1j11j35Q8r6J46j35L9N2L5o5q4Q7j9l4L5N7J91k70J07O0k1l9J3l6kJ0
$$ 79 150 39 -96 -8 -104 42 -93 -54 -2 33 -32 -116 -29 -48 -82 -47 10 201 -69 38 98 77 38 51 15 13 23
7728B3j08ok03K98j98K18j07QMK8MJ04j88P1o0J42%o3Q3j69J74r3jJ77j50k1m1
$$ 23 -85 -91 -294 4 -194 24 -83 -75 -71 -43 -39 65 -123 -52 -112 30 30 -33 50 -119 55 -38 -39 138 -12 -33 -74
7755g4N1J3j19J03n8K4P1N5O1k41N7J13k3p0o5J92q6J86l22K28j77J40k24R9M6
$$ -74 -23 -10 -129 -26 -84 -60 11 66 127 -114 -57 56 33 -37 -102 90 4 190 -132 96 -81 59 -165 -66 -20
7780b0o9Q1j1m0l9m7J15r1P7L6m2J0J52k23J23J0n1r1J29kn0J63k17k0J22j26
$$ -20 -89 -8 -19 -59 -98 -145 -30 -121 -44 -8 -50 -40 112 -111 12 22 -29 -120 9 7 -43 120 -97 -117 5 -121
7806a21J9J36o4O9M4k6L3j04J59p9L5Jj45n1j13L14j33l8O0K5m8LJ2L5J0j58K21
$$ -121 -102 34 -30 39 83 57 90 -14 145 66 101 102 -43 -94 -207 107 -26 -64 -4 21 -27 -24 -12 23 33 -125 96
7833I6j49L9o0lj4J14l7K03k72j03K06j09j42J77n4J08P7j07q2M12k54n9k8P9
$$ 96 -53 -14 -74 -77 -91 23 -14 189 -83 -186 20 -89 -231 -54 -108 0 77 -30 -112 300 46 -13 -41 38
7857C8M2j43p7K01r8j2L4n5J52j84K47l6k68M04k74nm6O7k5J25j63k3J05j06K41
$$ 38 80 -63 -140 61 -37 -49 -15 -70 82 -102 145 109 -159 245 -29 -34 -80 -13 -38 87 -76 -99 6 -100 141
7882A41j81R5lk27J16O9o7J69j74q2R1oJ21j54J27j40O1M1J4J15k81K98j74r3
$$ 141 -40 55 52 -175 -59 10 -57 112 -62 -144 -53 -59 62 -92 35 -105 -44 -3 11 126 -155 143 -31 -124
7906a24K31k23K72k54K7oJ82k96J22K24l6K0j82J46q3j41L26m02K78o0M1L8P9
$$ -124 107 -116 156 -98 -71 -77 105 -191 -69 155 119 139 -43 103 20 -121 205 -197 81 21 62 100 179
7929A79j51n2n9j2J75j37M8J83j80J90k39P2Opj87K3J38l7j0J44L9j41K9Jq7J31
$$ 179 28 -24 -83 -95 80 -57 -9 174 -6 184 -55 17 23 16 -171 -148 -10 -47 -57 87 126 -15 14 15 -72 59
7955E9O6p4J7n2n4J08p8j81J30k62L14R4j86Q7o7N5J22o4j85J39j68J54K5j0K6
$$ 59 125 51 68 16 -38 70 -8 -189 -59 -321 -7 87 -99 -12 -79 -24 98 34 -151 -12 -180 -26 -1 -11 15
7980A5k12L92k76l6P6O2m7j65qJ45J95k52M3o0J45K2p6L1M1n6j26Q0K0l2J11R2
$$ 15 -197 195 -81 -117 -41 21 -26 -191 -199 -54 141 -111 -68 -128 17 39 -37 -6 35 -21 -147 -67 -47 -79 32 124
8006A24j89P1l1O3L2r5J68k48J17j76J44k2K6m4K07j13j36O8L9R1p0r9J27j72
$$ 124 -65 6 -25 38 70 -25 143 -105 12 -164 -20 -42 -16 -60 147 34 -102 -34 5 96 26 -73 54 -118
8030a18O4p7J23k03K22j39K71k37j10P9Q7l5j24K59Lr1K13k6l11K25L8j01N6k09
$$ -118 -54 -131 -8 -211 11 -128 143 -94 -204 -125 -38 -73 -197 62 65 -26 187 161 -150 75 113 12 68 -141
8054a41L25q5p7J23l13N7J62j25N3l0L0knP4l8n7J47r2M1J76o6j43mj09J08N9
$$ -141 184 99 22 145 -168 -111 51 -74 -21 -51 -21 -23 -28 46 8 -49 98 6 47 223 157 14 10 -99 9 68
8080F8m3l6Q6NJ25j83j5K0k96K24M6p4R6O6j27J5J58k8J6o4n0L3N5k43Q1M08l01
$$ 68 25 -11 75 80 205 22 7 27 -269 -45 1 -73 23 89 -38 -23 135 107 123 59 9 42 97 -146 -65 343 42
8107D2q2N0J73j81l2%K3m3M5J54j54J45k67L7N3j5K51j94K21k41J9krP6j39J00
$$ 42 -40 10 183 2 -30 -30 -7 -50 -5 149 -5 140 -127 -90 -37 -52 199 5 226 -15 4 2 -7 69 -70 30
8133C0p7k8J18Qn9l8L09j60j72j12R0J27j08J43j43O8K73k63K9Qo9J7j02P3N3
$$ 30 -47 -75 43 51 -8 -46 263 103 -69 -181 -91 36 -72 71 -72 -4 269 6 35 43 -26 -9 -111 -38 15
8158A5J2Q3M1j79l5k0J29QR0j18P2q4M8n4k59L20q0J03O5j31K7j06J96m4l05J95
$$ 15 27 110 151 -28 -63 -83 46 54 144 26 98 14 62 8 -251 69 -11 92 157 26 53 -53 143 99 -206 -11
8184a1Q1j87K63J3k46K47j56
$$ -11 70 -117 146 159 -87 160 4
8191D
$$ Imaginary data points
##PAGE= N=2
##DATA TABLE= (X++(I..I)), XYDATA
0@%%%%%%%%%%%%J6l2L2l2L2m8O4o4Q0r6J12j44J61j77K09k43K89l36L85m33M82
$$ 0 0 0 0 0 0 0 0 0 0 0 0 0 16 -16 16 -16 16 -32 32 -32 48 -48 64 -80 81 -96 113 -130 159 -177 208 -225 257
33B57n52O32p10P90q86R97j113J236j375J526j690J871k066K278k515K771l050
$$ 257 -295 337 -373 417 -469 528 -585 651 -724 802 -888 983 -1083 1195 -1320 1451 -1599
50a599L362l706M085m508M980n512O118o816P626q579R724j1125J2893j5202J8353
$$ -1599 1763 -1943 2142 -2366 2614 -2898 3220 -3596 4030 -4549 5175 -5950 6943 -8259 10094
65A0094k2932L0232m3727P6862l05140n03941N90875O59031N8979n65466l91165
$$ 10094 -12838 17394 -26333 50529 -254611 -758552 -167677 491354 550333 -15133 -406298
76d06298J14269L75126J40278q7269j05568k8835j03352j06864R2055L11409J58960
$$ -406298 -292029 83097 223375 136106 30538 1703 -101649 -208513 -116458 194951 353911
87C53911k42482m26262r2238L72417M12917m3235m15639k80450J44966L20748
$$ 353911 111429 -314833 -407071 -34654 378263 335028 -80611 -361061 -216095 104653
97A04653J28940j23227j58423n3964J7584L1979Q4192J18662K152j93936j86729
$$ 104653 233593 110366 -48057 -102021 -84437 -52458 31734 150396 152548 -41388 -228117
108b28117P5783K69684J25442j64477k24405p652J65192Q3934p9220o3598O5509
$$ -228117 -152334 117350 242792 78315 -146090 -153742 11450 95384 16164 -47434 18075
119A8075N1770j01851j18958Q0620K12789N3170k06539k10421O5355K61703J17821
$$ 18075 69845 -32006 -150964 -70344 142445 195615 -10924 -221345 -155990 105713 223534
130B23534j67324k07022K4537J78921N8116j16242p3024R6830J00447r4190j83459
$$ 223534 56210 -150812 -126275 52646 110762 -5480 -78504 18326 118773 24583 -158876
141a58876J3691K40237J45283j75741k79670r376K74454J97339j21973k59542
$$ -158876 -145185 95052 240335 64594 -215076 -224452 50002 247341 125368 -134174
151a34174o3912J73683J51300m2997j15499r277O1701q484o7665J0472J10508
$$ -134174 -198086 -24403 126897 83900 -31599 -40876 20825 12341 -55324 -44852 65656
162F5656N3952j06608j43054J7294J66752R9798r4397j56282k0560J15558Q6206
$$ 65656 119608 13000 -130054 -112760 53992 153790 59393 -96889 -117449 -1891 84315
173H4315l4366p5536j1800L4728J991k8302J6353O2503J0174q0378o5163N0591
$$ 84315 49949 -25587 -37387 -2659 -668 -28970 -12617 49886 60060 -20318 -85481 -34890
185c4890J03130J2240r4815o6517N2850Q9454n085q4399l0079O8563N5555n0830
$$ -34890 68240 80480 -14335 -80852 -28002 61452 56367 -28032 -58111 10452 66007 15177
197A5177q5920J0260R8398M8200p1494r0907J4767R1053L4756o0130n2733L2376
$$ 15177 -70743 -60483 37915 86115 14621 -76286 -61519 29534 64290 4160 -48573 -16197
209a6197N3589j9343o1524M969Q1388L8943p7062r7294K2389J24730O3201q4512
$$ -16197 37392 18049 -43475 -38506 42882 81825 4763 -92531 -70142 54588 117789 33277
221C3277j23424n995J06406P6569l5042q0258k4528L4385K6711l152K969J8641
$$ 33277 -90147 -96142 10264 86833 51791 -28467 -52995 -18610 8101 4949 7918 26559
233B6559j0029n2513k8866N2975Q3742N993r0798p9343L1447J03824M8909n8122
$$ 26559 16530 -35983 -64849 -11874 71868 77861 -12937 -92280 -60833 42991 91900 33778
245C3778q3304j0280N4181L9612o900j9856p092j0661k0396J846M4737M1041k6821
$$ 33778 -49526 -59806 -5625 33987 27087 7231 139 -10522 -30918 -29072 15665 56706 29885
258B9885p6606k9815O3103P9510k969p7111n2139L0377O4463J7954l6850l1716
$$ 29885 -46721 -76536 -13433 66077 63108 -14003 -66142 -35765 28698 46652 9802 -21914
270b1914Q570J9216k603p756J2341J4879j5290l4346o518L8275L7587j6199n3609
$$ -21914 -13344 5872 3269 -4487 7854 22733 7443 -26903 -33421 4854 42441 26242 -27367
283b7367k0220L9862M3394j0299m2430j4293K7904K5845j1960k6424K572K7597
$$ -27367 -47587 -7725 35669 25370 -17060 -31353 -3449 22396 10436 -15988 -13416 14181
295A4181N754k6561j4880K2369K5512j0583l1455p821K5504K2015j2949k8113
$$ 14181 19935 -6626 -21506 863 26375 15792 -15663 -23484 2020 24035 11086 -17027
307a7027p10K5375R871k0695j7676J1914K2111M91k1789j2943J6848K3895m700
$$ -17027 -17737 7638 17509 -3186 -20862 -8948 13163 13654 -8135 -21078 -4230 19665 14965
320A4965k7079q157K2285J9032r497k1105k453J6894J0166j2365j5278Q059J8354
$$ 14965 -12114 -20271 2014 21046 11549 -9556 -12009 4885 15051 2686 -12592 -4533 13821
333A3821l931k2227m787K0430J4779j3486k3459m86K4300J7213j4500k5385N2
$$ 13821 9890 -12337 -17124 3306 18085 4599 -18860 -19346 4954 22167 7667 -17718 -17666
346a7666K2331J1227j0403j2090J430R079K486o071k839P831M503j1576j2356
$$ -17666 4665 15892 5489 -6601 -5171 3908 6394 323 -2516 5315 9818 -1758 -14114
359a4114Q502J9424K347j9646j7550O636K3576J0307j7010k0845M365J9480N960
$$ -14114 -5612 13812 16159 -3487 -21037 -14401 9175 19482 2472 -18373 -14008 5472 11432
372A1432j0276o956L659M266j488l333M499Q629k444j4979o585J4025J5715m465
$$ 11432 1156 -5800 -2141 2125 637 -2696 1803 10432 7988 -6991 -13576 449 16164 11699
386A1699j7865q256R077J4416J915j3306j0163N581J0849O45o379j468K781P75
$$ 11699 -6166 -14422 -5345 9071 10986 -2320 -12483 -6902 3947 4592 -1787 -3255 -474 301
400C01k583q36M853O248k936j0880k974J2236R685p216j2970j986J0510Q548l609
$$ 301 -2282 -3118 1735 7983 5047 -5833 -8807 3429 13114 5898 -7072 -9058 1452 10000 6391
415F391j1305l970O986N765k889l628J445J253k729j790L206M773R09n525o148
$$ 6391 -4914 -8884 -1898 3867 978 -2650 -1205 48 -2681 -4471 -1265 3508 4417 -1108 -7256
430g256K632J0334M524o963q635o64O766O107q44o027l420K155J233j983J155
$$ -7256 -4624 5710 10234 3271 -5364 -6028 738 6845 6001 -26 -3446 -1291 -58 -2041 -886
445h86M537l57p229n415M323R219L943n954j0290j557Q527Q030L31m633m928l030
$$ -886 3651 3294 -3935 -9350 -5027 4192 8135 2181 -8109 -9666 -1139 6891 7222 2589 -2339 -5369
461e369J937O033N097k80n766p611k219O985R429J696q716j0427k658P514J1097
$$ -5369 -3432 2601 7698 7418 1652 -5959 -8178 -1193 8236 9932 1216 -9211 -11869 -4355 6742
476F742M001p718j1229m537N396J1454Q644k867j3420j1020L753J5735J2252m312
$$ 6742 10743 3025 -8204 -12741 -7345 4109 12753 9886 -3534 -14554 -10801 4934 17186 12874
490A2874j6027j1165M515J4510Q858k974j0517r585k754O956J2367O556n949j5229
$$ 12874 -3153 -14318 -9803 4707 13565 10591 74 -9511 -12265 -5309 7058 13614 7665 -7564
504g564j1086N317J8717J4260n594k1583j4890Q077K3054J4308q991k1733j1245
$$ -7564 -18650 -13333 5384 19644 14050 -7533 -22423 -14346 8708 23016 14025 -7708 -18953
517a8953R150J7430Q881m894j1845j0256k458P474J3346P842o408j6771j2402
$$ -18953 -9803 7627 16508 11614 -231 -10487 -12945 -5471 7875 15717 9309 -7462 -19864
530a9864N390J9657J5189n570k1784j6932N607K4064J8958o206k4865j6232Q289
$$ -19864 -14474 5183 20372 14802 -6982 -23914 -18307 5757 24715 18509 -6356 -22588 -14299
543a4299K1516J2687n936j5887j0634J563R754R767L708m496j1627j0335P38J2742
$$ -14299 7217 19904 13968 -1919 -12553 -10990 -1236 8531 12239 7743 -3884 -14219 -13481 -739
557g39J4661K767j4996k1269m713K1079K6109J611k5142k3231L028K4945J7924
$$ -739 13922 16689 1693 -19576 -24289 -3210 22899 24510 -632 -23863 -20835 4110 22034
570B2034o257j9004r125M968P813M248L291J533n553j2252q908O753K0477J3940
$$ 22034 15777 -3227 -12352 -7384 429 4677 7968 9501 3948 -8304 -17212 -10459 10018 23958
584B3958j2381k8762j3473J8567L1696J0841k2887l1628m673K5960K4098q78j8196
$$ 23958 11577 -17185 -30658 -12091 19605 30446 7559 -24069 -28742 -2782 21316 20438 2242
597B242j3500o58P508Q804O035J958o483j4646j1063Q187K2836J4366j1158k7372
$$ 2242 -11258 -11916 -4408 4396 10431 12389 5906 -8740 -19803 -11616 11220 25586 14428 -12944
611a2944j7643J1890L2699J8959j7230l5270j4545K0120L2300J1400j8973k6682
$$ -12944 -30587 -18697 14002 32961 15731 -19539 -34084 -13964 18336 29736 10763 -15919
623a5919o486J5978J7547M420o337r658q202k633M890J1595J2082l90j9790k2268
$$ -15919 -22405 -6427 11120 15540 9203 -455 -8657 -11290 -6400 5195 17277 16887 -2903 -25171
637b5171J619K8374K4923p773l3618k3594J4544L6872J6745k0539l0098o242J7690
$$ -25171 -23552 4822 29745 21972 -11646 -35240 -20696 16176 32921 12382 -17716 -23958 -6268
650f268J7663K191q618o146r21k961l392O742J6479N665j8292k4719l207K5388
$$ -6268 11395 13586 4968 -1178 -2099 -5060 -8452 -1710 14769 20434 2142 -22577 -25784 -396
664c96K8174j325l1535k6600P910L1351J9009r611k5069j4452P932J8965J0606
$$ -396 27778 26453 -5082 -31682 -23772 7579 26588 16977 -8092 -22544 -14612 4353 14959
677A4959l052r020q401n471K098J1660J2446J173j4418j9073m216J8598K4634
$$ 14959 11907 2887 -5514 -10985 -8887 2773 15219 16392 1974 -17099 -21315 -2717 21917
690B1917K718k3106k5592j996K3658K5677Q00k5761k3974L096K4991J9272l867
$$ 21917 24635 1529 -24063 -26059 -2401 23276 24076 -1685 -25659 -22563 2428 21700 17833
703A7833j9493j4057L699J2721P635L98j969n420r752m755R721J7339N911j5109
$$ 17833 -1660 -15717 -12018 703 8338 8736 6767 1347 -8405 -13160 -3439 13900 19811 4702
717D702k3075n220K0518K3380l62k2594j8617M292K0617J3958o765j6649p011
$$ 4702 -18373 -23593 -3075 20305 19943 -2651 -21268 -16976 3641 17599 10834 -5815 -12826
730a2826P205Q844J901j516K15j107n321n005L278J1508O374q879j5140l180J1428
$$ -12826 -5621 3223 5124 3608 3823 2716 -2605 -7610 -4332 7176 13550 4671 -10469 -13649 -2221
745b221J2262P09r771r879j054P419Q105J087n234o094j480L163M519K414jj267
$$ -2221 10041 10750 979 -8900 -9954 -2535 5570 6657 1423 -4671 -6151 -2988 1531 3945 3944 2677
761B677l037m266k56O211O703n33q048p431M89Q949Q039j332j0015q572J400R373
$$ 2677 -360 -4626 -4882 1329 8032 7499 -549 -7980 -7491 1458 9497 8165 -1850 -10422 -9022 351
777C51Q393j992r524o362L520P580L133j676k698k304k272o47M802O917J537q014
$$ 351 8744 6752 -2772 -9134 -5614 1966 5099 3423 725 -1579 -3851 -4498 304 7221 8758 744
793G44q871M64R849Q065k999r781o776K880Q337N162k313p005m508J572N203L639
$$ 744 -8127 -7663 2186 10251 7252 -2529 -9305 -6425 1912 7074 4761 -2244 -6752 -5180 23 3662
809C662j0l306l225j325J848M441L385j248n075m227K156N890K969k840m908j866
$$ 3662 3652 346 -2879 -4204 -2356 2085 5470 4222 -853 -5080 -2924 2966 5935 3095 -1813 -3679
825c679J627K967J888n49k225k924r47J930L394J147k715k502N7J880J399R99
$$ -3679 -2052 915 2803 2254 29 -2895 -3842 -1912 1482 2629 -86 -2588 -2531 -651 748 1747
841A747L43j365k011n53J494K398J438j498l042j195J257K399J127q82l021k229
$$ 1747 2090 725 -1286 -1839 -345 2053 3491 1993 -1049 -2244 -987 1412 2539 1657 -1364 -3593
857c593J231K751J561j125j874j580j99K377K241M49j477k542j040K028L915J086
$$ -3593 -2362 389 1950 825 -1049 -2629 -2828 -451 1790 2239 762 -1780 -2820 -792 3123 4209
873D209l054l338k11K471K456M88j979k859j163J803K410J106j420k864j941K054
$$ 4209 1155 -2183 -2394 77 2533 3021 1042 -1817 -2980 -1177 1233 2339 919 -1945 -3886 -1832
889a832L412M65j566k008j351J409L347J391j862k540p84J703K380J248k017k678
$$ -1832 1580 2045 479 -1529 -2880 -1471 1876 3267 1405 -1135 -1919 -216 2164 3412 1395 -1283
905a283m28J715J609K54j389k211j078J652K411m4j642j340l94J107K165N21j667
$$ -1283 -1711 4 1613 1867 478 -1733 -2811 -1159 1252 1208 -434 -1774 -2168 -1061 1104 1625 -42
922d2j242N2R32J481J324j154k257j84J651J012J26r73j766p55J591J283l12j184
$$ -42 -1284 -1232 -300 1181 2505 1351 -906 -1090 561 1573 1699 726 -1040 -1795 -204 1079 767 -417
940d17r52o39R79J749j58j338p10Q49M55O35J063q48j160r4J207O87j09m55q69
$$ -417 -1369 -2008 -1029 720 562 -776 -1486 -637 -182 453 1516 668 -492 -586 621 1308 1199 744 -125
959a25n75J128P67q44k68n70o99M02J126j96j227j46Q22J17l1M34j86l68J50M00
$$ -125 -700 428 1195 351 83 -487 -1186 -784 342 146 -1081 -1227 -405 -288 -319 115 -71 -439 -289 111
979A11q7Q10M84j052o63Q16R83m31o03o28l89N24O44m47q41J2L10m08J17Q38k67
$$ 111 24 834 1318 266 -397 419 1402 971 368 -260 -649 -125 519 72 -769 -757 -447 -855 -738 100 -167
1000a67k90k76r5J89J094J035j121j129N66J272J95k07m11p36j82M48PM29L86
$$ -167 -457 -733 -828 -639 455 1490 369 -760 -194 1078 1273 1066 655 -81 -263 185 192 621 1007
1019A007r64k050M3J903J320p32j722j147O28K354R03j136q91l14K95N35J197
$$ 1007 43 -2007 -1964 -61 1259 527 -1195 -2342 -1714 640 1543 407 -484 -798 -503 32 1229
1036A229P55r27j249r21N24J711J744j145l277j443J934K398P83j940k150m15
$$ 1229 1984 1057 -192 -1113 -589 1122 2866 1721 -1556 -2999 -1065 1333 2116 176 -1974 -2389
1052b389J463J257L47L74r34j747o94J750K837P63k501k690n5K907K613p04k835
$$ -2389 -926 331 678 1052 118 -1629 -2323 -573 2264 3027 526 -2164 -2219 688 3301 2597 -238
1069b38j268N72Q19O25N56L4j084j776j198J502L544J117l128m413L1M627M043
$$ -238 -1506 -934 -115 510 1066 1100 16 -1760 -2958 -1456 2088 3205 77 -4336 -4305 322 4365
1086D365j339m379k073K220L132R4j507l84P35p98j763N28L350J704k644m778
$$ 4365 3026 -1353 -3426 -1206 1926 2020 513 129 864 66 -1697 -1169 2181 3885 1241 -3537
1102c537j322L936M747l46m455l915J273M049K691r51k846j786M53J783J786Q03
$$ -3537 -4859 -923 3824 3478 -977 -4892 -3619 430 3121 2170 -676 -2462 -2009 -226 1560 2363
1118B363m62k007j940k3K810K739n27k953k840P7K013K724J028j711l552k591
$$ 2363 1901 -106 -2046 -2069 741 3480 2953 0 -2840 -2763 -750 1974 3002 1291 -2261 -4852
1134d852J687N418L184l107o773j980M829O371K21m956l786J389L892Q19j859
$$ -4852 -3165 2253 5437 2330 -4443 -6423 -1594 4777 4998 42 -3744 -2355 1537 2356 497
1149D97j44J288n60l263j619L747N357j02p252o282L279R516L814o869q515K6
$$ 497 353 1641 1081 -2182 -3801 -54 5303 5201 -2051 -8333 -5054 4462 8276 1407 -7108 -7082
1165g082P519N630k181o398j348L577K229j968j025K693J904k421m411p99N156
$$ -7082 437 6067 3886 -2512 -3860 -283 1946 -22 -1047 1646 3550 1129 -3282 -4081 1075
1180A075N258k098p357l887M058O750J636m195n165j104L565L850O11k310k290
$$ 1075 6333 4235 -3122 -7009 -2951 3799 5435 1240 -3925 -5029 -1464 2386 2997 687 -1603
1195a603j021P18K529J890m34j848r45j96M61J256J114Q27j640l462k267K937
$$ -1603 -2624 -1906 623 2513 2079 231 -714 -910 -449 807 1921 2748 1108 -2354 -4621 -1684
1211a684O236J607o112o950M58P668N561l038p934k990N816O291j154n104j187
$$ -1684 4552 6159 47 -6903 -6445 1223 6784 3746 -4188 -7178 -1362 4929 3775 -1329 -2516
1226b516L217J806k606l193K689O034k75p676n090N544R112O35q854p572K858
$$ -2516 701 2507 -99 -3292 -603 5431 5156 -2520 -7610 -2066 7046 7681 -1173 -8745 -5887
1241e887R381L676n851o803Q02N469K072k317j750P47J751j053k570K99M355K777
$$ -5887 3494 7170 1319 -5484 -4682 787 2859 542 -1208 -461 1290 237 -2333 -2034 2321 5098
1257E098l146n354o24M514M086q04m536l246J341L534J264n92j172k162j363J381
$$ 5098 1952 -3402 -4026 488 4574 3770 -766 -4012 -2671 863 2127 1535 363 -1799 -3162 -1781
1273a781L597J049k676k944j07L045K423j190k095Q38J535j463k622J314M236
$$ -1781 1816 2865 189 -2755 -2862 183 2606 1416 -679 159 1694 231 -2391 -1077 3159
1288C159J182m317m828Q87O482M045m450p329r18O254M370k277m914j321L881
$$ 3159 4341 24 -4804 -3917 2565 6610 2160 -5169 -6087 167 4537 2260 -2654 -3975 -94
1303i4K906k123l223J548M269m63n425j989M837N458j124o845l565M499O482m49
$$ -94 2812 689 -2534 -986 3283 2820 -2605 -4594 243 5701 4577 -2268 -5833 -1334 5148 4699
1319D699o205k942K818L559o02k172n22J586M93j944j188K197L044j289l882j008
$$ 4699 -1506 -4448 -1630 1929 1327 -845 -1367 219 712 -1232 -2420 -223 2821 1532 -2350 -3358
1335c358L196L272k67l069j652J557J788n87j342P64P60j241j953Q00K862J368
$$ -3358 -162 3110 2843 -226 -1878 -321 1467 880 -462 302 1062 -179 -2132 -1332 1530 2898
1351B898k570l854N72L613K262k427l053O29L186N99k204j429K003K269j383l491
$$ 2898 328 -3526 -2954 659 2921 494 -2559 -1930 1256 1855 -349 -1778 225 2494 1111 -2380
1367b380P6M363K095l074m345N85M428J886l258l480O91L517Q69k822j713J946
$$ -2380 -2304 2059 4154 1080 -3265 -2680 1748 3634 376 -3104 -2413 1104 1973 -849 -2562 -616
1383f16K710j142l471L26L289K129k431l488L31L926K165k644l203N72L173P80
$$ -616 2094 952 -2519 -2193 1096 3225 794 -2694 -2363 1563 3728 1084 -2119 -1547 1626 2406
1399B406k519j987J604K391q69l156m94K988K297k157l743M52L835J641k839k707
$$ 2406 -113 -2100 -496 1895 1026 -2130 -2624 364 2661 504 -3239 -2787 1048 2689 -150 -2857
1415b857J465L146N11k457j457J758K174j018k736j56K960J056k026k561P59K737
$$ -2857 -1392 1754 2265 -192 -1649 109 2283 1265 -1471 -1627 1333 2389 363 -2198 -1439 1298
1431A298Q68k590k133J199K551P0k476o89J857J456j088j837K27K416J273k283
$$ 1298 2166 -424 -2557 -1358 1193 1263 -1213 -1902 -45 1411 323 -1514 -1287 1129 2402 119
1447A19k323J400L142Jk840j662J777K649p11k902r61K624J937k063k525O17K744
$$ 119 -2204 -804 2338 2339 -501 -2163 -386 2263 1552 -1350 -2311 313 2250 187 -2338 -1721 1023
1464A023P17k329j907J297K879K98k741j796K424K602q49k682l88J987J910j430
$$ 1023 1740 -589 -2496 -1199 1680 1978 -763 -2559 -135 2467 1618 -1064 -1452 535 2445 1015
1480A015k563Q0K574J199k493k203J312K306J33k304j340J536K065k93k440n92
$$ 1015 -1548 -1468 1106 2305 -188 -2391 -1079 1227 1360 -944 -2284 -748 1317 1024 -1416 -2008
1496b008K374J656j609k024Q89K067N05j611j690J005K413l10k400r30J862J534
$$ -2008 366 2022 413 -1611 -722 1345 1850 239 -1451 -446 1967 1657 -743 -1673 189 1723
1512A723j220k019R7J817P88j247j855N94K237L52k163p80J480J610m54j707m38
$$ 1723 503 -1516 -1419 398 1186 -61 -1916 -1322 915 1267 -896 -1676 -196 1414 960 -747 -1185
1529a185J449J650q14k229K63J971O63j676j557P54J567L90j858j241J023J911
$$ -1185 264 1914 1100 -1129 -866 1105 1768 92 -1465 -711 856 1246 -612 -1853 -830 1081
1545A081k67k289k67J964R50j169j291K18J788P12j468j451J221K069j37k031
$$ 1081 814 -1475 -1742 222 1172 3 -1288 -1070 718 1430 -38 -1489 -268 1801 1664 -367
1561c67n66Q79J141j69j409p10J199J136j119j432L84J362M96j435q92O89J672
$$ -367 -933 -54 1087 918 -491 -1201 -2 1134 15 -1417 -1033 329 825 -610 -1502 -813 859
1578H59J05j476j040J280J657l10j509j79R18N01m14p21J46O19K03j017o36J106
$$ 859 964 -512 -1552 -272 1385 1075 -434 -613 305 806 392 -329 -183 436 639 -378 -1014 92
1596I2O71p53j043m2P74P12k87p74j77P82P51p31n33P84N77l68p44r0J015N25
$$ 92 763 10 -1033 -1075 -301 411 124 -650 -827 -45 706 -25 -558 226 803 435 -309 -399 616 1141
1616A141n08j414J06J374O27j039j295K88P81J55k33o41OP53N1p41n2P04N68k74
$$ 1141 633 -781 -675 699 1326 287 -1008 -720 61 216 -17 -658 -652 101 152 -589 -641 63 631 357
1636C57q80k52J083Q50l46j105l01P01O79k91k35m06o0L2J85j06j62M71n60n70
$$ 357 -523 -775 308 1158 812 -293 -594 107 786 495 260 -146 -206 -174 11 -95 -257 214 -346 -916
1656i16L82N02K99k92n00KO25Q7K40j03j46j57m3Q7M25L47l72o59m33L03P28M27
$$ -916 -534 -32 267 -25 -525 -523 102 189 429 326 180 23 -20 67 492 839 467 -192 -625 -322 406 833
1678H33p66r09j10N64O77k22l99l65K35M02L7L7L17j91J30n76J64N96N41j31q54
$$ 833 67 -842 -952 -388 289 67 -332 -697 -462 -60 -23 14 331 140 270 -306 -142 454 995 864 10
1699A0m59K10P31M89o53j112k15O34Q39J56q46p39L6Q92K29j22m17J18L14j27
$$ 10 -449 -239 492 981 328 -784 -999 -365 474 630 -216 -955 -919 -27 202 80 -337 -219 95 -32
1719c2J3K30N46J31m47p12k65O57J082k92j466n59M42J276M15j035j055q5R50
$$ -32 -19 211 757 888 441 -271 -536 121 1203 911 -555 -1114 -672 604 1019 -16 -1071 -1156 -206
1738b06N04k91l89Q5K31J21k8o1J77O26k86o84k24L15R95K07n41j416l67J391
$$ -206 298 7 -382 -297 -66 55 27 -34 143 769 483 -201 -425 -110 885 1092 551 -865 -1232 159
1758A59J313n78j708p67R27J135L05r64q26M67Q11M5n60j35N73M10k23p82p26
$$ 159 1472 894 -814 -1581 -654 481 786 -178 -1004 -537 274 319 -241 -376 197 607 384 -398 -1124
1777a124J441J524n24k230p34J446J827k27j847j624J055K149K03j723q92Q18
$$ -1124 317 1841 1317 -913 -1647 -201 1626 1399 -448 -2072 -1017 1132 1335 -388 -1280 -462
1793d62Q97p4o69m08N75Q73l14r90p1Q96J138m70j479n57N68J902K78j668j128
$$ -462 435 361 -308 -716 -141 732 418 -572 -643 253 1391 921 -558 -1115 -547 1355 1633 -35 -1163
1812a163M05J201M83n47j169j07M49O12n5o03K11L73j2r8k68k13O93O75k78j227
$$ -1163 -758 443 926 379 -790 -897 -448 164 109 -494 -283 90 78 -20 -288 -501 192 867 589 -638
1832f38m68J608J193n97j739q85J330J793j36k206r29R66J466j77p88o68L41R35
$$ -638 -1106 502 1695 1098 -641 -1526 -196 1597 1461 -745 -1674 -708 758 581 -207 -875 -534 401
1850D01J52j257m72J344J087p62j314m37J479J645m93k043p78J300J756o44j582
$$ 401 553 -704 -1176 168 1255 493 -821 -1258 221 1866 1373 -670 -1448 -148 1608 964 -618
1867f18n50R24Q89l0j207j95N60M09o45n96O43P98L78r35m33J32P94P55p55o50
$$ -618 -1168 -244 645 615 -592 -787 -227 182 -463 -1059 -416 382 760 -175 -608 -476 318 1073 318 -332
1887c32j42M74M42J62j83n38k31K26O14l15j63n12m00M57O05o5m19J56K70J09
$$ -332 -474 0 442 604 421 -117 -348 -122 492 177 14 -498 -898 -441 164 99 -320 -164 106 215
1907B15m38l29O06O31m3j005n73Q31J523J06j460q76O85J270j58j423p64R49J107
$$ 215 -223 -552 54 685 642 -363 -936 -105 1418 1524 64 -812 -127 1143 985 -438 -1202 -253 854
1926H54n39j193QJ185N25j236q36K48J474N40j011j211P54J313J95p33r08K61
$$ 854 315 -878 -870 315 840 -396 -1232 -984 490 1030 19 -1192 -438 875 1070 337 -571 -310
1944c10O53L17o52n51O70N71l16q92l2P74M81q16r51Q9R65N36o71m86L09O93j34
$$ -310 343 660 8 -543 127 698 382 -510 -542 232 713 -103 -1054 -965 0 536 -135 -621 -312 381 247
1965B47k00r1N15J33o52l72O38P06l06p73m42M64L38M5q19p0O93J11m84l30L29
$$ 247 47 -44 471 604 -48 -420 218 924 618 -155 -597 -133 205 250 -569 -639 54 165 -319 -649 -320
1986c20N42k0o80l24P23P69K5j018l29P15Q26k08j058k09P98N37n51q41J53R94
$$ -320 222 202 -478 -802 -79 690 715 -303 -632 83 909 701 -357 -566 232 769 218 -623 -470 524
2006E24K50j075p64N46J080j6j074n75Q21J131l82j045k88R60P70n07o66q0Q38
$$ 524 774 -301 -1065 -519 561 545 -529 -1104 -283 848 466 -579 -867 93 863 356 -310 -390 448
2025D48L79o82p55N11Q45j5r19n80P57M34q6q41j18L32M72l81l33J27Q08k0n98
$$ 448 827 145 -610 -99 746 731 -188 -768 -11 423 337 -504 -622 -290 182 -199 -532 -405 403 383 -215
2046b15j23K84O95j91n44k29N87M19l30n47l9P79Qp73l31K25O88L6p62m16Q35
$$ -215 -338 -54 641 450 -94 -323 264 683 353 -194 -233 546 554 -219 -550 -325 363 399 -363 -779 56
2067E6N31n04p64j62J095L55m37p03J57R18J45o74l60L57P43j34p60l68M48O45
$$ 56 587 83 -681 -843 252 607 170 -533 -376 542 687 13 -347 10 753 619 -141 -509 -61 584
2087E84J8r79k68M85P83p25o22J04P17M98p16k40J0O19M63r70m39R44L75j38r17
$$ 584 602 -377 -645 -160 623 -102 -724 -620 97 595 -121 -361 -351 268 731 -239 -678 266 641 503 -414
2108d14Q8O19K38j69o50K9P00Q8p60m58N75L69p8n92o7K66Q19k49p73q4Q75K14
$$ -414 -326 293 531 362 -288 -259 441 529 -231 -689 -114 255 177 -415 -482 -216 603 354 -419 -503 372 586
2130E86n22l10Q8O56Q2n55m20M59N53l72o49n3O76J93l97l97o1N01L85o61l36
$$ 586 64 -246 -158 498 580 25 -395 64 617 245 -404 -457 219 412 15 -382 -443 58 443 -218 -554
2151e54L02N09N9p14R9M23O19o00n97K76N71L15m18p31K98Q60j5p75n01L53O57
$$ -554 -252 257 316 -398 -299 124 743 143 -454 -178 393 708 290 -441 -143 717 702 -73 -574 -221 436
2172D36P4p73o04O79P33n82p62L10P09J88k45p80L10O65L82o66o13M77O69p7n29
$$ 436 510 -263 -867 -188 545 -37 -799 -489 220 408 163 -617 -307 358 740 74 -539 -62 607 530 1
2193Al90L38M51j08o12k26O47L47m44o45K71L87L85m86n79K85M57L24m53m09O28
$$ 1 -389 -51 400 292 -320 -546 101 448 4 -641 -370 17 402 -84 -663 -378 79 403 -50 -459 169
2214A69L69l99m29K53N27j23k43n30M31L74ro51m02O62K64k65l12j37N43L06m47
$$ 169 538 139 -290 -37 490 367 124 -406 25 399 390 -261 -663 -1 263 -2 -314 -451 92 398 -49
2235d9n86L91Q03P3p09n19L62J012J7j037k41L94O41j63o56j87N82J55p7n14J20
$$ -49 -635 -244 559 632 -77 -596 -234 778 795 -242 -483 -89 552 389 -267 -454 128 283 206 -308 -188
2256a88L95L0n32m46L77P30P7o75k17L23L50J56k32l49L72Q5j96k25K11J83j62
$$ -188 207 237 -295 -741 -364 366 443 -232 -449 -126 224 380 148 -201 171 256 60 -165 46 229 67
2277F7l64j86N28K43p6n63k44N12M61m15l39q8M51K22o13OM99K95k00l54j20N79
$$ 67 -297 -483 45 288 212 -351 -595 -83 378 -37 -376 -464 -13 209 -404 -398 101 396 196 -158 -278 301
2299C01L08j75o78k94M88M07J2o03j72L31K49p0m27K8L19J33j66m92J48O77J42
$$ 301 609 434 -244 -538 -50 357 369 -234 -406 -75 174 104 -323 -295 24 157 -9 -501 -353 324 466
2320D66m53k47J3N14J12k88j64k3L08l7qj19O8k66lJ55M5k39n8J3K02j0J3k58
$$ 466 13 -234 -221 293 405 117 -47 -70 238 201 193 74 142 -124 -127 28 73 -166 -224 -211 -9 -19 -6 -264
2344b64M0M16j01j86p6K69L80k75k85l92M42M66J72p22l11L29K61P8j66n18J21
$$ -264 -224 192 91 -95 -171 98 478 203 -82 -474 -32 434 606 -116 -427 -98 163 241 75 -443 -322
2365c22L93m5l08k82M95K95l8l92l33M41O54k28n40k42M51N22L1k53o13n2M80
$$ -322 71 26 -282 -564 -69 226 188 -204 -537 -96 558 330 -210 -452 -1 521 552 299 -314 -366 114
2386A14M81m69m77J10K20K74l84j91R8K62J19l27m96L39O39n4k91l12r0P42N00
$$ 114 595 126 -351 -241 -21 253 -131 -322 -224 38 157 -170 -666 -327 312 258 -33 -345 -435 307 807
2407H07m79p44J88N28L19l77m18M5J39M41k77m92j30M81J35n46R7qL75L26n73
$$ 807 328 -416 -228 300 619 242 -176 -131 8 449 172 -320 -450 31 166 -380 -283 -291 84 410 -163
2428a63k67K03O55l3l14j54k84N81K55j14k45lj55K44k13Q1k55M5r1K19j87l80
$$ -163 -430 -227 428 395 81 -73 -357 224 479 365 120 117 -38 206 -7 74 -181 -136 -227 -8 -195 -575
2450e75M99K23j52j35j43j1O07M6l13m01J08N17J86l51l19J34J20M94k62p66K38
$$ -575 -76 147 -5 -140 -283 -294 313 359 46 -355 -247 270 456 105 -214 -80 40 534 272 -494 -256
2471b56L69M36o64m59K73N89J05n08p10L60J041k92n98k27N26M58J38o06l27K71
$$ -256 113 549 -115 -574 -301 288 393 -115 -825 -465 576 284 -314 -541 -15 443 581 -25 -352 -81
2491h1N19r5n19J03K38J49k2o47k3K06M15j4n53j40O63k3j28l72L4M33j44K0j94
$$ -81 438 343 -176 -73 165 314 292 -355 -378 -172 243 229 -324 -464 199 176 48 -324 -290 143 -1 19 -175
2514a75K21J63k57J54K24P2l54l69P2N19j16j88j80K39J60j78j68j96L44K90l19
$$ -175 46 209 -48 106 330 402 48 -321 -249 270 154 -34 -214 25 185 7 -161 -357 -13 277 -42
2535d2n73M57L90J05k73m61J90M86L21k32n62j3O49O3n16m25J48Q64j26n39n66
$$ -42 -615 -158 232 337 64 -397 -207 279 600 368 -194 -207 442 505 -11 -436 -288 576 450 -89 -655
2556f55L95N58j15p64j59N05O23n2n58k38M76L92l54l41K32J04K67k25j70K9M69
$$ -655 -260 298 183 -581 -740 -235 388 336 -222 -460 16 408 54 -287 -55 49 316 91 -79 -50 419
2577D19j18l79l5J05J06j48j30Q9J45j34Rj86K63j7j59o7q6L33L01l47n3o3L40
$$ 419 301 -78 -113 -8 98 -50 -180 -91 54 -80 -71 -257 6 -11 -170 -237 -323 10 311 -36 -89 -152 188
2600A88K66n56k20K91M60n7m88k35M71L60k20p96KO86L64m82o48K86P22j0m07
$$ 188 454 -102 -322 -31 429 372 -116 -351 120 480 260 -536 -534 152 516 34 -614 -328 394 384 -23
2621b3m08L59L60R6n17k12M06L84k61k21j94K98L75%o19m9L08L5l32o4o9L53L63
$$ -23 -431 -72 288 384 -133 -345 61 445 184 -37 -231 67 442 442 -177 -226 82 117 -215 -279 -348 5 368
2644C68m62k72J33M32q7l54P2K11L13l15k38M9O05j50o04K2N07J23j97k49m3L79
$$ 368 -94 -366 -233 199 112 -242 -170 41 354 39 -199 -150 455 305 -299 -277 230 353 156 -93 -136 243
2666B43j08k15k56J45K31J53n16j55K93N81j17m37j87M47K39o4n75l6M09M97k85
$$ 243 135 -80 -336 -191 40 193 -323 -478 -185 396 279 -158 -345 102 341 277 -298 -334 75 572 287
2687B87p77K37M90J35m54l82M9R17j28n92l41N37K15n3l95LK60J26R9k51k62N85
$$ 287 -490 -253 237 372 -82 -464 -415 502 374 -218 -559 -22 193 140 -255 -252 8 134 233 -18 -280 305
2709C05p7k04k15J57L94k58k02p5R0K46j54m22L3O89j50l66j85K54K59K8l83j48
$$ 305 228 24 -191 -34 360 102 -100 -175 -85 161 7 -415 -382 307 157 -209 -394 -140 119 147 -236 -384
2731c84K34M97l51k03k0O10j65n1k84J7L61Nk25m40J98L42J14n27j95K28M35q8
$$ -384 -150 347 -4 -207 -227 383 218 167 -117 -100 261 266 41 -399 -201 141 255 -272 -467 -239 196 108
2753A08l43q3K41M04k15l12M9L94n8k42j22K14J76k3k63k20M56K56k56l92N2M87
$$ 108 -235 -318 -77 327 112 -200 -151 243 185 -57 -179 35 211 188 -75 -295 161 417 161 -231 -179 308
2775C08k19k22k72M15K10k37q3k60L18J18J24l92m0L56L26o0l17k83M94R8l78
$$ 308 89 -133 -405 10 220 -17 -100 -360 -42 76 200 -192 -232 124 450 390 73 -210 284 382 4
2796Dk42K08L80j25j74j99L7L36j95k85j06L33J30%m08K7J17K63j05j56K92j17
$$ 4 -238 -30 350 225 51 -148 -111 225 30 -255 -361 -28 102 102 -306 -279 -162 101 -4 -160 132 15
2818A5R7j49j20K21J31k67j24Q2J64J09J3m03J74n7J24j97p7K26J60l33L6q3M09
$$ 15 112 -37 -157 64 195 -72 -196 -114 50 159 172 -231 -57 -114 10 -187 -264 -38 122 -211 -175 -258 151
2841A51M3k77q8l7N40J07k44n24J64L40J06l92jJ26L1k9k07L7K6L52j95k13j34
$$ 151 194 -83 -171 -208 332 439 195 -329 -165 175 281 -111 -112 14 45 16 -191 -154 -128 224 29 -184 -318
2864c18K08J06K28n21J04K16J63j6j68P8m5K78l16jJ90L7l12j5j09J98J63k86
$$ -318 -110 -4 224 -297 -193 23 186 170 2 80 35 313 -3 -4 186 223 -89 -104 -213 -15 148 -138
2886a38l5J38J10l26J04j40L20q1R1j30J83P0k3l07m0M00Q8K5k89k45K88R3k90
$$ -138 -173 -35 75 -251 -147 -287 33 -48 43 -87 96 166 143 -164 -204 196 284 309 20 -225 63 156 -134
2909a34j06pL08R7l11j56K64R5J27k58q5o0K71K92k40k59J16K36J71j78k69N4
$$ -134 -240 -247 61 158 -153 -309 -45 50 177 -81 -166 -226 45 337 97 -162 -46 190 361 183 -86 -32
2931c2M0J33o7j51n0J77L8k28O3l2j02L26k71l0Q8nJ30K0qj86L8j1K75k99M3J92
$$ -32 8 141 74 -77 -127 50 88 -140 -77 -109 -211 115 -156 -186 -98 -103 27 47 39 -147 -109 -120 155 -144 -101 91
2957I1L2J70j19k39L9J25l3j17q5J3K34j16j15r8k7K31J10lj88j21K97Q0o6k81
$$ 91 123 293 174 -65 -26 99 66 -51 -136 -123 111 -5 -120 -218 -245 -14 96 93 -95 -216 81 161 95 -186
2981a86k6M20q7K20m30K44M0k55J66q7L8q4K3nk24P8J99O2P5m71l7K90K40q6m10
$$ -186 -212 208 121 341 -89 155 195 -60 106 19 57 -27 -4 -9 -233 -155 44 106 181 -290 -327 -37 203 117 -293
3006b93%L61p7Q4j55j93M37R4k9j78l42K77J33j37J0j80J50k9m1Pr9J55K17j74
$$ -293 -293 68 -9 75 -80 -273 164 258 229 51 -291 -14 119 -18 -8 -188 -38 -67 -108 -101 -200 -45 172 -2
3030bNj41K6K23J40r6l46Q1L62r8l35J08M5J78q6l9j43J2K21o9k41j07K71J48
$$ -2 3 -138 -112 111 251 155 -191 -110 252 154 -181 -73 -28 150 64 25 -118 -106 115 46 -195 -302 -31 117
3054A17M8k53q7o0K23J66j00j25J09o3J98L5r2r0L5J2L8j04J23k18K07p3No0j29
$$ 117 165 -88 -175 -235 -12 154 54 -71 38 -25 173 208 116 26 61 73 111 7 130 -88 119 46 51 -9 -138
3079a38J43J50j59j69J42l7K79l70j77L77J82J20l79j60J52K85l1j69j12L8L76
$$ -138 5 155 -4 -173 -31 -68 211 -159 -336 41 223 343 -36 -196 -44 241 210 41 -71 -33 343
3100C43k35k29j93J46J78j23l9p6J35J21Mk53O7J78K31l99J91K0k8N6N6r7j45
$$ 343 108 -121 -314 -168 10 -113 -152 -228 -93 28 32 -221 -154 24 255 -144 47 67 39 95 151 54 -91
3123i1J66p7J02j46Kr5N8O6m1R2K3l57K24m4J77j65l5l0K96O2j88j26K26J23j68
$$ -91 75 -2 100 -46 -44 -139 -81 -15 -56 36 59 -298 -74 -118 59 -106 -141 -171 125 187 -1 -127 99 222 54
3148E4j89n2L72q2M7k35jJ27J04m7l69J63J19R9j97k76L03K42R2l42j83l2N73
$$ 54 -135 -187 185 103 150 -85 -86 41 145 98 -271 -108 11 110 -87 -363 -60 182 274 -68 -251 -283 290
3171B90j04j34m05M43R5j13j52j1Q7K90q4l47J02k5m5n3J46j17R7q4j22R6Q1o0
$$ 290 186 52 -353 90 185 72 -80 -91 -4 286 202 -145 -43 -68 -113 -166 -20 -137 -40 -124 -246 -150 -69 -129
3195a29Q5J86k50K17R6r2nq1J70K4m05Q4R6q0n7J15O8L6K29m39j10K61mj09j26
$$ -129 -44 142 -108 109 205 113 108 27 197 221 -184 -100 -4 -84 -141 -26 42 78 307 -132 -242 19 15 -94 -220
3220b20k87M52K35j0m00m1L96Pj35q2m2K41M0k54K2K9L06j18j80l31N20N2j66
$$ -220 -507 -55 180 170 -230 -271 125 132 -3 -85 -127 114 154 -100 -78 -49 257 139 -41 -372 148 200 34
3243C4k38Q5M4K17k55J15j43K1K66l02QK00n7J03j22q3L02r9P9j69j00P4K11j64
$$ 34 -204 -119 -75 142 -113 2 -141 -120 146 -156 -148 52 -5 98 -24 -107 195 96 175 6 -94 -20 191 27
3267B7k13J25J75j01k55m7K80R7j0k25J6J29K25k29j06M4K53N7j80j93p8N27M
$$ 27 -186 -61 114 13 -242 -289 -9 88 78 -147 -131 -2 223 -6 -112 -68 185 242 62 -131 -209 318 322
3290C22k83k14K25J0J42m13q4K12L66k57l98J05Q3L00l09J0P8K19J39j71k03J59
$$ 322 39 -175 50 60 202 -211 -295 -83 283 26 -372 -267 -184 116 -193 -183 -105 114 253 82 -121 38
3312C8L34j66k71L6P3J0r2j04q5K80K7Ml31j1L54m7n3j92K61l6j16lj04K67J56
$$ 38 372 206 -65 -29 44 54 -38 -142 -227 53 80 84 -247 -258 96 49 -4 -196 65 29 -87 -90 -194 73 229
3337B29m1k95j39M79j06j04j15J81L8k0k53M3P8K07k73j91P9J80l4N3p9k07L89
$$ 229 188 -107 -246 233 127 23 -92 89 127 107 -146 -103 -25 182 -91 -282 -203 -23 -57 -4 -83 -290 99
3360I9k8j85J06q0L47p9k76Q0L6J27J2j57j19K46%p1j45O7O9l8j60k04L21J30
$$ 99 71 -114 -8 -88 259 180 -96 -16 20 147 159 2 -117 129 129 58 -87 -20 49 11 -149 -353 -32 98
3384I8m6j14j19J48J79j83p8R3J63K25l45J8j30P3J55j88KR2J17Nm12R0J32J52
$$ 98 52 -62 -181 -33 146 -37 -115 -22 141 366 21 39 -91 -18 137 -51 -49 43 160 165 -247 -157 -25 127
3408A27rl77R2L68j43K4l24R4L72K6k83K1N8M14j44m49J46J18K35k92l23J13J67
$$ 127 118 -259 -167 201 58 82 -242 -148 224 250 -33 -12 46 460 316 -133 13 131 366 74 -249 -136 31
3431C1O8J7j90k66L97j5k55J85k8L14l62k03L19J85N9k59j03J32p7J23o9j8o5
$$ 31 99 116 -74 -340 57 42 -213 -28 -56 258 -104 -307 12 197 256 -3 -106 26 -51 72 3 -15 -80
3454h0J85k9j25J68M8j15r5r4j52L18K7l3k91J48K66M7k83LK74N8j01k03p9L32
$$ -80 105 76 -49 119 167 52 -43 -137 -289 29 56 23 -268 -120 146 193 -90 -87 187 245 144 -59 -138 194
3478A94k51J07J3j98M12j31j36j46k02M41q4j08J6N1J49N6k15j25K23oJ61l06
$$ 194 -57 50 63 -135 277 146 10 -136 -338 103 19 -89 -73 -22 127 183 -32 -157 66 60 221 -85
3500h5N4N3K6m9k01K69J21p6j28j50K49k28M86l64k4r0K13m4l79N03q0j64j34
$$ -85 -31 22 48 -1 -202 67 188 112 -16 -166 83 -145 341 -23 -47 -137 76 32 -347 156 76 -88 -222
3523b22O8K19K6j00k5P3K20j08j50m6R1K52p9k61j7O3L9J96m40m7K97J64k53j42
$$ -222 -154 65 91 -9 -34 39 259 151 1 -45 46 298 219 -42 -59 4 43 239 -201 -248 49 213 -40 -182
3547a82J22O6R7lj81m7K20j6j25N4k24M16Q9k07r3R9M0j48K1j69K18r5n2K2o7
$$ -182 -60 6 103 100 -81 -128 92 76 -49 5 -219 197 286 79 -14 85 125 -23 -2 -171 47 -48 -100 -78 -145
3572a45K00k2l12J44J18l0J17l37L46j45K89k52O5P5P2k76M8R6k12K24o4Q7j4
$$ -145 55 33 -279 -135 -17 -47 70 -267 79 -66 223 -29 36 111 183 -93 -45 51 -161 63 -1 86 72
3595G2ln9N7j30j29J87mk45k1K71J86o5k38j15MK52j3L4j93RM09r9j49J06r4j36
$$ 72 69 10 67 -63 -192 -5 -9 -254 -275 -4 182 117 -121 -236 -232 20 7 41 -152 -143 266 167 18 124 30 -106
3621a06J60Qj77P3J78j11n7k31K03O5Rj43J2O6P5L7m9l3N9Q8j30J53k87K04k0
$$ -106 54 62 -115 -42 136 25 -32 -263 -60 5 14 -129 -117 -51 24 61 12 -21 38 126 -4 149 -138 66 46
3646D6l0Q0j00mK1j73J04P8j11q5K6O4Q2l9m5j22M33r8j23m5J84j3k02J32K9o
$$ 46 16 96 -4 -8 13 -160 -56 22 -89 -174 -148 -84 -2 -41 -86 -208 225 127 4 -41 143 130 -72 60 89 83
3672H3P7j07m9J13L1P0l43%L0J6J4J58k66J27M6L7l7k11K26k1J4OM1l1J21r6Q9
$$ 83 160 53 4 117 148 218 -125 -125 -95 -79 -65 93 -173 -46 0 37 0 -211 15 -6 8 14 55 24 145 49 138
3699A38k0r8M5j72K58k23P5k9N2j70M2l1k1M48j83n5j01j2J68m5j1j30j2J82l7
$$ 138 118 20 65 -107 151 -72 3 -26 26 -144 -102 -133 -154 294 111 56 -45 -57 111 66 55 -75 -87 95 58
3724E8j0j3K4O2j4l48K80J28k17p3J09j38K27j61L8J48p1p1k1J9K7q3n4J18J41
$$ 58 48 35 59 121 107 -241 39 167 -50 -123 -14 -152 75 -86 -48 100 29 -42 -63 -44 -17 -100 -154 -36 105
3749A05l5p5J96k42R4r7P9k9K01j33J13k92J22p1m4K17o3j72l7P6J41m1j36N1
$$ 105 70 -5 191 -51 43 -54 25 -4 197 64 177 -115 7 -64 -108 109 46 -126 -163 -87 54 13 -123 -72
3773g2J04m2L0j74Q7K01m7n8j99O6Q2L46k81j50R4j27R4jO4n1J15k28K37j34o5
$$ -72 32 -10 20 -154 -67 134 87 29 -170 -104 -22 324 43 -107 -13 -140 -46 -47 17 -34 81 -147 90 -44 -109
3798a09M2j3J43k98J78L4r9L2J38n1j17J24j48J33k9j52K43j04LQ8k80j1j5K50
$$ -109 -67 -80 63 -235 -57 -23 -122 -90 48 -3 -120 4 -144 -11 -40 -192 51 -53 -50 38 -242 -253 -268 -18
3822a8K1n7r5K65O9k81L7Q2K01k81Q5O0J78l8q3k16J21Q4L5k3n3k80K61r7o1p4
$$ -18 3 -54 -149 116 185 -96 -59 23 224 -57 28 88 266 228 145 -71 50 134 169 146 93 -187 74 -23 -84 -158
3848a58J82o5J14k15O1M6j16L34m6l25K35K00k08o2l4O3O6Lq4m3K2O5O4M8l17
$$ -158 24 -41 73 -142 -81 -35 -151 183 137 -188 47 247 39 -23 -57 6 72 75 -9 -52 -30 35 99 147 -170
3873a70K0Q4o4J72mk25J92P4k13J60J6k17J02J30Nj46J05r1J72r6J85k3l91N31
$$ -170 -150 -66 -130 42 38 -187 5 79 -134 26 42 -175 -73 57 62 -84 21 -70 102 6 191 168 -223 308
3897C08q2j55k84R4J52o9o5J07m5k2M3k30L8J61K86k05j42K40j23J37N7k49J6
$$ 308 226 71 -213 -119 33 -36 -101 6 -39 -61 -18 -248 -210 -49 237 32 -110 130 7 144 201 -48 -32
3920c2J67Q3j41j69j20K43j8J49l01K05j62K1n0n1J97p3j06N5K34k30J21N8j02
$$ -32 135 218 77 -92 -212 31 13 162 -139 66 -96 -75 -125 -176 21 -52 -158 -103 131 -99 22 80 -22
3943b2K2J72j88J36rq4j54J57k08O4J71O5r8k24K66k18J32rr5j6K20J12k39J19
$$ -22 0 172 -16 120 111 27 -127 30 -178 -114 57 122 24 -200 66 -152 -20 -29 -124 -140 80 192 -47 72
3967G2j09O9o4L0J60j50n4K1o0K7M1J00j34Ql7k9K21j55m6m6J90K4r6r5M9J35
$$ 72 -37 32 -32 -2 158 8 -46 -25 -85 -58 -17 83 -51 -43 -80 -109 112 -43 -89 -135 55 79 -17 -112 -63 72
3993G2r4N1j59K43l7J5q0j35P9N0j18J8J33j05L0Oj90R7K35j61j80L16J3j89J63
$$ 72 -22 29 -130 113 76 91 11 -124 -45 5 -113 -95 38 -67 -37 -31 -221 -124 111 -50 -230 86 99 -90 73
4018G3j3o9J34J9j20R1j35J58j04l6J45k02L17k58J4P4R8j34n2o5j05L37k87J03
$$ 73 60 -9 125 144 24 115 -20 138 34 -2 143 -59 258 0 14 88 186 52 0 -65 -170 167 -120 -17
4042a7k9p8l0J60Q2k56K62k79J16p2J76N5O7j89q3K94j37J57rk15j8P8k09O1Q1
$$ -17 -46 -124 -154 6 88 -168 94 -185 -69 -141 35 90 157 -32 -115 179 42 199 190 -25 -43 35 -174 -113 -32
4067c2J0P0j13O9j08J44k05P0M1K57k10o1j9M8p6O8J90l21M9K29k52J59mM0j8
$$ -32 -22 48 -65 4 -104 40 -165 -95 -54 203 -7 -68 -87 -39 -115 -47 143 -178 -129 100 -152 7 3 43 25
4092B5l6no0J09J6p4o2R2N3l1K1m3k83N95k51Q5k24J60M1j04k2j8n2J03J7k32
$$ 25 -11 -16 -76 33 49 -25 -87 5 58 27 48 5 -278 317 66 151 -73 87 128 24 2 -16 -68 35 52 -180
4118a80J81lNj67mJ30m2m0Q6R4j00P2J12j31o2qJ9R1j66K43j84o8J4K17r4j35
$$ -180 1 -2 3 -164 -168 -38 -80 -120 -34 60 -40 32 144 13 -49 -57 -38 53 -113 130 -54 -122 -108 109 15 -120
4144a20K25j99K03p1l6j1o2J52j47J13N2j40q0K16j36o3QK90o6J26k38M9K8k51
$$ -120 105 -94 109 38 2 -9 -71 81 -66 47 99 -41 -121 95 -41 -104 -96 194 128 254 16 65 93 -158
4168a58R8J14r7p4L3n6P1O1J22n9L8L6k57J84j23J47j39R2l0M5O5o0j7j18J78
$$ -158 -60 54 -43 -117 -84 -140 -69 -8 114 55 93 129 -128 56 -67 80 -59 33 3 48 113 53 36 -82 96
4193I6M0j75P2K25l42J51k21K36j75m3K7j2J95j94o2K29l9l9mK3J9J04k1LL6j99
$$ 96 136 -39 33 258 -84 67 -154 82 -93 -136 -109 -121 74 -120 -182 47 8 -31 -35 -12 7 111 90 93 129 -70
4219g0O9n5p0Q6M3L8K6j14J5l0J45l13L29k17O1k7N6R8k00O6M1J41j1m2O8k44
$$ -70 -1 -56 -126 -40 3 41 67 -47 -32 -62 83 -230 99 -118 -57 -84 -28 70 -130 -64 -23 118 107 65 133 -111
4245a11K56k02o2J66q0N1on8m0K45j87r1J40q1M6J16m8k75J61j5M9MJ75k40J06
$$ -111 145 -57 -119 47 -33 18 12 -46 -86 159 -28 -119 21 -60 -14 102 54 -221 -60 -75 -26 -22 153 -87 19
4270A9J90j15j67j21K29K1J43k87M2R3K42k63p7j01J55j42K48j78k01L26Qk5n4
$$ 19 209 94 -73 -194 35 56 199 -88 -46 47 289 26 -51 -152 3 -139 109 -69 -270 56 64 39 -15
4293a5j18k4K47j54j1J26J21j18j07Q1N8j71P8M0K10l26J1J67n8K9k79K08J59
$$ -15 -133 -157 90 -64 -75 51 172 54 -53 28 86 -85 -7 33 243 -83 -72 95 37 66 -213 -5 154
4316A54j49j19Q7K4J5%J32nk6m9j2j8m8j2N4j1L4k11J89n4J71k02J23j40n7K80
$$ 154 5 -114 -27 -3 12 12 144 139 113 64 52 34 -14 -26 28 17 51 -160 29 -25 146 -56 67 -73 -130 150
4342A50j81r7P4k7l4J66n2J13o4m6j7M4q1K1q0J31m6l8J14q9K05j04m6l0m9R7
$$ 150 -31 -128 -54 -81 -115 51 -1 112 48 2 -15 29 -52 -31 -111 20 -26 -64 50 -39 166 62 16 -14 -63 34
4368C4j61J13j80Q1K81k04O0j23J88j56J8j2J54l7N7L6j99J07j6l0n1M6p7j62
$$ 34 -127 -14 -194 -113 168 -36 24 -99 89 -67 -49 -61 93 56 113 149 -50 57 41 11 -40 6 -71 -233
4392b33J16j6J43j9J0j78J92j55J69L1P3j9k14RJ62j61K9J35L2n3M5j23m4K26
$$ -233 -117 -133 10 -9 1 -177 15 -140 29 60 133 114 -100 -91 71 -90 -61 74 106 53 98 -25 -69 157
4416A57j33Ln9N8O4j15j38R5L9j9Q8j14n9L1n3k6J85p5M8l8J51L9k54J99K3j56
$$ 157 24 27 -32 26 90 -25 -163 -68 -29 -48 40 -74 -133 -102 -155 -181 4 -71 -23 -61 90 129 -125 74 97 -59
4442e9M6R1M8j85J6J05j03J8J02M2l50J59m5R3j22K53k7L5j73J1N2J65k98L2R3
$$ -59 -13 78 126 -59 -43 62 -41 -23 79 121 -229 -70 -115 -22 -144 109 82 117 -56 -45 7 172 -126 -94 -1
4467ar7K06n0rj42o2K35k86K21J03r9r7M1j35J24oP4J05q4j92K2J65o3l2J8M6
$$ -1 -98 108 58 49 -93 -155 80 -206 15 118 19 -78 -37 -172 -48 -54 20 125 41 -151 -129 36 -27 -59 -41 5
4493E%Q2m9M7o9n1J03M2m2J4j53K4m8M3Q9k18J21j62K19l8J9LJ09q8L0p3J13J28
$$ 5 5 87 38 85 16 -35 68 110 68 82 -71 -47 -95 -52 37 -181 -60 -222 -3 -41 -22 -19 90 2 32 -41 72 200
4521B00j93J01q3K14k81j09j25L61K3m6p5O1j07ml8J07j06mK35j34M3k4K24k72
$$ 200 7 108 25 239 -42 -151 -276 85 108 62 -13 48 -59 -63 -101 6 -100 -104 131 -3 40 16 240 -32
4545c2k9J48j5j0nk6m3PJ40k28J13p4j4J3k0Rn9J58k6j21M6M4k2q8J71J5p0J40
$$ -32 -61 87 72 62 57 31 -12 -5 135 -93 20 -54 -68 -55 -75 -66 -125 33 7 -114 -68 -24 -46 -134 37 52 -18 122
4573A22j40N6r7M9R5j88O8K5p8J78m5k14K06pj53l6K46qj86R8J39j23K32l16l2
$$ 122 -18 38 -59 -10 85 -103 -35 -10 -88 90 45 -169 37 30 -123 -159 87 79 -107 -9 130 7 239 -77 -109
4598a09j4J70J22j87M6j09J49L6n4r9R5L0m4N4k54O9J88j41q3M6p1K02l7Q0Lq1
$$ -109 -123 47 169 -18 28 -81 68 104 50 -49 46 76 32 86 -168 -99 89 -52 -135 -89 -160 42 5 85 88 7
4624GJ07j74J73q5l0J11r6n7j27K30n7k42J99P8j65n3Q5J52j1L0j9l6L1n9P7n2
$$ 7 114 -60 113 28 -2 109 13 -44 -171 59 2 -240 -41 37 -128 -181 -96 56 45 75 56 20 51 -8 69 17
4650A7J0j83J53M4j57O6J60L7p0o3j90R3R7o0p3Q6p7J27l52M02j89Q4J12m1n4
$$ 17 27 -156 -3 41 -116 -50 110 147 77 14 -176 -83 14 -46 -119 -33 -110 17 -335 67 -122 -38 74 33 -21
4675b1j6J67j39J63k4j98n7K0J88k59J98r8K73j93J33k83K32o7j83N1J31Pp7k
$$ -21 -37 130 -9 154 130 -68 -125 -105 83 -176 22 -76 197 4 137 -146 86 19 -164 -113 18 25 -52 -54
4699e4j4j5k7J30P5j91J06L2q3N3n8J27N0j8k37K38j45j0P8j90K19n2p5J38k84
$$ -54 -68 -83 -110 20 95 -96 10 42 -41 12 -46 81 131 113 -124 114 -31 -41 37 -153 66 14 -61 77 -207
4724b07R3J09j87Q3J75n6jn4o4J69j95O7L3Q6j9J16j44K09j21j82J97Lj87p8L05
$$ -207 -114 -5 -192 -109 66 10 9 -45 -109 60 -135 -68 -35 51 32 148 4 213 92 -90 107 110 -77 -155 150
4749A50k40M4M3J03k15K7J95j97m0R4j11L02n0m0j99K61J18l11K06k31J69j00
$$ 150 -90 -46 -3 100 -115 -88 107 -90 -130 -36 -147 155 105 65 -134 127 245 -66 140 -91 78 -22
4771b2oL9J20r7j23J25k89J26J33J08o0k28Q8K14j92K98j01j41j0K34j41j47L3
$$ -22 -28 11 131 34 -89 36 -253 -127 6 114 54 -174 -86 128 -64 234 133 -8 -18 216 75 -72 -39
4794c9k6n1Q5l7K51l79K56j60k7J49q4P4j98K02l6L2p0L7Q0P1j68j28P2j03L08
$$ -39 -65 -116 -31 -68 183 -196 60 -100 -127 22 -62 12 -186 16 -20 12 -58 -21 59 130 -38 -166 -94 -197 111
4819A11k79J21O1n2k3J32j44R1Q1JN6k15Q4M9j61j2N2J35P1m45K45j57K29J02
$$ 111 -168 -47 14 -38 -61 71 -73 18 99 100 156 -59 25 74 -87 -99 -47 88 159 -286 -41 -198 31 133
4843A33j67L9O4r0P7p6n9J00j5l2J1j27J04qK1kQ1k71K99m2M9l03L04k73Q9Q0
$$ 133 -34 5 69 -21 56 -20 -79 21 6 -26 -15 -142 -38 -46 -25 -27 54 -217 82 40 89 -214 90 -183 -94 -14
4869a4n2J64p2n8j32M9J37l0j09O0K8O4j80K33k77K49j23r5L95k99Qj53K70q3
$$ -14 -66 98 26 -32 -164 -115 22 -8 -117 -57 -29 35 -145 88 -189 60 -63 -158 237 -62 -54 -207 63 -20
4893b0K4j07L23l60N2J24J36j15n9rQ7Oq1P9J06j00q0J33k10J70j21l7m2K67k03
$$ -20 4 -103 220 -140 -88 36 172 57 -2 -11 76 82 1 80 186 86 6 139 -71 99 -22 -59 -101 166 -37
4918c7p7O0m6K2J3qJ86j4R8j17J7L0J09j61j59K69k13J00K7j00n8R8No9J13j67
$$ -37 -114 -54 -100 -78 -65 -73 113 99 197 80 97 127 236 75 -84 185 -28 72 99 -1 -59 39 44 -25 88 -79
4944g9L3L00k50j68J9K63M5j18O8q3K2j93q9J97J07j54J5K14j60j3L3j35Q3r6
$$ -79 -46 254 4 -164 -145 118 163 45 113 30 52 -141 -230 -33 74 -80 -65 149 -11 -24 9 -126 -43 -139
4968a39J79k32P0O4q5qJ71J05n9kk0j41M2J55q8j41J49Q6K9j26K1j0J65j86M0
$$ -139 40 -192 -122 -58 -143 -151 20 125 66 64 44 -97 -55 100 12 -129 20 106 135 9 30 20 185 -1 39
4993C9j39j12K76p8L0L3%j49m3J88K4n2l1R5k3l1Nj88J84L2J1J6M8o8k10K57j78
$$ 39 -100 -212 64 -14 16 49 49 -100 -143 45 69 17 -14 81 58 27 32 -156 28 60 71 87 135 67 -143 114 -64
5020f4J51j71j19J21L5J42q5r8q6K70j31J36j90O1M9N2n3J3J5N7j86J35P7j29
$$ -64 87 -84 -203 -82 -47 95 10 -88 -174 96 -35 101 -89 -28 21 73 20 33 48 105 -81 54 131 2
5044BQ2j93Q1K4j3q4J24J11j60k37K92m6Q4n3Pr7m5K06R6l76L21k8l9q0N3q7r3
$$ 2 84 -109 -28 -4 -17 -101 23 134 -26 -263 29 -17 67 14 21 -76 -121 85 181 -195 126 98 59 -21 32 -55 -148
5071a48J48j36p3J69J74j63k6J00J6l16J60J55j68M6J64k13R6J11j68K38k42J48
$$ -148 0 -136 -209 -40 134 -29 -55 45 61 -255 -95 60 -108 -62 102 -111 -15 96 -72 166 -76 72
5093G2k8m1OO2k40J76L0j15J65p9j83K33j74R5j0l4j4n6K03j71j12J51J44N7j41
$$ 72 44 3 9 71 -169 7 37 -78 87 8 -175 58 -116 -21 -31 -65 -79 -135 68 -103 -215 -64 80 137 -4
5118dJ52j82N8j52J77k2l7n0R4J14j97R9L0q2j23J54N1j77P9M6o1K1l9r3J18m4
$$ -4 148 -34 24 -128 49 27 -10 -60 34 148 -49 50 80 -2 -125 29 80 -97 -18 28 -33 -12 -51 -144 -26 -70
5144g0j3L8j12P4J32o9J17O0o6k00J56L8r4P9pj47Q6J39l7j04j09K69k05J12m0
$$ -70 -83 -45 -157 -83 49 -20 97 157 91 -109 47 85 -9 70 63 -84 2 141 104 0 -109 160 -45 67 27
5169B7k1l6N0j38J19J55P7l56J71j22J34q8J69k86j5P9n6Q9L6J65j34J5J6K9j20
$$ 27 6 -30 20 -118 1 156 233 -123 48 -74 60 -28 141 -145 -160 -81 -137 -48 -12 153 19 34 50 79 -41
5194d1K15r9r9j6J29k31J44ll4r0J61J8k38N9J83j62J6R3l7NnR2p8J52k31K9j1
$$ -41 174 75 -24 -40 89 -142 2 -1 -35 -125 36 54 -184 -125 58 -104 -88 5 -32 -27 -32 60 -18 134 -97 -68 -79
5221g9J96q0l4J75j32j68K66n4n5j11J64M0j16J9l1K20l20K6L8j4N7p4M8l1L7
$$ -79 117 37 3 178 46 -122 144 90 35 -76 88 128 12 31 0 220 -100 -74 -36 -50 7 -67 -19 -50 -13
5246a3R8o3j04J65p8M5n9L2p9l0L0J80n2k2j22J55o8N9O4r6J0n9l8L7p4M9J09
$$ -13 85 22 -82 83 5 50 -9 23 -56 -86 -56 124 72 50 -72 83 15 74 138 42 52 -7 -45 -8 -82 -33 76
5273G6j73j2J35j9Q5l02K56m4M7j14n9L12l0n6j88KJ53m3Kk06J02Q3r5p0J67K
$$ 76 -97 -109 26 7 92 -210 46 2 49 -65 -124 188 158 102 -86 -84 69 26 28 -178 -76 7 -88 -158 9 11
5299A1p7J30r1k5o2J22n1K36j37P6j51N1j44K00j27l2L7j37J70P3q6p6rL6K65
$$ 11 -66 64 -27 -52 -114 8 -43 193 56 132 -19 32 -112 88 -39 -71 -34 -171 -1 72 -14 -90 -99 -63 202
5324B02l80K52q8N8k23K14j02J15O2n9j0n2J3J96lj76o7R5r2J55k60Q9Jj27K26
$$ 202 -178 74 -14 44 -179 35 -67 48 110 51 41 -11 2 198 195 19 -48 47 -45 110 -150 -61 -60 -187 39
5349C9j39M9q7Q1J13q7k6J42J74j71o7J75k17N2m0M0J14m6l35J73J30O2k0n5k88
$$ 39 -100 -51 -138 -57 56 -31 -57 85 259 88 21 196 -21 31 -9 31 145 99 -236 -63 67 129 109 54 -234
5374b34K05M2j11J95j9j68J26l2j32O7J10n5p9Q3m9L4j11J87k0J5M1p5p1J31N
$$ -234 -29 13 -98 97 78 -90 36 4 -128 -61 49 -6 -85 -2 -51 -17 -128 59 39 54 95 20 -51 80 85
5399H5J49k09K73k19M0K2k42J31M0n2k6m8L4p5NJ63J0n3j82J35l0J14j37J32p9
$$ 85 234 25 298 79 119 141 -101 30 70 18 -8 -56 -22 -97 -92 71 81 28 -154 -19 -49 65 -72 60 -19
5424a9k2K4L6j7M2k97K66J67l72J14J80o3l3j9N3n2Q7l8p2J97k04K41j99n5J32
$$ -19 -41 -17 19 2 44 -253 13 180 -192 -78 102 39 6 -13 40 -12 75 37 -35 162 -42 199 0 -55 77
5449G7j29R2j32O9Q0LL5m9k96J52N8j6O5r5K3P5J16l01K34k9o1J62k66p1J92L
$$ 77 -52 40 -92 -23 57 60 95 46 -250 -98 -40 -56 9 -86 -63 12 128 -173 61 32 -29 133 -133 -204 -12 -9
5475iN5o1J33J61j46j62j9J03J75k19p0K03r0p3j2m4J5j00K02R7j78n9K2r5K60
$$ -9 46 -15 118 279 133 -29 -48 55 230 11 -59 144 54 -19 -31 -75 -60 -160 42 139 -39 -98 -76 -171 89
5500H9j16J76j55N0m5J49k73K66k03J34l5M1m7k2m4J60j78j63J08M9K05%j60o6
$$ 89 -27 149 -6 44 -1 148 -125 141 -62 72 37 78 31 9 -35 125 -53 -216 -108 -59 146 146 -14 -80
5524h0J24j32K3J33N3n3k1P3n6Oo9j15O9l0j40L75p7P1k45L5L4N6j21r0JQ7N8
$$ -80 44 -88 -65 68 121 68 47 120 64 70 1 -114 -45 -75 -215 160 83 154 -91 -56 -22 34 -87 -177 -176 -89 -31
5551c1Mk5J68j92J43nn6k9pP3j79M25l26morJ80j70o7m2J05O8K8j58p9K12K4p
$$ -31 -27 -52 116 -76 67 62 6 -23 -30 43 -136 289 -37 -41 -47 -56 124 -46 -113 -155 -50 18 46 -112 -191 21 45 38
5579C8j4Mj09J62l5p7K9J86j21l8m7M3j53K09j71l2L7K01K8k35N9J01o8j0j62
$$ 38 24 28 -81 81 46 -31 -2 184 63 25 -22 21 -132 77 -94 -126 -89 112 140 -95 -36 65 -3 -13 -175
5604a75O5K4J79j27K07k34K17l04P7O0j7M6n4O5N1o8j5kp1l3j3N3K9L3o3J37j22
$$ -175 -110 -86 93 -34 173 -61 156 -148 -71 -11 -28 18 -36 29 80 12 -3 -5 -76 -109 -122 -69 -40 -7 -70 67 -55
5631e5O0j13k4K25r4L7j28N4j01K46j25J27j19L3q7J45N9J10k23j2J09k56J05
$$ -55 5 -108 -132 93 -1 36 -92 -38 -139 107 -18 109 -10 23 -64 81 140 250 27 15 124 -132 -27
5654b7J25k07K6rM6r2jJ76K0k29J56O9q9j92O3Q3kL2K6J38j54Q6q5J28R8j24j35
$$ -27 98 -109 -83 -92 -46 -138 -139 37 57 -172 -16 53 -36 -228 -165 -82 -84 -52 -26 112 -42 44 -41 87 185 61 -74
5681g4J8K57j71j31J34l5q1J22k7r2o3rK83o6j55J74j29p4J87o2q7R3l0j8l0k1
$$ -74 -56 201 30 -101 33 -2 -83 39 12 -80 -143 -152 131 65 -90 84 -45 -119 68 6 -81 12 -18 -36 -66 -87
5707h7O9j93L39k41K06k77J83q3R2j23M9MJ91r5K9M6k24K07j11J7j08Q3j03J34
$$ -87 -18 -211 128 -113 93 -184 -1 -84 8 -115 -66 -62 129 34 63 109 -115 92 -19 -2 -110 -27 -130 4
5731DQ1k25K20L0j16J6J00po4j06J29p4J5R8q4n5m4J02J53J9j33L1j69M9M0Kj9
$$ 4 85 -140 80 110 -6 10 110 103 39 -67 62 -12 3 101 17 -38 -82 20 173 192 59 90 -79 -30 10 12 -7
5758gn1k4J11j3q0J42nk15K7N9J70p3pJ85k40P0N0O5r3j00Q0j73K03j73N8K11
$$ -7 -58 -82 29 16 -64 78 73 -142 -115 -56 114 41 34 219 -21 49 99 164 71 -29 51 -122 81 -92 -34 177
$$ [...]
8191B6
##END NTUPLES=NMR FID
##END=
