##TITLE=1H ikalashn
L-L
19.12.2024
##JCAMPDX= 6.0         $$ Bruker NMR JCAMP-DX V2.0
##DATA TYPE= NMR FID
##DATA CLASS= NTUPLES
##ORIGIN= UXNMR, Bruker Analytische Messtechnik GmbH
##OWNER= root
$$ TOPSPIN		Version 1.3
$$ 2024-12-19 14:47:43.875 +0400  Irina@DPX200
$$ Compression mode = diff/dup
##.OBSERVE FREQUENCY= 200.131300845
##.OBSERVE NUCLEUS= ^1H
##.DELAY= (6, 6)
##.ACQUISITION MODE= SIMULTANEOUS
##.ACQUISITION SCHEME= undefined
##.AVERAGES= 32
##.DIGITISER RES= 18
##SPECTROMETER/DATA SYSTEM= spect
##.PULSE SEQUENCE= zg
##.SOLVENT NAME= CDCl3
##.SHIFT REFERENCE= INTERNAL, CDCl3, 1, 17.49637
##AUDIT TRAIL= $$ (NUMBER, WHEN, WHO, WHERE, WHAT)
$$ ##TITLE= Audit trail, TOPSPIN		Version 1.3
$$ ##JCAMPDX= 5.01
$$ ##ORIGIN= Bruker BioSpin GmbH
$$ ##OWNER= Irina
$$ $$ F:/spectra/data/iren/nmr/1H/4/audita.txt
$$ ##AUDIT TRAIL=  $$ (NUMBER, WHEN, WHO, WHERE, VERSION, WHAT)
(   1,<2024-12-19 14:47:25.687 +0400>,<Irina>,<DPX200>,<TOPSPIN 1.3>,
      <created by zg
	started at 2024-12-19 14:45:17.781 +0400,
	POWCHK disabled, PULCHK disabled
       configuration hash MD5:
       BE 6D 3F 07 2A EA 11 49 91 17 2B D3 AF B3 58 0D
       data hash MD5: 16K
       73 90 98 7C 04 13 10 0E AF 68 63 4A 33 76 C3 BC>)
$$ ##END=
$$ 
$$ $$ hash MD5
$$ $$ 17 6D 17 FA F7 4D EA FD 27 F5 98 7B 69 BC 83 ED
##$RELAX= 
##$RELAX= 
##$RELAX= 
##$RELAX= 
##$RELAX= 
##$RELAX= 
##$RELAX= 
##$RELAX= 
##$RELAX= 
$$ Bruker specific parameters
$$ --------------------------
##$DU= <F:/spectra>
##$EXPNO= 4
##$NAME= <1H>
##$PROCNO= 1
##$TYPE= <nmr>
##$USER= <iren>
##$AMP= (0..31)
100 100 100 100 100 100 100 100 100 100 100 100 100 100 100 100 100 100 
100 100 100 100 100 100 100 100 100 100 100 100 100 100 
##$ANAVPT= -1
##$AQSEQ= 0
##$AQ_mod= 1
##$AUNM= <au_zg>
##$AUTOPOS= <>
##$BF1= 200.13
##$BF2= 200.13
##$BF3= 200.13
##$BF4= 200.13
##$BF5= 200.13
##$BF6= 200.13
##$BF7= 200.13
##$BF8= 200.13
##$BYTORDA= 1
##$CFDGTYP= 0
##$CFRGTYP= 5
##$CHEMSTR= <none>
##$CNST= (0..63)
1 1 145 1 1 1 1 1 1 1 1 1 1 1 1 1 1 1 1 1 1 1 1 1 1 1 1 1 1 1 1 1 1 1 
1 1 1 1 1 1 1 1 1 1 1 1 1 1 1 1 1 1 1 1 1 1 1 1 1 1 1 1 1 1 
##$CPDPRG= <>
##$CPDPRG1= <>
##$CPDPRG2= <>
##$CPDPRG3= <>
##$CPDPRG4= <mlev>
##$CPDPRG5= <mlev>
##$CPDPRG6= <mlev>
##$CPDPRG7= <mlev>
##$CPDPRG8= <mlev>
##$CPDPRGB= <>
##$CPDPRGT= <>
##$D= (0..63)
0 2 0 0 0 0 0 0 0 0.06 0 0.03 0 0 0 0 0.0002 0 0 0 0 0 0 0 0 0 0 0 0 0 
0 0 0 0 0 0 0 0 0 0 0 0 0 0 0 0 0 0 0 0 0 0 0 0 0 0 0 0 0 0 0 0 0 0 
##$DATE= 1734605245
##$DBL= (0..7)
120 120 120 120 120 120 120 120 
##$DBP= (0..7)
150 150 150 150 150 150 150 150 
##$DBP07= 0
##$DBPNAM0= <>
##$DBPNAM1= <>
##$DBPNAM2= <>
##$DBPNAM3= <>
##$DBPNAM4= <>
##$DBPNAM5= <>
##$DBPNAM6= <>
##$DBPNAM7= <>
##$DBPOAL= (0..7)
0.5 0.5 0.5 0.5 0.5 0.5 0.5 0.5 
##$DBPOFFS= (0..7)
0 0 0 0 0 0 0 0 
##$DE= 6
##$DECBNUC= <off>
##$DECIM= 32
##$DECNUC= <off>
##$DECSTAT= 4
##$DIGMOD= 1
##$DIGTYP= 9
##$DL= (0..7)
0 120 120 120 120 120 120 120 
##$DP= (0..7)
150 150 150 150 150 150 150 150 
##$DP07= 0
##$DPNAME0= <>
$$ [...]
##$SW= 21.9926040160658
##$SWIBOX= (0..15)
0 0 2 0 0 0 0 0 0 0 0 0 0 0 0 0 
##$SW_h= 4401.40845070422
##$TD= 16384
##$TD0= 1
##$TE= 300
##$TE2= 300
##$TE3= 300
##$TEG= 300
##$TL= (0..7)
0 120 120 120 120 120 120 120 
##$TP= (0..7)
150 150 150 150 150 150 150 150 
##$TP07= 0
##$TPNAME0= <>
##$TPNAME1= <>
##$TPNAME2= <>
##$TPNAME3= <>
##$TPNAME4= <>
##$TPNAME5= <>
##$TPNAME6= <>
##$TPNAME7= <>
##$TPOAL= (0..7)
0.5 0.5 0.5 0.5 0.5 0.5 0.5 0.5 
##$TPOFFS= (0..7)
0 0 0 0 0 0 0 0 
##$TUNHIN= 0
##$TUNHOUT= 0
##$TUNXOUT= 0
##$USERA1= <user>
##$USERA2= <user>
##$USERA3= <user>
##$USERA4= <user>
##$USERA5= <user>
##$V9= 5
##$VALIST= <valist>
##$VCLIST= <CCCCCCCCCCCCCCC>
##$VD= 0
##$VDLIST= <DDDDDDDDDDDDDDD>
##$VPLIST= <PPPPPPPPPPPPPPP>
##$VTLIST= <TTTTTTTTTTTTTTT>
##$WBST= 1024
##$WBSW= 25
##$XGAIN= (0..3)
0 0 0 0 
##$XL= 0
##$YL= 0
##$YMAX_a= 1412174
##$YMIN_a= -1094895
##$ZGOPTNS= <>
##$ZL1= 120
##$ZL2= 120
##$ZL3= 120
##$ZL4= 120
##$ABSF1= 10
##$ABSF2= 0
##$ABSG= 5
##$ABSL= 3
##$ALPHA= 0
##$AQORDER= 0
##$ASSFAC= 0
##$ASSFACI= 0
##$ASSFACX= 0
##$ASSWID= 0
##$AUNMP= <proc_1d>
##$AXLEFT= 0
##$AXRIGHT= 0
##$AXTYPE= 0
##$AXUNIT= <>
##$AZFE= 0.1
##$AZFW= 0.1
##$BCFW= 1
##$BC_mod= 2
##$BYTORDP= 1
##$COROFFS= 0
##$CY= 7568.61572265625
##$DATMOD= 1
##$DC= 2
##$DFILT= <>
##$DTYPP= 0
##$F1P= 17.9538593292236
##$F2P= -4.03888763876832
##$FCOR= 0.5
##$FTSIZE= 32768
##$FT_mod= 4
##$GAMMA= 1
##$GB= 1
##$INTBC= 1
##$INTSCL= 1
##$ISEN= 128
##$LB= 0.05
##$LEV0= 0
##$LPBIN= 0
##$MAXI= 945.577
##$MC2= 0
##$MEAN= 0
##$ME_mod= 0
##$MI= -402.1523
##$NCOEF= 0
##$NC_proc= 0
##$NLEV= 6
##$NOISF1= 8.587773
##$NOISF2= 6.764455
##$NSP= 1
##$NTH_PI= 0
##$NZP= 0
##$OFFSET= 17.49637
##$PC= 1
##$PHC0= 100.6369
##$PHC1= -3.423328
##$PH_mod= 0
##$PKNL= yes
##$PPARMOD= 0
##$PPDIAG= 0
##$PPIPTYP= 0
##$PPMPNUM= 100
##$PPRESOL= 1
##$PSCAL= 0
##$PSIGN= 0
##$REVERSE= no
##$SF= 200.13
##$SI= 32768
##$SIGF1= 18.5376
##$SIGF2= -6.396296
##$SINO= 400
##$SIOLD= 32768
##$SREGLST= <1H.CDCl3>
##$SSB= 3
##$STSI= 0
##$STSR= 0
##$SW_p= 4401.40845070422
##$SYMM= 0
##$S_DEV= 0
##$TDeff= 0
##$TDoff= 0
##$TI= <>
##$TILT= no
##$TM1= 0
##$TM2= 0
##$TOPLEV= 0
##$USERP1= <user>
##$USERP2= <user>
##$USERP3= <user>
##$USERP4= <user>
##$USERP5= <user>
##$WDW= 1
##$XDIM= 8192
##$YMAX_p= 0
##$YMIN_p= 0
$$ End of Bruker specific parameters
$$ ---------------------------------
##NTUPLES= NMR FID
##VAR_NAME=  TIME,          FID/REAL,        FID/IMAG
##SYMBOL=    X,             R,               I
##VAR_TYPE=  INDEPENDENT,   DEPENDENT,       DEPENDENT
##VAR_FORM=  AFFN,          ASDF,            ASDF
##VAR_DIM=   8192,          8192,            8192
##UNITS=     SECONDS,       ARBITRARY UNITS, ARBITRARY UNITS
##FACTOR=    0.0002272,     1,               1
##FIRST=     0,             0,               0
##LAST=      1.8609952,     -43,             307
##MIN=       0,             -1094895,        -1094895
##MAX=       1.8609952,     1412174,         1412174
$$ Real data points
##PAGE= N=1
##DATA TABLE= (X++(R..R)), XYDATA
$$ [...]
$$ plain form
2937 -3183 -3719 5374 819 -5734 1821 4609 -4107 -2147 5626 -674 -5159 3488 3746 -4759 -776
2952 -776 5230 -2332 -4613 4244 2076 -5842 218 5218 -3012 -3305 5048 600 -5492 1962 4355
2967 4355 -4541 -2291 5636 -354 -4859 3110 3412 -4558 -215 5284 -2314 -4686 4233 2333 -5263
2982 -5263 236 4362 -3029 -2718 5017 472 -5436 1846 4098 -4277 -2107 4865 -559 -4530 3076
2997 3076 3053 -4473 -252 5442 -1689 -4086 3614 1866 -4798 669 4261 -3461 -3100 4781 1004 -4940
3013 -4940 1491 3557 -3884 -1782 4644 -837 -4502 2880 2945 -4306 -814 4718 -1377 -3513 3609
3028 3609 1769 -4433 883 4516 -2821 -3340 3939 939 -4343 1494 3267 -3501 -1765 4652 -485
3043 -485 -4408 2243 2722 -3964 -1082 4108 -1442 -3362 3572 1815 -4152 377 4251 -2099 -2830 3347
$$ packed form
2937c183n36R093m555o553P555K788q716J960P773o300m485Q647K58q505L983
2952g76O006p562k281Q857k168p918O060N000q230k93Q353m448o092P454K393
2967D355q896K250P927n990m505P969L02p970M343N499p598k372Q919j900p596
2982e263N499M126p391L11P735m545n908P282K252q375K170O972n424l971P606
2997C076k3p526M221N694p131k397P700j748o664N467L592p722L61P881l777n944
3013d940O431K066p441K102O426n481l665P382O5p251L492N532o095k136P122
3028C609j840o202N316L633p337n19P279l000n282N837J773o768J736O417n137
3043d85l923O651M79o686K882N190n550j920O934j757n967M529L874o350p31O177
$$ plain form
3059 3347 638 -4251 1191 3590 -3214 -2242 3978 152 -3762 1983 2574 -3740 -1275 3956 -1257
3074 -1257 -3745 2655 2291 -3648 118 4012 -1638 -2572 3576 1114 -4424 682 3732 -2322 -2441 3542
3090 3542 228 -3503 1946 2632 -3625 -1638 4155 -553 -3767 2154 2448 -3518 -454 3992 -1667
3105 -1667 -2806 3274 1681 -3794 196 3635 -2329 -2354 3301 214 -3863 1457 3401 -3193 -1673
3120 -1673 3838 -331 -3998 1831 2337 -3505 -876 3644 -1055 -2871 2851 1446 -3685 599 4136
3135 4136 -2158 -2813 3608 1298 -4007 656 3292 -2505 -1498 3839 -389 -3656 2237 2861 -3895
3150 -3895 -1510 3524 -1218 -3385 2933 1855 -3935 330 4168 -1949 -3155 3223 1490 -3604 776
3165 776 3207 -2882 -1560 4187 -197 -4193 2362 3360 -3466 -1605 3891 -768 -3674 2343 1803 -3801
$$ packed form
3059C347k709m889N442K399o804R72O220l826l914N745N91o314K465N231n213
3074a257k488O400l64n939L766L894n650r34O148k462n538N106L050o054j19N983
3090C542l314l731N449O86o257J987N793m708l214N921K94n966L064M446n659
3105a667j139O080j593n475L990L439n964k5N655l087m077N320J944o594J520
3120a673N511m169l667N829N06n842K629M520m699j816N722j405n131M284L537
3135D136o294o55O421k310n305M663K636n797J007N337m228l267N893O24o756
3150c895K385N034m742k167O318j078n790M265L838o117j206O378j733n094M380
3165G76K431o089J322N747m384l996O555R98o826J861N496m659k906O017n40n604
$$ plain form
3181 -3801 -22 3973 -2156 -2746 3815 1256 -4119 842 3517 -3030 -2305 4266 245 -4164 1995
3196 1995 3249 -3364 -1363 4231 -851 -3711 2438 2005 -4047 -28 3891 -2557 -3218 3882 1356
3211 1356 -4646 685 4291 -2118 -2143 3569 -112 -3901 2099 2833 -3822 -1119 4841 -698 -3667 2588
3227 2588 2119 -3859 -255 3808 -2333 -3221 3634 1435 -4247 799 3873 -2304 -2016 3558 -162 -3894
3243 -3894 2332 2858 -3834 -1182 4555 -754 -3692 2827 2522 -3573 -147 3582 -2234 -2952 3343 812
3259 812 -4379 930 3774 -2719 -2099 3601 167 -3842 1875 2401 -3519 -781 4011 -1053 -3524 2917
3275 2917 2333 -3564 -245 3507 -1810 -2352 3456 826 -4176 1086 3675 -2561 -2224 3619 48 -3304
3291 -3304 1894 2400 -3376 -722 4074 -1168 -3659 2583 2237 -3187 0 3416 -1578 -2030 3232 692
$$ packed form
3181c801L779L995o129n90O561k559n375M961K675o547P25O571m021m409O159
3196A995J254o613K001N594n082k860O149m33o052M019L919o448o61P100k526
3211A356o002N331L606o409k5N712l681l789O000P34o655K703N960n539k969O255
3227B588m69n978L604M063o141q88O855k199n682N046L074o177K88N574l720l732
3243c894O226N26o692K652N737n309k938O519l05o095L426L729n816p18O295k531
3259H12n191N309K844o493O20N700l434m009N717N26n920K738M792n064k471O441
3275B917n84n897L319L752n317n42N808k630n002N262K589o236L37N843l571l352
3291c304N198N06n776K654M796n242k491O242l46n424L187L416m994m52N262k540
$$ plain form
3307 692 -3741 1044 3360 -2524 -2259 3299 307 -3451 1698 2455 -2921 -875 3353 -987 -3346 2211
3323 2211 1795 -3275 -135 3333 -1156 -2198 2999 802 -3374 868 3232 -2478 -2209 3145 577
3338 577 -3247 1157 2337 -2456 -841 2976 -1035 -3050 2395 1942 -3038 -703 3250 -915 -2341
3353 -2341 2245 949 -2702 734 2954 -2103 -1943 2907 645 -3378 889 2321 -2224 -1206 3028
3368 3028 -633 -2825 1976 2034 -2888 -748 2961 -999 -2512 1966 1213 -2676 544 2831 -1621 -1966
3384 -1966 3052 858 -3270 644 2724 -1882 -1412 2553 -316 -2491 1816 1984 -2919 -743 3148
3399 3148 -788 -3000 1766 1457 -2601 -13 2712 -1504 -1682 3127 927 -3132 620 2777 -1674
3414 -1674 -1618 2547 -60 -2692 1399 2160 -2595 -889 3179 -624 -3057 1768 1932 -2666 -243 2511
$$ packed form
3307F92m433M785K316n884K65N558k992l758N149P57n376K046M228m340k359N557
3323B211m16n070L140L468m489j042N197k197m176M242K364n710K69N354k568
3338E77l824M404J180m793J615L817m011k015N445m53m980K335L953m165j426
3353b341M586j296l651L436K220n057J60M850k262m023M267J432m545J018M234
3368C028l661k192M801N8m922K140L709l960j513M478p53l889L220K287m452l45
3384a966N018k194m128L914K080m606M70L965k869k175M307J68m903K176L891
3399C148l936k212M766l09m058K588K725m216j78M809k200m059L752K157m451
3414a674N6M165k607k632M091P61m755J706M068l803k433M825J64m598K423K754
$$ plain form
3430 2511 -1429 -2156 2652 1005 -3102 582 2919 -1775 -1946 2878 398 -2813 1063 2384 -2608
3445 -2608 -921 3135 -687 -2987 1841 2101 -2930 -653 2961 -1196 -2230 2489 958 -3075 566
3460 566 3103 -2066 -2223 3014 780 -2830 1025 2109 -2334 -945 3407 -677 -3132 1923 2273 -2882
3476 -2882 -790 2856 -946 -2720 2286 935 -3334 601 3171 -2153 -2176 2954 793 -2914 1131
3491 1131 2403 -2579 -1148 3457 -546 -3260 2018 2184 -2986 -532 3325 -1086 -2483 2372 1030
3506 1030 -3239 439 3006 -2278 -2134 3168 494 -3215 1008 2759 -2450 -1245 3248 -528 -2911
3521 -2911 2187 1791 -3297 -418 3529 -1035 -2470 2385 1168 -3088 570 2882 -2354 -2096 3203
3536 3203 412 -3231 1129 2646 -2198 -1082 3094 -757 -2618 2398 1997 -3203 -319 3135 -917
$$ packed form
3430B511l940p27M808j647m107L684K337m694j71M824k480l211L876J321m992
3445b608J687M056l822k300M828K60n031K277L614m157j034M719j531m033L641
3460E66K537n169j57N237k234l610L855J084m443J389M352m084k455N055L50n155
3476b882K092L646l802j774N006j351m269L935K570n324k3N130k161l707M045
3491A131J272m982J431M605m003k714N278J66n170K454L857m411j397M855j342
3506A030m269L678K567n284J44N302k674l709M223J751n209J205M493l776k383
3521b911N098l96n088K879L947m564j435M855j217m256L658K312n236K58N299
3536C203k791l643M360J517m844J116M176l851j861N016m01n200K884L454m052
$$ plain form
3551 -917 -2378 2396 1073 -2920 561 2814 -2172 -1919 3069 236 -3054 1362 2451 -2283 -1130
3566 -1130 2856 -581 -2662 2153 1632 -2928 -161 2957 -1285 -2217 2519 1212 -2765 349 2705
3581 2705 -1836 -1508 2946 223 -2972 1158 2373 -2319 -1349 2852 -348 -2510 1939 1387 -2625 8
3597 8 3030 -1231 -2438 2346 1350 -2608 292 2378 -1564 -1258 2816 193 -2827 1018 2284 -2222
3613 -2222 -1067 2494 -422 -2487 1709 1539 -2514 -256 2780 -1016 -2070 1966 1126 -2439 540
3628 540 2216 -1541 -1350 2432 340 -2540 987 2117 -2024 -1067 2594 -43 -2463 1328 1810 -2085
3644 -2085 -407 2361 -717 -1943 1867 979 -2589 335 2586 -951 -1599 2193 492 -2186 666
3659 666 2254 -2029 -1318 2511 189 -2120 1001 1551 -2063 -603 2104 -780 -2155 1788 1216 -2319
$$ packed form
3551i17j461M774j323l993L481K253m986K53M988k833l290M416J089m734J153
3566a130L986l437k081M815n21m560K767L118m242r32M736j307l977L114K356
3581B705m541L28M454k723l195M130J215m692R70M201l200k162M449n52m012K633
3597HL022m261j207M784r96l958K900K086l942L06M074k623l020L845J266m506
3613b222J155L561k916k065M196j70m053K258L036l796j054M036q40l565K979
3628E40J676l757J91L782k092k880L527J130m141R57L661k637k420L791M82l895
3644b085J678K768l078j226L810q88l568K924K251l537o48L792j701k678K852
3659F66J588m283P11L829k322k309L121N50l614J460K707k884j375L943n72l535
$$ plain form
3675 -2319 -313 2367 -1144 -1728 1947 522 -2625 683 2284 -1534 -1182 2294 210 -2157 986
3690 986 1803 -1946 -978 2237 -297 -2096 1270 1361 -2075 -123 2340 -1000 -1959 1870 686 -2397
3706 -2397 44 2264 -1274 -1482 2200 285 -2028 957 1829 -1831 -893 2308 -217 -2081 1436 1416
3722 1416 -2123 -162 2324 -805 -2321 1646 977 -2217 102 2082 -1379 -1379 2393 375 -2390 786
3738 786 2112 -1777 -1062 2407 -77 -2187 1399 1700 -2259 -753 2231 -649 -1978 1815 1014 -2509
3754 -2509 380 2510 -1508 -1806 2153 627 -2577 432 2032 -1726 -1080 2385 -98 -2413 1401
3769 1401 1749 -2175 -600 2317 -785 -1951 1872 1217 -2615 -18 2585 -1047 -1910 2096 600 -2560
3785 -2560 717 1851 -1833 -1114 2651 -130 -2381 1408 1721 -2327 -555 2474 -575 -2096 1867
$$ packed form
3675b319K006K680l511n84L675j425l147L308J601l818L52L476k084k367L143
3690I86Q17l749R68L215k534j799L366R1l436J952K463l340r59L829j184l083
3706b397K441K220l538k08L682j915k313K985Q72l660R38L201k525j864L517k0
3722A416l539J961K486l129j516L967o69l194K319J980l461%L772k018k765L176
3738G86J326l889P15L469k484k110L586L01l959J506K984k880j329L793q01l523
3754b509K889K130m018k98L959j526l204L009J600l758O46L465k483k315L814
3769A401L48l924J575K917l102j166L823o55l832K597K603l632q63M006j496l160
3785b560L277J134l684P19L765k781k251L789L13m048J772L029l049j521L963
$$ plain form
3800 1867 1336 -2547 215 2267 -1327 -1528 2242 208 -2460 1042 2149 -2012 -1183 2370 -96 -2340
3816 -2340 1354 1524 -2123 -529 2425 -607 -2020 1658 866 -2125 286 2257 -1617 -1655 2472 479
3832 479 -2579 486 1872 -1607 -1013 2086 -143 -2244 1583 1565 -2148 -529 2304 -767 -1766 1888
3848 1888 1160 -2211 333 2240 -1450 -1611 2163 687 -2020 761 1635 -1630 -970 2064 -377 -2174
3864 -2174 1194 1352 -2061 -458 2211 -708 -2016 1715 1069 -2172 94 1953 -1154 -1097 1998 358
3880 358 -2200 897 1903 -1528 -1036 1950 -140 -1935 1238 1122 -1607 -386 2212 -608 -1746 1287
3896 1287 910 -1893 193 1662 -1160 -1288 1712 406 -2084 749 1905 -1183 -948 1807 -287 -1913
3912 -1913 990 1153 -1723 -431 1927 -682 -1653 1139 881 -1678 150 1547 -1041 -1237 1723 599
$$ packed form
3800A867n31l883K762K052l594k01L770k034k668L502J107m161Q29L553k466k244
3816b340L694J70l647J594K954l032j413L678p92k991K411J971l874l8M127j993
3832D79l058L065J386l479N94L099k229k101L827j8l713J619K833l071r99L654
3848A888p28l371K544J907l690j61L774j476k707K781Q74l265O60L034k441j797
3864b174L368J58l413J603K669k919j308L731o46l241K266J859l107N7L095j640
3880C58k558L097J006l431M92K986k090j795L173j16k729J221K598k820j138L033
3896A287l77k803K086J469k822j28L000j306k490K833J156l088K35K755k094j626
3912a913K903J63k876J292K358k609r71K792k58k559J828J397k588j96K960j124
$$ plain form
3928 599 -1918 448 1682 -1017 -968 1736 198 -1441 753 1340 -1638 -552 1657 -464 -1574 1133
3944 1133 1044 -1567 -120 1539 -800 -1308 1163 640 -1739 247 1640 -940 -1051 1611 488 -1508
3960 -1508 539 1510 -1013 -591 1453 -363 -1454 1065 1131 -1653 -422 1608 -458 -1406 1065 616
3976 616 -1758 129 1642 -934 -1151 1408 504 -1442 494 1429 -1081 -661 1584 -12 -1591 882
3992 882 1191 -1255 -642 1556 -67 -1346 936 735 -1527 -215 1484 -752 -1318 1419 552 -1784
4008 -1784 147 1450 -902 -930 1407 104 -1626 661 1375 -1222 -760 1523 -205 -1558 1005 1030
4024 1030 -1530 -125 1755 -640 -1385 1298 730 -1993 -13 1760 -934 -997 1510 261 -1836 725
4040 725 1510 -1461 -701 1815 -1 -1704 875 1233 -1509 -373 1615 -620 -1343 1385 640 -1953
$$ packed form
3928E99k517K366J234k699M9K704j538j639K194N87k978J086K209k121j110K707
3944A133q9k611J447J659k339n08K471n23k379J986J393k580j11K662j123j996
3960a508K047R71k523M22K044j816j091K519O6k784J231K030k066r48K471m49
3976F16k374J887J513k576k17K559r04j946J936R35k510M20K245j596j579K473
3992H82L09k446O13K198j623j279K282k01k262J312J699k236n66K737q67k336
4008a784J931J303k352k8K337j303j730K287P14k597M62K283j728j353K563K5
4024A030k560J405J880k395p45K683n68k723J980J773k694o3K507j249k097K561
4040G25P85k971P60K516j816j703K579L58k742J136J988k235p23K728p45k593
$$ plain form
4056 -1953 60 1703 -874 -1168 1380 399 -1689 606 1612 -1172 -681 1942 -224 -1800 1068 1295
4072 1295 -1557 -186 1493 -601 -1529 1301 840 -1873 47 1692 -1312 -1206 1725 327 -1858 530
4088 530 1287 -1339 -721 1859 -147 -1859 1029 1260 -1504 -270 1750 -646 -1571 1335 643 -1643
4104 -1643 225 1953 -1200 -1267 1343 333 -1812 539 1452 -1522 -660 1636 -331 -1749 987 1051
4120 1051 -1685 -335 1823 -551 -1323 1262 702 -1745 384 1791 -1229 -1148 1629 243 -1677 600
4136 600 1296 -1349 -647 1684 -268 -1630 1166 951 -1669 -391 1798 -456 -1394 1233 644 -1544
4152 -1544 378 1570 -897 -1091 1443 343 -1622 631 1388 -1113 -551 1515 -323 -1363 895 1005
4168 1005 -1392 -274 1453 -397 -1339 1334 574 -1431 58 1456 -839 -892 1445 245 -1581 385
$$ packed form
4056a953K013J643k577k94K548r81k088K295J006k784M91K623k166j576K868K27
4072A295k852J371J679k094r28K830m61k713J920J645l004J06K931j398k185K388
4088E30P57k626O18K580k006j712K888K31k764J234K020k396r25K906o92k286
4104a643J868J728l153o7K610j010k145K351R13k974Q62K296j967j418K736O4
4120A051k736J350K158k374p72K585n60k447K129J407l020Q1K777j386j920K277
4136F00O96k645P02K331j952j362K796k15k620J278K189k254r38K627n89k188
4152a544J922J192k467j94K534j100j965K253P57k501N62K066j838j040K258J10
4168A005k397J118J727j850r42K673p60k005J489J398k295n3K337j200j826J966
$$ plain form
4184 385 1265 -1084 -492 1486 -180 -1296 710 792 -1347 -443 1328 -457 -1123 1056 460 -1466 175
4201 175 1478 -830 -900 1258 319 -1560 455 1199 -902 -568 1294 72 -1309 716 1087 -1224 -406
4218 -406 1197 -434 -1015 785 483 -1328 43 1345 -701 -1100 1195 292 -1339 212 1216 -864
4234 -864 -702 1173 44 -1035 608 1155 -1192 -441 1240 -362 -1142 822 641 -1231 -246 1363 -363
4251 -363 -963 1081 643 -1174 65 1286 -798 -741 1267 259 -1274 515 1036 -1046 -522 1081 -112
4268 -112 -1192 765 891 -1126 -330 1311 -581 -1009 837 536 -1395 101 1112 -689 -1052 1073
4284 1073 351 -1146 434 1018 -648 -688 1353 -57 -1349 641 1072 -1246 -394 1242 -396 -1226 748
4301 748 629 -1214 -146 1171 -631 -1057 1016 333 -1210 282 1400 -970 -813 1323 114 -1464
$$ packed form
4184C85Q80k349N92J978j666j116K006Q2k139R04J771j785o66K179n96j926J641
4201A75J303k308p0K158r39j879K015P44k101L34J862j222j381K025L71k311Q18
4218d06J603j631n81J800l02j811J371J302k046l99K295r03j631J551J004k080
4234h64J62J875j129j079J643N47k347P51J681j602p80J964j81j872R85J609j726
4251c63o00K044m38j817J239J221k084N7K008j008j533J789N21k082N24J603j193
4268a12j080J957J26k017P96J641j892m28J846l01j931J496J011j801l63K125
4284A073p22j497J580N84j666m0K041j410j292J990M31k318Q52J636j638q30J974
4301G48j19j843J068J317j802m26K073o83j543J492J118k370J57K136j209j578
$$ plain form
4317 -1464 577 1161 -881 -397 1319 -91 -1410 739 693 -1323 -186 1287 -461 -1047 1072 506
4333 506 -1434 224 1435 -672 -921 1167 105 -1123 545 1187 -1168 -451 1609 -310 -1260 919
4349 919 765 -1589 -117 1585 -738 -1279 1149 683 -1196 148 1313 -1032 -1117 1383 358 -1598
4365 -1598 801 1297 -1149 -404 1541 -287 -1200 1078 960 -1238 -151 1596 -534 -1180 1145 660
4381 660 -1389 231 1177 -952 -864 1488 161 -1520 490 1018 -1189 -498 1303 -301 -1237 1039 950
4398 950 -1526 -94 1604 -450 -1147 1087 540 -1518 132 1174 -1015 -788 1193 181 -1545 593
4414 593 1099 -1199 -510 1446 -232 -1408 858 982 -1122 -32 1412 -646 -890 1293 398 -1403
4430 -1403 294 1347 -810 -750 1198 -38 -1248 594 1047 -1209 -645 1292 17 -1264 962 802
$$ packed form
4317a464K041N84k042M84J716j410j319K149m6k016J137J473j748n86K119n66
4333E06j940J658J211k107k49K088j062j228J668O42k355P17K060j919r50K179
4349I19j54k354J472J702k323n41K428m66j879J344J165k345q5K500j025j956
4365a598K399M96k446P45J945j828r13K278j18k198J087J747k130o46K325m85
4381F60k049J620R46k129Q8K352j327j681K010N28k207O91J801j604r36K276q9
4398I50k476J432J698k054o97K234n47k058J650J042k189K27J981j012j726K138
4414E93N06k298O89J956j678j176K266J24k104J090J444k058k44K183q95j801
4430a403J697J053k157O0J948j236j210J842M53k256N64J937j275j281K226j60
$$ plain form
4446 802 -1229 -57 1126 -897 -1079 1083 573 -1547 341 1215 -843 -694 1321 30 -1193 493
4462 493 906 -985 -595 1244 -169 -1121 836 716 -1469 -190 1248 -535 -1138 980 646 -1223 285
4479 285 1100 -658 -610 1113 23 -1360 475 946 -1018 -493 1275 -265 -1140 751 893 -951 -341
4496 -341 1068 -380 -969 798 431 -1130 129 1232 -495 -695 915 432 -1114 332 991 -867
4512 -867 -685 1011 39 -1088 431 668 -854 -252 1121 -255 -852 771 622 -1082 -154 1238 -453
4529 -453 -808 902 443 -976 290 1015 -695 -710 976 61 -1005 408 746 -797 -523 1062 83
4546 83 -974 767 603 -1040 -368 1013 -423 -989 800 392 -1182 114 1077 -586 -756 923 456
4563 456 -1079 363 867 -783 -386 1071 108 -959 742 669 -1187 -354 1139 -262 -929 895 608
$$ packed form
4446H02k031J172J183k023j82K162n10k120J888Q74k058J49K015j291j223J686
4462D93M13j891L90J839j413r52J957j20k185J279J438j783o03K118l34j869J508
4479B85Q15j758M8J723j090j383J835M71j964N25J768j540q75J891J42j844O10
4496c41J409j448n89J767l67j561J259J103j727k00J610m83j546J446O59j858
4512h67J82J696r72j127J519K37j522O02J373j376n97J623j49j704R28J392j691
4529d53l55J710m59j419J266P25j710j5J686r15j066J413L38j543K74J585r79
4546H3j057J741j64j643O72J381j436n66J789m08j574J296R63j663j70J679m67
4563D56j535J442N04j650L97J457r63j067J701p3j856Q33J493j401o67J824k87
$$ plain form
4580 608 -938 -98 913 -552 -696 996 247 -1099 472 952 -771 -757 1143 151 -1157 413 876
4597 876 -1025 -331 1169 -293 -1153 825 732 -1266 3 1043 -638 -809 918 301 -1197 439 1114
4614 1114 -833 -677 1214 201 -1132 570 706 -1105 -452 1445 -103 -1133 802 900 -1323 -254
4630 -254 1115 -504 -956 1039 421 -1367 344 1226 -801 -1030 1358 243 -1282 497 856 -1046
4646 -1046 -427 1196 -230 -1217 834 707 -1329 -214 1186 -425 -1086 1094 355 -1232 68 1354
4662 1354 -762 -784 1294 68 -1413 385 1353 -1024 -528 1219 -313 -1139 1034 849 -1242 -161
4678 -161 1384 -478 -1063 1023 331 -1432 388 1231 -870 -718 1064 69 -1356 599 980 -894 -494
4695 -494 1231 -459 -1240 932 586 -1240 -201 1411 -500 -1156 1079 586 -1284 205 1021 -1072
$$ packed form
4580F08j546Q40J011j465j44J692p49j346J571M80j723J4J900r92j308J570M63
4597H76j901O94J500j462q60J978r3j998J269J040j681j71J727o17j498J636O75
4614A114j947J56J891j013j333J702J36j811O53J897j548j030J935R8k223J069
4630b54J369j619m52J995o18j788J711Q82k027k29K388j115j525J779L59j902
4646a046O19J623j426r87K051j27k036J115J400j611o61K180p39j587J300J286
4662A354k116k2K078j226j481J798R68k377M96J747j532q26K173j85k091J081
4678a61J545j862n85K086o92j763J820Q43k101J52J782r95j425J955L81j874M00
4695d94J725j690p81K172l46j826J039J612j911o56K235m93j870J489Q16k093
$$ plain form
4711 -1072 -725 1245 -18 -1482 427 860 -921 -229 1400 -294 -1080 982 640 -1273 6 1342
4727 1342 -559 -1114 1098 441 -1058 348 1058 -929 -939 1083 34 -1195 592 695 -1090 -519 1119
4744 1119 -164 -1068 730 565 -1045 9 1142 -571 -1059 973 351 -1235 111 949 -594 -581 993
4761 993 13 -1130 362 889 -1032 -531 1132 -141 -996 549 750 -1362 -14 1013 -474 -778 980
4778 980 502 -965 82 894 -502 -671 981 28 -955 298 822 -913 -502 830 16 -1105 673
4795 673 613 -987 -138 971 -349 -987 901 236 -947 -162 1000 -324 -533 803 105 -1041 234
4812 234 696 -744 -391 791 -192 -839 330 599 -946 -347 935 -123 -885 702 555 -1019 -25
4829 -25 880 -384 -700 888 246 -812 117 988 -394 -459 956 139 -977 353 570 -714 -500 933
$$ packed form
4711a072L47J970j263j464J909M33j781O92J629j694p86K062l42j913J279J336
4727A342j901n55K212o57j499J406P10j987j0K022j049j229J787J03j785N71J638
4744A119j283r04J798j65j610J054J133j713m88K032o22j586J346Q38j543J3J574
4761I93r80j143J492N27j921N01J663j273q55J545K01k112J348J027j487l04J758
4778I80m78j467J047Q12j396j69J652r53r83J253N24j735M11J332q14j121J778
4795F73o0j600Q49J109j320o38J888o65j183P85J162j324k09J336o98j146J275
4812B34M62j440L53J182r83o47J169K69j545N99J282j058p62J587j47j574R94
4829b5R05j264l16J588o42j058R29Q71j382o5J415q17j116J330K17j284K14J433
$$ plain form
4847 933 -82 -879 451 718 -912 -156 897 -396 -705 726 471 -974 78 842 -431 -622 1134
4864 1134 224 -987 208 789 -716 -490 905 -54 -936 572 775 -949 -285 970 -341 -873 724
4881 724 515 -899 59 1091 -457 -945 935 138 -1193 106 960 -678 -544 881 152 -784 699
4898 699 659 -1088 -207 1080 -166 -1164 541 607 -1049 -59 880 -478 -824 1020 465 -1152 397 910
4916 910 -747 -556 1321 35 -1039 517 834 -922 -455 1090 -204 -940 882 444 -1074 -106 1099
4933 1099 -494 -884 912 378 -1363 236 869 -759 -419 1197 87 -1062 603 641 -1091 -200 983
4950 983 -289 -1015 871 529 -1235 -114 1114 -565 -912 880 234 -1035 294 870 -852 -668 1042
4967 1042 54 -1127 623 763 -1004 -262 1162 -281 -1098 928 671 -1029 -16 1037 -445 -631
$$ packed form
4847I33j015p97J330K67j630P56J053j293l09J431k55j445J052P64j273j91J756
4864A134r10j211J195N81j505K26J395r59q82J508K03j724O64J255j311n32J597
4881G24k09j414R58J032j548m88J880p97j331J299Q54j638J34J425p29r36J483
4898F99m0j747Q81J287j246r98J705O6j656R90R39j358l46J844n55j617J549N13
4916I10j657J91J877j286j074J556L17j756M67J545j294p36J822m38j518R68J205
4933A099j593l90J796n34j741J599O33j628L40J616j110j149J665L8j732Q91J183
4950I83j272p26J886l42j764J121J228j679l47J792o46j269J329N76j722J84J710
4967A042r88j181J750J40j767P42J424j443q17K026k57j700J013J053j482j86
$$ plain form
4983 -631 845 405 -1159 255 846 -1028 -452 884 -35 -1065 676 770 -830 -411 1167 -113 -815
5000 -815 845 432 -1142 156 961 -614 -747 944 525 -893 168 895 -808 -538 979 -206 -1192
5017 -1192 469 766 -852 -55 1006 -314 -804 673 465 -957 46 947 -533 -755 878 197 -863
5034 -863 266 892 -533 -459 1038 -62 -886 470 608 -926 -306 841 -208 -721 485 483 -801 30
5052 30 841 -391 -776 638 319 -800 242 842 -611 -570 792 -12 -871 380 648 -749 -58 843
5070 843 -149 -727 512 323 -769 -40 917 -324 -380 695 288 -795 114 717 -471 -474 735 92 -638
5089 -638 566 649 -508 -239 899 10 -728 540 410 -689 -108 544 -199 -739 625 522 -754 27
5107 27 613 -563 -347 751 153 -945 369 865 -432 -341 673 -143 -784 511 339 -514 -183 711
$$ packed form
4983f31J476m40j564J414N91j874N76J336r19j030J741R4j600M19J578j280p02
5000h15J660m13j574J298Q05j575j33J691m19j418J061P27j703K70J517j185r86
5017a192J661K97j618P97J061j320m90J477k08j422J003R01j480k22J633o81j060
5034h63J129O26j425P4J497j100q24J356J38j534O20J147j049n13J206kj284Q31
5052C0Q11j232l85J414l19j119J042O00j453M1J362q04q59J251K68j397O91R01
5070H43r92n78J239j89j092P29R57j241n6J075m07j083R09O03j188lJ209o43p30
5089f38J204Q3j157K69J138q89p38J268j30j099N81O52p43n40J364j03j276P81
5107B7N86j176K16J098n98j098J314M96j297R1J014q16o41J295j72q53L31Q94
$$ plain form
5125 711 -134 -511 470 331 -699 -32 729 -464 -467 776 237 -834 141 754 -485 -378 751 -22 -528
5144 -528 268 534 -644 -204 744 -59 -767 393 513 -799 -314 700 -243 -706 645 181 -748 150
5162 150 585 -541 -388 816 103 -911 359 591 -659 -327 748 -119 -715 279 457 -754 -293 890
5180 890 -374 -629 487 255 -695 159 771 -289 -608 847 45 -642 341 655 -627 -347 971 -75
5198 -75 -765 674 467 -946 -122 825 -353 -721 671 213 -904 -59 830 -538 -603 760 22 -875
5216 -875 373 562 -919 -313 895 -121 -949 454 577 -889 -253 813 -326 -961 620 437 -901
5233 -901 16 924 -618 -658 845 217 -715 387 810 -680 -375 858 -36 -642 537 509 -819 -157
5251 -157 1016 -262 -767 634 343 -1139 212 808 -635 -613 723 137 -887 409 587 -774 -219
$$ packed form
5125G11q45l77R81j39j030O67P61j193lJ243n39j071R75O13j239J07J129p73n06
5144e28P96K66j178M40R48q03p08J160J20j312M85J014r43m63J351m64r29Q98
5162A50M35j126J53J204p13j014J270K32j250L32J075q67n96R94J78j211M61J183
5180H90j264k55J116k32r50Q54O12j060l19J455q02o87R83L14j282K80J318j046
5198g5o90J439k07j413Q24R47j178l68J392m58j117Q45Q89j368o5J363p38q97
5216h75J248J89j481O06J208j016q28J403J23j466O36J066j139o35J581j83j338
5233i01R17R08j542m0J503o28r32J102M23j490L05J233q94o06J179k8j328O62
5251a57J173j278n05J401k91j482J351N96j443K2J336n86j024J296J78j361N55
$$ plain form
5268 -219 1018 -180 -718 752 568 -765 -238 912 -307 -796 822 265 -872 336 878 -634 -497
5285 -497 794 49 -895 272 626 -592 -206 717 -30 -995 469 555 -767 33 931 -319 -687 881
5303 881 281 -825 316 817 -595 -598 687 -25 -939 251 621 -562 -201 709 -446 -847 632 389
5321 389 -683 51 901 -349 -488 608 289 -772 198 788 -556 -367 882 -36 -734 377 458 -656
5339 -656 -140 758 -316 -628 500 163 -790 -70 949 -205 -557 466 184 -739 252 599 -563 -331
5357 -331 754 -16 -686 322 493 -612 -254 637 -42 -490 490 393 -579 -128 691 -131 -602 338 -9
5376 -9 -733 70 504 -382 -343 644 190 -615 266 511 -489 -109 756 -163 -422 469 245 -499 -331 793
5396 793 -179 -854 267 303 -731 29 639 -416 -476 584 201 -666 187 654 -510 -236 742 27 -861
$$ packed form
5268b19J237j198n38J470j84j333N27J150j219m89J618n57j137J208N42j512J37
5285d97J291p45r44J167L54j218L86R23p47r65J464Q6j322Q00Q98j250l68J568
5303H81o00j106J141N01j412lJ285p12r14J190L70j183L61R10j155m01J479k43
5321C89j072P34Q50j250j39J096l19j061R70N90j344J89J249r18o98J111Q1j114
5339f56N16Q98j074l12J128l37r53P20J019j154l52J023k82r23R91L47j162K32
5357c31J085p70o70J008J71j105L58Q91o79m48R80r7r72M51Q19q22m71R40l47
5376ip24Q03M34q86L9R87m54q05Q81K45j000L80Q65r19k59Q91k24p44J68J124
5396G93r72o75J121L6j034P60O10j055o0J060l83q67Q53M67j164K74R78p15q88
$$ plain form
5415 -861 335 428 -613 -70 561 -157 -486 411 335 -636 -83 501 -246 -514 358 65 -639 153 663 -366
5435 -366 -313 473 224 -701 218 525 -448 -243 540 -105 -842 600 542 -576 -199 644 -324 -531 511 262
5455 262 -692 15 531 -477 -558 614 237 -572 309 541 -521 -271 774 -189 -694 405 403 -524 -196
5474 -196 707 15 -620 442 292 -930 89 679 -439 -304 1002 39 -740 291 712 -266 -302 816
5492 816 -82 -736 360 566 -611 -120 797 -299 -660 679 391 -793 -3 563 -549 -692 739 271
5510 271 -612 214 702 -434 -524 874 -99 -731 384 626 -910 -131 894 -230 -824 635 485 -772
5528 -772 56 722 -637 -479 721 -18 -862 325 731 -584 -349 949 -130 -899 393 497 -789
5545 -789 -52 950 -40 -578 654 521 -671 100 633 -399 -596 837 194 -955 165 706 -627
$$ packed form
5415h61J196R3j041N43O31p18l29Q97p6r71N53N84p47k68Q72k93p04P92N10j029
5435c66N3P86k49r25R19L07r73K05P83o45p37J442n8j118L77Q43r68k07J042k49
5455B62r54P07N16j008q1J172l77q09Q81K32j062K50J045r63n05J099kr27L28
5474a96R03o92o35J062j50j222J019N90j118J35J306r63p79J031M21r78l6J118
5492H16q98o54J096K06j177M91R17j096l61J339k88j184P90N66j112j43J431m68
5510B71q83Q26M88j136r0J398r73o32J115K42j536P79J025j124n94J459j50j257
5528g72Q28O66j359J58J200p39q44J187M06j315K35J298j079p69J292J04j286
5545g89P37J002r90n38J232j33j192P71N33j032j97J433o43j149J120N41j333
$$ plain form
5562 -627 -328 729 -48 -720 571 506 -761 -156 885 -373 -682 829 340 -940 81 879 -494
5579 -494 -461 875 208 -700 317 636 -642 -218 901 -40 -918 393 496 -725 -69 737 -319 -762
5597 -762 528 262 -806 119 704 -292 -496 704 160 -626 454 553 -444 -376 809 -282 -846 545
5615 545 482 -733 10 819 -352 -488 666 333 -586 104 566 -407 -477 585 8 -747 286 522 -459
5634 -459 -268 744 -111 -507 455 351 -639 -63 578 -470 -560 568 309 -590 61 585 -420 -493 701
5653 701 204 -552 330 581 -350 -272 797 117 -568 379 507 -436 30 542 -206 -487 423 279 -663 -41
5673 -41 652 -353 -390 502 52 -460 81 575 -348 -454 617 84 -664 282 348 -502 -142 491 -109 -720
5693 -720 172 451 -663 137 697 -290 -584 526 303 -679 221 698 -463 -577 523 51 -453 274 607
$$ packed form
5562f27K99J057p77o72J291o5j267O05J041j258l09J511m89j280J021P98j373
5579d94L3J336o67r08J017L19j278M24J119r41q78J311J03j221O56Q06j056m43
5597g62J290k66j068R25N85r96k04J200n44p86J080R9r97O8J185j091n64J391
5615E45o3j215P43Q09j171j36J154l33r19O90M62r73p0J062n77p55J033K36r81
5634d59J91J012q55l96R62j04r90N76O41j048r0J128k59q99O51N24j005p3J194
5653G01m97p56Q82K51r31P8J069o80o85R47J28r43M66N12p48k81R10j44r42O22
5673d1O93j005l7Q92m50n12N41M94r23j06J071n33p48R46O6q50L60O33o00o11
5693g20Q92K79j114Q00N60r87k94J110k23r82R00M77j161j14J100m72n04P27L33
$$ plain form
5712 607 -519 -232 679 -2 -674 281 445 -607 -267 770 -136 -587 459 275 -774 -167 520 -503
5730 -503 -398 643 -58 -645 103 778 -461 -454 686 -8 -607 364 587 -743 -52 579 -206 -781 503
5749 503 339 -583 -60 470 -427 -649 600 144 -635 191 879 -398 -494 637 -164 -636 326 649 -563
5768 -563 -181 691 -318 -422 633 492 -660 -85 723 -432 -670 512 192 -767 72 561 -429 -486 611
5787 611 27 -692 404 691 -454 -118 836 -235 -567 416 420 -780 51 678 -327 -506 689 91 -709
5806 -709 93 583 -749 -414 870 134 -687 358 653 -810 -409 663 -67 -751 677 500 -884 -33
5824 -33 808 -442 -524 941 281 -785 248 744 -667 -446 641 -32 -641 342 634 -878 -210 851
5842 851 -170 -859 536 279 -928 -163 787 -456 -647 869 378 -923 345 770 -418 -302 933
$$ packed form
5712F07j126K87R11o81o72R55J64j052L40J037r06m51J046j84j049O07O87j023
5730e03J05J041p01n87P48O75j239PJ140o94n99R71K23j330O91O31p85n75J284
5749E03j64r22N23N30q97k22J249m56p79Q26O88j277r6J131q01m72R62L23j212
5768e63L82Q72j009j04J055j41j152N75Q08j155k38J182l20r59Q39M89r90n7J097
5787F11n84p19J096K87j145L36R54j071l32R83Mj200Q31O27j005j79J195n98q00
5806g09Q02M90j332L35J284p36q21J045K95j463M01J072p30o84J428j77j384Q51
5824c3Q41j250q2J465o60j066J033M96j411K21J087o73o09R83K92j512O68J061
5842H51j021o89J395k57j207P65R50j243j91J516m91j301J268M25j188J16J235
$$ plain form
5859 933 -93 -730 389 513 -722 -2 974 -212 -794 503 356 -826 42 783 -438 -574 701
5876 701 121 -789 115 783 -626 -439 694 -100 -788 374 428 -771 -101 704 -300 -802 374 304 -692
5895 -692 33 686 -343 -538 615 187 -851 243 708 -497 -266 636 29 -808 397 497 -491 -57
5913 -57 898 -176 -534 603 287 -743 -59 715 -216 -341 546 55 -732 201 558 -556 -453 594 -91
5932 -91 -538 352 426 -608 -1 731 -112 -495 380 502 -411 -88 479 -247 -540 423 112 -647 178 526
5952 526 -375 -257 555 -55 -569 305 425 -479 -78 542 -196 -434 507 462 -489 -107 668 -235 -650 409
5972 409 303 -426 -86 364 -483 -289 422 -35 -581 65 488 -538 -281 419 -62 -481 256 591 -587
5991 -587 -44 631 -88 -666 438 182 -641 -41 674 -385 -284 654 257 -483 276 709 -318 -288 503
$$ packed form
5859I33j026o37J119J24j235P20R76j186n82J297j47j182Q68P41j221j36J275
5876G01n80r10R04O68j409J87J133p94o88J162N4j199O70Q05j004n02J176p0r96
5895f92P25O53j029j95J153m28j038J094M65j205K31R02o07q37J205J00r88M34
5913e7R55j074l58J137l16j030O84P74r31j25Q87m91p87R33L57j114J03J047o85
5932i1m47Q90P4j034O07P32q43l83Q75J22r13L23N67p26k93R63l11p59Q25L48
5952E26r01J18Q12o10n14Q74J20r04M01O20p38k38R41m5r51L82P75r03m15J059
5972D09j06p29L40M50q47J94P11m57n46O46M23j026K57P00m81m19P37L35j178
5991e87N43O75p19n78J104k56q23O00P15j059J01R38l97p40P59M33j027L0P91
$$ plain form
6010 503 208 -543 306 432 -431 -265 789 -34 -704 567 387 -741 -21 829 -244 -585 452 312
6028 312 -495 172 560 -595 -267 609 60 -681 297 309 -470 -218 692 -66 -724 419 419 -581 -29 818
6048 818 -412 -345 580 39 -695 165 698 -396 -382 572 65 -483 233 413 -451 -340 736 -37 -646 515
6068 515 412 -585 -53 766 -349 -472 529 262 -592 58 756 -441 -312 605 158 -715 312 466 -437
6087 -437 -243 514 -156 -852 548 551 -740 -140 688 -96 -500 499 128 -689 -12 959 -450 -314 615 -84
6107 -84 -576 341 756 -680 -399 620 -237 -657 530 446 -762 -54 680 -239 -630 404 209 -672 94
6126 94 665 -653 -405 547 86 -682 346 547 -719 -217 567 -371 -521 340 412 -703 -42 511 -461
6145 -461 -466 677 154 -699 288 505 -241 -387 698 118 -653 343 453 -560 -132 732 -322 -615 587
$$ packed form
6010E03k95p51Q49J26q63J66J054q23o70J271j80j128P20Q50j073l41J037j40
6028C12q07O67L88j155L28Q76n49p41R78J2p79K52R10p58o58J143%j000N52Q47
6048H18j230O7R25n41p34Q60N33j094J4R54n07n48P16J80q64J11J076p73o09J161
6068E15j03r97N32Q19j115j23J001k67q54O50O98j197J29R17m47q73J027J54r03
6087d37J94P57o70o96J400Lj291O00Q28p84m04R99l71q17O77R71j409J36R29o99
6107h4m92R17M15j436K81J019q57m20J187q4j208P08P34r19l91J034j95q81P66
6126I4N71j318K48R52m61p68J028K01j266N02P84r38j50Q61P2j115O61N53r72
6145d61nJ143n23q53R87K17p46j46J085n80p71R96J10j013M28Q64j054k93J202
$$ plain form
6164 587 103 -480 -106 630 -235 -518 728 279 -787 339 464 -324 -357 508 -44 -617 495 417 -491
6183 -491 37 770 -120 -609 495 37 -447 60 616 -363 -365 444 184 -623 296 471 -489 -197 538 178
6203 178 -469 237 503 -374 -80 616 -245 -345 348 383 -363 148 601 -261 -217 398 187 -727 -22 479 -519
6224 -519 -302 525 62 -545 167 348 -497 -156 550 -48 -494 420 346 -558 -72 668 -146 -398 240 90
6244 90 -436 -59 556 -487 -246 511 -132 -349 293 588 -520 -175 527 -46 -465 232 318 -361 -252 425
6264 425 -130 -460 458 218 -529 -116 539 -273 -505 395 -27 -468 175 439 -334 -192 552 85 -418 161
6284 161 319 -398 -143 392 -103 -469 219 226 -375 -66 474 -136 -375 307 76 -476 111 550 -436 -283 452
6305 452 91 -262 77 383 -424 -211 631 -22 -563 166 381 -438 -1 490 -198 -153 456 175 -472 40
$$ packed form
6164E87m84n83L74P36q65k83J246m49j066J126J25p88l3Q65n52n73J112p8r08
6183d91N28P33q90m89J104m58m84N07N56r79kQ09k60q07R19J75r60K92P35l60
6203A78o47P06K66q77K94O96q61j00O93L5p46N11M53q62M4O15k11r14P05N01r98
6224e19K17Q27m63o07P12J81q45L41P06n98m46R14p4r04M86P40q14k52O38j50
6244I0n26L77O15j043K41P57o43k17O42K95j108L45P02n73m19O97Q6o79J09O77
6264D25n55l30R18k40p47M13O55q12k32R00m22m41O43K64p73J42P44m67n03N79
6284A61J58p17K55N35m95l66O88Po01L09N40o10k39O82k31n52N87M39r86J53P35
6305D52l61l53L39L06q07K13Q42o53n41P29K15q19M37M91o88M5O09k81o47N12
$$ plain form
6325 40 394 -288 -431 446 109 -399 161 366 -468 -360 487 -74 -385 16 327 -532 -102 535 -316 -433
6345 -433 585 286 -582 -2 586 -255 -406 475 24 -572 138 554 -486 -377 493 -211 -727 199 408
6364 408 -670 5 524 -150 -405 504 247 -624 78 635 -232 -371 472 12 -638 79 433 -611 -241
6383 -241 392 -201 -609 343 294 -502 -106 379 -140 -387 376 189 -487 23 553 -377 -519 429 171 -491
6403 -491 312 410 -541 -370 518 -155 -537 176 261 -537 8 599 -233 -600 386 396 -611 59 591 -313 -299
6424 -299 558 31 -441 261 444 -330 -77 546 -24 -605 370 415 -700 -174 459 -241 -474 363 0 -526
6444 -526 179 403 -355 -329 548 76 -595 220 337 -467 -16 519 -111 -490 270 381 -433 21 356 -309
6464 -309 -276 525 146 -436 202 438 -327 -346 719 -19 -544 273 357 -447 -176 493 -24 -444 308 321 -545
$$ packed form
6325D0L54o82j43Q77l37n08N60K05q34J08Q47n61l11M01L11q59M30O37q51j17
6345d33J018k99q68N80N88q41j51Q81m51n96P10M16j040J09Q70p04n16R26K09
6364D08j078O75N19o74k55R09k57q71P02N57q67j39Q43m60o50P17L54j044L70
6383b41O33n93m08R52m9p96L96M85n19k47P63j87o76N10N30r30j42R48k58o62
6403d91Q03R8r51J71Q88o73l82P13Q5p98N45N91q32l67R86J0j007O70N32r04J4
6424b99Q57n27m72P02J83p74K53O23n70n81R75M5j115N26O33p00k33Q37l63n26
6444e26P05K24p58K6Q77m72o71Q15J17q04M51N35o30l79P60J11q14M54L35o65
6464c09L3Q01l79n82O38K36p65j9J065p38n25Q17Q4q04K71O69n17m20P52J3q66
$$ plain form
6485 -545 110 656 -149 -349 420 -19 -473 11 531 -350 -259 533 88 -515 192 331 -640 -289 360 65
6505 65 -383 293 240 -432 -108 541 -94 -293 428 266 -353 -27 482 -166 -299 385 14 -344 228 315 -437
6526 -437 -301 412 61 -374 295 370 -226 -26 378 -257 -233 281 182 -506 62 320 -221 -195 242 -15 -482
6547 -482 209 225 -370 -286 416 -24 -237 331 259 -481 -192 398 -185 -348 152 186 -255 96 208 -130 -254
6568 -254 352 198 -385 -32 363 -233 -218 375 -2 -423 310 446 -146 -217 238 -242 -175 278 251 -475 -258
6589 -258 522 -53 -453 243 278 -210 -21 487 -154 -195 357 -93 -368 28 327 -283 -52 261 41 -490 312
6610 312 391 -355 -176 454 -218 -203 381 193 -381 19 373 -264 -224 403 343 -455 107 580 -223 -94 388
6631 388 -118 -439 278 272 -587 -88 388 -171 -275 357 336 -471 19 390 -193 -413 415 36 -502 60 319
$$ packed form
6485e45O55N46q05k00P69m39m54M84N20q81R1P92m45o03P07J39r71L51O49k95
6505F5m48O76n3o72L24O49o35j99P21j62o19L26N09o48j33O84l71l58N72Q7p52
6526d37J36P13l51m35O69P5n96K00M04o35K4N14r9o88N68K58n41K6M37k57m67
6547d82O91J6n95Q4P02m40k13N68p2p40K89N90n83j63N00L4m41L51J12l38j24
6568b54O06j54n83L53L95n96J5N93l77m21P33J36n92p1M55m80O7M53k7p26K17
6589b58P80n75m00O96L5m88J89N08o41m1N52m50k75L96K99o10K31L13k20n31Q02
6610C12P9p46J79O30o72J5N84j88n74M00L54o37M0O27o0p98N62M73q03J29M82
6631C88n06l21P17oq59M99M76n59j04O32k1q07M90L71n83k20Q28l79n38N62K59
$$ plain form
6652 319 -257 -291 509 -90 -446 18 388 -420 -14 325 -198 -332 373 343 -498 -136 428 101 -334 498 50
6673 50 -386 146 276 -210 -31 324 -146 -282 348 308 -453 -86 526 -180 -498 472 140 -642 189 581 -261
6694 -261 -249 454 149 -447 335 354 -398 -170 470 -59 -454 271 100 -490 78 404 -25 -273 510 114 -626
6715 -626 154 450 -361 -379 476 -63 -403 108 556 -404 -176 527 -174 -383 346 368 -421 3 523 -208 -379
6736 -379 327 80 -482 278 424 -337 -241 360 162 -434 235 311 -565 -147 467 -151 -575 496 401 -454 27
6757 27 488 -110 -564 439 89 -568 12 544 -305 -308 502 63 -503 92 331 -564 -92 435 -96 -502 308
6778 308 347 -368 -91 422 -275 -325 397 277 -145 37 221 -148 -301 532 -18 -369 158 255 -324 -333 149 -60
6800 -60 -286 314 250 -403 -7 427 -106 -348 305 11 -333 -15 383 -424 -359 535 -16 -219 159 250 -426
$$ packed form
6652C19n76l4Q00n99l56M64L70q08M06L39n23j34P05l0q41L62N64l27m35Q32m48
6673E0m36N32J30m86J79L55m70j36O30m0p61L67O12p06l18R70l32p82Q31L92q42
6694b61J2P03l05n96P82J9p52K28O40n29l95P25j71n90N68L26m29k48P83l96p40
6715f26P80K96q11j8Q55n39l40N11M48r60K28P03p01k09P29K2p89M24N20p31j71
6736c79P06k47n62P60J46p61R6O01j98n96O69P6q76M18O14o18m24J071r5q55M81
6757B7M61n98m54J003l50o57N80N32q49lQ10m39n66N95K39q95M72N27n31m06Q10
6778C08L9p15K77N13o97n0P22j20m22J82J84l69j53Q33n50l51N27R7n79rM82k09
6800f0k26O00o4o53L96M34n33k42O53k94l44L18L98q07O5Q94n51k03L78R1o76
$$ plain form
6821 -426 -116 308 -18 -259 154 276 -252 5 382 135 -156 341 205 -400 45 378 -137 -172 264 61
6841 61 -255 141 425 -376 -116 369 39 -451 200 286 -250 12 304 -191 -383 387 216 -470 -135 316 -210
6862 -210 -490 242 97 -303 109 287 -62 -174 247 2 -333 189 193 -341 -150 390 -243 -272 21 175 -347
6883 -347 -120 321 -55 -282 182 197 -337 -65 263 -53 -183 317 127 -386 51 473 -318 -250 432 -71 -535
6904 -535 180 154 -329 -18 496 -155 -379 64 106 -361 -55 282 -81 -406 402 193 -415 213 417 -117 -143
6925 -143 430 68 -421 177 258 -534 -208 546 -43 -420 278 276 -523 -105 461 -392 -368 439 147 -453 136
6946 136 232 -233 -244 456 -154 -484 311 418 -488 -192 557 -6 -246 544 -8 -363 95 517 -307 -406 377
6967 377 129 -551 197 340 -481 -111 495 -8 -584 272 385 -425 -25 612 -163 -449 332 348 -644 91
$$ packed form
6821d26L10M24l26k41M13J22n28K57L77k47k91M97j36o05M45L33n15l5M36k03
6841F1l16L96K84q01K60M85l30m90O51Q6n36K62K92m95j92P70j71o86L35M51n26
6862b10k80P32j45m00M12J78l49j12M21k45l35N22Mn34J91N40o33k9K93J54n22
6883c47K27M41l76k27M64J5n34K72L28l16j30N00j90n13M37M22p91O8O82n03m64
6904e35P15k6m83L11N14o51k24M43M2m67L06L37l63l25Q08k09o08O28K04n34k6
6925a43N73l62m89N98Q1p92L26P54n89l77O98kp99M18N66q53K4Q07k92o00N89
6946A36R6m65j1P00o10l30P95J07r06K96P49n63k40P90n52l55M58M22q24r9P83
6967C77k48o80P48J43q21L70O06n03n76Q56J13q10M00O37p75k86P81J6r92P35
$$ plain form
6987 91 621 -237 -335 322 51 -656 153 420 -428 -262 509 148 -342 348 454 -391 -102 667 -80 -382 424
7008 424 190 -533 69 395 -224 -168 544 111 -583 274 441 -350 -230 425 -268 -446 422 279 -440 -102
7028 -102 345 -87 -346 439 197 -440 417 498 -173 -403 504 101 -519 324 315 -391 -186 475 -116 -633 403
7049 403 179 -309 -197 474 -260 -436 544 161 -537 55 477 -347 -337 425 46 -523 222 288 -534 -261 431
7070 431 -52 -419 116 199 -524 -20 496 -161 -495 281 363 -280 15 428 -207 -193 422 165 -429 459 266
7091 266 -379 -199 329 33 -240 191 230 -332 66 475 -52 -367 192 192 -358 -178 388 -329 -212 282 -19
7112 -19 -449 225 335 -307 -89 129 -111 -293 233 188 -246 -169 383 -17 -213 287 116 -431 -134 525 -246
7133 -246 -449 284 119 -291 209 417 -22 -227 378 134 -335 252 295 -305 -3 329 160 -371 283 234 -279
$$ packed form
6987I1N30q58r8O57k71p07Q09K67q48J66P71l61m90O90J06q45K89P69p47l02Q06
7008D24k34p23O02L26o19N6P12m33o94Q57J67p91J20O55o93j78Q68j43p19L38
7028a02M47m32k59P85k42o37Q57Q1o71k30R07m03o20Q43rp06K05O61n91n17J036
7049D03k24m88J12O71p34j76R80l83o98N92M22q24J0P62l79n69P45O6q22K73O92
7070D31m83l67N35Q3p23N04N16o57l34P76Q2o43K95M13o35J4O15k57n94Q88j93
7091B66o45J80N28k96k73M31L9n62L98M09n27l15N59%n50J80N66p17J17M94l01
7112a9m30O74J10o42K18K18k40j82N26m5m34P7N52m00j96N00j71n47K97O59p71
7133b46k03P33j65m10N00K08m39k05O05k44m69N87M3o00L02L32j69n31O54m9n13
$$ plain form
7154 -279 -131 454 -51 -264 269 131 -201 -73 404 -247 -285 360 5 -282 297 635 -202 -119 306 117 -223
7175 -223 148 164 -270 -196 295 -44 -291 291 225 -365 5 376 -315 -160 355 244 -182 61 359 -139 -138 447
7197 447 72 -232 227 175 -461 -133 503 -142 -381 253 316 -362 -167 418 -289 -345 314 125 -339 193 177
7218 177 -413 -384 471 149 -436 61 339 -236 -92 556 -96 -442 379 270 -479 -92 377 -143 -446 387
7238 387 83 -483 67 668 -279 -267 495 267 -353 167 309 -355 -78 535 -157 -346 272 185 -490 56 509
7259 509 -325 -332 462 70 -416 226 454 -389 -163 397 -106 -469 279 272 -391 -150 581 -86 -436 179 142 -332
7281 -332 234 425 -119 -196 443 167 -476 101 418 -320 -240 433 76 -349 405 98 -461 -44 467 -152 -345
7302 -345 446 273 -490 92 473 -206 -273 504 177 -409 106 239 -262 -61 460 -107 -449 293 247 -394 -124
$$ packed form
7154b79J48N85n05k13N33j38l32J28M77o51l8O45l55k87N79L38q37Q3M25j89l40
7175b23L71J6m34P4M91l39k47N82o6n90L70L71o91J55N15j11m26K43K98m98JN85
7197D47l75l04M59n2o36L28O36o45k39O34O3o78J95N85p07n6O59j89m64N32j6
7218A77n90K9Q55l22n85M97K78n75J44O48o52l46Q21j09p49L87M69n20l03Q33
7238C87l04n66N50O01r47J2P62k28o20N20J42o64K77O13o92j89O18q7o75N46M53
7259E09q34pP94l92m86O42K28q43K26N60n03l63P48po63K41P31o67l50O15l7m74
7281c32N66J91n44p7O39k76o43N77L17p38Q0O73l57m25P54l07n59M17N11o19j93
7302c45P91j73p63N82L81o79o7P77l27n86N15J33n01K01N21n67l42P42m6o41K70
$$ plain form
7323 -124 469 -170 -360 622 164 -333 -49 418 -183 -278 436 34 -490 287 447 -335 -252 391 -123 -236 162
7344 162 142 -330 -20 230 29 -254 217 144 -323 101 346 -278 -347 319 139 -350 325 262 -310 -125 425
7365 425 98 -453 197 213 -530 -192 375 -239 -499 290 0 -337 83 276 -307 -243 172 -34 -87 -52 219
7386 219 -231 -219 350 -102 -361 204 315 -158 -47 228 -219 -303 232 271 -362 69 443 -191 -234 110 209 -336
7408 -336 -167 18 -352 -350 369 19 -255 110 229 -293 -136 186 96 -317 152 276 -196 -182 276 -99 -99 228
7430 228 183 -250 42 322 -110 -243 352 194 -321 9 377 -243 -60 344 -3 -279 90 204 -311 95
7450 95 310 -119 -130 273 15 -252 47 100 -217 -368 151 6 -464 -98 281 -40 -313 417 -142 -257 -15
7471 -15 328 -47 -90 328 -88 -312 305 354 -413 4 328 -141 -200 82 171 -318 -120 344 -97 -251 184 43
$$ packed form
7323a24N93o39j90R82m58m97K84M67o01r5P14m02n24P77J60p82Q3O43n14j13L98
7344A62k0m72L10K50k01k83M71p3m67M24K45o24o9O66j80m89O75o3n72J85N50
7365D25l27n51O50J6p43L38N67o14k60P89k90l37M20J93n83O4M15k06n3L5K71
7386B19m50J2N69m52k59N65J11m73J11K75m47q4N35L9o33M31L74o34m3L44R9n45
7408c36J69J85l70KP19l50k74L65J19n22J57L22r0m13M69J24m72J4M58l75%L27
7430B28m5m33K92K80m32j33N95j58n15L30L68o20J83M04l47k76L69J14n15M06
7450I5K15m29j1M03k58k67K99N3l17j51N19j45m70L66L79l21k73P30n59j15K42
7471a5L43l75m3M18m16k24O17M9p67M17L24m69n9K82Q9m89J98M64m41j54M35j41
$$ plain form
7493 43 -382 140 279 -457 -120 287 -12 -465 230 257 -299 -126 273 -46 -312 301 133 -352 54 353 -144
7514 -144 -388 104 88 -366 141 195 -167 -282 158 -11 -473 198 242 -292 -27 404 -188 -337 327 217 -265
7535 -265 173 406 -144 -264 196 47 -191 62 373 -177 -315 378 -22 -306 286 184 -510 -48 429 -184
7555 -184 -284 152 23 -496 -18 417 -136 -72 272 203 -349 96 344 -411 -210 198 -82 -508 309 32 -400
7576 -400 -100 409 -193 -321 131 214 -431 -51 327 -209 -327 387 106 -264 312 332 -171 -154 488 54 -294
7597 -294 258 282 -352 50 363 -176 -224 214 -10 -386 -119 425 -265 -126 328 -15 -99 281 299 -215 -113
7618 -113 348 -159 -266 233 72 -271 -167 399 -67 -301 215 1 -129 102 212 -170 -187 230 37 -355
7638 -355 197 266 -184 -56 253 -7 -347 162 340 -289 -161 414 -52 -191 439 -107 -319 90 242 -102
$$ packed form
7493D3m25N22J39p36L37M07k99m53O95K7n56J73L99l19k66O13j68m85M06K99m97
7514a44k44M92j6m54N07N4l62j15M40j69m62O71M4n34K65M31n92j49O64j10m82
7535b65M38K33n50j20M60j49k38K53L11n50j38O93m00k84N92j02o94M62M77o13
7555a84j00M36j29n19M78M35n53O4L44o9n52M45K48p55K01M08k80m26Q17k77m32
7576d00L00N09o02j28M52Q3o45L80L78n36j18P14k81l70N76K0n03J7O42m34l48
7597b94N52K4o34M02L13n39m8M38k24l76K67N44o90J39M54l43q4L80J8n14J02
7618a13M61n07j07M99j61l43J04N66m66k34N16k14j30K31J10l82j7M17j93l92
7638c55N52O9m50J28L09k60l40N09J78o29J28N75m66j39O30n46k12M09J52l44
$$ plain form
7658 -102 -140 246 2 -230 111 357 -262 -190 315 -220 -162 112 142 -255 -108 147 -266 -161 78 21 -247 98
7680 98 302 -72 -159 104 12 -219 115 260 -215 -190 234 46 -172 166 165 -203 -89 5 -171 -195 92 8 -163
7703 -163 -156 214 -145 -273 238 -68 -449 197 285 -198 -126 386 64 -127 56 203 -357 51 240 -18 -53 143
7725 143 28 -327 -33 11 77 -178 48 9 -302 -86 21 -167 -237 245 79 -251 72 170 -61 -222 123 -100
7747 -100 -269 195 209 -321 125 232 0 -190 130 172 -142 17 315 -98 -54 251 74 -218 -8 352 -91
7768 -91 -356 296 -48 -295 107 298 -92 -161 360 -77 -135 -13 40 -161 -39 107 -31 -389 199 -19 -240
7789 -240 50 242 -239 -171 413 47 -167 192 108 -154 -316 495 40 -218 140 121 -278 135 364 -222 -248
7810 -248 289 138 -123 153 221 -98 -190 456 -8 -446 200 78 -247 -103 340 -97 -38 264 146 -282 -231
$$ packed form
7658a02l8L86k44k32L41K46o19P2N05n35N8K74L0l97J47K55m13J05K39n7k68L45
7680I8K04l74q7K63r2k31L34J45m75K5M24j88k18L38jl68J14R4j76k4K87q4j71
7703a63PL70l59j28N11l06l81O46Q8m83P2N12l22j91J83J47n60M08J89k58l5J96
7725A43j15l55K94M4O6k55K26l9l11K16J07j88p0M82j66l30L23R8k31j61L45k23
7747a00j69M64J4n30M46J07k32j90L20M2l14J59K98m13M4L05j77k92K10L60m43
7768i1k65O52l44k47M02J91l90o9N21m37n8J22N3k01J22J46j38l58N88k18k21
7789b40K90J92m81O8N84l66k14L59q4k62j62Q11m55k58L58j9l99M13K29n86k6
7810b48N37j51k61K76O8l19r2O46m64m38O46j22l25J44M43m37N9L02j18m28N1
$$ plain form
7831 -231 243 -236 -317 264 94 -558 -52 318 -330 -292 335 97 -321 241 226 -344 -340 317 -65 -120 228 255
7853 255 -302 83 255 -218 -299 310 159 -448 134 416 -229 -166 305 -174 -311 188 121 -295 -56 290 -70
7874 -70 -308 315 61 -213 -4 467 -176 -131 196 178 -285 189 270 -462 -123 212 -36 -43 219 33 -371 -83
7896 -83 339 56 -238 255 137 -441 -50 426 -216 -149 290 50 -210 121 262 -172 2 207 -74 -120 201
7917 201 151 -118 51 223 -110 -13 329 241 -162 94 24 -132 -251 120 -70 -278 189 187 -146 -59 8 -121 -319
7940 -319 237 -7 -231 -168 252 -39 -107 83 -81 -142 30 54 -179 -400 254 40 -167 67 227 -197 -157 168
7962 168 144 -309 102 123 -85 20 350 -67 -144 290 -16 -219 14 159 -78 -4 133 49 -164 38 130 -5
7984 -5 -86 209 -26 -138 -74 100 -107 -93 123 -43 -166 165 51 -253 -19 263 172 -224 158 339 -295 158
$$ packed form
7831b31M74m79q1N81j70o52N06L70o48L8O27k38m18N62j5n70MO57l82n5L48K7
7853B55n57L85J72m73q1O09j51o07N82K82o45O3M71m79j37M99o7m16K39L46l60
7874g0k38O23k54k74K09M71o43M5L27j8m63M74Q1p32L39L35k48pK62j86m04K88
7896h3M22k83k94M93j18n78L91M76o42O7M39k40k60L31J41m34J74K05k81m6L21
7917B01n0k69J69J72l33R7L42q8m03K56p0j56j19L71j90k08M67kl33Q7O7j29j98
7940c19N56k44k24O3M20k91o8J90j64o1J72K4k33k21O54k14k07K34J60m24M0L25
7962A68k4m53M11K1k08J05L30m17p7M34l06k03K33J45k37P4J37q4k13K02R2j35
7984eq1K95k35j12O4J74k07J4K16j66j23L31j14l04K34K82r1l96L82J81o34M53
$$ plain form
8006 158 214 -3 -250 182 65 -52 65 135 -144 -61 283 -11 -252 154 249 -207 -118 337 111 -251 151 -133
8028 -133 -163 191 169 -50 -146 140 126 -276 35 220 -52 -184 -33 -149 -109 114 91 0 108 357 -79 -313
8050 -313 210 186 -154 -3 79 -95 -172 195 168 -231 52 269 -244 -207 1 -25 -393 100 22 -199 -26 213
8072 213 76 -124 218 376 -196 -98 386 -27 -414 278 -103 -167 -27 91 -26 -234 302 -18 -155 294 176
8093 176 -222 -184 329 -191 -439 17 132 -343 27 363 -61 -153 303 166 -252 65 181 -129 -206 470 -58
8114 -58 -212 173 393 -271 -142 190 -29 -220 237 182 -430 28 253 -50 -226 259 32 -291 99 222 -204
8135 -204 -291 185 -127 -365 78 46 -142 -16 134 -20 -178 5 95 -137 41 19 -41 -245 202 26 -139 -20
8157 -20 72 -133 -234 448 -58 -325 52 427 -204 13 282 -98 -137 178 195 -236 75 168 -151 -218 295 90
$$ packed form
8006A58N6k17k47M32j17j17J17P0k79Q3L44k94k41M06R5m56Q9M55k26l62M02k84
8028a33l0L54k2k19r6K86j4m02L11J85k72j32J51j16M0K23k3r1J08K49m36k34
8050c13N23k4l40J51Q2j74p7L67k7l99K83K17n13L7K08k6l68M93p8k21J73K39
8072B13j37k00L42J58n72R8M84m13l87O92l81o4J40J18j17k08N36l20j37M49j18
8093A76l98L8N13n20k48M56J15m75L70L36m24r2M56j37m18L17J16l10p7O76n28
8114e8j54L85K20o64J29L32k19j91M57n5o12M58K25l03j76M85k27l23L90J23m26
8135b04q7M76l12k38M43l2j88J26J50j54j58J83R0k32J78k2o0k04M47j76j65J19
8157b0R2k05j01O82n06k67L77L75o31K17K69l80l9L15J7m31L11R3l19o7N13k05
$$ plain form
8179 90 -221 50 192 -89 -212 153 -109 -173 117 262 -378 -43
$$ packed form
8179I0l11K71J42k81j23L65k62o4K90J45o40L35
8191d3
$$ Imaginary data points
##PAGE= N=2
##DATA TABLE= (X++(I..I)), XYDATA
$$ plain form
0 0 0 0 0 0 0 0 0 0 0 1 -32 32 -32 33 -64 64 -96 97 -128 160 -192 225 -257 321 -385 449 -513 578 -674
29 -674 770 -898 1016 -1155 1301 -1473 1652 -1861 2080 -2316 2592 -2883 3202 -3552 3931 -4349
45 -4349 4806 -5297 5841 -6442 7094 -7813 8612 -9493 10477 -11579 12820 -14237 15860
58 15860 -17753 19996 -22686 25991 -30168 35646 -43149 54142 -71807 104861 -188031 842517
70 842517 1043186 -998099 -814938 -101616 332099 470901 266731 -698156 -656832 229031
80 229031 322938 -119304 410518 593214 -338336 -711651 74060 373532 213401 190087
90 190087 -327745 -970191 -169664 951869 523834 -342206 -161013 39095 -125407 200744
100 200744 424681 -181236 -411395 -1101 -146483 -349107 382668 678040 -216538 -553577
$$ packed form
0@%%%%%%%%%Jl3O4o4O5r7J28j60J93k25K88l52M17m82N78p06Q34r62J091j252
29f74J444j668J914k171K456k774L125l513L941m396M908n475O085o754P483q280
45d349R155j0103J1138j2283J3536j4907J6425j8105J9970k2056K4399k7057L0097
58A5860l3613L7749m2682M8677n6159O5814p8795R7291j25949J76668k92892J030548
70H42517K00669k041285J83161P13322M33715J38802k04170r64887M1324Q85863
80B29031R3907m42242N29822J82696r31550l73315P85711K99472j60131k3314
90A90087n17832o42446Q00527J121533m28035q66040J81193K00108j64502L26151
100B00744K23937o05917k30159M10294j45382k02624P31775K95372q94578l37039
$$ plain form
110 -553577 139405 337676 51393 113436 -40438 -446415 -125638 285940 -153986 -282733
120 -282733 425244 400280 -388328 -292711 350450 276406 19064 27172 -322429 -485773 220044
131 220044 505404 -222761 -394696 249762 268963 -145495 9967 168454 -36409 77838
141 77838 112418 -475509 -489355 428182 569589 -274946 -439509 99235 241929 223357 270280
152 270280 -160846 -480795 46037 333882 -205511 -284484 263497 166578 -281976 -60164
162 -60164 237951 78895 106556 164356 -283174 -387516 229574 317416 -263219 -258066 148421
173 148421 41298 -60503 228097 148848 -160307 35645 150377 -245035 -204365 286423
183 286423 117356 -348047 -108086 231668 47403 4146 156865 -71150 -172707 201999
$$ packed form
110e53577O92982J98271k86283O2043j53874m05977L20777M11578m39926j28747
120b82733P07977k4964p88608R5617O43161p4044k57342Q108l49601j63344P05817
131B20044K85360p28165j71935O44458J9201m14458J55462J58487k04863J14247
141G7838L4580n87927j3846R17537J41407q44535j64563N38744J42694j8572M6923
152B70280m31126l19949N26832K87845n39393p8973N47981r6919m48554K21812
162f0164K98115j59056K7661N7800m47530j04342O17090Q7842n80635N153M06487
173A48421j07123j01801K88600p9249l09155J95952J14732l95412M0670M90788
183B86423j69067m65403K39961L39754j84265m3257J52719k28015j01557L74706
$$ plain form
193 201999 148763 -334061 -170635 282008 40588 -273503 -3806 140656 -8372 135305
203 135305 184793 -198120 -182009 253920 95889 -321835 -63667 237983 -60211 -186054
213 -186054 85481 70915 -1655 229539 93107 -363389 -153440 345117 111470 -282075
223 -282075 -100283 31448 -97417 98891 265688 -64809 -164882 163826 73317 -229063
233 -229063 35215 262571 -122759 -295521 28435 94359 -282 180651 102707 -281908
243 -281908 -114365 323576 118106 -223046 -32556 48325 -191500 -59083 207766 15851
253 15851 -104149 124590 33194 -201404 95234 316926 -97766 -306333 19787 87263
263 87263 -65430 88318 102303 -201447 -87317 268609 76950 -186470 64067 137884
$$ packed form
193B01999n3236m82824J63426M52643k41420l14091K69697J44462j49028J43677
203A35305M9488l82913J6111M35929j58031m17724K58168L01650k98194j25843
213a86054K71535j4566p2570K31194j36432m56496K09949M98557k33647l93545
223b82075J81792J31731j28865J96308J66797l30497j00073L28708r0509l02380
233b29063K64278K27356l85330j72762L23956O5924r4641J80933p7944l84615
243b81908J67543M37941k05470l41152J90490Q0881k39825J32417K66849j91915
253A5851j20000K28739r1396k34598K96638K21692m14692k08567L26120O7476
263H7263j52693J53748J3985l03750J14130L55926j91659k63420K50537P3817
$$ plain form
273 137884 -185221 -129730 147452 -5947 -129204 102313 45765 -190435 66509 294262
283 294262 -60415 -223202 93699 93001 -144916 2154 103477 -140277 -71824 210964 12440
294 12440 -197326 114971 213022 -141001 -130885 137167 -9344 -149049 75948 47101 -186902
305 -186902 20693 229416 -64350 -157940 163087 113169 -173515 -25292 124946 -101293
315 -101293 -89145 149507 -16009 -189118 108300 200641 -122673 -95857 164930 10049
325 10049 -144823 69850 56675 -179276 -17290 171350 -83160 -144093 172523 117789 -167080
336 -167080 -16099 153021 -64523 -90349 113847 -30336 -180287 94162 165905 -138978
346 -138978 -88511 178144 22938 -133179 89310 91786 -157624 -40339 136615 -82708
$$ packed form
273A37884l23105N5491K77182j53399j23257K31517n6548k36200K56944K27753
283B94262l54677j62787L16901o98k37917J47070J01323k43754O8453K82788j98524
294A2440k09766L12297R8051l54023J0116K68052j46511j39705K24997k8847k34003
305a86902K07595K08723k93766r3590L21027m9918k86684J48223J50238k26239
315a01293J2148K38652j65516j73109K97418R2341l23314K6816K60787j54881
325A0049j54872K14673j3175k35951J61986J88640k54510o0933L16616n4734k84869
336a67080J50981J69120k17544k5826K04196j44183j49951K74449P1743l04883
346a38978N0467K66655j55206j56117K22489K476k49410J17285J76954k19323
$$ plain form
356 -82708 -134499 146200 77871 -176934 3242 179579 -45225 -88607 110781 -15817 -165250
367 -165250 79683 140038 -147672 -94789 162669 16602 -129045 93585 111673 -125413
377 -125413 -32028 128542 -69529 -120980 122557 46007 -184541 166 172615 -44417
387 -44417 -88784 114638 16699 -136199 61218 116196 -131822 -85021 136098 -3599 -131277
398 -131277 83295 107927 -108988 -22493 135826 -41132 -104767 104851 39318 -169176 -7785
409 -7785 144789 -56614 -97447 104056 34196 -108154 58282 107512 -113905 -71945 124582
420 124582 -11297 -134098 67314 94526 -112379 -32230 136038 -14746 -88030 95260
430 95260 45862 -140855 -2967 126254 -65598 -102792 90968 28197 -110285 49691 114989
$$ packed form
356h2708n1791K80699o8329k54805J80176J76337k24804m3382J99388j26598j49433
367a65250K44933O0355k87710N2883K57458j46067j45647K22630J8088k37086
377a25413R3385J60570j98071n1451K43537p6550k30548J84707J72449k17032
387d4417m4367K03422r7939j52898J97417N4978k48018M6801K21119j39697j27678
398a31277K14572K4632k16915Q6495J58319j76958o3635K09618o5533k08494J61391
409g785J52574k01403m0833K01503o9860j42350J66436M9230k21417M1960J96527
420A24582j35879j22801K01412K7212k06905Q0149J68268j50784p3284J83290
430I5260m9398j86717J37888J29221j91852l7194J93760o2771j38482J59976O5298
$$ plain form
441 114989 -86195 -62868 113582 -8153 -126049 58408 90240 -107853 -50783 108092
451 108092 -13120 -73944 98405 58524 -122132 -8564 116242 -48263 -86531 84157
461 84157 18570 -126749 20143 114022 -51395 -50776 95931 -7627 -113977 53746 93735
472 93735 -87126 -53005 81738 -31389 -87054 92041 82645 -95445 -23830 92360 -36509
483 -36509 -62030 99548 33464 -133183 -20135 88833 -35828 -33455 97303 -5458 -118298
494 -118298 39777 98822 -63183 -39821 83842 -36516 -116649 58783 90566 -63081 -16419
505 -16419 75212 -54311 -73014 112504 76605 -101670 -35109 53878 -55706 -33166 115937
516 115937 14893 -128204 9461 92519 -44179 -23930 98266 -19499 -123823 24259
$$ packed form
441A14989k01184K3327J76450j21735j17896J84457L1832j98093N7070J58875
451A08092j21212o0824J72349l9881j80656J13568J24806j64505l8268J70688
461H4157o5587j45319J46892R3879j65417O19J46707j03558j06350J67723L9989
472I3735j80861L4121J34743j13127n5665J79095r396j78090P1615J16190j28869
483c6509k5521J61578o6084j66647J13048J08968j24661K373J30758j02761j12840
494a18298J58075N9045j62005K3362J23663j20358q0133J75432L1783j53647M6662
505a6419R1631j29523j8703J85518l5899j78275O6561Q8987j09584K2540J49103
516A15937j01044j43097J37665Q3058j36698K0249J22196j17765j04324J48082
$$ plain form
526 24259 67518 -57938 1240 92710 -54027 -106098 78364 90099 -53599 -2116 50889
537 50889 -89209 -72749 117321 62687 -98809 -16952 54647 -52600 -15066 113353 1965
548 1965 -110842 20233 54484 -77193 -13991 108764 -19274 -104273 37646 50257 -58217
559 -58217 33199 106086 -67689 -116840 59037 63966 -45816 21601 41851 -98279 -46018
570 -46018 124903 34169 -94855 22098 57353 -86867 -39258 100158 6985 -69761 41896
581 41896 14314 -110601 11654 142056 -6796 -93045 22104 7336 -57295 74149 101925
592 101925 -102934 -110532 76153 46445 -52477 46463 57966 -92491 -47533 86900 -535
603 -535 -58496 67525 28722 -130490 -33585 115485 18048 -39258 49444 -22617 -120393 43373
$$ packed form
526B4259M3259j25456N9178R1470j46737n2071J84462J1735j43698N1483N3005
537E0889j40098J6460J90070n4634j61496Q1857P1599j07247L7534J28419j11388
548A965j12807J31075L4251j31677O3202J22755j28038q4999J41919J2611j08474
559e8217R1416P2887j73775m9151J75877M929j09782O7417K0250j40130N2261
570d6018J70921r0734j29024J16953L5255j44220M7609J39416r3173p6746J11657
581D1896k7582j24915J22255J30402j48852q6249J15149j4768o4631J31444K7776
592A01925k04859p598J86685k9708r8922R8940J1503j50457M4958J34433q7435
603e35n7961J26021l8803j59212R6905J49070r7437n7306Q8702p2061r7776J63766
$$ plain form
615 43373 147067 -24012 -90820 14635 -16775 -49422 93136 88252 -99176 -69040 77739
626 77739 5174 -56191 67777 48062 -103099 -41691 65674 -23105 -28057 104095 24847
637 24847 -131803 -24392 96117 5162 -14869 47969 -59645 -115355 75874 132232 -48396
648 -48396 -65185 43965 -19059 -56307 72825 55278 -82053 -17902 63842 -55282 -62797
659 -62797 103273 65345 -92527 -39804 34272 -34594 12855 118255 -13665 -140725 655
670 655 88168 -14992 -4592 59886 -51482 -91260 67361 78539 -55428 -11606 59394 -55591
682 -55591 -75959 71275 57034 -53710 1924 30735 -79960 -33640 118484 43858 -87502
693 -87502 -17446 24062 -47255 21165 108769 -27770 -119776 15401 67951 -17585 17058 56281
$$ packed form
615D3373J03694j71079o6808J05455l1410l2647J42558m884j87428L0136J46779
626G7739p2565o1365J23968j9715j51161O1408J07365q8779m952J32152p9248
637B4847j56650J07411J20509r0955k0031O2838j07614n5710J91229N6358j80628
648d8396j6789J09150o3024l7248J29132j7547j37331O4151Q1744j19124p515
659f2797J66070l7928j57872N2723P4076o8866M7449J05400j31920j27060J41380
670F55Q7513j03160J0400O4478j11368l9778J58621J1178j33967M3822P1000j14985
682e5591k0368J47234j4241j10744N5634K8811j10695M6320J52124p4626j31360
693h7502P0056M1508p1317O8420Q7604j36539r2006J35177N2550q5536L4643L9223
$$ plain form
705 56281 -59062 -71341 62701 36397 -64217 15577 62915 -63691 -65606 70777 45648
716 45648 -37609 17864 12380 -88669 -16115 109757 15807 -81196 4860 27519 -39682 26841
728 26841 79800 -44894 -77573 51225 37894 -60960 8591 67139 -38212 -55096 42172
739 42172 10724 -42074 44533 46505 -78338 -43672 73925 13966 -51361 30760 26561 -70382
751 -70382 -9088 81273 -4936 -52817 35343 18917 -60596 9854 64653 -30150 -39189 51223
763 51223 1975 -69135 24819 65661 -41166 -40393 44527 -5096 -47318 47611 48985 -63112
775 -63112 -35037 49145 -5298 -31582 48789 18016 -69049 4024 71013 -21652 -43665 48492
787 48492 12976 -69453 3696 56228 -22106 -19354 46505 -17455 -63650 40225 59197 -48392
$$ packed form
705E6281j15343j2279J34042k6304j00614P9794M7338j26606j915J36383k5129
716D5648q3257N5473n484j01049P2554J25872r3950r7003Q6056K2659o7201O6523
728B6841N2959j24694l2679J28798j3331r8854O9551N8548j05351j6884R7268
739D2172l1448n2798Q6607J972j24843L4666J17597n9959o5327Q2121m199r6943
751g0382O1294R0361q6209m7881Q8160j6426p9513P0450N4799r4803r039R0412
763E1223m9248p1110R3954M0842j06827P73Q4920m9623m2222R4929J374j12097
775f3112K8075Q4182n4443k6284Q0371l0773q7065P3073O6989r2665k2013R2157
787D8492l5516q2429P3149N2532p8334K752O5859o3960m6195J03875J8972j07589
$$ plain form
799 -48392 -31517 43258 -16995 -44006 52560 38251 -61547 -13411 55636 -18466 -35086 53439
811 53439 17915 -64771 2937 50149 -31424 -22896 58218 -3763 -68669 24995 56388 -39640
823 -39640 -24842 48121 -15901 -55076 38634 39603 -49040 -7273 50574 -27841 -41599 56088
835 56088 27178 -61496 1420 52475 -31584 -32277 55478 9401 -59030 16434 42742 -42946
847 -42946 -17625 59521 -8965 -58726 30915 36621 -50164 -7575 55770 -25279 -50545 46432
859 46432 29825 -52260 5596 51668 -34826 -36422 54149 11891 -55614 19546 42720 -49116
871 -49116 -21640 65637 -1469 -59076 26940 35302 -49945 -6962 57709 -23723 -52522 41772
883 41772 24917 -52846 11236 55540 -38582 -40298 56852 15965 -56423 17601 43351 -47795
$$ packed form
799d8392J6875P4775o0253k7011R6566j4309r9798M8136O9047p4102j6620Q8525
811E3439l5524q2686O7708M7212q1573Q528Q1114o1981o4906R3664L1393r6028
823c9640J4798P2963o4022l9175R3710R69q8643M1767N7847p8415j3758R7687
835E6088k8910q8674O2916N1055q4059o93Q7755m6077o8431P5464K6308q5688
847d2946K5321P7146o8486m9761Q9641N706q6785M2589O3345q1049k5266R6977
859D6432j6607q2085N7856M6072q6494j596R0571m2258o7505P5160K3174r1836
871d9116K7476Q7277o7106n7607Q6016Q362q5247M2983O4671q1432k8799R4294
883D1772j6855p7763O4082M4304r4122j716R7150m0887p2388P4024K5750r1146
$$ plain form
895 -47795 -22516 63440 -1292 -56246 28886 34823 -49805 -4968 58413 -25505 -53334 42789
907 42789 26007 -54668 6384 53068 -36184 -38897 55062 15624 -54439 17157 42425 -44704
919 -44704 -20540 60143 -4450 -55628 30610 36521 -49161 -6285 58458 -21743 -50698 40826
931 40826 25261 -53419 4533 49121 -36052 -36525 53578 12727 -54189 18214 42979 -43815
943 -43815 -20288 58412 -5512 -54867 31047 36328 -48532 -6849 56873 -19782 -46322 42076
955 42076 23229 -53169 5574 48529 -35979 -36096 51211 9929 -54612 18286 43360 -41971
967 -41971 -20876 54799 -5530 -51723 30513 34302 -48143 -7597 53691 -17856 -42357 40983
979 40983 22200 -50400 6502 48018 -33220 -35437 47377 9757 -52079 15240 40289 -38635
$$ packed form
895d7795K5279Q5956o4732n4954Q5132N937q4628M4837O3381q3918k7829R6123
907D2789j6782q0675O1052M6684q9252k713R3959l9438p0063P1596K5268q7129
919d4704K4164Q0683o4593n1178Q6238N911q5682M2876O4743q0201k8955R1524
931D0826j5565p8680N7952M4588q5173m73R0103m0851o6916P2403K4765q6794
943d3815K3527P8700o3924m9355Q5914N281q4860M1683O3722p6655k6540Q8398
955D2076j8847p6398N8743M2955q4508j17Q7307m1282o4541P2898K5074q5331
967d1971K1095P5675o0329m6193Q2236L789q2445M0546O1288p1547k4501Q3340
979D0983j8783p2600N6902M1516q1238k217Q2814l7620o1836O7319K5049p8924
$$ plain form
991 -38635 -19982 50699 -4289 -47500 28151 31252 -45451 -7679 50947 -16759 -41803 37456
1003 37456 22756 -45178 6079 46239 -29180 -33493 44029 10233 -48078 13518 37101 -37418
1015 -37418 -20768 47518 -2348 -43707 26337 29071 -44782 -8342 50573 -13626 -42245 31457
1027 31457 20990 -42158 6560 45839 -26054 -32064 41306 10591 -45074 14699 38296 -36459
1039 -36459 -25342 42651 659 -39655 24872 27913 -43845 -11365 48716 -8638 -39147 27584
1051 27584 18598 -42755 2668 45479 -19420 -30379 36166 9580 -42767 15468 42713 -31754
1063 -31754 -29740 36107 3206 -36364 22315 28618 -40136 -14129 43754 -7049 -36489 28718
1075 28718 21929 -44026 -6906 41636 -12804 -26210 33958 7360 -45962 12801 47975 -23109
$$ packed form
991c8635J8653P0681n4988m3211P5651L101p6703L7772N8626o7706k5044P9259
1003C7456j4700o7934N1257M0160p5419m313P7522l3796n8311O1596K3583p4519
1015c7418J6650O8286m9866m1359P0044K734p3853L6440N8915o4199k8619P3702
1027C1457j0467o3148M8718L9279p1893o010P3370l0715n5665N9773K3597p4755
1039c6459J1117O7993m1992m0314O4527L041p1758L2480O0081n7354l0509O6731
1051B7584q986o1353M5423M2811o4899j0959O6545k6586n2347N8235K7245p4467
1063c1754K014O5847l2901l9570N8679O303o8754K6007N7883n0803k9440O5207
1075B8718o789o5955L7120M8542n4440j3406O0168k6598n3322N8763L5174p1084
$$ plain form
1087 -23109 -29972 31767 2977 -36702 20044 30935 -36210 -15163 41545 -8385 -39253 30159
1099 30159 29914 -40830 -13522 35131 -14049 -25544 37803 12663 -48399 3370 44289 -18044
1111 -18044 -22702 36224 621 -45242 16682 38008 -29825 -16936 38713 -8720 -41589 27761
1123 27761 32826 -36119 -11578 35247 -17477 -33350 35590 21441 -41137 -1040 33622 -25009
1135 -25009 -19480 49223 9755 -53401 2933 38580 -18501 -12639 35060 -11620 -41623 28435
1147 28435 32540 -38116 -10976 42269 -13452 -40332 26556 22379 -32430 5562 31736 -35934
1159 -35934 -31124 51295 23624 -44911 -2623 28065 -22064 -5988 43662 -11120 -48134 24840
1171 24840 33735 -37856 -10606 46505 -8122 -39390 23287 16212 -36490 9093 40830 -32225
$$ packed form
1087b3109o863O1739k8790l9679N6746J0891o7145K1047N6708m9930l0868O9412
1099C0159k45p0744K7308M8653m9180j1495O3347k5140o1062N1769M0919o2333
1111a8044m658N8926l5603m5863O1924K1326o7833J2889N5649m7433l2869O9350
1123B7761N065o8945K4541M6825n2724j5873O8940j4149o2578M0097L4662n8631
1135b5009N529O8703l9468o3156N6334L5647n7081N862M7699m6680l0003P0058
1147B8435M105p0656K7140N3245n5721k6880O6888m177n4809L7992K6174o7670
1159c5934M810Q2419k7671o8535M2288L0688n0129J6076M9650n4782l7014P2974
1171B4840Q895p1591K7250N7111n4627l1268O2677p075n2702M5583L1737p3055
$$ plain form
1183 -32225 -38144 39010 19167 -34783 12013 28213 -38293 -18234 50445 4545 -42584 16353
1195 16353 24212 -37417 -4236 48766 -11166 -39555 27303 19417 -39654 3235 40864 -22701
1207 -22701 -30779 31169 2551 -40118 24922 45393 -36923 -35713 35034 10326 -25324 21097
1219 21097 13508 -46315 -2050 55444 -8153 -41883 25041 21640 -37104 -1750 34414 -19425
1231 -19425 -19486 38068 -1289 -51005 16658 49351 -24876 -32196 23466 -1564 -22755 33395 22535
1244 22535 -48366 -12434 47220 -5804 -34199 26922 18304 -37972 148 35766 -19251 -20418
1256 -20418 38585 3626 -47935 9381 38350 -22661 -17759 32067 -8395 -38635 24930 31749
1268 31749 -31293 -10291 32455 -15528 -29132 35652 20341 -42948 -6088 36518 -11819 -19275
$$ packed form
1183c2225n919P7154j9843n3950M6796J6200o6506K0059O8679m5900m7129N8937
1195A6353P859o1629L3181N3002n9932k8389O6858p886n9071M2889L7629o3565
1207b2701q078O1948k8618m2669O5040K0471q2316J210P0747k4708l5650M6421
1219B1097p589n9823M4265N7494o3597l3730O6924l401n8744L5354L6164n3839
1231a9425o1N7554l9357m9716O7663L2693p4227p320N5662k5030k1191N6150j0860
1244B2535p0901L5932N9654n3024k8395O1121q618n6276L8120L5618n5017j167
1256b0418N9003l4959n1561N7316K8969o1011M902M9826m0462l0240O3565O819
1268C1749o3042K1002M2746m7983j3604O4784j5311o3289L6860M2606m8337p456
$$ plain form
1280 -19275 31669 4413 -37125 12342 28531 -31596 -16791 42068 2163 -41597 9862 26087
1292 26087 -19094 -472 27497 -25380 -34935 35747 28293 -35078 -8064 30827 -11512 -18747
1304 -18747 27268 3666 -32357 14785 28596 -31829 -19649 41027 9090 -35304 4811 17570
1316 17570 -22225 436 32902 -17360 -34738 26168 22581 -30589 -3118 30870 -14505 -23267
1328 -23267 26029 9407 -28415 10613 24951 -28636 -18062 37132 7976 -31332 10110 21409
1340 21409 -25045 -9514 29144 -7722 -26874 20535 13715 -31704 2104 37714 -12208 -30221
1352 -30221 18659 11792 -24389 7233 23640 -22447 -14613 33897 4462 -32930 10380 26289
1364 26289 -22032 -14922 24663 -2169 -20662 19992 11234 -34473 -2212 37482 -8543 -30712
$$ packed form
1280a9275N0944k7256m1538M9467J6189o0127J4805N8859l9905m3760N1459J6225
1292B6087m5181J8622K7969n2877r555P0682p454o3371K7014L8891m2339p235
1304a8747M6015k3602l6023M7142J3811o0425J2180O0676l1937m4394M0115J2759
1316A7570l9795K2661L2466n0262j7378O0906l587n3170K7471L3988m5375q762
1328b3267M9296j6622l7822L9028J4338n3587J0574N5194k9156l9308M1442J1299
1340B1409m6454J5531L8658l6866j9152M7409o820m5419L3808L5610m9922j8013
1352c0221M8880o867l6181L1622J6407m6087P834M8510k9435l7392M3310J5909
1364B6289m8321P110L9585k6832j8493M0654q758m5707L2261L9694m6025k2169
$$ plain form
1376 -30712 16580 14690 -22388 3487 22400 -18746 -14833 28872 1564 -32988 12680 31136
1388 31136 -19988 -18015 24075 603 -21672 17291 14654 -30591 -4716 33024 -8754 -28718
1400 -28718 19155 16309 -25188 -371 23969 -14909 -15124 27314 1260 -34490 10288 31343
1412 31343 -19858 -18867 26353 4727 -22358 14405 15892 -26664 -4983 29345 -11891 -28528
1424 -28528 23191 19337 -28065 -4386 26374 -11212 -17395 23355 3165 -31408 9117 28044
1436 28044 -21184 -17594 28476 4900 -25888 11753 19327 -22055 -4325 28383 -11632 -28267
1448 -28267 22827 19078 -29776 -6246 27940 -7862 -17806 20924 4071 -28194 9967 25385
1460 25385 -24480 -18225 30742 5130 -29121 9707 21426 -19293 -4869 27291 -10460 -25874
$$ packed form
1376c0712M7292j890l7078K5875J8913m1146L913M3705k7308l4552M5668J8456
1388C1136n1124J973M2090k3472k2275L8963k637m5245K5875L7740m1778j9964
1400b8718M7873k846m1497K4817K4340l8878k15M2438k6054l5750M4778K1055
1412C1343n1201R91M5220k1626k7085L6763J487m2556K1681L4328m1236j6637
1424b8528N1719l854m7402K3679L0760l7586o183M0750k0190l4573M0525J8927
1436B8044m9228L590M6070k3576l0788L7641P574m1382J7730L2708m0015j6635
1448b8267N1094l749m8854K3530L4186l5802r944L8730j6853l2265L8161J5418
1460B5385m9865O255M8967k5612l4251L8828J1719m0719J4424L2160l7751j5414
$$ plain form
1472 -25874 23554 17381 -31078 -5326 28788 -9718 -20331 21133 6116 -26212 10566 25086
1484 25086 -24154 -17521 29681 2794 -30572 9642 21255 -19946 -5715 27027 -7987 -22867
1496 -22867 23504 15087 -31185 -3408 29299 -11233 -22148 20629 8359 -24438 8717 22892
1508 22892 -21787 -14105 29172 628 -31019 10153 21526 -20901 -8912 24532 -6061 -20187
1520 -20187 21888 13458 -28348 -469 29451 -12211 -22685 20222 8802 -24288 6318 21459
1532 21459 -18919 -11372 27984 -359 -29212 11131 20931 -21568 -10227 22703 -6053 -19612
1544 -19612 19709 11923 -26235 1927 28649 -12115 -21444 20515 9207 -23724 4279 19496
1556 19496 -17145 -9657 26383 -1150 -26311 13245 20641 -21203 -10331 22058 -5407 -20283
$$ packed form
1472b5874M9428o173m8459K5752L4114l8506j0613M1464j5017l2328L6778J4520
1484B5086m9240O633M7202k6887l3366M0214J1613m1201J4231L2742l5014j4880
1496b2867M6371q417m6272K7777L2707m0532j0915M2777j2270l2797L3155J4175
1508B2892m4679P682M3277k8544l1647M1172J1373m2427J1989L3444l0593j4126
1520b0187M2075q430m1806K7879K9920m1662j0474M2907j1420l3090L0606J5141
1532B1459m0378P547L9356k8343k8853M0343R800m2499J1341L2930k8756j3559
1544a9612L9321p786l8158K8162K6722m0764r329M1959j1308l2931K8003J5217
1556A9496l6641P488L6040k7533k5161L9556P396m1844J0872L2389k7465j4876
$$ plain form
1568 -20283 16050 10442 -23665 1909 25766 -11595 -18823 20830 9188 -22929 3259 18473
1580 18473 -15526 -10222 23234 -354 -23794 12000 19369 -18855 -8666 21890 -4086 -20307
1592 -20307 12820 10311 -21131 -82 21949 -11088 -17066 20312 9734 -21823 2584 19073
1604 19073 -13104 -11771 19514 919 -20870 10266 17083 -17615 -7059 22544 -2090 -20298
1616 -20298 10698 11079 -18770 -1518 19381 -10811 -17213 18255 9747 -20174 1813 18989 -11246
1629 -11246 -12074 18039 2123 -19512 8396 15746 -16954 -7955 22012 -82 -18871 10042 12073
1642 12073 -17297 -2846 18921 -8179 -17478 14469 8761 -19099 1550 19217 -10425 -13265
1654 -13265 16877 4378 -18310 6108 15679 -15211 -9567 19693 1015 -17747 9778 13446
$$ packed form
1568b0283L6333n608l4107K5574K3857l7361p228L9653j1642l2117K6188J5214
1580A8473l3999N304L3456k3588k3440L5794P369l8224J0189L0556k5976j6221
1592b0307L3127k509l1442K1049K2031l3037n978L7378j0578l1557K4407J6489
1604A9073l2177J333L1285j8595k1789L1136O817l4698J0556K9603k4634j8208
1616b0298L0996L81k9849J7252K0899l0192o402L5468q508k9921K1987J7176l0235
1629a1246q28L0113j5916k1635K7908P350l2700Q999K9967k2094j8789K8913K031
1642A2073k9370J4451K1767k7100r299L1947n708k7860K0649J7667k9642k840
1654a3265L0142j2499k2688K4418R571l0890N644K9260j8678j8762K7525L668
$$ plain form
1666 13446 -16166 -4538 18960 -4920 -16641 12463 7838 -19343 165 19665 -8794 -14681
1678 -14681 15006 5491 -17866 5368 16604 -13612 -10922 17674 1316 -17746 9171 14315
1690 14315 -15767 -5556 19287 -3223 -16269 12938 9721 -19487 -2758 18636 -7398 -14117
1702 -14117 14774 4752 -19282 4642 18681 -11994 -11986 16456 1037 -18119 9118 14846 -16234
1715 -16234 -7023 19630 -1875 -16789 12400 11477 -17848 -2719 17524 -8544 -14213 16313 6277
1728 6277 -20856 1618 18625 -9886 -10703 16239 539 -19723 8421 16238 -14909 -7958 18136
1741 18136 -2243 -16495 12919 11895 -17836 -2470 19111 -7560 -15627 15365 8157 -18621
1753 -18621 1041 15429 -12216 -9807 19384 1797 -21482 5613 16186 -12946 -6566 17332
$$ packed form
1666A3446k9612J1628K3498k3880j1721K9104m625k7181J9508J9500k8459n887
1678a4681K9687r515k3357K3234J1236l0216K690K8596j6358j9062K6917N144
1690A4315l0082J0211K4843k2510j3046K9207l217k9208J6729K1394k6034o719
1702a4117K8891j0022k4034K3924J4039l0675QK8442j5419j9156K7237N728l1080
1715a6234R211K6653k1505j4914K9189r23k9325J5129K0243k6068n669L0526j0036
1728F277k7133K2474J7007k8511q17K6942j5700k0262K8144P817l1147O951K6094
1741A8136k0379j4252K9414j024k9731J5366K1581k6671q067L0992p208k6778
1753a8621J9662J4388k7645K409K9191j7587k3279K7095J0573k9132O380K3898
$$ plain form
1765 17332 -4716 -17854 13548 13023 -18000 -3141 19207 -6280 -14455 14593 6339 -18134 4493
1778 4493 17088 -14852 -12959 19650 4876 -19216 4304 12803 -13509 -4172 19415 -4992 -19346
1791 -19346 11678 12231 -16999 -2382 18205 -7279 -13644 16203 6942 -18798 3203 17814 -12119
1804 -12119 -13218 15444 3252 -15448 8242 12366 -16881 -6053 20196 -2260 -18359 9429
1816 9429 10011 -16327 -692 18746 -7814 -15199 14214 7783 -16468 2250 15318 -10477 -8712
1829 -8712 16449 -280 -18124 9428 15823 -15716 -9877 16543 21 -13306 9940 6802 -18095
1842 -18095 -560 18864 -6509 -14442 12650 6244 -15585 3586 14559 -11494 -8628 17793
1854 17793 1713 -18317 6391 15649 -11089 -7587 12420 -3870 -12403 12801 8665 -17525 -2037
$$ packed form
1765A7332k2048j3138L1402n25l1023J4859K2348k5487q175K9048q254k4473K2627
1778D493J2595l1940J893L2609j4774k4092K3520Q499k6312R337K3587k4407j4354
1791a9346L1024N53k9230J4617K0587k5484o365K9847r261k5740K2001J4611k9933
1804a2119j099K8662j2192j8700K3690M124k9247J0828K6249k2456j6099K7788
1816I429N82k6338J5635J9438k6560p385K9413o431k4251J8718J3068k5795J765
1829h712K5161j6729j7844K7552O395l1539N839K6420j6522j3327K3246l138k4897
1842a8095J7535J9424k5373p933K7092o406k1829J9171J0973k6053K866K6421
1854A7793j6080k0030K4708R258k6738L502K0007j6290q533K5204m136k6190J5488
$$ plain form
1867 -2037 17797 -5350 -13428 11338 4946 -16186 2313 15036 -8869 -8716 15235 2291 -15560
1880 -15560 5618 12066 -11669 -5262 14777 -3134 -14776 10309 11011 -13465 -3462 13405 -5984
1893 -5984 -11704 12258 5940 -15845 330 13504 -7680 -8590 12821 1697 -14075 6632 12079
1906 12079 -12460 -7072 15074 161 -14359 6189 9682 -10034 -1068 13107 -7166 -12337 12173
1919 12173 7410 -15398 -1669 13164 -5731 -8313 11881 2111 -14061 4544 11418 -11369 -6828
1932 -6828 14966 1979 -12752 5775 8613 -11125 -1912 13682 -5287 -13094 10291 8634 -12646
1945 -12646 -1206 12714 -5959 -9534 9934 2354 -13355 4115 12025 -10139 -7664 14190 2077
1958 2077 -13668 4673 10090 -10011 -4062 12779 -2546 -11390 8878 7233 -12522 -359 14225
$$ packed form
1867b037J9834k3147q078K4766o392k1132J8499J2723k3905J53K3951j2944j7851
1880a5560K1178O448k3735O407K0039j7911j1642K5085P02k4476J0003J6867j9389
1893e984n720K3962o318k1785J6175J3174k1184r10K1411j1124j5772K0707N447
1906A2079k4539N388K2146j4913j4520K0548L493j9716Q966J4175k0273n171K4510
1919A2173m763k2808J3729J4833j8895k582K0194r770j6172J8605O874k2787M541
1932f828K1794j2987j4731J8527K838j9738R213J5594j8969p807K3385j657k1280
1945a2646J1440J3920j8673l575J9468p580j5709J7470P910k2164K475K1854j2113
1958B077j5745J8341N417k0101N949J6841j5325q844K0268j645j9755J2163J4584
$$ plain form
1971 14225 -5798 -11651 9875 4980 -12997 1624 11419 -8927 -7819 13144 2376 -13131 4920
1984 4920 10850 -10295 -5689 11892 -1989 -10819 9700 7817 -13777 -1291 15305 -4413 -12930
1997 -12930 8834 6446 -11676 1258 10954 -8567 -7176 13223 792 -15165 4817 12288 -10449
2010 -10449 -6949 12830 -273 -11424 8268 8013 -13308 -2401 14590 -3569 -11590 9749 6355
2023 6355 -12416 1028 11741 -8358 -8228 13385 1751 -15436 4112 12557 -9899 -7327 12493
2036 12493 -107 -11829 7408 8252 -12202 -1389 14111 -5427 -12071 11150 7386 -13341 411
2049 411 13342 -6617 -8313 11711 1483 -14327 4596 11793 -10606 -6645 13618 -215 -12493
2062 -12493 6979 7964 -12409 -1555 13993 -5822 -12029 11496 7811 -13211 -84 12831 -6376
$$ packed form
1971A4225k0023n853K1526m895j7977J4621R795k0346J108K0963j0768j5507J8051
1984D920N930k1145M606J7581j3881q830K0519j883k1594J2486J6596j9718q517
1997a2930K1764k388j8122J2934R696j9521J391K0399j2431j5957J9982P471k2737
2010a0449L500J9779j3103j1151J9692k55k1321J0907J6991j8159q021K1339l394
2023F355j8771J3444J0713k0099J30K1613j1634j7187J9548Q445k2456K572J9820
2036A2493j2600j1722J9237Q44k0454J0813J5500j9538o644K3221l764k0727J3752
2049D11J2931j9959j696K0024j0228j5810J8923P197k2399L961K0263j3833j2278
2062a2493J9472R85k0373J0854J5548j9815o207K3525l685k1022J3127J2915j9207
$$ plain form
2075 -6376 -8189 11791 1368 -13347 5798 11680 -11397 -6771 13992 -314 -13167 6702 8398
2088 8398 -11924 -1885 13209 -5556 -11564 10902 6564 -13395 637 12758 -6642 -7964 11728
2101 11728 1832 -12684 5600 10891 -11144 -5860 13785 -211 -12868 6181 8317 -10990 -2212
2114 -2212 12104 -5101 -10427 10549 5425 -13550 618 12775 -6633 -8394 10923 2309 -11822
2127 -11822 5238 10426 -10178 -5330 13029 -688 -12307 6470 8122 -10577 -2219 11531 -4660
2140 -4660 -9768 9950 4600 -13273 723 12017 -6726 -8592 10399 2590 -11009 4393 9532
2153 9532 -9571 -4509 12591 -1104 -12057 6532 8509 -10254 -2825 10977 -3674 -8845 9111
2166 9111 4182 -12470 765 11683 -6449 -8688 9510 2598 -10591 3454 8750 -8447 -4215
$$ packed form
2075f376j813J9980j0423j4715J9145N882k3077M626K0763j4306j2853J9869J696
2088H398k0322J0039J5094j8765o008K2466m338j9959J4032J2121j9400j322J9692
2101A1728r896j4516J8284N291k2035N284J9645j3996j2657J9049K136j9307Q778
2114b212J4316j7205n326K0976n124j8975J4168J2157j9408j761J9317q614j4131
2127a1822J7060N188k0604M848J8359j3717j1619J8777J652j8699Q358J3750j6191
2140d660n108J9718n350j7873J3996J1294j8743j866J8991p809j3599J5402N139
2153I532j9103N062J7100j3695j0953J8589J977j8763P429J3802j4651n171J7956
2166I111m929j6652J3235J0918j8132k239J8198o912j3189J4045N296j7197M232
$$ plain form
2179 -4215 11906 -829 -11356 6197 8708 -9194 -3401 10066 -2993 -8178 8105 4659 -11318
2192 -11318 268 11073 -5541 -8321 8871 2960 -10348 2170 8380 -7345 -4727 10644 -171
2205 -171 -10679 5288 8465 -8532 -3318 10082 -2017 -8753 6959 5184 -9592 129 10209
2218 10209 -5579 -8033 9040 3682 -10692 929 8716 -6286 -5438 9168 -185 -10055 4956
2231 4956 8317 -8601 -3804 10622 -758 -9074 5682 5539 -8688 -123 10133 -4988 -8582
2244 -8582 8837 4743 -10045 106 8640 -5670 -5528 8769 650 -10161 4180 8272 -8376
2257 -8376 -4476 10413 -50 -9349 4962 6141 -8492 -907 10013 -3853 -8393 8071 4810
2270 4810 -9801 552 9547 -5431 -6982 8318 1866 -9801 3396 7864 -8576 -4739 10663
$$ packed form
2179d215J6121j2735j0527J7553K511j7902N793J3467j3059n185J6283l446j5977
2192a1318J1586J0805j6614k780J7192n911j3308J2518O210j5725K618J5371j0815
2205a71j0508J5967L177j6997N214J3400j2099o736J5712j775j4776R721J0080
2218A0209j5788k454J7073n358j4374J1621P787j5002Q48J4606r353r870J5011
2231D956L361j6918M797J4426j1380q316J4756j43j4227Q565J0256j5121l594
2244h582J7419m094j4788J0151Q534j4310J42J4297q119j0811J4341M092j6648
2257h376L900J4889j0463r299J4311J179j4633P585J0920j3866m540J6464l261
2270D810j4611J0353Q995j4978j551J5300o452j1667J3197M468j6440L837J5402
$$ plain form
2283 10663 12 -10202 4809 7172 -8305 -1952 9923 -3196 -8127 8101 4646 -10804 603
2296 603 10717 -4825 -7795 8213 2425 -9550 3530 8342 -8656 -5295 10710 240 -10389
2309 -10389 4934 7279 -8809 -2593 10250 -2929 -8654 8260 5117 -10657 -176 10854 -4672
2322 -4672 -7340 8938 2444 -10430 3199 9222 -7604 -5367 9750 -328 -10137 5539 7659
2335 7659 -9681 -2980 10731 -2369 -8940 7283 5245 -10237 189 10453 -5373 -7323 9772
2348 9772 2973 -10953 2484 9193 -6684 -4637 10003 -963 -10768 5809 8229 -9533 -3565
2361 -3565 9848 -2556 -8457 7742 4431 -10545 591 10593 -5844 -7905 9294 3341 -10202
2374 -10202 2720 8763 -7569 -4109 10810 -749 -10995 5465 7865 -8401 -2369 9731 -3794
$$ packed form
2283A0663j0651j0214J5011K363j5477O353J1875j3119m931J6228l455j5450J1407
2296F03J0114j5542k970J6008n788j1975J3080M812j6998L361J6005j0470j0629
2309a0389J5323K345j6088O216J2843j3179n725J6914l143j5774J0481J1030j5526
2322d672k668J6278o494j2874J3629O023j6826K237J5117j0078r809J5676K120
2335G659j7340O701J3711j3100o571J6223k038j5482J0426J0264j5826j950J7095
2348I772o799j3926J3437O709j5877K047J4640j0966r805J6577K420j7762N968
2361c565J3413j2404n901J6199l311j4976J1136J0002j6437k061J7199n953j3543
2374a0202J2922O043j6332L460J4919j1559j0246J6460K400j6266O032J2100j3525
$$ plain form
2387 -3794 -8990 8131 5146 -10800 -369 10022 -5150 -7002 8826 2237 -9669 3498 8450
2400 8450 -8330 -4892 10888 519 -9748 4645 6649 -8458 -1392 10111 -3558 -9242 7144
2413 7144 5373 -9351 -321 8777 -5429 -6237 8939 1822 -10032 3372 9051 -7607 -5320 9339
2427 9339 458 -8650 5033 6090 -8458 -1341 10139 -2508 -8513 6255 3936 -9411 752
2440 752 9256 -5128 -6999 8319 2314 -9565 2041 7386 -6687 -3961 8730 -714 -8306 5757
2454 5757 6759 -8331 -2819 9128 -2071 -7227 6561 4087 -8989 605 9433 -4274 -7243
2467 -7243 6606 2313 -7729 2611 6513 -6805 -3742 9177 -482 -9359 4254 7399 -6711
2480 -6711 -3309 7285 -1519 -6177 6090 3833 -8305 46 8776 -3581 -6180 6694 2388 -8176
$$ packed form
2387c794n196J7121k985j5946J0431J0391j5172j852J5828o589j1906J3167M952
2400H450j6780L438J5780j0369j0267J4393K004j5107P066J1503j3669n684J6386
2413G144j771j4724R030R098j4206q08J5176p117j1854J3404N679j6658K287J4659
2427I339q881r108J3683J057j4548P117J1480j2647o005J4768k319j3347J0163
2440G52Q504j4384j871J5318o005j1879J1606N345j4073K726J2691r444p592J4063
2454E757J002j5090N512J1947j1199n156J3788k474j3076R594Q828j3707k969
2467g243J3849m293j0042J0340L902j3318L063J2919r659q877J3613L145j4110
2480f711L402J0594q804m658J2267k257j2138Q351Q730j2357k599J2874m306j0564
$$ plain form
2494 -8176 1580 7012 -5931 -4862 8246 907 -8181 2886 6110 -6355 -2951 6958 -1824 -6462
2508 -6462 6173 4683 -7840 -528 8563 -3185 -6840 6330 3633 -8077 251 7325 -3579
2521 -3579 -4058 6620 85 -7745 3258 5823 -7004 -3443 8436 -288 -7735 3964 5165 -6519
2535 -6519 -1022 7511 -3081 -6489 6196 3804 -7350 -138 7173 -3498 -4279 6797 532 -8144
2549 -8144 3035 7024 -6804 -4978 7461 791 -7450 3051 4767 -5743 -784 7590 -3430
2562 -3430 -7461 6159 4450 -7665 -276 8128 -3127 -5188 6363 1752 -7665 2092 6645 -6018
2576 -6018 -4132 7654 521 -7527 3637 5484 -6878 -2517 7678 -2119 -6692 5840 4414 -7887
2590 -7887 -549 8109 -3396 -6023 6227 2573 -7078 2187 6817 -5952 -3885 8405 539 -8671
$$ packed form
2494h176R756N432j2943J069J3108p339r088J1067L224j2465L404R909q782m638
2508f462J2635j490j2523P312R091j1748l655J3170k697j1710Q328P074j0904
2521c579m79J0678o535p830J1003K565j2827L561J1879q724p447J1699J201j1684
2535f519N497Q533j0592l408J2685k392j1154P212P311j0671p81J1076o265q676
2549h144J1179L989j3828J826J2439o670q241J0501J716j0510M959Q374j1020
2562c430m031J3620j709j2115P389Q404j1255k061J1551m611r417R757M553j2663
2576f018J886J1786p133q048J1164J847j2362M361J0195r797m573J2532j426j2301
2590g887P338Q658j1505k627J2250l654r651R265M630j2769K067J2290p866r210
$$ plain form
2604 -8671 2904 6206 -6198 -2657 7059 -2082 -6362 5849 3778 -8648 -215 8844 -3047 -6683
2618 -6683 6079 2687 -7422 1689 6623 -5578 -3573 8756 430 -8396 3306 6180 -6554
2631 -6554 -2788 7276 -1952 -6748 5891 4387 -8022 -611 8257 -3558 -6652 5910 2629 -7464
2645 -7464 1893 6902 -5286 -3636 8318 54 -8357 4021 6711 -6587 -3154 7777 -1200 -6776
2659 -6776 4872 3592 -7377 186 7788 -4348 -6297 7016 2814 -7633 1353 6787 -5042
2672 -5042 -3736 7774 -10 -7669 4210 6377 -6655 -2703 7426 -1144 -6007 5069 3178 -7682
2686 -7682 440 7713 -4437 -6295 6723 2925 -7689 960 6212 -4866 -3355 6711 -585 -7316
2700 -7316 4196 5675 -6369 -2120 7784 -1125 -6167 4643 3683 -6855 45 7025 -3784 -5640
$$ packed form
2604h671J1575L302j2404L541R716r141m280J2211k071j2426Q433R059j1891l636
2618f683J2762l392j0109R111M934j2201K005J2329q326q826J1702K874j2734
2631f554L766J0064r228m796J2639j504j2409P411Q868j1815l094J2562l281j0093
2645g464R357N009j2188J650J1954q264q411J2378K690j3298L433J0931q977n576
2659f776J1648j280j0969P563P602j2136j949J3313m202j0447Q986N434j1829
2672e042J306J1510p784p659J1879K167j3032L952J0129q570m863J1076j891j0860
2686g682Q122P273j2150j858J3018l798j0614Q649N252j1078J511J0066p296o731
2700g316J1512J479j2044M249R904q909n042J0810r60j0538O900O980j0809j856
$$ plain form
2714 -5640 6089 2319 -7197 1324 6055 -4347 -3458 6206 -494 -6682 3863 5155 -6493 -2335
2728 -2335 7360 -582 -6117 4019 3693 -5706 167 5953 -3738 -4618 6101 1992 -7200 1178 6151
2743 6151 -4138 -3869 5624 -217 -5930 3214 4488 -5825 -2249 6621 -908 -5640 3902 3633 -5554
2758 -5554 -48 6006 -2795 -4320 5474 1993 -6415 781 5991 -3543 -3717 5310 792 -5443 2374
2773 2374 4119 -4968 -1760 6024 -1077 -5856 3334 4046 -4952 -915 5246 -1830 -3980 4848 2139
2788 2139 -6035 640 5865 -3113 -4129 4736 1152 -5130 1808 4262 -4343 -2137 5749 -724 -5837
2803 -5837 2634 4032 -4733 -1451 4946 -1488 -3919 4342 2584 -5581 175 5458 -2692 -4030 4660
2818 4660 1532 -5328 1182 4642 -3443 -2393 5278 -281 -5573 2662 4086 -4624 -2174 5197 -935
$$ packed form
2714e640J1729l770r516Q521M731j0402Q89R664o700o188J0545J292j1648M158
2728b335R695p942n535J0136l26r399N873N786r691q80J0719m109r192Q378M973
2743F151j0289K69R493n841n713R144J274j0313L576Q870p529m732R542k69r187
2758e554N506O054q801j525R794l481q408P196N210r534j74R027m518o235P817
2773B374J745r087L208P784p101m779R190P12q998M037O161p076k150Q828k709
2788B139q174O675N225q978j016Q865l584o282O938K454q605K206P886o473n113
2803e837Q471J398q765L282O397o434k431Q261j758q165N756N283q150j338Q690
2818D660l128o860O510L460q085J050P671n559n292Q235J424q710K450P371o132
$$ plain form
2833 -935 -4697 3431 2754 -4812 88 5434 -2486 -4107 4894 2265 -5409 461 4642 -3040 -2677 4968
2849 4968 217 -5419 2420 4613 -4679 -2477 5383 -686 -5168 2956 2855 -4789 -212 5588 -2281
2864 -2281 -4441 4788 2650 -5170 275 4951 -3069 -3244 5102 752 -5417 1975 4606 -4336 -2576
2879 -2576 5412 -348 -5448 2904 3484 -5194 -1102 5385 -2223 -4564 4400 2319 -5258 746 5478
2894 5478 -3052 -3783 4920 970 -5118 1948 4204 -4645 -2158 6237 -199 -5604 2667 3644 -4772
2909 -4772 -1160 5109 -2213 -4610 4424 2232 -5664 598 5932 -2807 -3854 4821 1125 -5105 2210
2924 2210 4494 -4721 -2334 5828 78 -5262 3241 3616 -4919 -1029 5529 -2132 -4715 4188 2132
2939 2132 -5899 281 5309 -2919 -3403 4932 894 -5437 2111 4810 -3994 -2376 5328 -551 -4690
$$ packed form
2833i35l762Q128o77p566M900N346p920j621R001k629p674N870M181p682L63P645
2849D968m751n636P839K193r292K202P860o069m482Q124j01p644M577N800p869
2864b281k160R229k138p820N445M676q020j75Q346m350o169P392K631q942J760
2879b576P988n760n100Q352N80q678M092O487p608k341Q964k081p577O004M732
2894E478q530p31Q703l950o088P066K256q849K487Q395o436n405Q271R77q416
2909d772L612O269p322k397R034k192p896O262N334q739j047Q675l696o230P315
2924B210K284r215K387Q162n750n340Q503L75q535L890O558p661k583Q903k056
2939B132q031O180N028q228m84Q335m038o331P548K699q804J618P704n879m139
$$ plain form
2954 -4690 3370 3641 -5223 -953 5671 -1712 -4226 4016 1754 -5683 451 4900 -3487 -3512 5145 1113
2970 1113 -5278 1912 4525 -3848 -1825 5131 -1258 -5140 3572 3773 -4611 -871 5288 -1627 -3564
2985 -3564 4228 1691 -5438 571 4920 -3316 -3497 4496 667 -4884 2100 3894 -4025 -1735 5160
3000 5160 -687 -5199 2672 3237 -4334 -671 4789 -1922 -3706 4384 2197 -4809 97 4470 -2969
3015 -2969 -2983 4240 484 -4776 1854 3864 -3963 -2005 4668 -260 -4500 2639 2739 -4338 -464 4622
3031 4622 -1749 -3974 3505 2187 -4075 479 3922 -2384 -2526 4263 695 -4693 1211 3476 -3371
3046 -3371 -1992 4025 -296 -3943 2658 2811 -3976 -878 4232 -1276 -3627 3005 1723 -3929 327
3061 327 4154 -2202 -2951 3715 1267 -3843 975 3176 -3128 -2032 3828 23 -4150 1996 3029
$$ packed form
2954d690Q060K71q864M270O624p383k514Q242k262p437O134M449q387k5Q657m032
2970A113o391P190K613q373K023O956o389l882Q712K01q384L740O159o915j937
2985c564P792k537p129O009M349q236j81P993l829n551O984J794p919K290O895
3000E160n847m512P871N65p571L663N460o711j784Q090k187p006M906M373p439
3015b969j4P223l756n260O630K010p827J958O673m928m240P139J00p077L874N086
3031D622o371k225P479j318o262M554L443o306j42O789l568n388N904K265o847
3046c371J379O017m321l647O601J53o787L098N110n508k351O632j282n652M256
3061C27L827o356p49O666k448n110M818K201o304J096N860l805m173O146J033
$$ plain form
3076 3029 -3178 -1108 3882 -1058 -3511 2593 1691 -3968 -55 4246 -1453 -3056 3242 1324 -3435
3091 -3435 999 3259 -2844 -2100 4032 252 -4089 1354 3132 -3026 -1621 3407 -627 -3188 2460
3106 2460 2185 -3758 -475 3804 -1306 -2955 2982 1344 -3702 892 3950 -2198 -2605 3634 866
3121 866 -3961 981 3225 -2621 -1759 3501 -238 -3547 2196 2430 -3308 -333 4127 -1522 -3637 3000
3137 3000 1877 -3951 -200 3955 -1314 -2137 3512 962 -3889 1459 3352 -3158 -2463 3633 221
3152 221 -3666 2238 2801 -3447 -1022 4000 -1294 -4167 2326 2177 -3623 -397 3492 -1661 -2250 3748
3168 3748 747 -4137 1541 4221 -2880 -2610 3954 458 -3821 1632 2924 -3452 -991 4164 -983
3183 -983 -3644 2853 2014 -4174 -262 3893 -2059 -3040 3712 1213 -4132 1061 3891 -2692 -2121 4103
$$ packed form
3076C029o207K070M990m940k453O104r02n659L913M301n699j603O298j918m759
3091c435M434K260o103P44O132l780m341N443J778o158J405N028m034k561N648
3106B460k75n943L283M279n110j649N937j638n046M594L058o148m07O239k768
3121H66m827M942K244n846Q62N260l739l309N743K34n738K975M460n649k115O637
3137C000j123n828L751M155n269q23N649k550m851N348J893o510O95O096l412
3152B21l887N904N63o248K425N022n294k873O493j49n800L226L889n153n89N998
3168C748l001m884N678K680p101K70O564l496m279N453J292o376K461N155n147
3183i83k661O497q39o188L912M155n952r81O752k499n345N193K830o583N71O224
$$ plain form
3199 4103 435 -3899 1747 3097 -3351 -959 4063 -1441 -3537 3199 2192 -4434 -540 4308 -1630
3214 -1630 -3340 2930 737 -3891 1335 3494 -3000 -1775 4534 432 -4305 1598 2882 -3263 -1089
3229 -1089 4047 -1005 -3502 3307 2398 -4154 -417 4121 -1847 -3134 2897 764 -4078 1380 3476
3244 3476 -3258 -2214 4420 247 -3902 1842 3301 -3326 -1144 3831 -998 -3262 2951 2061 -3993
3259 -3993 211 4014 -1945 -3106 3198 921 -4123 659 3089 -2795 -1779 3933 -104 -4008 2123
3274 2123 2950 -3288 -1291 3787 -848 -3105 2738 1772 -3796 360 3907 -1983 -2887 3307 1432 -3536
3290 -3536 902 2721 -2937 -1722 3679 -377 -4003 1759 3097 -2724 -1180 3488 -655 -2647 2473
3305 2473 1573 -3559 222 3655 -1956 -2910 3144 1502 -3471 823 3004 -2391 -1752 3113 -297 -3661
$$ packed form
3199D103l668m334N646J350o448K392N022n504k096O736j007o626L894M848n938
3214a630j710O270k193m628N226K159o494J225O309m102m737N903J284o145K174
3229a089N136n052k497O809r09o552L737M538n968j287O031k133m842N458K096
3244C476o734J044O634m173m149N744J459o627K182M975m829k264O213q90o054
3259c993M204L803n959j161O304k277n044M782K430n884J016N712m037l904O131
3274B123Q27o238J997N078m635k257N843r66n568M156L547n890r04O194j875m968
3290c536M438J819n658J215N401m056l626N762J338n821J544M668m143j992N120
3305B473r00n132L781L433n611r54O054j642m973M294K181n395O39M865l410l364
$$ plain form
3321 -3661 1776 2581 -3060 -1205 3244 -609 -2901 2299 1683 -3142 80 3273 -1909 -2706 3000 1592
3337 1592 -3109 473 2893 -1814 -1543 2806 -148 -3202 1637 2630 -3039 -1494 3440 -233 -2904
3352 -2904 1722 1809 -2648 18 3077 -1699 -2526 2683 1351 -3227 167 3028 -1495 -1644 2736 175
3368 175 -3014 1229 2467 -2684 -1534 3041 -124 -2898 1779 1724 -2514 -342 2803 -1176 -2386 2569
3384 2569 1176 -3310 -67 3137 -1476 -1973 2441 936 -2554 1088 2524 -2287 -1467 3101 -61
3399 -61 -3184 1257 2102 -2569 -889 2656 -799 -2231 2368 1378 -3102 -386 3073 -1088 -2285 2265
3415 2265 820 -2823 1027 2664 -2226 -1500 3051 252 -3173 1101 2411 -2314 -1060 2674 -570
3430 -570 -2654 2142 1612 -3099 -337 3085 -1154 -2575 2468 1284 -2954 347 2769 -1872 -1532 3137
$$ packed form
3321c661N437Q05n641J855M449l853k292N200o16m825L222L193n182p97N706j408
3337A592m701L582K420m707K71M349k954l054M839R93n669J545M934l673k671
3352b904M626Q7m457K666L059m776q27N209j332m578L394K861m523j49M380k561
3368A75l189M243J238n151J150M575l165k774M677n5m238K172L145l979j210M955
3384B569j393m486L243L204m613m97M414j505l490L642J436m811Q20M568l162
3399f1l123M441Q45m671J680L545l455j432M599r90m480K716L459m161j197M550
3415B265j445l643L850J637m890P26M551k799l425M274J310m725J254L734l244
3430e70k084M796n30m711K762L422m239j421N043j184m238L301K422m641L40M669
$$ plain form
3446 3137 198 -3289 1226 2621 -2433 -1520 2907 -253 -2734 1967 1725 -3050 -282 3125 -1531
3461 -1531 -2793 2699 1477 -3106 126 2757 -1714 -1622 2977 276 -3270 1431 3086 -2485 -1474
3476 -1474 3031 -142 -2946 1805 1840 -2889 -213 3515 -1599 -2904 2503 1390 -3374 302 2740
3491 2740 -2087 -1721 3040 227 -3211 1483 2777 -2627 -1336 3444 -199 -2935 1712 1883 -2916
3506 -2916 -325 3230 -1286 -2726 2832 1365 -3253 261 2949 -1761 -2038 2760 415 -3060 1475
3521 1475 2432 -2861 -992 3622 -267 -3098 1832 2065 -2825 -188 3134 -1368 -2471 2852 1290
3536 1290 -3394 483 2907 -1961 -2040 2707 184 -3040 1681 2556 -2869 -1176 3258 -206 -2732 1763
3552 1763 1731 -2993 -233 3126 -1299 -2446 2756 1250 -3008 466 2910 -1979 -1871 3016 186 -2834
$$ packed form
3446C137k939l487M515J395n054R13M427l160k481M701k42m775K768L407m656
3461a531j262N492j222m583L232K631m471R2M599k701l546M701J655n571J011
3476a474M505l173k804M751L5m729K676L728n114j305N407j113m764L676K438
3491B740m827L66M761k813l438M694J294n404J291M780l643k736M647J71m799
3506b916K591L555m516j440N558j467m618L514K688m710k77M798k345l475M535
3521A475R57n293J869M614l889k831M930K33m890K637L322m502j103N323j562
3536A290m684L877K424m868p9M747k523l224M721Q75n425J693M434l464k526M495
3552A763l2m724K760L359m425j147N202j506m258L474K444m889J08M887k830l020
$$ plain form
3568 -2834 1440 2232 -2519 -1274 3052 -529 -2683 1996 1747 -2907 -291 2924 -1172 -1906 2455 911
3584 911 -3070 595 2832 -1725 -1762 2720 299 -2714 1236 2118 -2503 -708 2874 -553 -2938 1669
3600 1669 1894 -2409 -538 2697 -1130 -1946 2310 837 -2819 550 2640 -1757 -1640 2484 436 -2454
3616 -2454 1205 2257 -2202 -1093 2571 -384 -2612 1450 1738 -2334 -324 2390 -1171 -1921 1944
3631 1944 1102 -2534 194 2295 -1614 -1512 2433 469 -2405 725 2145 -1713 -968 2369 -180 -2365
3647 -2365 1271 1386 -2340 -584 2632 -690 -2117 1635 1037 -2209 0 2364 -1420 -1549 2201 461
3663 461 -2421 581 2028 -1520 -1014 2444 -18 -2298 1201 1791 -2163 -804 2285 -540 -2141 1331
3679 1331 1150 -2223 -65 2342 -1063 -1722 1948 885 -2263 579 2173 -1567 -1129 2277 556 -2209
$$ packed form
3568b834M274P92m751J245M326l581k154M679k49m654K616L215m096p34M361j544
3584I11l981L665K237m557l7M482k421l013L950Q82m621J795L582l427k385M607
3600A669K25m303J871L235l827q16M256j473l656L369K090m397J17M124k048k890
3616b454L659J052m459J109L664k955k228M062K88m072K010K714l561p50L865
3631A944q42l636K728K101l909J02L945j964k874L130J420l858P45L337k549k185
3647b365L636J15l726J756L216l322j427L752n98l246K209K364l784j29L750j740
3663D61k882L002J447l548N06L458k462k280L499N90l954J359L089k825j601L472
3679A331j81l373K158K407l405o59L670j063l148K842J594l740M38L406j721k765
$$ plain form
3695 -2209 855 1820 -1898 -786 2354 -495 -2267 1335 1221 -2298 -356 2225 -688 -1629 1828 926
3711 926 -2284 318 2069 -1468 -1616 2159 629 -2225 955 2112 -1722 -939 2305 -261 -2347 1090
3727 1090 1663 -1914 -481 2287 -683 -2000 1745 916 -2545 104 2442 -1361 -1647 2220 635 -2204
3743 -2204 888 2212 -1737 -1240 2366 179 -2149 1464 1594 -2133 -430 2369 -880 -2390 1830
3758 1830 1262 -2410 0 2286 -1065 -1565 2086 550 -2628 762 2251 -1800 -1060 2476 14 -2213
3774 -2213 1374 1799 -2353 -569 2685 -541 -2330 1639 1218 -2221 33 2059 -1389 -1558 2221 448
3790 448 -2588 775 2084 -2102 -1228 2564 33 -2449 1288 1899 -2040 -621 2403 -586 -2085 1794
3806 1794 1084 -2524 467 2486 -1428 -1652 2295 624 -2561 749 1907 -1869 -1139 2385 -201 -2199
$$ packed form
3695b209L064R65l718J112L140k849j772L602j14l519J942K581k913r41L457r02
3711I26l210K602J751l537j48L775j530k854L180J157l834P83L244k566k086L437
3727A090N73l577J433K768k970j317L745q29l461K649K338l803k86L867j585k839
3743b204L092J324l949M97L606k187k328L613J30l727J703K799l249j510M220
3758A830n68l672K410K286l351n00L651j536l178L390J489m051P40L536k462k227
3774b213L587M25m152J784L254l226j789L969m21l439K254K026l448j69L779j773
3790D48l036L363J309m186Q74L792k531k482L737O11l939J419L024k989j499L879
3806A794p10l608K991K019l914k24L947j671l185L310J158l776P30L524k586j998
$$ plain form
3822 -2199 1331 1528 -2068 -228 2371 -1007 -2067 2003 1160 -2407 104 2413 -1126 -1740 2032 432
3838 432 -2244 705 1884 -1867 -1411 2222 -135 -2160 1337 1466 -2229 -264 2196 -936 -2048 1913
3854 1913 1200 -1919 -55 2051 -951 -1433 1842 286 -2272 875 1864 -1737 -908 2174 -160 -2273
3870 -2273 1234 1400 -2186 -381 2202 -608 -1613 1565 917 -2175 298 2099 -1155 -1422 1893 515
3886 515 -1995 620 1599 -1459 -624 2246 -258 -2093 1024 1358 -1567 -512 1836 -632 -1350 1584
3902 1584 844 -2038 164 2181 -1035 -1658 1461 426 -1885 572 1521 -1435 -962 2070 10 -1974
$$ packed form
3822b199L530J97l596J840K599l378j060M070q43l567K511K309l539o14L772j600
3838D32k676K949J179l751M56L633k357k025L497J29l695J965K460l132j112L961
3854A913p13l119J864K106l002m82L275j556k558L147R89l601Q29L082k334k113
3870b273L507J66l586J805K583k810j005L178o48l092K473J801l254k67L315j378
3886E15k510K615R79l058Q35K870k504j835L117L34k925J055K348k468p18K934
3902A584p40k882K202K017l216o23L119j035k311K457R49k956M73L032k060j984
$$ [...]
8191C07
##END NTUPLES=NMR FID
##END=
