##TITLE=1H ikalashn
L-D
19.12.2024
##JCAMPDX= 6.0         $$ Bruker NMR JCAMP-DX V2.0
##DATA TYPE= NMR SPECTRUM
##DATA CLASS= NTUPLES
##ORIGIN= UXNMR, Bruker Analytische Messtechnik GmbH
##OWNER= root
$$ TOPSPIN		Version 1.3
$$ 2024-12-19 14:20:12.796 +0400  Irina@DPX200
$$ Compression mode = diff/dup
##.OBSERVE FREQUENCY= 200.131300845
##.OBSERVE NUCLEUS= ^1H
##.ACQUISITION MODE= SIMULTANEOUS
##.ACQUISITION SCHEME= undefined
##.AVERAGES= 64
##.DIGITISER RES= 18
##SPECTROMETER/DATA SYSTEM= spect
##.PULSE SEQUENCE= zg
##.SOLVENT NAME= CDCl3
##.SHIFT REFERENCE= INTERNAL, CDCl3, 1, 17.49637
##AUDIT TRAIL= $$ (NUMBER, WHEN, WHO, WHERE, WHAT)
$$ ##TITLE= Audit trail, TOPSPIN		Version 1.3
$$ ##JCAMPDX= 5.01
$$ ##ORIGIN= Bruker BioSpin GmbH
$$ ##OWNER= Irina
$$ $$ F:/spectra/data/iren/nmr/1H/4/pdata/1/auditp.txt
$$ ##AUDIT TRAIL=  $$ (NUMBER, WHEN, WHO, WHERE, VERSION, WHAT)
(   1,<2024-12-19 14:19:37.343 +0400>,<Irina>,<DPX200>,<TOPSPIN 1.3>,
      <created by zg
	started at 2024-12-19 14:15:24.546 +0400,
	POWCHK disabled, PULCHK disabled
       configuration hash MD5:
       BE 6D 3F 07 2A EA 11 49 91 17 2B D3 AF B3 58 0D
       data hash MD5: 16K
       6D 88 5F 90 4F FA 1E 0F 35 4F B3 2D 32 D2 5B 3E>)
(   2,<2024-12-19 14:19:57.875 +0400>,<Irina>,<DPX200>,<TOPSPIN 1.3>,
      <Start of raw data processing
       efp BC_mod = 2 LB = 0.05 FT_mod = 6 PKNL = 1 PHC0 = 260.2289 PHC1 = -6.003939 SI = 32K 
       data hash MD5: 32K
       72 DF FB BC AF 81 7B D6 F6 59 C0 A6 5C B7 1B 6C>)
(   3,<2024-12-19 14:20:00.828 +0400>,<Irina>,<DPX200>,<TOPSPIN 1.3>,
      <abs n ABSG = 5 
       data hash MD5: 32K
       0A CC 44 E4 9A 23 34 C0 B2 66 20 E5 D5 52 47 D9>)
$$ ##END=
$$ 
$$ $$ hash MD5
$$ $$ 12 90 14 59 96 9C 49 A3 53 41 0D A0 6E C2 09 B8
##$RELAX= 
##$RELAX= 
##$RELAX= 
##$RELAX= 
##$RELAX= 
##$RELAX= 
##$RELAX= 
##$RELAX= 
##$RELAX= 
$$ Bruker specific parameters
$$ --------------------------
##$DU= <F:/spectra>
##$EXPNO= 4
##$NAME= <1H>
##$PROCNO= 1
##$TYPE= <nmr>
##$USER= <iren>
##$AMP= (0..31)
100 100 100 100 100 100 100 100 100 100 100 100 100 100 100 100 100 100 
100 100 100 100 100 100 100 100 100 100 100 100 100 100 
##$ANAVPT= -1
##$AQSEQ= 0
##$AQ_mod= 1
##$AUNM= <au_zg>
##$AUTOPOS= <>
##$BF1= 200.13
##$BF2= 200.13
##$BF3= 200.13
##$BF4= 200.13
##$BF5= 200.13
##$BF6= 200.13
##$BF7= 200.13
##$BF8= 200.13
##$BYTORDA= 1
##$CFDGTYP= 0
##$CFRGTYP= 5
##$CHEMSTR= <none>
##$CNST= (0..63)
1 1 145 1 1 1 1 1 1 1 1 1 1 1 1 1 1 1 1 1 1 1 1 1 1 1 1 1 1 1 1 1 1 1 
1 1 1 1 1 1 1 1 1 1 1 1 1 1 1 1 1 1 1 1 1 1 1 1 1 1 1 1 1 1 
##$CPDPRG= <>
##$CPDPRG1= <>
##$CPDPRG2= <>
##$CPDPRG3= <>
##$CPDPRG4= <mlev>
##$CPDPRG5= <mlev>
##$CPDPRG6= <mlev>
##$CPDPRG7= <mlev>
##$CPDPRG8= <mlev>
##$CPDPRGB= <>
##$CPDPRGT= <>
##$D= (0..63)
0 2 0 0 0 0 0 0 0 0.06 0 0.03 0 0 0 0 0.0002 0 0 0 0 0 0 0 0 0 0 0 0 0 
0 0 0 0 0 0 0 0 0 0 0 0 0 0 0 0 0 0 0 0 0 0 0 0 0 0 0 0 0 0 0 0 0 0 
##$DATE= 1734603576
##$DBL= (0..7)
120 120 120 120 120 120 120 120 
##$DBP= (0..7)
$$ [...]
##$SW_h= 4401.40845070422
##$TD= 16384
##$TD0= 1
##$TE= 300
##$TE2= 300
##$TE3= 300
##$TEG= 300
##$TL= (0..7)
0 120 120 120 120 120 120 120 
##$TP= (0..7)
150 150 150 150 150 150 150 150 
##$TP07= 0
##$TPNAME0= <>
##$TPNAME1= <>
##$TPNAME2= <>
##$TPNAME3= <>
##$TPNAME4= <>
##$TPNAME5= <>
##$TPNAME6= <>
##$TPNAME7= <>
##$TPOAL= (0..7)
0.5 0.5 0.5 0.5 0.5 0.5 0.5 0.5 
##$TPOFFS= (0..7)
0 0 0 0 0 0 0 0 
##$TUNHIN= 0
##$TUNHOUT= 0
##$TUNXOUT= 0
##$USERA1= <user>
##$USERA2= <user>
##$USERA3= <user>
##$USERA4= <user>
##$USERA5= <user>
##$V9= 5
##$VALIST= <valist>
##$VCLIST= <CCCCCCCCCCCCCCC>
##$VD= 0
##$VDLIST= <DDDDDDDDDDDDDDD>
##$VPLIST= <PPPPPPPPPPPPPPP>
##$VTLIST= <TTTTTTTTTTTTTTT>
##$WBST= 1024
##$WBSW= 25
##$XGAIN= (0..3)
0 0 0 0 
##$XL= 0
##$YL= 0
##$YMAX_a= 1104871
##$YMIN_a= -1428135
##$ZGOPTNS= <>
##$ZL1= 120
##$ZL2= 120
##$ZL3= 120
##$ZL4= 120
##$ABSF1= 17.49637
##$ABSF2= -4.496376
##$ABSG= 5
##$ABSL= 3
##$ALPHA= 0
##$AQORDER= 0
##$ASSFAC= 0
##$ASSFACI= 0
##$ASSFACX= 0
##$ASSWID= 0
##$AUNMP= <proc_1d>
##$AXLEFT= 0
##$AXRIGHT= 0
##$AXTYPE= 0
##$AXUNIT= <>
##$AZFE= 0.1
##$AZFW= 0.1
##$BCFW= 0
##$BC_mod= 2
##$BYTORDP= 0
##$COROFFS= 0
##$CY= 7568.61572265625
##$DATMOD= 1
##$DC= 0
##$DFILT= <>
##$DTYPP= 0
##$F1P= 17.9538593292236
##$F2P= -4.03888763876832
##$FCOR= 0.5
##$FTSIZE= 32768
##$FT_mod= 6
##$GAMMA= 0
##$GB= 0
##$INTBC= 0
##$INTSCL= 5.656564e-011
##$ISEN= 128
##$LB= 0.05
##$LEV0= 0
##$LPBIN= 0
##$MAXI= 945.577
##$MC2= 0
##$MEAN= 0
##$ME_mod= 0
##$MI= -402.1523
##$NCOEF= 0
##$NC_proc= -4
##$NLEV= 6
##$NOISF1= 8.587773
##$NOISF2= 6.764455
##$NSP= 0
##$NTH_PI= 0
##$NZP= 0
##$OFFSET= 17.49637
##$PC= 1
##$PHC0= 260.2289
##$PHC1= -6.003939
##$PH_mod= 1
##$PKNL= yes
##$PPARMOD= 0
##$PPDIAG= 0
##$PPIPTYP= 0
##$PPMPNUM= 100
##$PPRESOL= 1
##$PSCAL= 0
##$PSIGN= 0
##$REVERSE= no
##$SF= 200.13
##$SI= 32768
##$SIGF1= 16.12182
##$SIGF2= -4.496377
##$SINO= 3.521527
##$SIOLD= 32768
##$SREGLST= <1H.CDCl3>
##$SSB= 0
##$STSI= 32768
##$STSR= 0
##$SW_p= 4401.40845070422
##$SYMM= 0
##$S_DEV= 0
##$TDeff= 16384
##$TDoff= 0
##$TI= <>
##$TILT= no
##$TM1= 0
##$TM2= 0
##$TOPLEV= 0
##$USERP1= <user>
##$USERP2= <user>
##$USERP3= <user>
##$USERP4= <user>
##$USERP5= <user>
##$WDW= 1
##$XDIM= 32768
##$YMAX_p= 326519216
##$YMIN_p= -2418498
$$ End of Bruker specific parameters
$$ ---------------------------------
##NTUPLES= NMR SPECTRUM
##VAR_NAME=  FREQUENCY,     SPECTRUM/REAL,   SPECTRUM/IMAG
##SYMBOL=    X,             R,               I
##VAR_TYPE=  INDEPENDENT,   DEPENDENT,       DEPENDENT
##VAR_FORM=  AFFN,          ASDF,            ASDF
##VAR_DIM=   32768,         32768,           32768
##UNITS=     HZ,            ARBITRARY UNITS, ARBITRARY UNITS
##FACTOR=    0.134324425510551, 1,           1
##FIRST=     4401.40845070422, -192782,      -948368
##LAST=      0,             -211993,         -1074497
##MIN=       0,             -2418498,        0
##MAX=       4401.40845070422, 326519216,    0
$$ Real data points
##PAGE= N=1
##DATA TABLE= (X++(R..R)), XYDATA
$$ [...]
9765A7173367j07770k71207j75229K2187k7662k76811l63293j86364j0134j6325
$$ 17173367 17065597 16794390 16619161 16641348 16613686 16336875 15973582 15787218 15777084 15760759
9755A5760759j05530j66058k21615k55541j75677l4104k3582j63887k35466j31796
$$ 15760759 15655229 15489171 15267556 15012015 14836338 14802234 14778652 14614765 14379299 14247503
9745A4247503l7090j11274k22853j82803o1390n1115j37994j41634k4781N1738
$$ 14247503 14210413 14099139 13876286 13693483 13632093 13580978 13442984 13301350 13276569 13328307
9735A3328307k0657j65842k60021k64674j97859q9339j352k530p7120j22531p4440
$$ 13328307 13307650 13141808 12881787 12617113 12419254 12329915 12328563 12326033 12248913 12126382 12051942
9724A2051942J0066K6963m2512j02809n2626P8844J30498p865k22973k76949j09080
$$ 12051942 12062008 12088971 12046459 11943650 11891024 11969868 12100366 12092501 11869528 11592579 11483499
9713A1483499O2891K0198j68471k53980j44803M415L1142m9160j26481j48478
$$ 11483499 11546390 11566588 11398117 11144137 10999334 11003749 11034891 10985731 10859250 10710772
9703A0710772j33058j10876j09430j37034j48753r2126j4014l5791j69378k49516
$$ 10710772 10577714 10466838 10357408 10220374 10071621 9979495 9965481 9929690 9760312 9510796
9693I510796j42808M1352P2352q7985k23753j52501L5744J09029l817j48832j72281
$$ 9510796 9367988 9409340 9481692 9393707 9169954 9017453 9053197 9162226 9158409 9009577 8837296
9682H837296j00050m9967n3606n2136k4163j2374k4550j0596L3480L5174k9409
$$ 8837296 8737246 8687279 8633673 8581537 8557374 8545000 8520450 8509854 8543334 8578508 8549099
9671H549099p1731k8281K1354k3454j11037j12820k9284K3065J4227L1063Q6933
$$ 8549099 8477368 8449087 8470441 8446987 8335950 8223130 8193846 8216911 8231138 8262201 8349134
9660H349134O9179n6959j44438o9804P6725J28819P8916M0154M0782Q460o4238
$$ 8349134 8418313 8361354 8216916 8147112 8223837 8352656 8431572 8471726 8512508 8520968 8456730
9649H456730q5188j2798P1696P5731P32q7127j23996p1716N5945J69997J74392
$$ 8456730 8371542 8358744 8430440 8506171 8506903 8419776 8295780 8224064 8280009 8450006 8624398
9638H624398Q4168J9308N3854J25215J29015N7591m375K673N1067Q3666R3082
$$ 8624398 8708566 8727874 8781728 8906943 9035958 9093549 9089174 9091847 9142914 9226580 9319662
9627I319662J13302J46558J46793J00599P7940J39541K22386K08370J05227N1281
$$ 9319662 9432964 9579522 9726315 9826914 9904854 10044395 10266781 10475151 10580378 10631659
9617A0631659J14249K03485K34690K52321K99952L01686K06033J31702J99143
$$ 10631659 10745908 10949393 11184083 11436404 11736356 12038042 12244075 12375777 12574920
9608A2574920L05773K68496J32759J14558K49838L41620K91057K41593L06108
$$ 12574920 12880693 13149189 13281948 13396506 13646344 13987964 14279021 14520614 14826722
9599A4826722L71441L11029K11963K24927L19162L57468L24829L14920L41182
$$ 14826722 15198163 15509192 15721155 15946082 16265244 16622712 16947541 17262461 17603643
9590A7603643L16691K11421J11734J14148K26949L69604M30764L61746K46021
$$ 17603643 17920334 18131755 18243489 18357637 18584586 18954190 19384954 19746700 19992721
9581A9992721K24705L23365M19856M12652L37499K84093K92391L66424M81937
$$ 19992721 20217426 20540791 20960647 21373299 21710798 21994891 22287282 22653706 23135643
9572B3135643N43509M60949L09236K65885L47065L89016L48659L86170N37054
$$ 23135643 23679152 24140101 24449337 24715222 25062287 25451303 25799962 26186132 26723186
9563B6723186N74665L95703K76263M65005P48370P63410N70962N26323O85621
$$ 26723186 27297851 27693554 27969817 28434822 29183192 29946602 30517564 31043887 31729508
9554C1729508P67354O81603O63325Q12949R09322Q16047P19766P86860Q87743
$$ 31729508 32496862 33178465 33841790 34654739 35564061 36380108 37099874 37886734 38774477
9545C8774477Q65864Q22570R09572J041269J044524R52580R37241J036826J124442
$$ 38774477 39640341 40462911 41372483 42413752 43458276 44410856 45348097 46384923 47509365
9536D7509365J098080R89220R17201R75914J107134J112484R12102P28306Q07108
$$ 47509365 48607445 49596665 50513866 51489780 52596914 53709398 54621500 55349806 56156914
9527E6156914J018345J023847Q20742P52759R33111J067058R84356R24153J067076
$$ 56156914 57175259 58199106 59019848 59772607 60705718 61772776 62757132 63681285 64748361
9518F4748361J193704J109229J031067J190037J380662J324689J195711J318262
$$ 64748361 65942065 67051294 68082361 69272398 70653060 71977749 73173460 74491722
9510G4491722J567968J564480J309917J140545J138985J085474R47653R36728
$$ 74491722 76059690 77624170 78934087 80074632 81213617 82299091 83246744 84183472
9502H4183472J073866J154643J168111J311452J551334J615670J489900J482745
$$ 84183472 85257338 86411981 87580092 88891544 90442878 92058548 93548448 95031193
9494I5031193J699126J872228J840401J775702J795356J751853J575398J434334
$$ 95031193 96730319 98602547 100442948 102218650 104014006 105765859 107341257 108775591
9486A08775591J376407J195861Q49869O17647O25250N98975L43448Q5409N2443
$$ 108775591 110151998 111347859 112197728 112815375 113440625 114039600 114383048 114468457 114520900
9477A14520900O9964r7503l29919m15365m26698m85610m45506j90594J8660q9033
$$ 114520900 114590864 114493361 114163442 113748077 113321379 112835769 112390263 112199669 112218329 112129296
9467A12129296l12428k78032k5541J29823J37053J64587J70531p619k38882k57353
$$ 112129296 111816868 111538836 111513295 111643118 111780171 111944758 112115289 112107670 111868788 111611435
9457A11611435j73269l35443o98818q33600o23329m63086o21858q46802q09337
$$ 111611435 111438166 111102723 110403905 109570305 108946976 108483890 107862032 107015230 106205893
9448A06205893n88714m70497n18914n80488n57208n03431n32288o95167q87265
$$ 106205893 105617179 105146682 104627768 104047280 103490072 102986641 102454353 101759186 100871921
9439A00871921r12171p57787p00681r41541j266946j339685j198886j147363j257146
$$ 100871921 99959750 99201963 98501282 97559741 96292795 94953110 93754224 92606861 91349715
9430I1349715j365987j465979j654681j764933j544890j197653j196629j512690
$$ 91349715 89983728 88517749 86863068 85098135 83553245 82355592 81158963 79646273
9422G9646273j609537j324616j119037j230115j244440q86997o01192q20252j185533
$$ 79646273 78036736 76712120 75593083 74362968 73118528 72231531 71630339 70810087 69624554
9413F9624554j104864o95185n18365o57146p20728o07765o05726p71851q16120
$$ 69624554 68519690 67824505 67306140 66648994 65928266 65320501 64714775 63942924 63126804
9404F3126804o49260n32648n96021o47499n64285m89265n31884n96734o00344
$$ 63126804 62477544 61944896 61348875 60701376 60137091 59647826 59115942 58519208 57918864
9395E7918864n84068n60520n01736m85542n90523o77445n71749m12355m71123
$$ 57918864 57334796 56774276 56272540 55786998 55196475 54519030 53947281 53534926 53063803
9386E3063803o67680o65795m48613l54758m88101n58681m34099l74438n13252
$$ 53063803 52396123 51730328 51281715 50926957 50438856 49880175 49446076 49071638 48558386
9377D8558386n62108l26563j13782k55245n37375n23709k36912r5231k63929m61260
$$ 48558386 47996278 47669715 47555933 47300688 46763313 46239604 46002692 45907461 45643532 45182272
9367D5182272m21264k37531j62518k62287l73839l33417j90858j68925l61520
$$ 45182272 44761008 44523477 44360959 44098672 43724833 43391416 43200558 43031633 42670113
9358D2670113n36705m11610j01130l2434l43145o50158n79547k65869r6630j74906
$$ 42670113 42133408 41721798 41620668 41588234 41245089 40594931 40015384 39749515 39652885 39477979
9348C9477979l07004l69349l97606l96142l27779k58045k86620l61550l53515
$$ 39477979 39170975 38801626 38404020 38007878 37680099 37422054 37135434 36773884 36420369
9339C6420369k79665k67838l31960l67219l45529l38667l56891l27085k35053
$$ 36420369 36140704 35872866 35540906 35173687 34828158 34489491 34132600 33805515 33570462
9330C3570462j57624j55496k32154l59684m50338l82250j79247p3266k27877m79818
$$ 33570462 33412838 33257342 33025188 32665504 32215166 31832916 31653669 31580403 31352526 30872708
9320C0872708n35423l61101j89588j86472l05508m42008n31201n07992l59914
$$ 30872708 30337285 29976184 29786596 29600124 29294616 28852608 28321407 27813415 27453501
9311B7453501k20123k37136l63523m39330m46158m77736m96467l71301j70297
$$ 27453501 27233378 26996242 26632719 26193389 25747231 25269495 24773028 24401727 24231430
9302B4231430j48039l64448n54861m96670l07311k39672l35208m27188l90651
$$ 24231430 24083391 23718943 23164082 22667412 22360101 22120429 21785221 21358033 20967382
9293B0967382k64024j72189j99245l01735l41268k63626j99939k69875l49975
$$ 20967382 20703358 20531169 20331924 20030189 19688921 19425295 19225356 18955481 18605506
9284A8605506k37637j1726L2010j61632k99577j96037n6157j24978k96735l15958
$$ 18605506 18367869 18356143 18388153 18226521 17926944 17730907 17674750 17549772 17253037 16937079
9274A6937079j90877j34622j96194k19418j38273p5591j26717k27405k74009k42697
$$ 16937079 16746202 16611580 16415386 16195968 16057695 15982104 15855387 15627982 15353973 15111276
9264A5111276j65759r7424j09437k16271l06069k56595j24400r8034k32909l50634
$$ 15111276 14945517 14848093 14738656 14522385 14216316 13959721 13835321 13737287 13504378 13153744
9254A3153744k73191p2662J4539j04160k59450k45759q6647J1026o5610k19081
$$ 13153744 12880553 12807891 12822430 12718270 12458820 12213061 12126414 12137440 12071830 11852749
9244A1852749l13022l23259k60799j03474P3157N9942j91693l77475k08873J21367
$$ 11852749 11539727 11216468 10955669 10852195 10925352 10985294 10793601 10416126 10207253 10328620
9234A0328620J69473j00842k73300j39789J2544o7810j90228j14808N651p4219
$$ 10328620 10498093 10397251 10123951 9984162 9996706 9928896 9738668 9623860 9629511 9555292
9224I555292k30478j98906n6079o0931j70142j41526j8363n8029k19309j92719
$$ 9555292 9324814 9125908 9069829 9008898 8838756 8697230 8678867 8620838 8401529 8208810
9214H208810K4941O3298j94971l74485j99692P2937Q4603r5509j79156j36068
$$ 8208810 8233751 8297049 8102078 7727593 7527901 7600838 7685441 7589932 7410776 7274708
9204G274708j25202j35036l9312R0256N2409j34687k31744j33468P265L7093j5034
$$ 7274708 7149506 7014470 6975158 7065414 7117823 6983136 6751392 6617924 6625189 6662282 6647248
9193F647248n8576q1942j09471j29787j20912q1079j8813L3308J4006q7452j74793
$$ 6647248 6588672 6506730 6397259 6267472 6146560 6065481 6046668 6079976 6093982 6006530 5831737
9182E831737j49139m4758K2940J6115j1113k9087n6900q2419o7346l5253m9221
$$ 5831737 5682598 5637840 5660780 5676895 5665782 5636695 5579795 5497376 5430030 5394777 5345556
9171E345556r0722p0465J3639M5873k2665p0970Q238J04020J5032k31681l52390
$$ 5345556 5254834 5184369 5198008 5243881 5221216 5150246 5158484 5262504 5277536 5045855 4693465
9160D693465j69664J25623K12924O6114m9193N545N4982o1430j96126j34224L1314
$$ 4693465 4523801 4649424 4862348 4928462 4879269 4884814 4939796 4878366 4682240 4548016 4579330
9149D579330M0518r6213j15419L9599J08146m0429j67208n8552J13202P8914q8379
$$ 4579330 4619848 4523635 4408216 4447815 4555961 4515532 4348324 4289772 4402974 4481888 4393509
9138D393509j23461j7080J1121p7396q7065M1066J10315n58j42558j46882o2962
$$ 4393509 4270048 4252968 4264089 4186693 4099628 4140694 4251009 4250451 4107893 3961011 3898049
9127C898049j6411N80N1384R3851M6350o1564j28855j23415q8144n3409k2361
$$ 3898049 3881638 3882218 3933602 4027453 4073803 4012239 3883384 3759969 3671825 3618416 3596055
9116C596055P14L0644R6311J58578J08688o9564k09352j45197N4751J61727P8179
$$ 3596055 3596769 3627413 3723724 3882302 3990990 3921426 3712074 3566877 3621628 3783355 3861534
9105C861534o4319j12401p4331m2328l5515j4716O818k2019q1265r0678m1161
$$ 3861534 3797215 3684814 3610483 3568155 3532640 3517924 3524742 3502723 3421458 3330780 3289619
9094C289619j4936m3554n2694o719Q763n0768o2944O6684J83803Q0782j38135
$$ 3289619 3274683 3231129 3178435 3171716 3180479 3129711 3066767 3133451 3317254 3398036 3259901
9083C259901j59832M9076J58115j5841k12382j35915J01196J98035J14901J5267
$$ 3259901 3100069 3149145 3307260 3291419 3079037 2943122 3044318 3242353 3357254 3372521
9073C372521o4508j65082j68318K6968J95584M8809k48712k57517M0783J98081
$$ 3372521 3308013 3142931 2974613 3001581 3197165 3245974 2997262 2739745 2780528 2978609
9063B978609L0194j07134M1102K04560J01851o5215k2684M9822j21976l16489
$$ 2978609 3008803 2901669 2942771 3147331 3249182 3183967 3161283 3211105 3089129 2772640
9053B772640j31758K78574L60874J8135k42849j00495J50206J33777o5434j51016
$$ 2772640 2640882 2919456 3280330 3298465 3055616 2955121 3105327 3239104 3173670 3022654
9043C022654q1083j1136R617K7809J7577n8619j19113o5484N8319J32589J08966
$$ 3022654 2941571 2930435 2940052 2967861 2985438 2926819 2807706 2742222 2800541 2933130 3042096
9032C042096N246j39966k28277j47592N1604J61986R4893j139K67P124p9013j39896
$$ 3042096 3047342 2907376 2679099 2531507 2583111 2745097 2839990 2838851 2839118 2846242 2767229 2627333
9020B627333l7735J12423J09773J689j1673N8725R647j73119k42889p7904J12401
$$ 2627333 2589598 2702021 2811794 2813483 2801810 2860535 2870182 2697063 2454174 2376270 2488671
9009B488671R8538m5425q9457J4158J09037Q2652j2638o8703m6438J1106L1080
$$ 2488671 2587209 2541784 2452327 2466485 2575522 2658174 2645536 2576833 2530395 2541501 2572581
8998B572581j7847p8782o4485J6590N4610j979n9573k3164M8544L7889l5032m5573
$$ 2572581 2554734 2475952 2411467 2428057 2482667 2480688 2421115 2397951 2446495 2484384 2449352 2403779
8986B403779K0046L4235n0512r8169J533J41086J45218L1791l6420j8901l2538
$$ 2403779 2423825 2458060 2407548 2309379 2310912 2451998 2597216 2629007 2592587 2573686 2541148
8975B541148j10532j23399j1955Q6345O4019K5320P5440Q9484p2610k42716j45146
$$ 2541148 2430616 2307217 2295262 2381607 2445626 2470946 2546386 2635870 2563260 2320544 2175398
8964B175398J20470J52648j29616l03219o5916K81521K75143l0092j90221n7625
$$ 2175398 2295868 2448516 2318900 2015681 1949765 2231286 2506429 2476337 2286116 2228491
8954B228491O9169j6673j27775m1588J39903J77934M5001j00377j52867j10371
$$ 2228491 2297660 2280987 2153212 2111624 2251527 2429461 2474462 2374085 2221218 2110847
8944B110847J2166J64198K26747J36807m342n9462l7611l7469o6743m9919J4373
$$ 2110847 2123013 2287211 2513958 2650765 2646423 2586961 2549350 2511881 2445138 2395219 2409592
8933B409592L8749o118m4549j8701L1840M2527O864m0728p0266n9714L28P7851
$$ 2409592 2448341 2442223 2397674 2378973 2410813 2453340 2460204 2419476 2349210 2289496 2289824 2367675
8921B367675J07255N2853m7721j15948j03199k9791M0555O5379N5260L2627j1540
$$ 2367675 2474930 2527783 2480062 2364114 2260915 2231124 2271679 2337058 2392318 2424945 2413405
8910B413405p7138j00739k2592R7103J27869N3129o972M689o642r7244j48174
$$ 2413405 2336267 2235528 2212936 2310039 2437908 2491037 2484065 2488754 2482112 2384868 2236694
8899B236694n4619O8769N2317m4088k4961J03254J29384p729j06978l3671O3102
$$ 2236694 2182075 2250844 2303161 2259073 2234112 2337366 2466750 2459021 2352043 2318372 2381474
8888B381474N659j19552j08423M1593J50736J27800M4193k3060n6140k8003O4856
$$ 2381474 2387133 2267581 2159158 2200751 2351487 2479287 2523480 2500420 2444280 2416277 2481133
8877B481133J07930j8976k13542k18557J4784K08330J24762r3996j35069L0033
$$ 2481133 2589063 2570087 2356545 2137988 2152772 2361102 2485864 2391868 2256799 2286832
8867B286832J22843q925j64705j02701R9239J75252O8737j8651L2313Q9622J9877
$$ 2286832 2409675 2400750 2236045 2133344 2232583 2407835 2476572 2457921 2490234 2579856 2599733
8856B599733q5999q1369j1130n167l1013K6417J02924L1882j25587j16264P6141
$$ 2599733 2513734 2432365 2421235 2416068 2385055 2411472 2514396 2546278 2420691 2304427 2380568
8845B380568J41096p0017k55826j05784K10618L02393J30964k3871o0452j25703
$$ 2380568 2521664 2451647 2195821 2090037 2300655 2603048 2734012 2710141 2649689 2523986
8835B523986k16692j26173J37326K60919J08296n4583n219Q9005J6096q8185q656
$$ 2523986 2307294 2181121 2318447 2579366 2687662 2633079 2627860 2716865 2732961 2644776 2636120
8824B636120J30095P9096o9503k6691J79686K42362J01315K5272J20816J59461
$$ 2636120 2766215 2845311 2775808 2749117 2928803 3171165 3272480 3297752 3418568 3578029
8814C578029J6465q8711J8526J59135J19456J1184L8831J23228O2908q0908q2739
$$ 3578029 3594494 3505783 3524309 3683444 3802900 3814084 3852915 3976143 4039051 3958143 3875404
8803C875404M8248Q3909l4710j23975r1108n9076r7718r3104R697O6112k3442
$$ 3875404 3923652 4007561 3972851 3848876 3757768 3698692 3600974 3507870 3517567 3583679 3560237
8792C560237j20804o8107N2982O1978l2273p5832l1458j264j5468J3207J08125
$$ 3560237 3439433 3371326 3424308 3486286 3454013 3378181 3346723 3345459 3329991 3343198 3451323
8781C451323J66130J21197L8315n225j3271N703Q4521J92783K07617R3177L482
$$ 3451323 3617453 3738650 3776965 3771740 3758469 3764172 3848693 4041476 4249093 4342270 4345752
8770D345752P4109J99365J82855N3077K7456J63197K61314J84578O5862P2809
$$ 4345752 4419861 4619226 4802081 4855158 4882614 5045811 5307125 5491703 5557565 5630374
8760E630374J38396J02662l083k0669N8543R6612O0703N6615R9558O4654q0717
$$ 5630374 5768770 5871432 5868349 5847680 5906223 6002835 6063538 6120153 6219711 6284365 6203648
8749F203648j91860j76799j34404j61448j87954j31150o5876r2654j54972j42383
$$ 6203648 6011788 5834989 5700585 5539137 5351183 5220033 5154157 5061503 4906531 4764148
8739D764148p6697m2709k6566J7547L1054m2416r9530k4780P8727L3690q9030
$$ 4764148 4687451 4644742 4618176 4635723 4666777 4624361 4524831 4500051 4578778 4612468 4523438
8728D523438n6754J23966J83009K2515j10616j5880J53874J59534M1956J263N7950
$$ 4523438 4466684 4590650 4773659 4796174 4685558 4669678 4823552 4983086 5025042 5026305 5084255
8717E084255P1598J7860K1694J33145K50727K76905K18272J27899N1724K3723
$$ 5084255 5155853 5173713 5195407 5328552 5579279 5856184 6074456 6202355 6254079 6277802
8707F277802K8391p477j09111j86953j58546p4402k6567q598J4930j4382j44701
$$ 6277802 6306193 6298716 6189605 6002652 5844106 5769704 5743137 5734539 5749469 5735087 5590386
8696E590386k56739j97723l4984K0567p0630j44928j24924j14899j58822j34320
$$ 5590386 5333647 5135924 5100940 5121507 5050877 4905949 4781025 4666126 4507304 4372984
8686D372984Q397J07677L3650r3265q4195M3611J28272R8668L464j03776j67113
$$ 4372984 4381381 4489058 4522708 4429443 4345248 4388859 4517131 4615799 4619263 4515487 4348374
8675D348374j06063O0032J51882N6048p0490m839J99606K85408J72065M0170K6674
$$ 4348374 4242311 4302343 4454225 4510273 4439783 4434944 4634550 4919958 5092023 5132193 5158867
8664E158867N9534M6626K5159M4108P2139J00492J70172K23565J19185j06080
$$ 5158867 5218401 5265027 5290186 5334294 5406433 5506925 5677097 5900662 6019847 5913767
8654E913767j96491m4880J05265K2007j45939j24028K5447L0819q3174p066L00082
$$ 5913767 5717276 5672396 5777661 5799668 5653729 5529701 5555148 5585967 5502793 5495727 5795809
8643E795809M55213K10273j46874j86432Q8227L18303L00645J59839P7624R0095
$$ 5795809 6251022 6461295 6314421 6127989 6216216 6534519 6835164 6995003 7072627 7162722
8633G162722J51510K16727K39051K06337J77439J97429K25219K35966L02890M44777
$$ 7162722 7314232 7530959 7770010 7976347 8153786 8351215 8576434 8812400 9115290 9560067
8623I560067N02652L60059J94324K65916N07269N95727M37419K88964L42968M83557
$$ 9560067 10062719 10422778 10617102 10883018 11390287 11986014 12423433 12712397 13055365 13538922
8613A3538922N57280N96450O13901M55188Q1076k40495k98042l04157n87257j041444
$$ 13538922 14096202 14692652 15306553 15761741 15842817 15602322 15304280 15000123 14412866 13371422
8603A3371422j226866r84024o23534m68032m89099m84090l79062k36795j27649
$$ 13371422 12144556 11160532 10536998 10068966 9579867 9095777 8716715 8479920 8352271
8594H352271r9518j62661k35617k06419q3951J8091N8173R2512J16236N1745o2871
$$ 8352271 8252753 8090092 7854475 7648056 7564105 7582196 7640369 7732881 7849117 7900862 7837991
8583G837991n8263J08735K48641K03252P6336P0701K02483L14455L04526K17602
$$ 7837991 7779728 7888463 8137104 8340356 8416692 8487393 8689876 9004331 9308857 9526459
8573I526459J49773J58272K43216L55415M45008N26309O42728P61352P96168P59136
$$ 9526459 9676232 9834504 10077720 10433135 10878143 11404452 12047180 12808532 13604700 14363836
8563A4363836P76440R11888J084212J196958J216249J073260O64391N1767n02928
$$ 14363836 15140276 16052164 17136376 18333334 19549583 20622843 21287234 21339001 20836073
8554B0836073q45314j116424j463093j710758j574236j126663p85894p95715r41101
$$ 20836073 19990759 18874335 17411242 15700484 14126248 12999585 12213691 11417976 10476875
8545A0476875q75736n73216l13717k94335l98754l86588k18567q2573r6071j28979
$$ 10476875 9601139 9027923 8714206 8419871 8021117 7634529 7415962 7333389 7237318 7108339
8535G108339l6720N8770n5764k83442k86386q041J86263M4576j87671j58955N7265
$$ 7108339 7071619 7130389 7074625 6791183 6504797 6496756 6683019 6727595 6539924 6380969 6438234
8524F438234J32325J5634m4613O4601J92757K17752J86186J52335J15059J21835
$$ 6438234 6570559 6586193 6541580 6606181 6798938 7016690 7202876 7355211 7470270 7592105
8514G592105K26133L52563L95502M01526M52963M68120L69079L21909M75183N72530
$$ 7592105 7818238 8170801 8566303 8967829 9420792 9888912 10257991 10579900 11055083 11627613
8504A1627613K51198l23406o09223n03015m74125p57432r70756p93915n02386
$$ 11627613 11878811 11555405 10946182 10443167 9969042 9211610 8240854 7446939 6944553
8495F944553m53042m94678l42705j63005k62139m69595l81367n5796P6766p8763
$$ 6944553 6491511 5996833 5654128 5491123 5228984 4759389 4378022 4322226 4398992 4320229
8485D320229j87559r3043k4060j23029k09673j41668m0263j8849o411K7293l1872
$$ 4320229 4132670 4039627 4015567 3892538 3682865 3541197 3500934 3482085 3475674 3502967 3471095
8474C471095j83615k29231r5359J5191m4587j24720n1181P4198N6882o8699j16356
$$ 3471095 3287480 3058249 2962890 2978081 2933494 2808774 2757593 2831791 2888673 2819974 2703618
8463B703618m5076J6456j1272p3948r7869p6193m4185l3484m8730o7750p4736
$$ 2703618 2658542 2674998 2663726 2589778 2491909 2415716 2371531 2338047 2289317 2221567 2146831
8452B146831p3395m3109N1011J48231J04095p6256j56160q31J54041L1318k15044
$$ 2146831 2073436 2030327 2081338 2229569 2333664 2257408 2101248 2100417 2254458 2285776 2070732
8441B070732k06390M7025J55590n231j14750O290R1067n9939j90818m3713J63564
$$ 2070732 1864342 1911367 2066957 2061726 1946976 1953266 2044333 1984394 1793576 1749863 1913427
8430A913427J08265p7340n6106J12979R4674j18573j98024n1167M6906m6655j15137
$$ 1913427 2021692 1944352 1888246 2001225 2095899 1977326 1779302 1728135 1775041 1728386 1613249
8419A613249J6464J83829J56866k8562j72325j73431o9311N3935J04682N1010
$$ 1613249 1629713 1813542 1970408 1941846 1769521 1596090 1526779 1580714 1685396 1736406
8409A736406j6530J364M6510J673p6959l5608P8998N2444j25698j94711k9389
$$ 1736406 1719876 1721240 1767750 1769423 1692464 1656856 1735854 1788298 1662600 1467889 1438500
8398A438500J42508Q5397r7058j48077k7147J01724J33965R0975L442j02565j51687
$$ 1438500 1581008 1666405 1569347 1421270 1394123 1495847 1629812 1720787 1724229 1621664 1469977
8387A469977r2107P896M0058j702l8068j7379N1028J19003J10370p557j26478
$$ 1469977 1377870 1385766 1425824 1424122 1386054 1368675 1419703 1538706 1649076 1641519 1515041
8376A515041r2125N1707P3246r9574k21816q0918J59367J83588j7258j62767j10542
$$ 1515041 1422916 1474623 1547869 1448295 1226479 1145561 1304928 1488516 1471258 1308491 1197949
8365A197949q913m159l5114j489N2707M2283J436J9811Q6113R7349J408j31835
$$ 1197949 1189036 1184877 1149763 1148274 1200981 1243264 1244700 1264511 1350624 1447973 1449381 1317546
8353A317546j80244r3232M6134R6068J4821q8950j01101m2720j439J3432M4106
$$ 1317546 1137302 1044070 1090204 1186272 1201093 1112143 1011042 968322 966883 980315 1024421
8342A024421O3462J2979o1627n4895J9012L9764q269Q58J08523J68236O2921j05487
$$ 1024421 1087883 1100862 1039235 984340 1003352 1043116 1034847 1035705 1144228 1312464 1375385 1269898
8330A269898j59824q3831L120L1595K3394J985k3657k0421K4653N2550J2740m3170
$$ 1269898 1110074 1026243 1029363 1060958 1084352 1086337 1062680 1042259 1066912 1119462 1132202 1089032
8318A089032l9734o785k4987p7133p1279M123O4492O4973M2112J9883j6758n1254
$$ 1089032 1049298 1042513 1017526 940393 869114 873237 937729 1002702 1044814 1064697 1047939 996685
8306I96685m7304l2853n8242p6017K98J15490J15838mn7075J1259N3094l0136
$$ 996685 949381 916528 858286 782269 782567 898057 1013895 1013891 956816 968075 1021169 991033
8294I91033j05804m9381L0637o071p6841m1352L0136L936l6791N0775J42172J7163
$$ 991033 885229 835848 866485 860414 783573 742221 772357 776293 739502 790277 932449 949612
8282I49612k03139j74958J02221K41649P6549r1825j3402J29737R3520k4835l9437
$$ 949612 746473 571515 673736 915385 991934 900109 886707 1016444 1109964 1085129 1045692
8271A045692k8779j13887j48436J1422J53395J9935k05539j50578J27269K20462
$$ 1045692 1016913 903026 754590 766012 919407 939342 733803 583225 710494 930956
8261I30956J8284j71388j52877o3949j5596P1156J74173J14324p9227j20593O5128
$$ 930956 949240 777852 624975 561026 545430 616586 790759 905083 825856 705263 770391
8250G70391J84859O0341q7640m6131M1461j3232r1925j6072J13356J14517M4642
$$ 770391 955250 1015591 927951 881820 923281 910049 818124 802052 915408 1029925 1074567
8239A074567M0631M2490m5755j12562l9608L8072l8114j39679p3742N5086L0288
$$ 1074567 1115198 1157688 1111933 999371 959763 997835 959721 820042 746300 801386 831674
8228H31674q2140o6665M4883O1323N663L8774J04483K8030j05392o3496R1981
$$ 831674 749534 682869 727752 789075 794738 833512 937995 966025 860633 797137 889118
8217H89118Q5698p3169j01327L6704O2508r5830j65963l2741N9919k2240n4021
$$ 889118 974816 901647 800320 837024 899532 803702 637739 604998 664917 642677 588656
8206E88656J06828K16918O5445j36823r8567Q5229J24530o509j02823p6540o030
$$ 588656 695484 912402 977847 841024 742457 827686 952216 945707 842884 766344 760314
8195G60314N2692Q3646M2524n0634o6804L2001R2173J4540p1437m0076J4791j7436
$$ 760314 813006 896652 939176 888542 821738 853739 945912 960452 889015 848939 863730 846294
8183H46294m1216M8880J32008N9594p0217q0808j3710q514k5306M8508J32100
$$ 846294 805078 853958 985966 1045560 975343 894535 880825 872311 847005 895513 1027613
8172A027613O6381r0170j41677o3752O830K1682K9682J2174n9362p9904L9098
$$ 1027613 1093994 1003824 862147 798395 805225 826907 856589 868763 809401 729497 768595
8161G68595J56837Q4713r5509j45439l0604Q4374J25740J32627O7674j07062k27970
$$ 768595 925432 1010145 914636 769197 738593 822967 948707 1081334 1149008 1041946 813976
8150H13976j06627J32357J93836N9333k2900K6890L2130p5070j34539o2263K1097
$$ 813976 707349 839706 1033542 1092875 1069975 1096865 1128995 1053925 919386 857123 878220
8139H78220K7967R634j0698n7964n8680N3982J21164l5542k32387j36514J55827
$$ 878220 906187 915821 905123 847159 788479 842461 963625 928083 695696 559182 715009
8128G15009K06636n4638k03109k2977J64937Q8609m4737J5668J30592R4583J4836
$$ 715009 921645 867007 663898 640921 805858 894467 849730 865398 995990 1090573 1105409
8117A105409L6391L5828q0593j14169M6840J31413n1112j99023q151K49283J43978
$$ 1105409 1141800 1177628 1097035 982866 1029706 1161119 1110007 910984 902833 1152116 1296094
8106A296094j73102k12071M8989J74659J4871j17902k7056J06896J09589M3869
$$ 1296094 1122992 910921 959910 1134569 1149440 1031538 1004482 1111378 1220967 1264836
8096A264836j0525o0829n1928O9241J53772L8334j22571p0775Q8043M8650j34775
$$ 1264836 1254311 1193482 1141554 1210795 1364567 1402901 1280330 1209555 1297598 1346248 1211473
8085A211473j37633K3225J1776j63513j02101K45283L90607R9066k08165j57658
$$ 1211473 1073840 1097065 1108841 945328 843227 1088510 1479117 1578183 1370018 1212360
8075A212360N632n2704j44165L6177K78139J81925j38415k22296O999J83270J09395
$$ 1212360 1217992 1165288 1021123 1057300 1335439 1517364 1378949 1156653 1163652 1346922 1456317
8064A456317k5287m5822j9824l1459l6157o483O179n346M862K6297K4661L4132
$$ 1456317 1431030 1385208 1365384 1333925 1297768 1291285 1297464 1292118 1296980 1323277 1347938 1382070
8052A382070O8904L4730j04024j90204j04026J0029k1215q5293J0464J55505J00807
$$ 1382070 1450974 1485704 1381680 1191476 1087450 1097479 1076264 990971 1001435 1156940 1257747
8041A257747q4340j03270N1583P9172r3071j64007K4075K05180J29175m1496l2764
$$ 1257747 1173407 1070137 1121720 1200892 1107821 943814 967889 1173069 1302244 1260748 1227984
8030A227984R3621Q8722n0026r9163M319P7702R213p3168l2725M6422J460j21048
$$ 1227984 1321605 1410327 1360301 1261138 1265457 1343159 1352372 1279204 1246479 1292901 1294361 1173313
8018A173313r7850J19082K55271P2706k32042k40831P8043K81123Q9378j99365
$$ 1173313 1075463 1194545 1449816 1522522 1290480 1049649 1127692 1408815 1498193 1298828
8008A298828j84622L1505P7226n5107o1948P8945P1114j17527j42446J00814K28125
$$ 1298828 1114206 1145711 1222937 1167830 1105882 1184827 1255941 1138414 995968 1096782 1324907
7997A324907j1669k85848j86511J41381K64752J12541l9636o9813q9093j08158
$$ 1324907 1313238 1027390 840879 982260 1247012 1359553 1319917 1250104 1161011 1052853
7987A052853j4877J29193J17280n0261j43441p1397O462j0217j6772M8555O6104
$$ 1052853 1037976 1167169 1284449 1234188 1090747 1019350 1025812 1015595 998823 1047378 1113482
7976A113482l5538j27380r3221j4994o248j7567M0897J09318P0644n0371j25308
$$ 1113482 1077944 950564 857343 842349 836101 818534 859431 968749 1039393 989022 863714
7965H63714j03564l4079M4278J17598J40389P7059j9671o7476p1178q6968r3217
$$ 863714 760150 726071 770349 887947 1028336 1105395 1085724 1018248 947070 860102 766885
7954G66885j4469J15621J39059j5953j97982j98058j1428J61010J67853O9488
$$ 766885 752416 868037 1007096 991143 793161 595103 583675 744685 912538 982026
7944I82026J1211J8053l086r6784j90584j99360j21730j2158P8107J09653P0529
$$ 982026 993237 1011290 1008204 911420 720836 521476 399746 387588 465695 575348 645877
7933F45877J2948R607M4421K5250n5832p5681L1162J36226Q4850p2751j52925
$$ 645877 658825 668432 712853 738103 682271 606590 637752 773978 858828 786077 633152
7922F33152r3924M040O5540J06697J13319K2937j24188j69208m7794J04906J44917
$$ 633152 539228 543268 608808 715505 828824 851761 727573 558365 510571 615477 760394
7911G60394R8554N5745M223r1139j35769j4821J71657J75598m9714k36051j48414
$$ 760394 858948 914693 918916 827777 692008 677187 848844 1024442 974728 738677 590263
7900E90263P5831J06728j04968k41526p1913J95234J90273q9452k72802j40236
$$ 590263 666094 772822 667854 426328 354415 549649 739922 650470 377668 237432
7890B37432R9100J60372P7224M6458O4639q791j31619j27683k4933k9877j36252
$$ 237432 336532 496904 574128 620586 685225 676434 544815 417132 392199 362322 226070
7879B26070r0080J53783K75074P8364j62294j16764Q9953J09295o1983j16847
$$ 226070 135990 289773 564847 643211 480917 364153 454106 563401 501418 384571
7869C84571L7368J61998J00781k4896q6279j11239j04911O236J53361J26948p5799
$$ 384571 421939 583937 684718 659822 573543 462304 357393 363629 516990 643938 568139
7858E68139j78088n1864N9569m3659j52582N390K64885K31834j00160l12951j60953
$$ 568139 390051 338187 397756 354097 201515 206905 471790 703624 603464 290513 129560
7847A29560J14495J63085k2940j69557q9557J28283K40444J12659j12012j54935
$$ 129560 244055 407140 384200 214643 125086 253369 493813 606472 494460 339525
7837C39525L2602J66641L1349j68417j05535J32264J54221j01488k48854p1480
$$ 339525 372127 538768 570117 401700 296165 428429 582650 481162 232308 160828
7827A60828J37974P5628q6539l0931J52396J28475j14024k49601j27556N7348
$$ 160828 298802 374430 287891 256960 409356 537831 423807 174206 46650 103998
7817A03998J23298J16068J08170O2345j5556k3299M2584M6934l7935n6298N1197
$$ 103998 227296 343364 451534 513879 498323 475024 517608 564542 526607 470309 521506
7806E21506J01990m3335k32197k36266p5318O4647J23884J71634J91143Q9861
$$ 521506 623496 580161 347964 111698 36380 101027 224911 396545 587688 677549
7796F77549q3396j42382l3010P1693K5225q1005p0032N1485J13933M1714n0549
$$ 677549 594153 451771 418761 490454 515679 434674 364642 416127 530060 571774 521225
7785E21225m7393N027Q384j0208L6757J02768N0097r9669j47137k2740P8689O298
$$ 521225 473832 478859 487243 477035 513792 616560 666657 566988 419851 397111 475800 482098
7773D82098r1166k1390J06019O6724o2740j7245J70033J74218p3537k30415q1907
$$ 482098 390932 369542 475561 542285 479545 462300 632333 806551 733014 502599 420692
7762D20692J19609Q0228q2153r4296J0349J0040r5537j20357l4810K1837N380
$$ 420692 540301 620529 538376 444080 454429 464469 368932 248575 213765 235602 240982
7751B40982j1073j1557q422O3249J92581J73211q4088k75066r5632K19931J91929
$$ 240982 229909 218352 209930 273179 465760 638971 554883 279817 184185 404116 596045
7740E96045j41897k62100P64K11892P2329j14672j3629J64735O1868j90244j92249
$$ 596045 454148 192048 192812 404704 477033 362361 348732 513467 575335 385091 192842
7729A92842O1280J98617O4322j10506j24795m8921n747J1972L7001M7315M6625
$$ 192842 254122 452739 517061 406555 281760 232839 227092 239064 276065 323380 370005
7718C70005O7404P0365j2193j26925j41667m3244M7390O0359L9317J6952k9641
$$ 370005 437409 507774 495581 368656 226989 183745 231135 291494 330811 347763 318122
7707C18122q1058o3260L3150J20137J23838N4720l5469r7256r7222n3620l0462
$$ 318122 237064 173804 206954 327091 450929 505649 470180 372924 275702 222082 191620
7696A91620l9530p965Q6577J36596O5189k6325p763O5130M6354n4492j00612o2114
$$ 191620 152090 144125 230702 367298 432487 406162 398399 463529 509883 455391 354779 292665
7684B92665l7560n7717m7094J5351O1699O9765Q0968Q1900J9484o5424p1766m651
$$ 292665 255105 197388 150294 165645 227344 297109 378077 459977 479461 414037 342271 337620
7672C37620M0266M3382N3039M1248m4893j18336n7960M3347o571j39806q9704
$$ 337620 377886 421268 474307 515555 470662 352326 294366 337713 331142 191336 101632
7661A01632J41453K19337Q777j77961p3539J23508J05266m0379l4806P9906L8319
$$ 101632 243085 462422 471199 293238 219699 343207 448473 408094 373288 453194 491513
7650D91513j41494j66659J7384J22133O234r6255L956J24835M1534j09963n7382
$$ 491513 350019 183360 200744 322877 329111 232856 236812 361647 403181 293218 235836
7639B35836J31352J31569j09002k49880n7707K35865K56115k785k09926j68725
$$ 235836 367188 498757 389755 139875 82168 318033 574148 571363 361437 192712
7629A92712k3587K3815o136J9096R8947J12467J9079p9720p6085J9892R4014M1763
$$ 192712 169125 192940 186804 205900 304847 417314 436393 356673 280588 300480 394494 436257
7617D36257j05490j74874n1908J23871J07510q5213j63623m51J57135Q7030m7733
$$ 436257 330767 155893 103985 227856 335366 250153 86530 86079 243214 330244 282511
7606B82511o829Q8288r086j66454o1302K01253J77814j60898l05563j3864K74395
$$ 282511 275682 363970 354884 188430 127128 328381 506195 345297 39734 25870 300265
7595C00265J33485j82309j81779Q6882J78980j8595j75892p9301J04302J52131
$$ 300265 433750 251441 69662 156544 335524 316929 141037 61736 166038 318169
7585C18169O6556k3552k9966N5906J43323Q7009j20200k74395k14069l6664Q3039
$$ 318169 384725 361173 331207 387113 530436 617445 497245 222850 8781 -27883 55156
7574E5156J40939J87721J38112o2059k25723j51203N5025J41556Q0661J1978m3111
$$ 55156 196095 383816 521928 459869 234146 82943 137968 279524 360185 372163 329052
7563C29052j14965p8400J45739L08988J37235j85444k47417n0181L3467r1410
$$ 329052 214087 135687 281426 590414 727649 542205 294788 244607 278074 186664
7553A86664j29276K8118J15830Q941n5046N6808J23657L63j07759l3457O0693
$$ 186664 57388 85506 201336 210277 155231 212039 335696 336059 228300 194843 255536
7542B55536K2127j3056O5034Q9887m2872j17886K0576J46294L4575j24142n3222
$$ 255536 277663 264607 329641 419528 376656 258770 279346 425640 460215 336073 282851
7531B82851J21419R6402r3309j70080q1413p595q204M108K1628k3478o1289N414
$$ 282851 404270 500672 407363 237283 155870 148275 140071 144179 165807 142329 81040 86454
7519H6454Q3136L9407l5266J7287J18090P8141o9493j35543q1298r736M3840P6193
$$ 86454 169590 208997 173731 191018 309108 387249 317756 182213 100915 91179 135019 211212
7507B11212J1464j24519j05889J39929K94220R8309j80838j42575R8341J33184
$$ 211212 222676 98157 -7732 132197 426417 524726 343888 201313 299654 432838
7497D32838l6471n9625R3096J00216p9744j33034l022J465j75149j83704Q2417
$$ 432838 396367 336742 429838 530054 450310 317276 314254 315719 140570 -43134 39283
7486C9283K45138Q7363q4259q866R4942l76r6249Q641Q7340q4211k38215m3258
$$ 39283 284421 371784 287525 278659 373601 373225 276976 285617 372957 288746 50531 7273
7474G273K78593K76740n666j53140p1014l3224j09415o5833J32622J96749M535
$$ 7273 285866 562606 556940 403800 332786 299562 190147 124314 256936 453685 458220
7463D58220j75639j14479L9977M1833p1439q5176M4874J45353Q4111o0163j13658
$$ 458220 282581 168102 208079 249912 178473 93297 138171 283524 367635 307472 193814
7452A93814l3628M3467L503o7038j3560J20427J36473j439j02843o0442N83k3735
$$ 193814 160186 203653 207156 140118 126558 246985 383458 382019 279176 218734 219317 195582
7440A95582m9020j6728l0223j15423j00075O9064J51806J602j38589k5305J58122
$$ 195582 146562 129834 99611 -15812 -115887 -46823 104983 106585 -32004 -57309 100813
7429A00813J21390k0574K0924J55841Q1895j18736q7539J36672J21499j99748
$$ 100813 222203 201629 222553 378394 460289 341553 254014 390686 512185 312437
7419C12437l39392l5242K94763J99711j19575j74545N4541J66670j042j81609
$$ 312437 -26955 -62197 232566 432277 312702 138157 192698 359368 358326 176717
7409A76717j36075L3539J06970M9010k4147m8023n9459q4785p3106K3772J45686
$$ 176717 40642 74181 181151 230161 206014 157991 98532 13747 -59359 -35587 110099
7398A10099J72008Q5527J994l523P210j8677j9268K6914m673j58024k20471j8567
$$ 110099 282107 367634 369628 366105 373315 354638 335370 362284 357611 199587 -20884 -39451
7386c9451K38452K15019l3503j45433k5627M6058p7492j82358r7488K8992L6026
$$ -39451 199001 414020 380517 235084 209457 255515 178023 -4335 -101823 -72831 -36805
7375c6805K0966R6320J46248N3703n7627l7977K8498J047n9885l3807K5653K0064
$$ -36805 -15839 80481 226729 280432 222805 184828 213326 214373 154488 120681 146334 166398
7363A66398J6470J01276J65306P3136p2595q0565J0896J2111q7933j16540j5470
$$ 166398 182868 284144 449450 522586 449991 369426 380322 392433 304500 187960 172490
7352A72490Q1508P5905K0202j6587m5537q4615r6696l8587P3464J52633J02794
$$ 172490 253998 329903 350105 333518 287981 203366 106670 68083 141547 294180 396974
7341C96974n2083j30188j2305J30429L9573j95388j95886J21944L51934J82975
$$ 396974 344891 214703 202398 332827 372400 177012 -18874 103070 455004 637979
7331F37979j32034j78662P216Q0748m0469j24312n0898N8881J04732R9883L5185
$$ 637979 505945 327283 334499 415247 374778 250466 199568 258449 363181 463064 498249
7320D98249q5004j20928K7319J84995J13837j09974k14004j51886r4162o6355
$$ 498249 413245 292317 319636 504631 618468 508494 294490 142604 48442 -17913
7310a7913M7788J76613J19707m7832k3260K06897K87176M9212k17317k14423l6258
$$ -17913 29875 206488 326195 278363 255103 462000 749176 798388 581071 366648 330390
7299C30390O6705M9349O636k3307j7470P0226J68490J16985n1747r8071L3434
$$ 330390 397095 446444 453080 429773 412303 482529 651019 768004 716257 618186 651620
7288F51620P9561j12967k93252j72536J29411K59370J10954r8745j44491j1928
$$ 651620 731181 618214 324962 152426 281837 541207 652161 553416 408925 396997
7278C96997J35056J09239r3916k24285p0027J91655J99033l3160j21435M0969
$$ 396997 532053 641292 547376 323091 253064 444719 643752 610592 489157 530126
7268E30126R2605j42909k87047l5193K75910J95227r3472r9597J37032J45763
$$ 530126 622731 479822 192775 157582 433492 628719 535247 435650 572682 718445
7258G18445j43978k89118q5178J31707P2982r1846j09022l0184l262J3452R7477
$$ 718445 574467 285349 200171 331878 404860 313014 203992 173808 170546 183998 281475
7247B81475J56389Q4785m2002r0249m4723M3291J39457J78062Q5149p9791j54598
$$ 281475 437864 522649 480647 390398 345675 388966 528423 706485 791634 711843 557245
7236E57245r2809K703P4836J48235J69070M7974j15905j21742j6154n1077k23330
$$ 557245 464436 467139 541975 690210 859280 907254 791349 669607 653453 602376 379046
7225C79046k09363R3001L21254J86164p2363p7280J04164J34001k7849j17135
$$ 379046 169683 262684 583938 770102 697739 620459 724623 858624 830775 713640
7215G13640l4936M5307K2020p294J1550m270p7027j03694l7999M8643J14397J79260
$$ 713640 678704 724011 746031 738737 750287 746017 668990 565296 527297 575940 690337 869597
7203H69597K02200J14831q698j0406R8304J38768N4902l081N8540J34250J24088
$$ 869597 1071797 1186628 1177930 1167524 1265828 1404596 1459498 1456417 1514957 1649207 1773295
7192A773295R2192J14257J31705P3203j8539q4829j39326j67883r9623J7365n112
$$ 1773295 1865487 1979744 2111449 2184652 2166113 2081284 1941958 1774075 1674452 1691817 1686705
7181A686705j97993l07622j56987N0398L3856j19172j18992K8506N2896q7011
$$ 1686705 1488712 1181090 1024103 1074501 1108357 989185 870193 898699 951595 864584
7171H64584j30488J2660J05002K2999k4366Q0612R0583j61673l69650j93574J47852
$$ 864584 734096 746756 851758 874757 850391 931003 1021586 859913 490263 296689 444541
7160D44541J79489p9656j60787Q9403K87066J47600j08968j71336p5329j888M5279
$$ 444541 624030 544374 383587 472990 760056 907656 798688 627352 552023 550135 595414
7149E95414J08108Q4357o8106j55884l7045J11957P5259m4006k4635Q2735P6136
$$ 595414 703522 787879 719773 563889 526844 638801 714060 670054 645419 728154 804290
7138H04290k0780k9511K9594r179j05604o1021R1852R1903j09297k31267r0505
$$ 804290 783510 753999 783593 774414 668810 607789 699641 791544 682247 450980 360475
7127C60475J30511J71011L5242q6084q2347L266O4161K8699o0861p4649J7716
$$ 360475 490986 661997 697239 611155 528808 532074 596235 624934 564073 489424 507140
7116E07140O3621l4516j16908j0093J52797J35007R853K4180J23943L3653j97298
$$ 507140 570761 536245 419337 409244 562041 697048 706901 731081 855024 888677 691379
7105F91379j93394J12968L10857J44884j16551j69359j12985j26415r9624P3600
$$ 691379 497985 610953 921810 1066694 950143 780784 667799 541384 441760 515360
7095E15360J77317K3730j63841j06640M0749k9478k14882j64203J22779K90715
$$ 515360 692677 716407 552566 445926 486675 457197 242315 78112 200891 491606
7085D91606J76526j7343q6708m3636K6315O4446J8967o9516m7138R7551J24238
$$ 491606 668132 650789 564081 520445 546760 611206 630173 560657 513519 611070 735308
7074G35308p5565k09841k4159K24480J46684j24783j50632P7345J54980k5841
$$ 735308 659743 449902 425743 650223 796907 672124 521492 598837 753817 727976
7064G27976j39188k7316Q8191P8249Q5353J24177j685k46769k71787o691K03260
$$ 727976 588788 561472 649663 727912 813265 937442 935757 688988 417201 410510 613770
7053F13770J76672J32142J70725O6315j83252j73717J90341L67673J9698l56329
$$ 613770 790442 922584 1093309 1159624 976372 802655 992996 1360669 1380367 1024038
7043A024038j93040K13842K03985j64071k67133L4996K50026J13070r0511j26558
$$ 1024038 830998 1044840 1248825 1084754 817621 852617 1102643 1215713 1125202 998644
7033I98644j22550j49866m6420J69078J94348m1291j93120n0569J30093Q5871
$$ 998644 876094 726228 679808 848886 1043234 1001943 808823 758254 888347 974218
7023I74218l2261J3170J17579O1805p2891n7699P4308R4756l3114j23009q4863
$$ 974218 941957 955127 1072706 1134511 1061620 1003921 1078229 1172985 1139871 1016862 931999
7012I31999k7942l8690n3527P868J11723J51349O0160j10282j99079q7718J20953
$$ 931999 904057 865367 811840 819708 931431 1082780 1142940 1032658 833579 745861 866814
7001H66814J82030L2967r5315p512J54305J21866q1629j68889j9987J47675J07002
$$ 866814 1048844 1081811 986496 978984 1133289 1255155 1173526 1004637 984650 1132325 1239327
6990A239327p3417j67292r8381K4002R2992R5026N7312K0915L9619J04515J04168
$$ 1239327 1165910 998618 900237 924239 1017231 1112257 1169569 1190484 1230103 1334618 1438786
6979A438786k3807j37635m6314J80500K47381L9268j97001j95684k3837P8937
$$ 1438786 1414979 1277344 1231030 1411530 1658911 1698179 1501178 1305494 1281657 1360594
6969A360594O5994O7499J02170N7643o2034j05235j4494R7030J37222J23437O6447
$$ 1360594 1426588 1494087 1596257 1653900 1591866 1486631 1472137 1569167 1706389 1829826 1896273
6958A896273m3360j20285n7275O7623P5922q630L687J05112O9164j29210k02847
$$ 1896273 1852913 1732628 1675353 1742976 1818898 1810268 1813955 1919067 1988231 1859021 1656174
6947A656174q075K05731J93976O7416K4918K2944l4315m4574P1053J44520N1625
$$ 1656174 1648099 1853830 2047806 2115222 2140140 2163084 2128769 2084195 2155248 2299768 2351393
6936B351393k0051R2906J85185L9171j26639O91K48717K12406n4855j24824R4379
$$ 2351393 2331342 2424248 2609433 2648604 2521965 2522656 2771373 2983779 2928924 2804100 2898479
6925B898479K53422J75261P1042P9990O5184k5619k4816J03293J60759Q3978N1139
$$ 2898479 3151901 3327162 3398204 3478194 3543378 3517759 3492943 3596236 3756995 3840973 3892112
6914C892112J23385J45702R4874J38085K50259J92389p307J30K84755M43367K40328
$$ 3892112 4015497 4161199 4256073 4394158 4644417 4836806 4829499 4829629 5114384 5557751 5798079
6903E798079J827P6180L01683L50026K52374K23055K48835K14053J98479L13762
$$ 5798079 5799906 5876086 6177769 6527795 6780169 7003224 7252059 7466112 7664591 7978353
6893G978353M45527M58929M61801N83476O97191O36989M89735M16662M00136M04766
$$ 7978353 8423880 8882809 9344610 9928086 10625277 11262266 11752001 12168663 12568799 12973565
6883A2973565N29594P42165P59446M98647L33071N39768Q10324P42065N21631
$$ 12973565 13503159 14245324 15004770 15503417 15836488 16376256 17186580 17928645 18450276
6874A8450276O09348R66853J156599J079458J053206J207506J342673J410525
$$ 18450276 19059624 20026477 21183076 22262534 23315740 24523246 25865919 27276444
6866B7276444J629541K037557K367145K471329K505471K607243K739710K900901
$$ 27276444 28905985 30943542 33310687 35782016 38287487 40894730 43634440 46535341
6858D6535341L118889L165530K654726J555342K78013q77013k032413l318556
$$ 46535341 49654230 52819760 55474486 57029828 57307841 56430828 54398415 51079859
6850E1079859m431938m862734m448819l550228k732409k323992k202980j998006
$$ 51079859 46647921 41785187 37336368 33786140 31053731 28729739 26526759 24528753
6842B4528753j548377j088108q90964q90436q31108o46393m53300l00270j75534
$$ 24528753 22980376 21892268 21001304 20110868 19279760 18633367 18180067 17879797 17704263
6833A7704263j54002k72095l59759k57223q7548n7232j25914j46719j61900k47052
$$ 17704263 17550261 17278166 16918407 16661184 16573636 16516404 16390490 16243771 16081871 15834819
6823A5834819k51980n4301J22727M2852r2404K8970K50795K07818o308M261K31911
$$ 15834819 15582839 15528538 15651265 15694117 15601713 15630683 15881478 16089296 16082988 16087249 16319160
6812A6319160L11248K01479K18182M10446N07280M81212N66277P12074O33581
$$ 16319160 16630408 16831887 17050069 17460515 17967795 18449007 19015284 19727358 20360939
6803B0360939M19317M60344P45593Q67539P56964P48824Q92866R02181Q18647
$$ 20360939 20780256 21240600 21986193 22853732 23610696 24359520 25252386 26154567 26973214
6794B6973214R82668J300331J336545J183870J372540J848587J994482J782541
$$ 26973214 27955882 29256213 30592758 31776628 33149168 34997755 36992237 38774778
6786C8774778J868233K348590K549227K327699K396656K953936L231131K925518
$$ 38774778 40643011 42991601 45540828 47868527 50265183 53219119 56450250 59375768
6778E9375768K818876L334300L747121L571154L449778L830453M050471L686955
$$ 59375768 62194644 65528944 69276065 72847219 76296997 80127450 84177921 87864876
6770H7864876L520410M131681M847236N126625N574403O469184O954797P009163
$$ 87864876 91385286 95516967 100364203 105490828 111065231 117534415 124489212 131498375
6762A31498375Q269231J1163064J3339729J3210770J2862346J4595742J6841568
$$ 131498375 139767606 150930670 164270399 177481169 190343515 204939257 221780825
6755B21780825J7229838J7537976K0523159K3088237J8783881P575300l200358
$$ 221780825 239010663 256548639 277071798 300160035 318943916 326519216 323318858
6748C23318858r465307j5582273k5296505l3447775l2604543k4257668j6945041
$$ 323318858 313853551 298271278 272974773 239526998 206922455 182664787 165719746
6741A65719746j4916912j4759381j2830991j0114519q547076p458747n800212
$$ 165719746 150802834 136043453 123212462 113097943 104550867 97092120 91291908
6734I1291908m454484m234241m114018l218190k448666k598894k774244k160217
$$ 91291908 86837424 82603183 78489165 75270975 72822309 70223415 67449171 65288954
6726F5288954j609503j997631k559263k329896j868419k082347k535381k373873
$$ 65288954 63679451 61681820 59122557 56792661 54924242 52841895 50306514 47932641
6718D7932641j917736j914470k073948j720514j182481j200697j531920j406492
$$ 47932641 46014905 44100435 42026487 40305973 39123492 37922795 36390875 34984383
6710C4984383r18151p63822r55505r18074o16856n43783p37921p55247n23200
$$ 34984383 34066232 33302410 32346905 31428831 30811975 30268192 29530271 28775024 28251824
6701B8251824m12305n20835n86021n38599n47496o10871o18734o69058q54282
$$ 28251824 27839519 27318684 26732663 26194064 25646568 25035697 24416963 23747905 22893623
6692B2893623r50024p69135n55174n67498n97359l85849j69187k64358m56420
$$ 22893623 21943599 21174464 20619290 20051792 19454433 19068584 18899397 18635039 18178619
6683A8178619l78772j81948k23039l90007l54273k22092l05964m92429m60912
$$ 18178619 17799847 17617899 17394860 17004853 16650580 16428488 16122524 15630095 15169183
6674A5169183l03610l12935l82498k42430n7848j49054l41900k62299n6924j23166
$$ 15169183 14865573 14552638 14170140 13927710 13869862 13720808 13378908 13116609 13059685 12936519
6664A2936519l30593k53513m15k8161k65662k43595j2122o8732l84372l90292
$$ 12936519 12605926 12352413 12351998 12323837 12058175 11814580 11802458 11733726 11349354 10959062
6654A0959062j6055J44796j24241l15376j38617J1570j43294k66237r6588N0405
$$ 10959062 10943007 11087803 10963562 10648186 10509569 10521139 10377845 10111608 10015020 10065425
6644A0065425r7364k64294j76434o0027j55879k44791r4681Q2118M5144l1958
$$ 10065425 9968061 9703767 9527333 9467306 9311427 9066636 8971955 9054073 9099217 9067259
6634I067259N1407J09360m4168j94442j22682j5443o6203o7621J50377K69158
$$ 9067259 9118666 9228026 9183858 8989416 8866734 8851291 8785088 8717467 8867844 9137002
6624I137002k0645m06133l84352m8014J08110k9830j45625r6773n0186p5414o2546
$$ 9137002 9116357 8710224 8325872 8277858 8385968 8356138 8210513 8113740 8063554 7988140 7925594
6613G925594k4919r2493k22166k49312j84937j57151j35333k2671P1110k0894
$$ 7925594 7900675 7808182 7586016 7336704 7151767 6994616 6859283 6836612 6907722 6886828
6603F886828j84694j72053j6637K8916q3763j67271j48660j29852j25560n0147
$$ 6886828 6702134 6530081 6513444 6542360 6458597 6291326 6142666 6012814 5887254 5837107
6593E837107M8402L0235p4120j08037o2346m5187l6845M6136J08377R91j71723
$$ 5837107 5885509 5915744 5841624 5733587 5671241 5626054 5589209 5635345 5743722 5744713 5572990
6582E572990j92195j13459j47739k27233r2959J76782J86288j32776l44740j63018
$$ 5572990 5380795 5267336 5119597 4892364 4799405 4976187 5162475 5029699 4684959 4521941
6572D521941J20813J12378j15008k21724j23116m89M1528L9773o07r0741j34601
$$ 4521941 4642754 4755132 4640124 4418400 4295284 4294795 4336323 4376096 4375489 4284748 4150147
6561D150147l8491R7715Q7161p1775j94583j69374p0164r745r494l8371p7591
$$ 4150147 4111656 4209371 4296532 4224757 4030174 3860800 3790636 3780891 3771397 3733026 3655435
6550C655435j08723j07648q5394q4782j05417p9002L0084J29475Q3790q9708k00295
$$ 3655435 3546712 3439064 3353670 3268888 3163471 3084469 3114553 3244028 3327818 3238110 3037815
6539C037815j26318M848M80r7976q1538P1868J35143p447j60949j18990K6418
$$ 3037815 2911497 2916345 2916825 2818849 2737311 2809179 2944322 2936875 2775926 2656936 2683354
6528B683354N2827o0289j57100j53187p7938L2910J19089P6682p3014j19378M2582
$$ 2683354 2736181 2675892 2518792 2365605 2287667 2320577 2439666 2516348 2443334 2323956 2366538
6517B366538J90579P7547j74200k50004j10502J2403J5063N445K1346k1106r7044
$$ 2366538 2557117 2634664 2460464 2210460 2099958 2112361 2127424 2132869 2154215 2133109 2036065
6506B036065q7045k9105o5788j38489n1045J41815J54000o0495k04831j15373
$$ 2036065 1949020 1919915 1854127 1715638 1664593 1806408 1960408 1899913 1695082 1579709
6496A579709K782l0265o6972O4513K26703J86653k4251j82825j75963o5758L5226
$$ 1579709 1582491 1552226 1485254 1549767 1776470 1963123 1938872 1756047 1580084 1514326 1549552
6485A549552M0766m5805r0494P459J09062R980j83778j56117J00963K22458L3085
$$ 1549552 1590318 1544513 1454019 1461478 1570540 1580520 1396742 1240625 1341588 1564046 1597131
6474A597131j91422j90921q1178l4360L2766J80538K04680o896j87575j04305
$$ 1597131 1405709 1214788 1133610 1099250 1132016 1312554 1517234 1510338 1322763 1218458
6464A218458L9384j8677j13317K4591K18497J15746j76257k44202n2227M9008
$$ 1218458 1257842 1239165 1125848 1150439 1368936 1484682 1308425 1064223 1011996 1061004
6454A061004m8265q6792K6672O5832n4452j08113K6817J69563J76169J26918P1436
$$ 1061004 1012739 925947 952619 1018451 963999 855886 882703 1052266 1228435 1355353 1426789
6443A426789o0613j93575j21260Q9596R6065j62391k96305p0935K06358J83151
$$ 1426789 1366176 1172601 1051341 1140937 1237002 1074611 778306 707371 913729 1096880
6433A096880j362j7599J00312Q6556o4641j28209o1083k9748p5555o6426L1422
$$ 1096880 1095518 1077919 1178231 1264787 1200146 1071937 1010854 981106 905551 839125 870547
6422H70547J02353J00235Q6795O1505k4262r6344l3526Q2931L9607j52181k18091
$$ 870547 972900 1073135 1159930 1221435 1197173 1100829 1067303 1150234 1189841 1037660 819569
6411H19569k8784J82152J51055m6962j40469m9367O4242P0638Q056n0133r6719
$$ 819569 790785 972937 1123992 1077030 936561 887194 951436 1022074 1030130 979997 883278
6400H83278j25227r8376l2640k489j0394K9094J12703R8599n5202j50774k7112
$$ 883278 758051 659675 627035 624546 614152 643246 755949 854548 799346 648572 621460
6389F21460J46939R8234j11299j68345j6745N9399o6686j42763J6034J95311J46154
$$ 621460 768399 866633 755334 586989 570244 629643 562957 420194 436228 631539 777693
6378G77693j0211m2460j5901r1807j46795L605J79328Q5254j35988r5282J56736
$$ 777693 767482 725022 709121 617314 470519 474124 653452 738706 602718 507436 664172
6367F64172J74813j14721k56692k6128J99994Q9668j15655p0956Q4019K9388j43719
$$ 664172 838985 724264 467572 441444 641438 731106 615451 544495 628514 657902 514183
6356E14183j04554J30198K16677K5766j99094k19837n8725J28655K13601J30518
$$ 514183 409629 539827 756504 782270 583176 363339 304614 433269 646870 777388
6346G77388o3450j73228o0985J58352K36797Q6375j33813j92756j0805K34782
$$ 777388 713938 540710 479725 638077 874874 961249 827436 634680 623875 858657
6336H58657K45809l5754k67141j25684J85388K01155o5322j30131J27836K20481
$$ 858657 1104466 1068712 801571 675887 861275 1062430 997108 866977 994813 1215294
6326A215294r7641l30272m9150L32808K14561j84187j96316J78042L19696N0445
$$ 1215294 1117653 787381 738231 1071039 1285600 1101413 905097 1083139 1402835 1453280
6316A453280j44254o12J54593Q2001J2229J15245J72919N5390L596J42261J86622
$$ 1453280 1309026 1308414 1463007 1545008 1557237 1672482 1845401 1900791 1904387 2046648 2233270
6305B233270m8918k83254k42491j05058j25569j82312p6518M3568l8993j76526
$$ 2233270 2184352 1901098 1658607 1553549 1427980 1245668 1169150 1212718 1173725 997199
6295I97199j10366N6946M6652j04796j32351n964N8616j7759j05509j25864j09437
$$ 997199 886833 943779 990431 885635 753284 747320 805936 788177 682668 556804 447367
6284D47367n1353N3348J04053M1033q688N1316P0032r2451k44808j19947J63119
$$ 447367 396014 449362 553415 594448 585760 637076 707108 614657 369849 249902 413021
6273D13021K38042L4449j55619j38757k6504L6030N0018K7733n9599j44527j00560
$$ 413021 651063 685512 529893 391136 364632 400662 450680 478413 418814 274287 173727
6262A73727L8399R8819L4920k2493j685K5278J2678M461R589r538k3949J4322
$$ 173727 212126 310945 345865 323372 321687 346965 359643 364104 373693 364155 340206 354528
6250C54528L7741l5894j13699n5123O2292N3443m4658l7182O5972P0522k3066
$$ 354528 392269 356375 242676 187553 249845 303288 258630 221448 287420 357942 334876
6239C34876j1322J05661Q5779j00120j66292j0703Q0723n8192j51046L7930K45201
$$ 334876 323554 429215 514994 414874 248582 237879 318602 260410 109364 147294 392495
6228C92495J14781j95464k41701K3649K19851J28593o7499j42781r4052o254P2963
$$ 392495 507276 311812 70111 93760 313611 442204 374705 231924 137872 131618 204581
6217B04581P7335k8318j15538l1181J22430R2336j17757k17707p4083R6130R2266
$$ 204581 281916 253598 138060 106879 229309 321645 203888 -13819 -87902 8228 100494
6206A00494K0619M4193Q4215M771r2570l3303R2311N2286j18927j42335N1076
$$ 100494 121113 165306 249521 254292 161722 128419 220730 273016 154089 11754 62830
6195F2830J87089P4756j00498q6991M5342O2523l7118o1393J2649J2614q2631
$$ 62830 249919 324675 224177 137186 182528 245051 207933 146540 159189 171803 89172
6184H9172p1431J02904J95334M1876j44271r9641N7786K9209j48114j44914R9649
$$ 89172 17741 120645 315979 357855 213584 113943 171729 200938 52824 -92090 7559
6173G559K30108J6721k65219k26669P5231K45289J17449o9603p2907K7741J5278
$$ 7559 237667 254388 -10831 -237500 -162269 83020 200469 130866 57959 85700 100978
6162A00978j12024j43088K7732K33827K43470N1158j28781j34611k4288M7900
$$ 100978 -11046 -154134 -126402 107425 350895 402053 273272 138661 114373 162273
6152A62273K5998l0016m4773J6674J24893J63182K3670k00347k44131j6770K15498
$$ 162273 188271 158255 113482 130156 255049 418231 441901 241554 -2577 -19347 196151
6141A96151J69421n2645j36152l9097l810j06208j29337L5754J75494R3548q4825
$$ 196151 365572 312927 176775 137678 133868 27660 -101677 -65923 109571 203119 118294
6130A18294j28157k5141P8698J10723P6881k0633j26012j23166r982O2797K8679
$$ 118294 -9863 -35004 43694 154417 231298 210665 84653 -38513 -48495 14302 42981
6119D2981J989L2764m561j29792j27873Q2795K15845L6844k15615j71416R5226
$$ 42981 44970 77734 73173 -56619 -184492 -101697 114148 150992 -64623 -236039 -140813
6108a40813K13024J01694M750J3972j5580r4818o4734L8716q095j79057j75047
$$ -140813 72211 173905 178655 192627 177047 82229 17495 56211 48116 -130941 -305988
6097c05988N5916J83680M1903q9858K4963J78541R8654p9746o4708R7513J30928
$$ -305988 -250072 -66392 -24489 -114347 -89384 89157 187811 108065 43357 140870 271798
6086B71798j1239j25317j06028k7715N5542J30230J09099m8220j61658m3482J62885
$$ 271798 260559 135242 29214 1499 57041 187271 296370 248150 86492 43010 205895
6075B05895J45888q4505j83320j183J82328R2908j36091j98103n9277O6752P9125
$$ 205895 351783 267278 83958 82775 265103 358011 221920 23817 -35460 31292 110417
6064A10417P6147J06235O4985r6437k32706j85993q184J12276R3401K0947q912
$$ 110417 186564 292799 357784 261347 28641 -157352 -165536 -53260 40141 61088 52176
6053E2176M556K7876N3889O0987L154j01069j46026p3698L3239O3765K2054j6595
$$ 52176 56732 84608 138497 199484 202638 101569 -44457 -118155 -84916 -21151 903 -15692
6041a5692k7371k3480J4018Q7878J20129N0964m2066m2631K5767M2958k0299q2773
$$ -15692 -43063 -66543 -52525 35353 155482 206446 164380 121749 147516 190474 170175 87402
6029H7402r0371n3223J5827P9868N2187p5480j53500p6180L0687J0445m6524L4013
$$ 87402 -2969 -56192 -40365 39503 91690 16210 -137290 -213470 -182783 -172338 -218862 -184849
6017a84849J71890J51537M746n5218k8791q8057j68467l1415K38311K66581J5181
$$ -184849 -12959 138578 143324 88106 59315 -28742 -197209 -228624 9687 276268 291449
6006B91449j16586L0786J14969o1673j79095p048J33243n0808k53114r7055J74000
$$ 291449 174863 205649 320618 258945 79850 72802 206045 155237 -97877 -194932 -20932
5995b0932J18518j24645j13405R6606R8041r0865q2972J26354J49496n6900j14484
$$ -20932 97586 -27059 -140464 -43858 54183 -36682 -119654 6700 156196 99296 -15188
5984a5188N7722R6947j08523k00049m758J64855Q3108m4605l4366k2588q6496
$$ -15188 42534 139481 30958 -169091 -173849 -8994 74114 29509 -4857 -27445 -113941
5973a13941n1136R6628Q7024j09275j42649Q2678J78925k7155j42919O7884K01689
$$ -113941 -165077 -68449 18575 -90700 -233349 -150671 28254 1099 -141820 -73936 127753
5962A27753o3152l24472j29017K09242J49021j24724n2451K74789K58658j55437
$$ 127753 64601 -259871 -388888 -179646 -30625 -155349 -207800 66989 325647 170210
5952A70210l69164j08484K04607J89530K854q5349r3835j06320o3427L9950Q4486
$$ 170210 -198954 -307438 -102831 86699 89553 4204 -89631 -195951 -259378 -219428 -134942
5941a34942O4822Q6882R3472n1862k03475p8721K09489K37610l6978j75627J0863
$$ -134942 -70120 16762 110234 58372 -145103 -223824 -14335 223275 186297 10670 21533
5930B1533J56182q229k00450j08418Q3593P2550k9790L5227J60665P6591j31275
$$ 21533 177715 169486 -30964 -139382 -55789 16761 -13029 22198 182863 259454 128179
5919A28179j48608K8345R4834m8495j53113m2378J23099J06236p3379j87049r2244
$$ 128179 -20429 7916 102750 54255 -98858 -141236 -18137 88099 14720 -172329 -264573
5908b64573J07535J98000J16764J4295R736J313j29078k36451r7559J79518K52374
$$ -264573 -157038 40962 157726 172021 181757 183070 53992 -182459 -280018 -100500 151874
5897A51874O4343q3096m2586j9795j26601j44696L9234J54610P370j35213J0701
$$ 151874 216217 133121 90535 70740 -55861 -200557 -161323 -6713 657 -134556 -123855
5886a23855K21613J18997j82316k45473m91J95470J37837l257m8949l4885k4770
$$ -123855 97758 216755 34439 -211034 -211525 -16055 121782 118525 69576 34691 9921
5875I921J308K8618J2325J472N0444O1955n3975j55000o8801P9218N1176q3276
$$ 9921 11229 39847 52172 53644 104088 166043 112068 -42932 -111733 -32515 18661 -64615
5863f4615o8081O5999M9942j17983j40527N4229J74638O0205p4511l8829M4831
$$ -64615 -132696 -66697 -16755 -134738 -275265 -221036 -46398 13807 -60704 -99533 -54702
5852e4702K3612k8715j7289q074l6600m404P8139K9063j57012j95196M8037K82513
$$ -54702 -31090 -59805 -77094 -85168 -121768 -126172 -48033 -18970 -175982 -371178 -323141 -40628
5840d0628K06249n7009j85520j08745K4354J28910J78806R3671j12080k21343
$$ -40628 165621 108612 -76908 -185653 -161299 -32389 146417 240088 128008 -93335
5830i3335r8204P2799O7172k9742j7357M5737k4505j53913j01534J17699K24968
$$ -93335 -191539 -118740 -51568 -81310 -98667 -52930 -77435 -231348 -332882 -215183 9785
5819I785R8472p2634r0305J5832R3893N0725q6925j80490r4783R5257J31802n6365
$$ 9785 108257 35623 -54682 -38850 55043 105768 18843 -161647 -256430 -161173 -29371 -85736
5807h5736j84308j7892K34739K24055n105j23372n4058j4878o9488m3074R0110
$$ -85736 -270044 -287936 -53197 170858 165753 42381 -11677 -26555 -96043 -139117 -49007
5796d9007J26118J1882n5404j36J5269m9019m938J61469J65707q6509k54842q5197
$$ -49007 77111 88993 33589 33453 48722 -297 -5235 156234 321941 235432 -19410 -104607
5784a04607J58602J19172q4072j00115N4800P7841o7378j24890l6571k1250j18617
$$ -104607 53995 173167 89095 -11020 43780 121621 54243 -70647 -107218 -128468 -247085
5773b47085p3764J85636L32060J24035j84234k03061K3013J22779k4861j52158
$$ -247085 -320849 -135213 196847 320882 136648 -66413 -43400 79379 54518 -97640
5763i7640n5713J10424J12959j5134q5226o0102m4377n3223j3638L5478j4925
$$ -97640 -153353 -42929 70030 54896 -30330 -90432 -134809 -188032 -201670 -166192 -181117
5752a81117q4766M1968L13212L51140k719l55607k81549M1859J13174j02553j49125
$$ -181117 -265883 -223915 89297 440437 437718 82111 -199438 -157579 -44405 -146958 -296083
5741b96083J36455L31128J11700k17857k10630M7674J40408j6562j27337l9808
$$ -296083 -159628 171500 283200 65343 -145287 -97613 42795 26233 -101104 -140912
5731a40912O9340M1109m9317p8406l8692L5907J18495J29819Q201j37336j21520
$$ -140912 -71572 -30463 -79780 -158186 -196878 -160971 -42476 87343 95544 -41792 -163312
5720a63312M0446J28351L3211r5009q4070K9612R8090P3721K4681P445P511j5965
$$ -163312 -122866 5485 38696 -56313 -140383 -110771 -12681 61040 85721 93166 100677 84712
5708H4712o6020q7219k7842O3108O6206l3688r5310k9935M5971R84p7005k6029
$$ 84712 18692 -68527 -96369 -33261 32945 -743 -96053 -125988 -80017 -79033 -156038 -182067
5696a82067R1771P3187p3060j13287L5726J64050R2644o8348j10252j6160P2257
$$ -182067 -90296 -17109 -90169 -203456 -167730 -3680 88964 20616 -89636 -105796 -33539
5685c3539O9018Q077l6985j8460M6287O8145j1627j10691r8379O799O2113K1138
$$ -33539 35479 43556 6571 -11889 34398 102543 90916 -19775 -118154 -111355 -49242 -28104
5673b8104k1996j5654j0242j7116J4334N5793K4364l4186M3O8808Q36j34992o5083
$$ -28104 -50100 -65754 -75996 -93112 -78778 -22985 1379 -32807 -32764 36044 36880 -98112 -163195
5660a63195K00594K77791j641k65901j53793J28571J59991m2356j33577k9459
$$ -163195 37399 315190 313549 47648 -106145 22426 182417 140061 6484 -22975
5650b2975M9069K1970J4447J7319j00847k38435j29690J73717K85963O2530j72525
$$ -22975 26094 48064 62511 79830 -21017 -259452 -389142 -215425 70538 133068 -39457
5639c9457j27865N5372R7827k609o9171m8947n572L7204O9969M2358l4593n9835
$$ -39457 -167322 -111950 -14123 -16732 -85903 -134850 -140422 -103218 -33249 9109 -25484 -85319
5627h5319j4602q334o4261n1101O1647R6274l5123j41395n2908Q8200O8472l6455
$$ -85319 -99921 -108255 -172516 -223617 -161970 -65696 -100819 -242214 -295122 -206922 -138450 -174905
5615a74905q847J22027J24757m6994j78763j19724L3026J12859Q2181J1247k3479
$$ -174905 -183752 -61725 63032 16038 -162725 -282449 -249423 -136564 -54383 -43136 -66615
5604f6615Q190O2233N2944k6561o7717l290P5759N5650k9863p3773n6823j8303
$$ -66615 -58425 3808 56752 30191 -37526 -40816 34943 90593 60730 -13043 -69866 -88169
5592h8169M2280J07395Q6500l7336j13949m2495L7766k8489j19732k3784J70478
$$ -88169 -45889 61506 148006 110670 -3279 -45774 -8008 -36497 -156229 -180013 -9535
5581i535J68660o1261k21710j30251M7324R4761L4178M842M5963J08534J35790
$$ -9535 159125 97864 -123846 -254097 -206773 -112012 -77834 -72992 -27029 81505 217295
5570B17295O6163r6516j91976p2977J16594P8286j75385k79728n6604K06893K05843
$$ 217295 283458 186942 -5034 -78011 38583 116869 -58516 -338244 -394848 -187955 17888
5559A7888N4960J5466L6570q3538k44501j53694J48907K66376K5628k46684j94175
$$ 17888 72848 88314 124884 41346 -203155 -356849 -207942 58434 84062 -162622 -356797
5548c56797P1190J70668J8455q6449O7922K75823J99340j33200l31867j74489
$$ -356797 -285607 -114939 -96484 -182933 -115011 160812 360152 226952 -104915 -279404
5538b79404Q4963R1878r2754j14245J08217K58807J22811j05867j61965q2345
$$ -279404 -194441 -102563 -195317 -309562 -201345 57462 180273 74406 -87559 -169904
5528a69904l6568j2581P6234J42804N9232p8450q3699R984K9177k7064k3066K8103
$$ -169904 -206472 -219053 -142819 -15 59217 -19233 -102932 -92948 -63771 -90835 -113901 -85798
5516h5798L75o3475p450J10233O6173j18569j51205N7238K11615Q4190j37339
$$ -85798 -85423 -148898 -156348 -46115 20058 -98511 -249716 -192478 19137 103327 -34012
5505c4012j56698L477J08901Q3308M0778M8730O0592L5704j6447o9538p1973J6963
$$ -34012 -190710 -187233 -78332 4976 45754 94484 155076 190780 174333 104795 32822 49785
5493D9785J16500P2059j03352j83184l9559J46623J36076l7424j50941j04699
$$ 49785 166285 238344 134992 -48192 -87751 58872 194948 157524 6583 -98116
5483i8116J2914Q9774P2633l2172j12966j9321J89305K12424q1577l68409k55811
$$ -98116 -85202 4572 77205 45033 -67933 -87254 102051 314475 232898 -135511 -391322
5472c91322J45786L48379J48783j50472k17583q5094L7641Q3595R6299O3537l6960
$$ -391322 -245536 102843 251626 101154 -116429 -201523 -163882 -80287 16012 79549 42589
5461D2589j23613q7373N9547J91357J91971M4983j43348k10900j05554L4391N9671
$$ 42589 -81024 -168397 -108850 82507 274478 319461 176113 -34787 -140341 -105950 -46279
5450d6279K0147N0386J02230J0802j79485k15142k4849J45420J07239j771R544
$$ -46279 -26132 24254 126484 137286 -42199 -257341 -282190 -136770 -29531 -31302 -21758
5439b1758O4361j1056j59380j81034n4637N8855P5742N3317L6483K1976L9765
$$ -21758 42603 31547 -127833 -308867 -363504 -304649 -228907 -175590 -139107 -117131 -77366
5428g7366J02979J17474P863j12540p8299O0760J04510J2944n5676j9907K3537
$$ -77366 25613 143087 150950 38410 -39889 20871 125381 138325 82649 62742 86279
5417H6279N307j4283l246k5174p8213n2757O1841J07732O784q7941k4910J04085
$$ 86279 91586 77303 74057 48883 -29330 -82087 -20246 87486 94270 6329 -18581 85504
5405H5504J10599j0948j12137j23307r9124p5885l0256L1658N9855L7839J51j5659
$$ 85504 196103 185155 73018 -50289 -149413 -225298 -255554 -223896 -164041 -126202 -126051 -141710
5393a41710J2208P6632J06781K2023j26460j69934n5706N3646K5105l3593L3088
$$ -141710 -129502 -52870 53911 75934 -50526 -220460 -276166 -222520 -197415 -231008 -197920
5382a97920J48583J29902N842l7110J6568N512q3002o8007Q2106J45851J2191
$$ -197920 -49337 80565 86407 49297 65865 71377 -11625 -79632 2474 148325 160516
5371A60516j13626m3749Q0936L4675j16838j35667Q652J27161J11496K0278q3464
$$ 160516 46890 3141 84077 118752 1914 -133753 -125101 2060 113556 133834 50370
5360E0370j65596j36405M4167K05969J42218p1704j69980r7034m5778p7746k2451
$$ 50370 -115226 -251631 -207464 -1495 140723 69019 -100961 -197995 -243773 -321519 -343970
5349c43970J51679J97882P409j37666O874K16786J33966j41794j89117O8762K43394
$$ -343970 -192291 5591 13000 -124666 -117792 98994 232960 91166 -97951 -29189 214205
5338B14205Q9505j38933j15814O6522R0776p6955j62160k3363J39595Q9867j09534
$$ 214205 303710 164777 48963 115485 206261 129306 -32854 -56217 83378 173245 63711
5327F3711j99374q8723M2574K9817l5897K1268J44625J10570q4570j55963L1499
$$ 63711 -135663 -224386 -181812 -151995 -187892 -166624 -21999 88571 4001 -151962 -120463
5316a20463K01353P3551j63557j22721J47460K04543q4160l00502j07516K40850
$$ -120463 80890 154441 -9116 -131837 15623 220166 136006 -164496 -272012 -31162
5306c1162K95320M7524j54347j50541q4938n8643m340Q9858J15777N0745K95p255
$$ -31162 264158 311682 157335 6794 -78144 -136787 -141127 -51269 64508 115253 115548 108293
5294A08293n7680j37788j03438O2388J63973P4674p1287r6067l6763l7851r7702
$$ 108293 50613 -87175 -190613 -128225 35748 110422 39135 -56932 -93695 -131546 -229248
5283b29248q5045M4910J84637K06316P8854j14028k16107j20269Q8885J87209
$$ -229248 -314293 -269383 -84746 121570 200424 86396 -129711 -249980 -161095 26114
5273B6114P8079p7618q7990J0200M7735l400k2559K9407N5111J0532j8699J9350
$$ 26114 104193 26575 -61415 -51215 -3480 -6880 -29439 -32 55079 65611 46912 66262
5261F6262N0371J5107k6746k0066k1281p3347q5277J8540J14702L2029j49118
$$ 66262 116633 131740 104994 84928 63647 -9700 -94977 -76437 38265 70294 -78824
5250g8824j61606M9211K05066Q7583j31622j39638N8962J67354M8095r6289n5100
$$ -78824 -240430 -191219 13847 101430 -30192 -169830 -110868 56486 104581 8292 -46808
5239d6808Q7595J11158k1950j54548j63409o4168O5836J52732J43372N3880k3650
$$ -46808 40787 151945 129995 -24553 -187962 -252130 -186294 -33562 109810 163690 140040
5228A40040l4260l0860o0873o4352R080P1018K6212m4432p718P9772O2283k6108
$$ 140040 105780 74920 14047 -50305 -41225 29793 56005 11573 3855 83627 145910 119802
5216A19802j2396P9843L3732j62072k25255l2404J35848K5198j72346j24469J04182
$$ 119802 107406 187249 220981 58909 -166346 -198750 -62902 -37704 -210050 -334519 -230337
5205b30337J70092R477q9767K1704J39475P2195o6234p9849J0224N6369K3507
$$ -230337 -60245 -50768 -140535 -118831 20644 92839 26605 -53244 -43020 13349 36856
5194C6856k0244m7931p1209o8523k9652q331l4797m1632K9909J14778J14970N0266
$$ 36856 16612 -31319 -102528 -171051 -200703 -209034 -243831 -285463 -255554 -140776 -25806 24460
5182B4460J4635K5049K0964j2106k6375j1876j1819l0029j7115K8809L6247k3184
$$ 24460 39095 64144 85108 73002 46627 34751 22932 -7097 -24212 4597 40844 17660
5170A7660p0159l2879L2639K2850m4932n1172K8947O6439j3764p5164L9471K19138
$$ 17660 -52499 -85378 -52739 -29889 -74821 -125993 -97046 -30607 -44371 -119535 -80064 139074
5158A39074J84334r5295k92782j57782J17050J63675m1373j77222o7505J02873
$$ 139074 323408 228113 -64669 -222451 -105401 58274 16901 -160321 -227826 -124953
5148a24953J20092L8972R509R544n2772j06610j7477J41817J49009k9897j69474
$$ -124953 -4861 34111 43620 53164 392 -106218 -123695 18122 167131 137234 -32240
5137c2240j13186J2079K3247l0913J4547J24532Q7844j24690k45138p3992K01781
$$ -32240 -145426 -133347 -110100 -141013 -126466 -1934 85910 -38780 -283918 -357910 -156129
5126a56129K47402M6885r9795l1880P2672K4880r1480j14009p2830o5602l3324
$$ -156129 91273 138158 38363 6483 79155 104035 12555 -101454 -174284 -239886 -273210
5115b73210R3487J62912R659j94188j30290J50340K60595O7783j17663n8815O4527
$$ -273210 -179723 -16811 -7152 -201340 -331630 -181290 79305 147088 29425 -29390 35137
5104C5137K1383q9732p8785o772o453L199J16750J65711j6643k24385j46024J17847
$$ 35137 56520 -33212 -111997 -118769 -125222 -122023 -5273 160438 143795 -80590 -226614 -108767
5092a08767J95328K9945p8955l460N8143m610m5829j237j8750j25517j21908L8490
$$ -108767 86561 116506 37551 34091 92234 87624 41795 40558 21808 -103709 -225617 -187127
5080a87127J09225k4501j18655J1110J65673J17973p421p271K4915o5938j34171
$$ -187127 -77902 -102403 -221058 -209948 -44275 73698 66277 59006 83921 17983 -116188
5069a16188Q897J76511P0323j79036j85932N2834J61772K1367p3632L6486J24750
$$ -116188 -107291 69220 139543 -39493 -225425 -172591 -10819 10548 -63084 -26598 98152
5058I8152K5557p9075k8983K1741p1050j39581o215J70937J48681r937q2700n2116
$$ 98152 123709 44634 15651 37392 -33658 -173239 -179454 -8517 140164 130227 47527 -4589
5046d589l7906k3414N5843Q8545l9335j67537q3812Q1848M8308j08177n5452J92680
$$ -4589 -42495 -65909 -10066 78479 39144 -128393 -212205 -130357 -82049 -190226 -245678 -52998
5034e2998K38141l9140k41039q3971J44909P2143j64696j87524l35Q4756O533
$$ -52998 185143 146003 -95036 -179007 -34098 38045 -126651 -314175 -314510 -229754 -223221
5023b23221K779J28399J41582n2084j95644p3508J54984J96949K7015j27888j05240
$$ -223221 -220442 -92043 49539 -2545 -198189 -271697 -116713 80236 107251 -20637 -125877
5012a25877L3450J17072N3773p9307j19224j5375J01573J13756Q5416J05822P8662
$$ -125877 -92427 24645 78418 -889 -120113 -135488 -33915 79841 165257 271079 349741
5001C49741j05760k73635j53140J53389K36512o665j95966o5012J34193P8993
$$ 349741 243981 -29654 -182794 -29405 207107 200442 4476 -60536 73657 152650
4991A52650j05298j17055l204r994r3893j8870J55829J33757q4972j61915K3640
$$ 152650 47352 -69703 -72907 -82901 -176794 -195664 -39835 93922 8950 -152965 -129325
4980a29325J77722P6699j04386j18967q702N3914M2966J4202l7008q5325k6201
$$ -129325 48397 125096 20710 -98257 -106959 -53045 -10079 4123 -32885 -118210 -144411
4969a44411J28092J83011M5318j06274r2423L324J4536l7861m7962m1047p9281
$$ -144411 -16319 166692 212010 105736 13313 16637 31173 -6688 -54650 -95697 -174978
4958a74978q5140K4032J34848R1692l5616n8670K1644L8928m2459p5986J4456
$$ -174978 -260118 -236086 -101238 -9546 -45162 -103832 -82188 -43260 -85719 -161705 -147249
4947a47249J18892J13528J0474r6889j39010j03316k9924K7008O4175J09374J24874
$$ -147249 -28357 85171 95645 -1244 -140254 -243570 -273494 -246486 -182311 -72937 51937
4936E1937M0040q5781q6834N0994J31212M9809l6916R297O8042r843j25151j11712
$$ 51937 91977 6196 -80638 -29644 101568 151377 114461 123758 191800 181957 56806 -54906
4924e4906k4579l610j0312M2476O2213m0595j08576R353J29775J9604j54401q2218
$$ -54906 -79485 -83095 -93407 -50931 11282 -29313 -137889 -128536 1239 20843 -133558 -215776
4912b15776J18947P9725j52191j60875J10565K47207P5959p0227J6741P0235j03256
$$ -215776 -96829 -17104 -169295 -330170 -219605 27602 103561 33334 50075 120310 17054
4901A7054k29236o0301J63627J29330l4805m7297L1685o805r1141l4689P4371
$$ 17054 -212182 -272483 -108856 20474 -14331 -61628 -29943 -36748 -127889 -162578 -88207
4890h8207L5209p8563n5572O9337J02397L4160j1450l6997q9866p2641P2545J56897
$$ -88207 -52998 -131561 -187133 -117796 -15399 18761 7311 -29686 -119552 -192193 -119648 37249
4878C7249K6275j29038p0113P2672L4917j09437j02355K9027O4956J5634L5224
$$ 37249 63524 -65514 -135627 -62955 -28038 -137475 -239830 -210803 -145847 -130213 -94989
4867i4989N1913p6275j74546j729K37192J59078j14927j30325J02116J27163j13087
$$ -94989 -43076 -119351 -293897 -295626 -58434 100644 -14283 -144608 -42492 84671 -28416
4856b8416j58949J09986K12462p5821k82903m3126K67647J73379j31184j77719
$$ -28416 -187365 -77379 135083 59262 -223641 -266767 880 174259 43075 -134644
4846a34644M340N8773m5024n8579M2795P7320L4754L0010J7667p8900j10324N8294
$$ -134644 -130304 -71531 -116555 -175134 -132339 -55019 -20265 9745 27412 -51488 -161812 -103518
4834a03518K12045P7486j96038k43306m9356R2849Q7732Q4960R3803k2460j85113
$$ -103518 108527 186013 -10025 -253331 -302687 -209838 -122106 -37146 56657 34197 -150916
4823a50916j44751Q4649K07903J08369j6124k4736j3747o1355r2631p0511n7450
$$ -150916 -295667 -211018 -3115 105254 89130 64394 50647 -10708 -103339 -173850 -231300
4812b31300l8686O0266J56692Q6274q2653j03844M5271J25445M8663J341O9818
$$ -231300 -269986 -209720 -53028 33246 -49407 -153251 -107980 17465 66128 67469 137287
4801A37287P8335o2972j61818p0414O5390P2565K3174M1663N8513k7742j20703
$$ 137287 215622 152650 -9168 -79582 -14192 58373 81547 123210 181723 153981 33278
4790C3278p7989L8573O5191r661o5943m9398n685J6558r782q9280j50264q8963
$$ 33278 -44711 -6138 59053 49392 -16551 -65949 -71634 -55076 -64858 -154138 -304402 -393365
4778c93365O5597J50571J01653M4271O9096P7369k7274j39608j02277M4562J15332
$$ -393365 -327768 -177197 -75544 -31273 37823 115192 87918 -51690 -153967 -109405 5927
4767E927K8197j12466j50206k7578J55735K13272P0937j10747j26468j5565J0931
$$ 5927 34124 -78342 -228548 -256126 -100391 112881 183818 73071 -53397 -68962 -58031
4756e8031p5679p5330Q1994J87611Q4399q6945j29415p4134m7611l4774L3176
$$ -58031 -133710 -209040 -127046 60565 144964 58019 -71396 -145530 -193141 -227915 -194739
4745a94739J00545Q5013L4244K0148r48o8032r0516o922O7887K4574m7897k7361
$$ -194739 -94194 -9181 25063 45211 44263 -23769 -114285 -121207 -53320 -28746 -76643 -104004
4733a04004K5183M658k5243L0087P8491o454j26481r4241N6518J31400P8265Q616
$$ -104004 -78821 -74163 -99406 -69319 9172 2718 -123763 -218004 -161486 -30086 48179 56795
4721E6795j8102k0221K3535J08307J05950m7895j69773p4756R7549Q1093q5592
$$ 56795 38693 18472 42007 150314 256264 208369 38596 -36160 61389 142482 56890
4710E6890j38593l2998L1053k773J2567Q6354N0533q4861r3024O1206J22108k0731
$$ 56890 -81703 -114701 -83648 -86421 -73854 12500 63033 -21828 -114852 -53646 68462 47731
4698D7731j35619n4605M8504j095n9534M7356J63475M4934j98886k31221J2816
$$ 47731 -87888 -142493 -93989 -95084 -154618 -107262 56213 101147 -97739 -328960 -316144
4687c16144K40505K14276J6764j35338j58421j08016l8628M0516J01652P5801
$$ -316144 -75639 138637 155401 20063 -138358 -246374 -285002 -244486 -142834 -67033
4677f7033n5150j69699j04186J20564K71362J89942P369n5016K409J4468o3845
$$ -67033 -122183 -291882 -396068 -275504 -4142 185800 193169 138153 140562 155030 91185
4666I1185j29242j28687q5214J2747J38916J34703o1504j95987k6361K33949J90916
$$ 91185 -38057 -166744 -251958 -239211 -100295 34408 -27096 -223083 -249444 -15495 175421
4655A75421q1765j47496M6469Q4592j52401k40315L2852K54803R5300j19238l694
$$ 175421 93656 -53840 -7371 77221 -75180 -315495 -282643 -27840 67460 -51778 -55472
4644e5472J92847N2414k38724k09364P3217J47724l5268r4170O6583J38016J4532
$$ -55472 137375 189789 -48935 -258299 -185082 -37358 -72626 -166796 -100213 37803 52335
4633E2335n3257K3918L0560q6852r8976M9240J19588L6412J4100J03719O6476
$$ 52335 -922 22996 53556 -33296 -132272 -83032 36556 72968 87068 190787 257263
4622B57263j44917k32345p2232N3596k8300p7693P9415J93428M6776j22519l8118
$$ 257263 112346 -119999 -192231 -138635 -166935 -244628 -165213 28215 74991 -47528 -85646
4611h5646J11852J8391j78845j33937Q8470J25432n6730j24061M4069J75101Q1671
$$ -85646 26206 44597 -134248 -268185 -179715 -54283 -111013 -235074 -191005 -15904 65767
4600F5767n3248j2612J15674J12670l6376j48804j06905O859L0749o7594j41614
$$ 65767 12519 -93 115581 228251 191875 43071 -63834 -56975 -26226 -93820 -235434
4589b35434o8140M7666J3740j09301m3372K44618L88256J36909k17782k34322
$$ -235434 -303574 -255908 -242168 -351469 -394841 -150223 238033 374942 157160 -77162
4579g7162L3321J51033j6093j43904j0537J62562R3423j21656j77921q392J59201
$$ -77162 -43841 107192 91099 -52805 -63342 99220 192643 70987 -106934 -115326 43875
4568D3875J31095l6533j54362j26855k2377M6608O0007O7207O0942j7017j19633
$$ 43875 174970 138437 -15925 -142780 -165157 -118549 -58542 8665 69607 52590 -67043
4557f7043q8919R6430K07610N9868j85972k15827K057J88568J50740k406p5858
$$ -67043 -155962 -59532 148078 207946 21974 -193853 -191796 -3228 147512 145106 69248
4546F9248l5989K6249M1635K124n3205n2618L0118J07905P9198k1080p5272n9121
$$ 69248 33259 59508 101143 103267 50062 -2556 27562 135467 214665 193585 118313 59192
4534E9192l4210J392Q7577J43942L9344j53124j84912M396J54686M7934j64742
$$ 59192 24982 26374 113951 257893 297237 144113 -40799 -36403 118283 166217 1475
4523A475j76207M0308K04500J17743r2558j67411m3549J06233J23386M7979P428
$$ 1475 -174732 -134424 70076 187819 95261 -72150 -115699 -9466 113920 161899 169327
4512A69327R590k9257q5875l8272R1421J04103n8617j68142n4624R6294L5268
$$ 169327 178917 149660 63785 25513 116934 221037 162420 -5722 -60346 35948 71216
4501G1216j30169j15963N4931J08016K634k6887P1228P2309p6528j18507M5979
$$ 71216 -58953 -174916 -119985 -11969 -9335 -36222 35006 107315 30787 -87720 -41741
4490d1741J40332j8373j82185q3032J24366J49328L9971K1613O3808j4786j46265
$$ -41741 98591 80218 -101967 -184999 -60633 88695 128666 150279 214087 199301 53036
4479E3036j01921Q5354J46451O963j30619j40550j06149p3924K9930J75689J88236
$$ 53036 -48885 36469 182920 189883 59264 -81286 -187435 -261359 -231429 -55740 132496
4468A32496K1394j40554j43455m5120L2866O3505N8907J6497j7256K5267R5034
$$ 132496 153890 13336 -130119 -175239 -142373 -78868 -19961 -3464 -20720 4547 99581
4457I9581O4247o0643j22692n3081L8822O1953N6196M6130l2983j65568j84928
$$ 99581 163828 103185 -19507 -72588 -33766 28187 84383 130513 97530 -68038 -252966
4446b52966p416J92084J84291j6248j84443j66101k2849P8207M8579m0849m5407
$$ -252966 -260382 -68298 115993 99745 -84698 -250799 -273648 -195441 -146862 -187711 -233118
4435b33118O8266J58796J00439k2404m3265J3255j8917j29836j06864J00662K31754
$$ -233118 -164852 -6056 94383 71979 28714 41969 23052 -106784 -213648 -112986 118768
4424A18768Q5054j52818j57497P4390K35409J29945j07397k26533j48926L254
$$ 118768 203822 51004 -106493 -32103 203306 333251 225854 -679 -149605 -146351
4414a46351P8837M6789r308k2587k7264o8028q1411J6921J53860J65225N0417
$$ -146351 -67514 -20725 -30033 -52620 -79884 -147912 -229323 -212402 -58542 106683 157100
4403A57100j6911K7243M2011m9362j08363l3552L7046m1826j57805j19779L1451
$$ 157100 140189 167432 209443 160081 51718 18166 55212 13386 -144419 -264198 -232747
4392b32747J13137R4845P5315N4276l1166j05905m3920P8148O6158o2846r1030
$$ -232747 -119610 -24765 50550 104826 73660 -32245 -76165 1983 68141 5295 -85735
4381h5735M2626J45129Q0498n1263j11804r2279k1023Q8166J33154o418k16423
$$ -85735 -43109 102020 182518 131255 19451 -72828 -93851 -5685 127469 121051 -95372
4370i5372k07740N6519K43574J22143r6210j06612K2927K3895r6023q8626Q4701
$$ -95372 -303112 -246593 -3019 119124 22914 -83698 -60771 -36876 -132899 -221525 -136824
4359a36824J76944O0642q4197p6496J2126L3768L832J6009N1723K8907l6427n4938
$$ -136824 40120 100762 16565 -59931 -47805 -14037 -10205 5804 57527 86434 50007 -4931
4347d931j2235J9294J386k5631j8509J4024L7784L0838q230n8246q1783n7104
$$ -4931 -17166 2128 3514 -22117 -40626 -26602 11182 42020 33790 -24456 -106239 -163343
4335a63343l350M0404N5598N3105N0027M7702L0330j2679n8883o6011l3658k4522
$$ -163343 -166693 -126289 -70691 -17586 32441 80143 110473 97794 38911 -27100 -60758 -85280
4323h5280p7446j20512m6637J16494K00545J07979m6287q1308J4462R0995N6832
$$ -85280 -162726 -283238 -329875 -213381 -12836 95143 48856 -32452 -17990 73005 129837
4312A29837j8713m1789k9058m6585q5717q1675k5063K2541K2087M088R931L3526
$$ 129837 111124 69335 40277 -6308 -92025 -173700 -198763 -176222 -154135 -150047 -140116 -106590
4300a06590M1786K1157j5113m3075l8363M326M6406K9240m6958q9764r207J47746
$$ -106590 -64804 -43647 -58760 -101835 -140198 -135872 -89466 -60226 -107184 -196948 -206155 -58409
4288e8409K10230P7682j26762j72222n381J63058J22414n9423j39777m7757L7556
$$ -58409 151821 229503 102741 -69481 -74862 88196 210610 151187 11410 -36347 1209
4277A209j4562r2229n3262L1012J8763l7291Q087R5246K7827j62905k02306M638
$$ 1209 -13353 -105582 -158844 -127832 -109069 -146360 -138273 -43027 -15200 -178105 -380411 -375773
4265c75773K03439J79460O7105P3503J16739Q887j57778j27559P7205J51998k5216
$$ -375773 -172334 7126 74231 147734 264473 273360 115582 -11977 65228 217226 192010
4254A92010k08442j53107N5523J66811R4449m3825j08309n7396M3039P0450k7822
$$ 192010 -16432 -169539 -114016 52795 147244 103419 -4890 -62286 -19247 51203 23381
4243B3381j39640j11977K7084R8327L7103k6052Q124O5162N3672R918o281k0835
$$ 23381 -116259 -228236 -201152 -102825 -65722 -91774 -83650 -18488 35184 45102 38821 17986
4231A7986n4315n3861j1791j4410p1229m9620R3409J77989O8630p6862l8859J00260
$$ 17986 -36329 -90190 -101981 -116391 -187620 -237240 -143831 34158 102788 25926 -12933 87327
4219H7327P3598j43219k76549j42231J21526K56448J63803n6015k16598j77326
$$ 87327 160925 17706 -258843 -401074 -279548 -23100 140703 84688 -131910 -309236
4209c09236K4631J71973J04719o6214j10569r39Q4784N5063j332j9627m5039p1550
$$ -309236 -284605 -112632 -7913 -74127 -184696 -185635 -100851 -45788 -47120 -66747 -111786 -183336
4197a83336p145J21624J34410j9991j31151k5510J55802J52521m6498k10918j88803
$$ -183336 -190481 -68857 65553 45562 -85589 -111099 44703 197224 150726 -60192 -248995
4186b48995n3698N0950P4211M8011J3855p105j4232j3771j273K2172K6637j067
$$ -248995 -302693 -251743 -177532 -129521 -115666 -122771 -137003 -150774 -152047 -129875 -103238 -104305
4174a04305m402O4186J24318N3308r8862j37069j2714Q4181J6906q7272n7467
$$ -104305 -108707 -44521 79797 133105 34243 -102826 -115540 -31359 -14453 -101725 -159192
4163a59192M7790P0629L0513N4094J10556N4189r4683j44130l0341Q4013O5556
$$ -159192 -111402 -40773 -10260 43834 154390 208579 113896 -30234 -60575 23438 88994
4152H8994j6513m7439l8557m6009m5543K348N1623L9911K59J0733O6427Q0558
$$ 88994 72481 25042 -13515 -59524 -105067 -102719 -51096 -11185 -10926 -193 66234 146792
4140A46792N081j00254j26567l3799Q8374J02272p815r4797m2381N6164K8374
$$ 146792 151873 51619 -74948 -108747 -20373 81899 74084 -20713 -63094 -6930 21444
4129B1444j00780j22230M2444K04048J66381j0434j20717q9386j1465K0189o23
$$ 21444 -79336 -201566 -159122 44926 211307 200873 80156 -9230 -20695 -506 -1129
4118a129m8407r0906p2917K5727J23273J17391K8114l0132j6765n716m2469o6575
$$ -1129 -49536 -140442 -213359 -187632 -64359 53032 81146 51014 34249 28533 -13936 -80511
4106h0511k5652K3989P132m1282k7171N0701R2242M4597k4348l4469p007j0798
$$ -80511 -106163 -82174 -75042 -116324 -143495 -92794 -552 44045 19697 -14772 -21779 -32577
4094c2577l9969k6502L1962M3085m4313j39500j10897L8257J61979J43646K4946
$$ -32577 -72546 -99048 -67086 -24001 -68314 -207814 -318711 -280454 -118475 25171 50117
4083E0117n6387k5128N9371P8669j1311j25925j39621l0131Q9464J00646J3427
$$ 50117 -6270 -31398 27973 106642 95331 -30594 -170215 -200346 -110882 -10236 3191
4072C191o2988n9256p101K9308L0098J7006J3408K3234K7807J288m8960o7399
$$ 3191 -59797 -119053 -126154 -96846 -66748 -49742 -36334 -13100 14707 15995 -32965 -100364
4060a00364j1912P4293R6406K2025p6315j06728n7001P954K9726K1796M6376J17847
$$ -100364 -112276 -37983 58423 80448 4133 -102595 -159596 -151642 -121916 -100120 -53744 64103
4048F4103J47498M0202j43982k10829p5555R5224Q9718n6981j14229J6417J75455
$$ 64103 211601 251803 107821 -103008 -178563 -83339 6379 -50602 -164831 -148414 27041
4037B7041J81812O0595l6154l6239J0214L2382N244n2914r6747q8820m2670l652
$$ 27041 208853 269448 233294 197055 207269 239651 244895 191981 95234 6414 -36256 -39908
4025c9908J4700K9131L0495k286l7813k3496K1774L6135K5841L7253L2459o0854
$$ -39908 -25208 3923 34418 32132 -5681 -29177 -7403 28732 54573 91826 124285 63431
4013F3431j73357j45562J2239J06555O7107M9638J32575J47707k0800j88596j42830
$$ 63431 -109926 -255488 -243249 -136694 -69587 -19949 112626 260333 239533 50937 -91893
4002i1893J8431O2576j3495n7432o3845j10010j00520R3426L04634K33970o4970
$$ -91893 -73462 -10886 -24381 -81813 -145658 -255668 -356188 -262762 41872 275842 210872
3991B10872k18637q5061P8562P0353R214K3015J6795p0875r1139K7352R2073k7008
$$ 210872 -7765 -92826 -14264 56089 65303 88318 105113 34238 -56901 -29549 62524 35516
3979C5516j42158o3644O8631L8358p7106p8257M449K9584M0138J21269J31379
$$ 35516 -106642 -170286 -101655 -63297 -140403 -218660 -214211 -184627 -144489 -23220 108159
3968A08159o5585k44085j01791J95668K05114q6981k26352j7872J92655J17473
$$ 108159 42574 -201511 -303302 -107634 97480 10499 -215853 -233725 -41070 76403
3958G6403m7738l9416L3724k1773q5063K8462J61335M5936k09857k48631n371
$$ 76403 28665 -10751 22973 1200 -83863 -55401 105934 151870 -57987 -306618 -311989
3947c11989K18387K04437M4462q9574j36271q4592L9425J00650j0143j54072r0696
$$ -311989 -93602 110835 155297 65723 -70548 -155140 -115715 -15065 -25208 -179280 -269976
3936b69976J29780J87073k2308j95423p0799J74860J94587l0714k05127j44649
$$ -269976 -140196 46877 24569 -170854 -241653 -66793 127794 97080 -108047 -252696
3926b52696L8511J59141J69501J18638N0022q644m4172p9360j33434j60670j03078
$$ -252696 -214185 -55044 114457 233095 283117 274473 230301 150941 17507 -143163 -246241
3915b46241N3M5488J9131J9133R3380J48023Q2991m8925j01210k3509Q2058R3320
$$ -246241 -246188 -200700 -181569 -162436 -69056 78967 161958 113033 11823 -11686 70372 163692
3903A63692M4j08790j49122j10804m2880N006K0670J6384j637k6183k0465N3930
$$ 163692 163736 54946 -94176 -204980 -247860 -242854 -222184 -205800 -207437 -233620 -254085 -200155
3891b00155J56660J68985L6896j16624j12688M0890J27787K224j94273k00839
$$ -200155 -43495 125490 162386 45762 -66926 -26036 101751 103975 -90298 -291137
3881b91137J6291K13429J85929J5856p0754j0503M7144k2714j44869j53914j9381
$$ -291137 -274846 -61417 124512 140368 69614 59111 106255 83541 -61328 -215242 -234623
3870b34623J11747J01527m504m1680M4293J10966K1611j30271j26708M7017J44071
$$ -234623 -122876 -21349 -25853 -67533 -23240 87726 109337 -20934 -147642 -100625 43446
3859D3446R586j61179q9357J59331K45956N1536j52457j16545L3927L7167q7211
$$ 43446 53032 -108147 -197504 -38173 207783 259319 106862 -9683 24244 61411 -25800
3848b5800j06879K0184Q8381N835n0842N3938J70050R6259r2294j55334m6285
$$ -25800 -132679 -112495 -24114 -18279 -69121 -15183 154867 251126 158832 3498 -42787
3837d2787M9859J9068m2853l2779m949m4391j04237p9634L2161J41625J83438
$$ -42787 7072 26140 -16713 -49492 -54441 -98832 -203069 -282703 -250542 -108917 74521
3826G4521J43982K8203j15218j83399j25921k6533Q755K506M1397J05077R7600
$$ 74521 218503 246706 131488 -51911 -177832 -204365 -195610 -193104 -151707 -46630 50970
3815E0970L2866K7749Q8763P6772n0785j34256o1949L1550j8175j17206n7457
$$ 50970 83836 111585 200348 277120 226335 92079 30130 61680 43505 -73701 -131158
3804a31158J20133J56658k0089j70449j08069L1397L6735m2575j5780J02481J10175
$$ -131158 -11025 145633 125544 -44905 -152974 -121577 -84842 -127417 -143197 -40716 69459
3793F9459l4975j24943k3722J19261J03623k1923o1538J4106N1837m762k4165
$$ 69459 34484 -90459 -114181 5080 108703 86780 25242 39348 91185 86423 62258
3782F2258O4606J14947j1829j92743j94774j6628J17246R4149L6550M3485K7915
$$ 62258 126864 241811 229982 37239 -157535 -174163 -56917 37232 73782 117267 145182
3771A45182o8543j01172M1716J81615Q0381j59912k13706k9596R6628N879q2912
$$ 145182 76639 -24533 17183 198798 279179 119267 -94439 -124035 -27407 -21528 -104440
3760a04440K8745J63954O3430j72491k33233p1701P6336R2876Q9867J14620N2199
$$ -104440 -75695 88259 151689 -20802 -254035 -325736 -249400 -156524 -66657 47963 100162
3749A00162r7076j23907O0293K27067J45079q2565j90440j28465n6125m4685j0473
$$ 100162 3086 -120821 -60528 166539 311618 229053 38613 -89852 -145977 -190662 -201135
3738b01135P3078J02306K3271o6495n7716K7839Q7946O9097O476k8377p389P860
$$ -201135 -128057 -25751 -2480 -68975 -126691 -98852 -10906 58191 64667 36290 28901 36761
3726C6761o7041j91438j91132J3425K39446K40174L7012j09260o3498K7100j725
$$ 36761 -30280 -221718 -412850 -399425 -159979 80195 117207 7947 -55551 -28451 -30176
3715c0176q6360p7272O761K7726l4244n2790M3051J66966J96243J05418l9851
$$ -30176 -116536 -193808 -187047 -159321 -193565 -246355 -203304 -36338 159905 265323 225472
3704B25472j49804j54671m9732P6542J10257L4284n4373o5368j4000J9954m074
$$ 225472 75668 -79003 -128735 -52193 58064 92348 37975 -27393 -41393 -21439 -25513
3693b5513n2550o7005k7684K4481K8988j7287l9581K1191J06772R6214k5650j27055
$$ -25513 -78063 -145068 -172752 -148271 -119283 -136570 -176151 -154960 -48188 48026 22376 -104679
3681a04679j00043m341L3227Q649K1678Q7936J03701K8542l2165o142J0165p5326
$$ -104679 -204722 -209063 -175836 -167187 -145509 -57573 46128 74670 42505 36363 46528 -28798
3669b8798j45415l0989J74705J89780l5152k02965q8275J38168J78787L7860m5865
$$ -28798 -174213 -205202 -30497 159283 124131 -78834 -167109 -28941 149846 187706 141841
3658A41841R093N6029N321o4794r4516j15468j07633l947J17473P8382r1047j36155
$$ 141841 150934 206963 212284 147490 52974 -62494 -170127 -174074 -56601 21781 -69266 -205421
3646b05421J9333J16295k2853j78760q2930J37962J74311L4372j4737P6383Q7858
$$ -205421 -186088 -69793 -92646 -271406 -354336 -216374 -42063 -7691 -22428 53955 141813
3635A41813m8254j29328m9730L1614m644n1737j9036O803j3575M7803K02630K06027
$$ 141813 93559 -35769 -85499 -53885 -58529 -110266 -129302 -122499 -136074 -88271 114359 320386
3623C20386o0970l00865j90924J07819J73832m2275j78195m6867J06974M0996
$$ 320386 259416 -41449 -232373 -124554 49278 7003 -171192 -218059 -111085 -70089
3613g0089j11571r5703O2286J38739P5711K6023P0361R7501J0973r7889q0461
$$ -70089 -181660 -277363 -215077 -76338 -627 25396 95757 193258 204231 106342 25881
3602B5881M4353J08063K5143r2873r8463o104N3831L4639J3424L1462J8158p4929
$$ 25881 70234 178297 203440 110567 12104 6000 59831 94470 107894 139356 157514 82585
3590H2585j66541j51524m6649M5059O7221M4070K3370L3398N7021L1144o0437
$$ 82585 -83956 -235480 -282129 -237070 -169849 -125779 -102409 -69011 -11990 19154 -41283
3579d1283r9698L1171K15774J92469n5091k16396r6530R1178P7938m3579l8176
$$ -41283 -140981 -109810 105964 298433 243342 26946 -69584 21594 99532 55953 17777
3568A7777L5005l2659j55767p8965J16537R3385j32640j56627J19558K59289L171
$$ 17777 52782 20123 -135644 -214609 -98072 -4687 -137327 -293954 -174396 84893 88064
3557H8064k64846j29726J74076J62382j02228j49118J04608K45104O1593j41507
$$ 88064 -176782 -306508 -132432 29950 -72278 -221396 -116788 128316 189909 48402
$$ [...]
##END NTUPLES=NMR SPECTRUM
##END=
