##TITLE=1H ikalashn
I-52-Et
24.10.2024
##JCAMPDX= 6.0         $$ Bruker NMR JCAMP-DX V2.0
##DATA TYPE= NMR FID
##DATA CLASS= NTUPLES
##ORIGIN= UXNMR, Bruker Analytische Messtechnik GmbH
##OWNER= root
$$ TOPSPIN		Version 1.3
$$ 2024-10-24 14:45:02.593 +0400  Irina@DPX200
$$ Compression mode = diff/dup
##.OBSERVE FREQUENCY= 200.131300845
##.OBSERVE NUCLEUS= ^1H
##.DELAY= (6, 6)
##.ACQUISITION MODE= SIMULTANEOUS
##.ACQUISITION SCHEME= undefined
##.AVERAGES= 32
##.DIGITISER RES= 18
##SPECTROMETER/DATA SYSTEM= spect
##.PULSE SEQUENCE= zg
##.SOLVENT NAME= CDCl3
##.SHIFT REFERENCE= INTERNAL, CDCl3, 1, 17.49637
##AUDIT TRAIL= $$ (NUMBER, WHEN, WHO, WHERE, WHAT)
$$ ##TITLE= Audit trail, TOPSPIN		Version 1.3
$$ ##JCAMPDX= 5.01
$$ ##ORIGIN= Bruker BioSpin GmbH
$$ ##OWNER= Irina
$$ $$ F:/spectra/data/iren/nmr/1H/4/audita.txt
$$ ##AUDIT TRAIL=  $$ (NUMBER, WHEN, WHO, WHERE, VERSION, WHAT)
(   1,<2024-10-24 14:44:26.890 +0400>,<Irina>,<DPX200>,<TOPSPIN 1.3>,
      <created by zg
	started at 2024-10-24 14:42:16.812 +0400,
	POWCHK disabled, PULCHK disabled
       terminated by command 'halt'
       configuration hash MD5:
       BE 6D 3F 07 2A EA 11 49 91 17 2B D3 AF B3 58 0D
       data hash MD5: 16K
       26 7F E1 80 68 47 B3 C0 32 56 40 14 1C EE 17 46>)
$$ ##END=
$$ 
$$ $$ hash MD5
$$ $$ 3E 8C 4B 78 33 DF C1 0B 8E A5 23 B9 61 69 E5 E2
##$RELAX= 
##$RELAX= 
##$RELAX= 
##$RELAX= 
##$RELAX= 
##$RELAX= 
##$RELAX= 
##$RELAX= 
##$RELAX= 
$$ Bruker specific parameters
$$ --------------------------
##$DU= <F:/spectra>
##$EXPNO= 4
##$NAME= <1H>
##$PROCNO= 1
##$TYPE= <nmr>
##$USER= <iren>
##$AMP= (0..31)
100 100 100 100 100 100 100 100 100 100 100 100 100 100 100 100 100 100 
100 100 100 100 100 100 100 100 100 100 100 100 100 100 
##$ANAVPT= -1
##$AQSEQ= 0
##$AQ_mod= 1
##$AUNM= <au_zg>
##$AUTOPOS= <>
##$BF1= 200.13
##$BF2= 200.13
##$BF3= 200.13
##$BF4= 200.13
##$BF5= 200.13
##$BF6= 200.13
##$BF7= 200.13
##$BF8= 200.13
##$BYTORDA= 1
##$CFDGTYP= 0
##$CFRGTYP= 5
##$CHEMSTR= <none>
##$CNST= (0..63)
1 1 145 1 1 1 1 1 1 1 1 1 1 1 1 1 1 1 1 1 1 1 1 1 1 1 1 1 1 1 1 1 1 1 
1 1 1 1 1 1 1 1 1 1 1 1 1 1 1 1 1 1 1 1 1 1 1 1 1 1 1 1 1 1 
##$CPDPRG= <>
##$CPDPRG1= <>
##$CPDPRG2= <>
##$CPDPRG3= <>
##$CPDPRG4= <mlev>
##$CPDPRG5= <mlev>
##$CPDPRG6= <mlev>
##$CPDPRG7= <mlev>
##$CPDPRG8= <mlev>
##$CPDPRGB= <>
##$CPDPRGT= <>
##$D= (0..63)
0 2 0 0 0 0 0 0 0 0.06 0 0.03 0 0 0 0 0.0002 0 0 0 0 0 0 0 0 0 0 0 0 0 
0 0 0 0 0 0 0 0 0 0 0 0 0 0 0 0 0 0 0 0 0 0 0 0 0 0 0 0 0 0 0 0 0 0 
##$DATE= 1729766664
##$DBL= (0..7)
120 120 120 120 120 120 120 120 
##$DBP= (0..7)
150 150 150 150 150 150 150 150 
##$DBP07= 0
##$DBPNAM0= <>
##$DBPNAM1= <>
##$DBPNAM2= <>
##$DBPNAM3= <>
##$DBPNAM4= <>
##$DBPNAM5= <>
##$DBPNAM6= <>
##$DBPNAM7= <>
##$DBPOAL= (0..7)
0.5 0.5 0.5 0.5 0.5 0.5 0.5 0.5 
##$DBPOFFS= (0..7)
0 0 0 0 0 0 0 0 
##$DE= 6
##$DECBNUC= <off>
##$DECIM= 32
##$DECNUC= <off>
##$DECSTAT= 4
##$DIGMOD= 1
##$DIGTYP= 9
##$DL= (0..7)
0 120 120 120 120 120 120 120 
##$DP= (0..7)
$$ [...]
##$SW= 21.9926040160658
##$SWIBOX= (0..15)
0 0 2 0 0 0 0 0 0 0 0 0 0 0 0 0 
##$SW_h= 4401.40845070422
##$TD= 16384
##$TD0= 1
##$TE= 300
##$TE2= 300
##$TE3= 300
##$TEG= 300
##$TL= (0..7)
0 120 120 120 120 120 120 120 
##$TP= (0..7)
150 150 150 150 150 150 150 150 
##$TP07= 0
##$TPNAME0= <>
##$TPNAME1= <>
##$TPNAME2= <>
##$TPNAME3= <>
##$TPNAME4= <>
##$TPNAME5= <>
##$TPNAME6= <>
##$TPNAME7= <>
##$TPOAL= (0..7)
0.5 0.5 0.5 0.5 0.5 0.5 0.5 0.5 
##$TPOFFS= (0..7)
0 0 0 0 0 0 0 0 
##$TUNHIN= 0
##$TUNHOUT= 0
##$TUNXOUT= 0
##$USERA1= <user>
##$USERA2= <user>
##$USERA3= <user>
##$USERA4= <user>
##$USERA5= <user>
##$V9= 5
##$VALIST= <valist>
##$VCLIST= <CCCCCCCCCCCCCCC>
##$VD= 0
##$VDLIST= <DDDDDDDDDDDDDDD>
##$VPLIST= <PPPPPPPPPPPPPPP>
##$VTLIST= <TTTTTTTTTTTTTTT>
##$WBST= 1024
##$WBSW= 25
##$XGAIN= (0..3)
0 0 0 0 
##$XL= 0
##$YL= 0
##$YMAX_a= 468748
##$YMIN_a= -713797
##$ZGOPTNS= <>
##$ZL1= 120
##$ZL2= 120
##$ZL3= 120
##$ZL4= 120
##$ABSF1= 10
##$ABSF2= 0
##$ABSG= 5
##$ABSL= 3
##$ALPHA= 0
##$AQORDER= 0
##$ASSFAC= 0
##$ASSFACI= 0
##$ASSFACX= 0
##$ASSWID= 0
##$AUNMP= <proc_1d>
##$AXLEFT= 0
##$AXRIGHT= 0
##$AXTYPE= 0
##$AXUNIT= <>
##$AZFE= 0.1
##$AZFW= 0.1
##$BCFW= 1
##$BC_mod= 2
##$BYTORDP= 1
##$COROFFS= 0
##$CY= 7568.61572265625
##$DATMOD= 1
##$DC= 2
##$DFILT= <>
##$DTYPP= 0
##$F1P= 17.9538593292236
##$F2P= -4.03888763876832
##$FCOR= 0.5
##$FTSIZE= 32768
##$FT_mod= 4
##$GAMMA= 1
##$GB= 1
##$INTBC= 1
##$INTSCL= 1
##$ISEN= 128
##$LB= 0.02
##$LEV0= 0
##$LPBIN= 0
##$MAXI= 945.577
##$MC2= 0
##$MEAN= 0
##$ME_mod= 0
##$MI= -402.1523
##$NCOEF= 0
##$NC_proc= 0
##$NLEV= 6
##$NOISF1= 8.587773
##$NOISF2= 6.764455
##$NSP= 1
##$NTH_PI= 0
##$NZP= 0
##$OFFSET= 17.49637
##$PC= 1
##$PHC0= -43.30347
##$PHC1= 11.72053
##$PH_mod= 0
##$PKNL= yes
##$PPARMOD= 0
##$PPDIAG= 0
##$PPIPTYP= 0
##$PPMPNUM= 100
##$PPRESOL= 1
##$PSCAL= 0
##$PSIGN= 0
##$REVERSE= no
##$SF= 200.13
##$SI= 32768
##$SIGF1= 18.5376
##$SIGF2= -6.396296
##$SINO= 400
##$SIOLD= 32768
##$SREGLST= <1H.CDCl3>
##$SSB= 3
##$STSI= 0
##$STSR= 0
##$SW_p= 4401.40845070422
##$SYMM= 0
##$S_DEV= 0
##$TDeff= 0
##$TDoff= 0
##$TI= <>
##$TILT= no
##$TM1= 0
##$TM2= 0
##$TOPLEV= 0
##$USERP1= <user>
##$USERP2= <user>
##$USERP3= <user>
##$USERP4= <user>
##$USERP5= <user>
##$WDW= 1
##$XDIM= 8192
##$YMAX_p= 0
##$YMIN_p= 0
$$ End of Bruker specific parameters
$$ ---------------------------------
##NTUPLES= NMR FID
##VAR_NAME=  TIME,          FID/REAL,        FID/IMAG
##SYMBOL=    X,             R,               I
##VAR_TYPE=  INDEPENDENT,   DEPENDENT,       DEPENDENT
##VAR_FORM=  AFFN,          ASDF,            ASDF
##VAR_DIM=   8192,          8192,            8192
##UNITS=     SECONDS,       ARBITRARY UNITS, ARBITRARY UNITS
##FACTOR=    0.0002272,     1,               1
##FIRST=     0,             0,               0
##LAST=      1.8609952,     82,              -24
##MIN=       0,             -713797,         -713797
##MAX=       1.8609952,     468748,          468748
$$ Real data points
##PAGE= N=1
##DATA TABLE= (X++(R..R)), XYDATA
$$ plain form
0 0 0 0 0 0 0 0 0 0 0 0 0 0 0 1 -32 32 -32 32 -64 64 -65 96 -97 128 -136 161 -193 225 -257 291 -353 386 -450
33 -450 513 -577 642 -718 805 -901 1004 -1123 1248 -1384 1532 -1696 1872 -2066 2283 -2512
49 -2512 2767 -3050 3361 -3705 4087 -4516 4999 -5550 6178 -6910 7774 -8807 10074 -11670
63 -11670 13750 -16586 20705 -27259 39381 -69452 308636 320283 -118334 239815 434783
74 434783 264591 42140 288508 468748 235787 -133193 -53303 178359 69081 -296881
84 -296881 -292105 39916 152213 -134168 -313754 -194422 -97722 -233928 -284513 -72442 146033
95 146033 87256 -75182 -66776 72640 71733 -76501 -127250 25012 169769 149153 56566 30572
107 30572 31675 -16132 -78127 -60410 34461 96039 32329 -82133 -99651 -31355 -41129 -150408
$$ packed form
0@%%%%%%%%%%%%%Jl3O4o4O4r6J28j29J61j93K25k64K97l54M18m82N48o44P39q36
33d50R63j090J219j360J523j706J905k127K371k632K916l228L568l938M349m795
49b512N279n817O411p066P792q603R515j0549J1728j3088J4684j6581J8881k1744
63a1670K5420l0336L7291m7964O6640j08833L78088J1647m38617L58149J94968
74D34783j70192k22451K46368J80240k32961l68980P9890K31662j09278l65962
84b96881M776L32021J12297k86381j79586J19332R6700j36206n0585K12071K18475
95A46033n8777j62438Q406J39416r07j48234n0749J52262J44757k0616r2587k5994
107C0572J103m7807o1995J7717R4871O1578o3710j14462j7518O8296r774j09279
$$ plain form
119 -150408 -183586 -63551 49157 20876 -52620 -34014 18536 -30405 -119882 -59891 129971
130 129971 204297 90325 14684 99765 154467 44541 -43092 62445 205450 172258 48448
141 48448 43146 121261 77785 -82972 -134808 -13320 69039 -12562 -91249 -29045 29994 -67019
153 -67019 -194402 -160470 -25092 19352 -40321 -57930 1591 13790 -73527 -130819 -52071 60170
165 60170 63127 4136 22007 98967 93376 -9690 -71091 -18402 50748 35819 -12621 4136
177 4136 50354 12424 -92058 -120558 -41710 5812 -46815 -86241 -23335 42907 -1501 -90737
189 -90737 -85588 -2199 32751 3964 18843 97171 118904 36300 -23386 31873 107850 87218
201 87218 25386 38858 100484 94675 19150 -18560 13128 28118 -15296 -42457 2354 47921
$$ packed form
119a50408l3178J20035J12708k8281p3496J8606N2550m8941q9477N9991J89862
130A29971P4326j13972p5641Q5081N4702j09926q7633J05537J43005l3192j23810
141D8448n302P8115m3476j60757n1836J21488Q2359q1601p8687O2204N9039r7013
153f7019j27383L3932J35378M4444n9673j7609N9521J2199q7317n7292P8748J12241
165F0170K957n8991J7871P6960n591j03066o1401N2689O9150j4929m8440J6757
177D136M6218l7930j04482k8500P8848M7522n2627l9426O2906O6242m4408q9236
189i0737N149Q3389L4950k8787J4879P8328K1733q2604n9686N5259P5977k0632
201H7218o1832J3472O1626n809p5525l7710L1688J4990m3414k7161M4811M5567
$$ plain form
213 47921 8369 -72636 -89806 -41933 -20449 -54671 -71594 -33701 -2015 -28533 -66393 -50428
225 -50428 -10338 -14511 -48383 -34349 30539 56657 8742 -33609 -6571 34111 17963 -14287
237 -14287 11604 60483 47190 -10723 -21555 21129 28407 -21620 -45593 1261 44093 15397
249 15397 -30423 -17459 18373 4934 -29340 -8358 43901 45455 2426 -5903 29889 40772
261 40772 7883 -9297 18654 42647 22966 -3973 5181 22443 3692 -27631 -23873 626
273 626 721 -18228 -20823 -10713 -13628 -26350 -29795 -21824 -13304 -9131 -9234 -10042 -9264 -6862 -3961 -2414
289 -2414 -3384 -2427 6123 13160 7439 2562 11168 15198 370 -6779 10902 24115 10324 -5753
303 -5753 763 12155 5648 -7593 -5011 8122 7250 -10153 -12168 7813 15078 -7793 -21819 -3584
$$ packed form
213D7921l9552q1005j7170M7873K1484l4222j6923L7893L1686k6518l7860J5965
225e0428M0090m173l3872J4034O4888K6118m7915m2351K7038M0682j6148l2250
237a4287K5891M8879j3293n7913j0832M2684P278n0027k3973M6854M2832k8696
249A5397m5820J2964L5832j3439l4274K0982N2259J554m3029q329L5792J0883
261D0772l2889j7180K7951K3993j9681k6939R154J7262j8751l1323L758K4499
273F26R5j8949k595J0110k915j2722l445P971Q520M173j03q08P78K402K901J547
289b414r70R57Q550P037n721m877Q606M030j4828p149J7681J3213j3791j6077
303e753O516J1392o507j3241K582J3133q72j7403k015J9981P265k2871j4026J8235
$$ plain form
317 -3584 12539 1212 -10086 -1471 6198 -2787 -11183 -2342 10009 6422 -9156 -12359 3166 12250
331 12250 0 -9030 -276 5499 -2622 -4304 6946 9698 -244 -6044 -1244 5901 8558 3416
345 3416 -2484 -1369 3620 2370 -277 2929 2925 -4178 -6044 -17 2301 -1190 -2912 -3229 -4006 -1376
361 -1376 1840 109 -520 2691 1707 -916 4378 9777 6212 1964 4347 6651 4950 3897 2362 -260
377 -260 -470 -1954 -6785 -8937 -6608 -8992 -15352 -15154 -12325 -14803 -16651 -12557 -9926 -12588 -11660 -6575
393 -6575 -2651 -427 2527 3707 6437 12148 13232 11855 15669 19905 17273 13307 16537 18717 15654
408 15654 12525 10971 7764 5754 6810 4777 506 -1664 -2636 -4609 -4436 -4127 -7210 -9733 -7337 -6533
424 -6533 -8510 -7542 -4616 -6624 -9479 -6351 -2815 -3061 -4033 -3695 -4452 -4227 -3847 -4345 -3853 -2581 -5914
$$ packed form
317c584J6123j1327j1298Q615P669q985q396Q841J2351l587j5578l203J5525R084
331A2250j2250r030Q754N775q121j682J1250K752r942n800M800P145K657n142
345C416n900J115M989j250k647L206mp103j866O027K318l491j722l17p77K630
361a376L216j731o29L211r84k623N294N399l565m248K383K304j701j053j535k622
377b60k10j484m831k152K329k384o360J98K829k478j848M094K631k662R28N085
393f575L924K224K954J180K730N711J084j377L814M236k632l966L230K180l063
408A5654l129j554l207k010J056k033m271k170r72j973J73L09l083k523K396Q04
424f533j977R68K926k008k855L128L536k46r72L38p57K25L80m98M92J272l333
$$ plain form
441 -5914 -10022 -6817 -811 -4962 -13185 -10781 -3225 -2963 -7109 -6196 -417 1791 -2248 -4396 3084 11431
457 11431 8595 1804 7444 18499 16027 5396 7355 17745 17759 8979 8475 17228 19099 7829 -53
472 -53 6935 15184 8061 -3357 230 10772 5862 -8977 -10914 -2410 -2827 -12813 -14288 -5222 -2107
487 -2107 -11385 -20000 -16402 -8996 -9700 -13911 -11099 -2337 56 -4537 -6755 -3448 -607 -1502 -1755 2263
503 2263 8267 10305 3928 -5061 -5720 761 1958 -5049 -6559 2716 7800 -2349 -12710 -7821 1872
518 1872 -2424 -11703 -2730 16636 17690 -771 -6981 8717 17754 5103 -1726 17556 33997 20940
532 20940 1684 9127 25444 16060 -5719 -462 25568 28736 3761 -9875 3230 8558 -12079
545 -12079 -27160 -10533 8667 -3416 -26572 -23339 -6623 -12898 -35475 -36317 -12470 2075 -7740
$$ packed form
441e914m108L205O006m151q223K404P556K62m146R13N779K208m039k148P480Q347
457A1431k836o791N640J1055k472j0631J959J0390J4q780n04Q753J871j1270p882
472e3O988Q249p123j1418L587J0542m910j4839j937Q504m17r986j475R066L115
487b107r278q615L598P406p04m211K812Q762K393m593k218L307K841q95k53M018
503B263O004K038o377q989o59O481J197p007j510R275N084j0149j0361M889R693
518A872m296r279Q973J9366J054j8461o210J5698R037j2651o829J9282J6441j3057
532B0940j9256P443J6317r384k1779N257K6030L168k4975j3636J3105N328k0637
545a2079j5081J6627J9200j2083k3156L233J6716o275k2577q42K3847J4545r815
$$ plain form
558 -7740 -17183 -8487 863 -8476 -21334 -11888 11155 17158 5443 1304 10929 12833 -1428 -13657
572 -13657 -6035 10692 15238 5258 -203 6856 6630 -10896 -21943 -5615 16741 16402 2666 3526
586 3526 17499 17172 -2302 -11598 7689 29609 24876 10391 16908 30110 15526 -13337 -13400 12040
600 12040 20346 1916 -7718 6440 11478 -13526 -39627 -32436 -7938 -6697 -23686 -18865 3207
613 3207 -561 -33555 -46977 -22391 552 -4787 -14786 -477 19364 10946 -16480 -20945 2639
626 2639 15691 2412 -336 24742 38334 13671 -15922 -11628 10422 12309 -1701 2945 26241
639 26241 30734 2504 -20569 -8254 9086 -1467 -15075 3542 30925 23537 -9091 -21143
651 -21143 -6519 1719 -9180 -11337 11744 30232 14888 -12633 -13218 4079 1796 -14191 -8005
$$ packed form
558g740r443Q696R350r339j2858R446K3043O003j1715m139R625J904j4261j2229
572a3657P622J6727M546r980n461P059k26j7526j1047J6328K2356l39j3736Q60
586C526J3973l27j9474r296J9287K1920m733j4485O517J3202j4584k8863o3K5440
600A2040Q306j8430r634J4158N038k5004k6101P191K4498J241j6989M821K2072
613C207l768l2994j3422K4586K2943n339r999J4309J9841q418k7426m465K3584
626B639J3052j3279k748K5078J3592k4663k9593M294K2050J887j4010M646K3296
639B6241M493k8230k3073J2315J7340j0553j3608J8617K7383p388l2628j2052
651b1143J4624Q238j0899k157K3081J8488j5344k7521n85J7297k283j5987O186
$$ plain form
664 -8005 19857 29759 10928 -8941 -9752 -3150 -9073 -17502 -7229 15636 18193 -5564 -22907 -15962
678 -15962 -8514 -18708 -28039 -13867 9645 13711 -4111 -16293 -8339 -1800 -14777 -22388 1820
691 1820 32898 28149 474 -5280 10968 10285 -10176 -11870 18579 39388 21439 -4478 993
704 993 16679 746 -27170 -16169 22844 29103 -810 -13168 6493 10469 -18522 -34017 -6675
717 -6675 23818 14787 -9607 -2649 19191 7703 -26255 -26813 8926 25451 7175 -2752 13562
730 13562 18763 -7757 -30476 -17371 8535 9283 -6235 -5315 8932 2591 -24304 -34090 -15728
743 -15728 -238 -5098 -9334 1934 10970 -117 -17886 -20059 -4966 7618 7970 8376 17734 23457
757 23457 11768 -5457 -6500 6014 14260 12204 9817 14208 17510 7158 -9542 -12856 -2323
$$ packed form
664h005K7862R902j8831j9869q11O602n923q429J0273K2865K557k3757j7343O945
678a5962P448j0194r331J4172K3512M066j7822j2182P954O539j2977p611K4208
691A820L1078m749k7675n754J6248o83k0461j694L0449K0809j7949k5917N471
704I93J5686j5933k7916J1001L9013O259k9913j2358J9661L976k8991j5495K7342
717f675L0493r031k4394O958K1840j1488l3958n58L5739J6525j8276r927J6314
730A3562N201k6520k2719J3105K5906P48j5518R20J4247o341k6895r786J8362
743a5728J5490m860m236J1268R036j1087j7769k173J5093J2584L52M06R358N723
757B3457j1689j7225j043J2514Q246k056k387M391L302j0352j6700l314J0533
$$ plain form
770 -2323 2896 -2883 -2324 8939 11627 -4356 -21051 -17452 -3721 -106 -5180 -1416 11316 11059
784 11059 -6207 -16947 -7060 3568 -1008 -6815 3847 17337 10613 -9591 -15639 -4231 2573
797 2573 -3275 -5199 6893 14702 3454 -11810 -9338 2719 1558 -9133 -6016 10853 17241 3541
811 3541 -9268 -5325 1642 -3389 -8759 1568 16192 12498 -5142 -11024 -690 4202 -5068 -9460
825 -9460 2772 14268 7723 -4237 -3479 3929 261 -9525 -5877 9499 14975 3657 -5929 -1861
839 -1861 3588 -2425 -9365 -3401 7389 6400 -2347 -3970 1275 -8 -8871 -11649 -3251 6094 5341
854 5341 -1281 -2693 449 0 -5606 -5363 2991 8384 5161 533 1809 6060 4091 -2960 -4144 3067
870 3067 8845 5443 -173 1739 4355 -1946 -9179 -5475 3678 3625 -3974 -6309 -1104 919 -6017 -10251
$$ packed form
770b323N219n779N59J1263K688j5983j6695L599J3731L615n074L764J2732k57
784A1059j7266j0740R887J0628m576n807J0662J3490o724k0204o048J1408O804
797B573n848j924J2092P809j1248j5264K472J2057j161j0691L117J6869O388j3700
811C541j2809L943O967n031n370J0327J4624l694j7640n882J0334M892r270m392
825i460J2232J1496o545j1960P58P408l668r786L648J5376N476j1318r586M068
839a861N449o013o940N964J0790r89q747j623N245j283q863k778Q398R345p53
854E341o622j412L142m49n606K43Q354N393l223m628J276M251j969p051j184P211
870C067N778l402n616J912K616o301p233L704R153n3p599k335N205K023o936m234
$$ plain form
886 -10251 -4013 2542 -1238 -6645 -1129 6186 2505 -6846 -5304 3501 5113 368 172 5185 5588
901 5588 -470 -4003 508 5049 1717 -2634 -89 4384 1357 -3488 -2080 778 -1583 -3411 705
916 705 4002 2498 -490 -832 904 2323 2628 2904 4097 3632 1733 2342 4881 3687 63 248 2953
933 2953 1583 -1078 736 2305 -2021 -6669 -5097 -1143 -1236 -4978 -6379 -4526 -3662 -5542 -6353 -3091
949 -3091 -1197 -5236 -7054 -1576 2618 -1164 -4326 -1311 2128 773 316 3074 4831 3511 682
964 682 1827 5718 7263 2900 1105 3910 5619 2804 1851 4163 3175 -559 -1146 1737 1978 -248
980 -248 -1988 -1688 -810 -369 -1394 -1549 -217 -470 -1836 -871 1944 1790 -175 414 1766 1130 1099 2007
998 2007 1373 -264 -883 -434 -1105 -1364 -2263 -3753 -4546 -3940 -4599 -5626 -5140 -5277 -5933 -5970 -4235 -4110 -3928
$$ packed form
886a0251O238O555l780n407N516P315l681r351J542Q805J612m745j96N013M03
901E588o058l533M511M541l332m351K545M473l027m845J408K858k361j828M116
916G05L297j504k988l42J736J419L05K76J193m65j899O09K539j194l624J85K705
933B953j370k661J814J569m326m648J572L954r3l742j401J853Q64j880q11L262
949c091J894m039j818N478M194l782l162L015L439j355m57K758J757j320k829
964F82J145L891J545m363j795K805J709k815r53K312r88l734n87K883K41k226
980b48j740L00Q78M41j025j55J332k53j366R65K815j54j965N89J352o36l1R08
998B007o34j637o19M49o71k59q99j490p93O06o59j027M86j37o56l7J735J25J82
$$ plain form
1017 -3928 -2465 -1313 -1281 68 2444 2987 2578 3590 4971 5363 5665 6052 6026 5502 5468 4836 4018 4242 3590
1036 3590 1335 779 1017 349 -1585 -1673 -1026 -2052 -2552 -1746 -940 -1320 -783 -717 -280 1174 1717 1513 1825
1055 1825 2622 2514 1759 1925 2168 594 140 -193 -1144 -2611 -2860 -3347 -5357 -6692 -6689 -6283 -6823 -7168 -7156
1074 -7156 -6357 -5265 -5155 -5158 -3682 -1075 -391 68 2431 4881 5321 4274 5814 7664 8132 7077 7193
1091 7193 8056 8403 6268 4583 4757 5204 2833 380 1139 2499 1245 -2113 -3744 -2644 -1961 -3027
1107 -3027 -3845 -2418 -640 -1581 -3180 -2693 -478 -692 -2373 -1770 895 2344 354 -1666 -1144 -147 -1449
1124 -1449 -3191 -2305 25 -432 -2820 -4274 -2745 -1819 -3779 -5669 -3775 -121 657 -1756 -2519 -678
1140 -678 341 -1266 -1085 1786 4537 4222 1694 2059 4422 4437 889 -324 4227 7380 5143 1507
$$ packed form
1017c928J463J152L2J349K376N43m09J012J381L92L02L87k6n24l4o32q18K24o52
1036C590k255n56K38o68j934q8O47j026n00Q06Q06l80N37O6M37J454N43k04L12
1055A825P97j08p55J66K43j574m54l33r51j467k49m87k010j335LM06n40l45J2
1074g156P99J092J10lJ476K607O84M59K363K450M40j047J540J850M68j055J16
1091G193Q63L47k135j685J74M47k371k453P59J360j254l358j631J100O83j066
1107c027q18J427J778r41j599M87K215k14j681O03K665J449j990k020N22R97j302
1124a449j742Q86K330m57k388j454J529R26j960j890J894L654P78k413p63J841
1140f78J019j607J81K871K751l15k528L65K363J5l548j213M551L153k237l636
$$ plain form
1156 1507 2315 3724 1435 -2311 -1048 4078 5272 694 -2494 162 2024 -2558 -6870 -3720 2413
1171 2413 1579 -3369 -2928 881 -505 -6717 -7961 -2106 3363 153 -3862 -1148 3051 95 -6507
1186 -6507 -5033 2310 3685 -621 -903 3914 5158 -1456 -6337 -3145 3167 3138 -969 -190 4631 3218
1202 3218 -4485 -7316 -1962 2032 -387 -2054 1307 4969 2358 -3935 -5415 -25 4051 1662 104
1217 104 5227 8744 3311 -3205 -2135 2665 3634 648 908 5579 6965 269 -6610 -4838 804 -677
1233 -677 -5096 -2006 4990 4046 -4817 -9185 -4430 -650 -2504 -4716 598 7226 4346 -5014 -7082
1248 -7082 319 2607 -2688 -3328 4859 9627 3085 -4391 -3194 2051 517 -4847 -2043 7268 9800
1263 9800 -18 -6551 -1620 3274 -2325 -6540 107 9061 6536 -2086 -4186 685 1122 -5271 -7139
$$ packed form
1156A507Q08J409k289l746J263N126J194m578l188K656J862m582m312L150O133
1171B413q34m948M41L809j386o212j244N855N469l210m015K714M199k956o602
1186f507J474P343J375m306k82M817J244o614m881L192O312k9m107P79M821j413
1202C218p703k831N354L994k419j667L361L662k611o293j480N390M076k389j558
1217A04N123L517n433o516J070M800R69k986K60M671J386o696o879J772N642j481
1233f77m419L090O996r44q863m368M755L780j854k212N314O628k880r360k068
1248g082P401K288n295o40Q187M768o542p476J197N245j534n364K804R311K532
1263I800r818o533M931M894n599m215O647Q954k525q622k100M871M37o393j868
$$ plain form
1278 -7139 2044 9862 4745 -3837 -2707 1707 -2019 -8253 -4768 5188 7826 1206 -3621 -560 1853
1293 1853 -3514 -8386 -3102 6467 6797 434 -1114 2842 1558 -4813 -6975 -150 6785 5840 1229
1308 1229 142 3155 1270 -5343 -7212 65 6208 4009 -79 1143 2937 -775 -7535 -7649 338
1323 338 6103 3305 -1258 932 4078 -1221 -8586 -6118 3796 6160 716 -1557 3448 4801 -3571
1338 -3571 -10424 -5041 4523 3456 -3752 -2305 5221 2452 -9025 -11239 -1327 4519 -586 -4359 2190
1353 2190 7720 1240 -8080 -5769 4271 5940 -346 743 9317 10375 -220 -6375 43 6231
1367 6231 3012 -1463 2939 8999 5080 -4435 -7145 -1372 1568 -2515 -4141 1851 6211 807 -6148
1382 -6148 -5521 -641 -100 -2650 -1427 4549 6537 1822 -4286 -3391 593 291 -2841 -1618 4052 5233
$$ packed form
1278g139R183P818n117q582J130M414l726o234L485R956K638o620m827L061K413
1293A853n367m872N284R569L30o363j548L956j284o371k162O825O935r45m611
1308A229j087L013j885o613j869P277O143k199m088J222J794l712o760j14P987
1323C38N765k798m563K190L146n299p365K468R914K364n444k273N005J353q372
1338c571o853N383R564j067p208J447P526k769j1477k214R912N846n105l773O549
1353B190N530o480r320K311J0040J669o286J089Q574J058j0595o155O418O188
1367F231l219m475M402O060l919r515k710N773K940m083j626N992M360n404o955
1382f148O27M880N41k550J223N976J988m715o108Q95L984l02l132J223N670J181
$$ plain form
1398 5233 -767 -6081 -4651 -1482 -3355 -6106 -3097 3145 3159 -3753 -7280 -3390 37 -2958 -4679
1413 -4679 722 7159 4661 -2086 -2291 2873 3543 -1036 -919 6137 9877 5122 -406 1569 5610 2894
1429 2894 -1832 387 7409 7826 1557 -1188 2020 3321 -1672 -5213 -844 4348 2669 -2994 -3885
1444 -3885 -748 -1493 -6740 -7755 -2195 2049 -1358 -5357 -3962 -664 -2687 -6475 -5145 641 2732
1459 2732 -720 -2307 771 3036 -688 -4543 -1419 4196 3855 -277 -453 2571 2311 -1872 -4048 -283
1475 -283 3295 1546 -1937 -201 3634 1961 -2726 -2335 2066 4205 1752 1474 4048 5679 3221 503
1491 503 1702 5205 5131 2329 1962 4334 3900 -39 -1916 -494 660 -1414 -3047 -2777 -1839 -2616 -5666
1508 -5666 -6859 -4515 -2884 -4242 -5229 -3403 -1342 -1940 -3071 -2329 -191 438 149 472 2271 3637
$$ packed form
1398E233o000n314J430L169j873k751L009O242J4o912l527L890L427k995j721
1413d679N401O437k498o747k05N164O70m579J17P056L740m755n528J975M041k716
1429B894m726K219P022M17o269k745L208J301m993l541M369N192j679n663q91
1444c885L137p45n247j015N560M244l407l999J395L298k023l788J330N786K091
1459B732l452j587L078K265l724l855L124N615l41m132j76L024k60m183k176L765
1475b83L578j749l483J736L835j673m687L91M401K139k453k78K574J631k458k718
1491E03J199L503p4k802l67K372m34l939j877J422J154k074j633K70R38p77l050
1508e666j193K344J631j358r87J826K061n98j131P42K138O29k89L23J799J366
$$ plain form
1524 3637 2317 475 741 3118 2457 926 531 1976 1426 -710 -1226 -747 -509 -985 -2018 -1434 407
1541 407 385 -1271 -1477 658 1389 799 1258 3054 3585 3216 2987 3626 3434 3940 3223 2412 3093 3545 2568
1560 2568 501 148 -210 -655 -1476 -1973 -2734 -2647 -2733 -3672 -4457 -3395 -3201 -4275 -4747 -2807 -1699 -2343 -2857
1579 -2857 -1930 -846 -620 -797 -504 1029 1535 540 -332 1951 2859 1334 -7 1153 2487 1464 600
1596 600 1102 1366 1225 140 197 1397 1764 384 -440 1221 1936 851 176 1102 1848 816 673 1131
1614 1131 1672 1247 360 832 1299 1108 565 -315 -72 51 -748 -1276 -772 -810 -2073 -2166 -1789 -2118 -2573 -2798
1634 -2798 -2549 -2556 -2513 -2319 -2063 -1610 -1413 -1415 -1441 -256 324 185 465 975 1485 1436 1703 2226 1843 1781 1896 1792
1656 1792 1711 1732 1494 1045 1299 1072 614 510 181 -56 -331 -255 -344 -621 -553 -497 -676 -693 -342 -23 -229 -98
$$ packed form
1524C637j320j842K66K377o61j531l95J445n50k136n16M79K38m76j033N84J841
1541D07k2j656k06K135P31n90M59J796N31l69k29O39j92N06p17q11O81M52r77
1560B568k067l53l58m45q21m97p61Q7q6r39p85J062J94j074m72J940J108o44n14
1579b857R27J084K26j77K93J533N06r95q72K283R08j525j341J160J334j023q64
1596F00N02K64j41j085N7J200L67j380q24J661P15j085o75R26P46j032j43M58
1614A131N41m25q87M72M67j91n43q80K43J23p99n28N04l8j263r3L77l29m55k25
1634b798K49pM3J94K56M53J97kk6J185N80j39K80N10N10m9K67N23l83o2J15j04
1656A792q1K1k38m49K54k27m58j04l29k37k75P6q9k77O8N6j79j7L51L19k06J31
$$ plain form
1678 -98 -79 212 95 332 345 22 568 465 416 254 507 187 -3 -305 -316 -456 -475 -801 -1088 -748 -846 -1421
1700 -1421 -1599 -1240 -810 -1203 -1131 -691 -67 -102 -509 -267 487 720 296 849 1572 1662 1099 670 976 1792 1182
1721 1182 359 653 1470 977 -298 -404 424 317 -1041 -1210 -308 420 -545 -1391 -674 9 -422 -992 -1492
1740 -1492 142 652 -316 -742 375 988 -223 -913 -279 1118 1098 99 -441 478 666 -357 -1175 -8
1758 -8 880 201 -1182 -420 931 781 -1067 -1217 217 1547 785 -582 597 1563 694 -1251 -1082 996
1776 996 1222 -1059 -1123 498 1316 -650 -2614 -1310 804 341 -1346 -1415 1085 1274 -1506 -2569 100
1793 100 1730 276 -1140 287 2518 1449 -1686 -1849 638 1718 -899 -1290 978 2383 -337 -3356
1809 -3356 -1689 1030 305 -2278 -1120 2036 2648 -406 -2266 297 2629 927 -564 1431 4965
$$ packed form
1678i8J9K91j17K37J3l23N46j03m9j62K53l20j90l02j1j40j9l26k87L40r8n75
1700a421j78L59M30l93P2M40O24l5m07K42P54K33m24N53P23R0n63m29L06Q16o10
1721A182q23K94Q17m93j275j06Q28j07j358j69R02P28r65q46P17O83m31n70n00
1740a492J634N10r68m26J117O13j211o90O34J397k0r99n40R19J88j023q18J167
1758hQ88o79j383P62J351j50j848j50J434J330p62j367J179R66q69j945J69K078
1776I96K26k281o4J621Q18j966j964J304K114m63j687o9K500J89k780j063K669
1793A00J630j454j416J427K231j069l135j63K487J080k617l91K268J405k720l019
1809c356J667K719p25k583J158L156O12l054j860K563K332j702j491J995L534
$$ plain form
1824 4965 3457 -464 -707 1964 2335 -474 -954 1301 2895 462 -3284 -2620 -104 -865 -4054 -3566
1840 -3566 302 823 -2540 -4343 -2075 -274 -1941 -3542 -1111 2523 2560 -845 -1463 1353 2081 -387
1856 -387 -1858 1531 4388 2848 -235 -150 1297 780 -2103 -3053 941 3206 594 -2856 -1474 923
1872 923 -609 -3748 -2167 2170 3081 276 -1143 1341 2820 260 -2504 -44 4554 4557 748 -140
1888 -140 3396 3234 -1118 -3101 742 3505 1568 -1841 -1213 1722 -58 -4827 -5593 -1132 1536 -1664
1904 -1664 -3907 -1180 602 -2144 -6056 -3658 952 1802 -1560 -2039 1930 3134 -1465 -4107 -196
1919 -196 3871 2491 -816 995 4638 2915 -1875 -2766 1256 3702 1251 -997 1375 4192 1390
1934 1390 -3465 -2618 1315 2217 -1154 -1335 2413 3837 -12 -3744 -1491 2184 1821 -1150 375 4299
$$ packed form
1824D965j508l921k43K671L71k809m80K255J594k433l746O64K516p61l189M88
1840c566L868N21l363j803K268J801j667j601K431L634L7l405o18K816P28k468
1856c87j471L389K857j540l083Q5J447n17k883r50L994K265k612l450J382K397
1872I23j532l139J581M337R11k805j419K484J479k560k764K460M598Ll809q88
1888a40L536j62m352j983L843K763j937l409O28K935j780m769p66M461K668l200
1904a664k243K727J782k746l912K398M610Q50l362m79L969J204m599k642L911
1919a96M067j380l307J811L643j723m790q91M022K446k451k248K372K817k802
1934A390m855Q47L933R02l371j81L748J424l849l732K253L675l63k971J525L924
$$ plain form
1950 4299 3761 -1165 -3532 -299 2196 275 -2023 380 3660 1685 -3702 -4815 -1236 -159 -3063
1965 -3063 -4055 -678 1785 -1137 -5459 -4329 -833 -637 -3922 -2981 1590 3600 -123 -3114 -771 2677
1981 2677 1163 -1765 663 5738 5610 882 -606 2459 3969 867 -1248 2095 5570 3061 -1670
1996 -1670 -1581 2069 1049 -3075 -3309 1407 3407 -518 -3823 -1358 1317 -656 -4067 -1909 2896 2966
2012 2966 -851 -1884 1094 1890 -1000 -3143 188 3488 2043 -1575 -1440 1122 524 -3380 -4014 -479
2028 -479 1727 -688 -3228 -1773 200 -1619 -4205 -3375 376 1666 -432 -1550 584 2284 198
2043 198 -2000 -77 3520 3675 1482 983 2895 3245 422 -1100 1040 3298 2155 -580 35 2357
2059 2357 1182 -1675 -2680 -34 1533 -291 -1482 61 2033 -157 -2924 -2032 1171 1754 -771
$$ packed form
1950D299n38m926k367L233K495j921k298K403L280j975n387j113L579J077k904
1965c063r92L377K463k922m322J130L496J96l285R41M571K010l723k991K343L448
1981B677j514k928K428N075j28m728j488L065J510l102k115L343L475k509m731
1996a670Q9L650j020m124k34M716K000l925l305K465K675j973l411K158M805P0
2012B966l817j033K978P96k890k143L331L300j445l618J35K562n98l904o34L535
2028d79K206k415k540J455J973j819k586Q30L751J290k098j118K134J700k086
2043A98k198J923L597J55k193m99J912L50k823j522K140K258j143k735O15K322
2059B357j175k857j005K646J567j824j191J543J972k190k767Q92L203N83k525
$$ plain form
2074 -771 -1148 1027 2065 -399 -2340 -1168 1520 388 -1770 -1037 1224 692 -2274 -3438 -810 322
2090 322 -1149 -2423 -750 811 -214 -2522 -2265 502 911 -646 -1108 1378 2387 534 -1339 -253
2106 -253 1565 1278 12 411 2280 2601 507 -487 1079 1974 1064 -688 475 2347 1907 -194 -267
2123 -267 851 1100 -259 -593 65 1368 204 -1485 -1234 130 40 -1738 -1668 -275 -25 -1538 -1931 -1259
2141 -1259 -483 -1226 -1781 -1162 120 611 -516 -1070 336 578 -149 -800 401 987 500 -629 -442 734
2159 734 438 -210 -524 444 1290 489 -290 139 720 665 -559 133 749 1019 516 345 463 1201 720 381
2179 381 511 915 1126 224 254 876 458 -451 -86 -80 -217 -361 -205 -785 -297 -590 -1064 -1114 -505 -207 -770
2200 -770 -1025 -648 -10 -509 -278 -439 -141 -24 -182 -210 -272 642 222 -106 -51 374 505 -66 -336 61 312
$$ packed form
2074g71l77K175J038k464j941J172K688j132k158P33K261n32k966j164K628J132
2090C22j471j274J673J561j025k308K57K767M09j557m62K486J009j853j873J086
2106b53J818k87j266L99J869L21k094r94J566Q95r10j752J163J872m40k101p3
2123b67J118K49j359l34O58J303j164j689K51J364r0j778P0J393K50j513l93O72
2141a259P76p43n55O19J282M91j127n54J406K42p27o51J201N86m87j129J87J176
2159G34k96o48l14R68Q46q01p79M29N81n5j224O92O16K70n03j71J18P38m81l39
2179C81J30M04K11r02L0O22m18r09L65Oj37j44J56n80M88k93m74n0O09K98n63
2200g70k55L77O38m99K31j61K98J17j58k8o2R14m20l28N5M25J31n71k70L97K51
$$ plain form
2221 312 -205 -131 -72 468 9 -223 -296 344 327 -210 -381 253 529 67 181 403 547 362 324 299 731 722 -87
2244 -87 -266 533 505 -39 -268 192 322 -361 -742 157 69 -283 -762 -443 -318 -352 -674 -623 -169 -306 -527 -436
2266 -436 7 -244 -299 -364 133 177 -23 -78 -65 148 11 -74 119 117 95 107 113 232 8 163 157 437 281 252 189
2291 189 41 260 177 177 -24 -70 -92 17 -82 -312 -101 25 -445 -137 -270 -311 -176 -181 -339 -293 87 -158 -191 17
2315 17 343 44 222 -100 246 655 45 138 503 397 25 1 -54 102 -132 -188 -266 -416 44 -290 -301 -316 10
2338 10 -166 -524 96 251 348 33 -90 0 287 408 -138 303 430 223 -303 -29 656 259 -574 -503 -176
2359 -176 92 -410 -1010 -759 -60 -237 -666 -416 29 -186 -396 -537 122 589 -159 47 386 729 686 65
2379 65 402 840 718 -85 94 793 922 222 -139 -32 757 -31 -508 -180 494 465 -607 -698 9 341 -297
$$ packed form
2221C12n17P4N9N40m59k32p3O40j7n37j71O34K76m62J14K22J44j85l8k5M32rq09
2244h7j79P99k8n44k29M60J30o83l81Q99q8l52m79L19J25l4l22N1M54j37k21R1
2266d36M43k51n5o5M97M4k00n5J3K13j37q5J93kk2J2OJ19k24J55oK80j56k9o3
2291A89j48K19q3%k01m6k2J09r9k30K11J26m70L08j33m1J35nj58M6L80k45l3K08
2315A7L26k99J78l22L46M09o10R3L65j06l72k4n5J56k34n6p8j50M60l34j1j5L26
2338A0j76l58O20J55R7l15j23R0K87J21n46M41J27k07n26K74O85l97q33P1L27
2359a76K68n02o00K51O99j77m29K50M45k15k10j41O59M67p48K06L39L43m3o21
2379F5L37M38j22q03J79O99J29p00l61J07P89p88m77L28O74k9j072r1P07L32o38
$$ plain form
2400 -297 -500 -52 461 264 -499 -164 -5 209 -614 -531 149 609 9 -718 -463 289 231 -657 -389 218 685
2421 685 -383 -956 -257 140 -434 -991 -407 350 594 -629 -743 263 32 -559 -841 157 819 597 -428
2440 -428 17 871 679 -284 -254 794 1621 505 32 750 1502 437 -828 143 1298 902 -43 -400 319
2459 319 725 -732 -1775 -563 495 -180 -1354 -1025 352 -422 -1426 -1537 -503 344 -143 -863 17
2476 17 1069 223 -1193 -753 857 885 285 -188 818 839 -230 -1315 -500 610 640 -732 -410 704
2494 704 588 -1101 -1499 -340 645 -28 -614 291 983 704 -206 -479 822 1424 469 197 1363 1785 668
2513 668 -439 -291 1004 608 -370 -449 825 785 -412 -1658 -1205 -229 -753 -1637 -1145 264 -10 -1304
2531 -1304 -1730 -707 -52 -813 -1245 37 1394 1017 -637 -941 701 911 -292 -375 1012 1952 708
$$ packed form
2400b97k03M48N13j97p63L35J59K14q23Q3O80M60o00p27K55P52n8q88K68O07M67
2421F85j068n73O99L97n74n57N84P57K44j223j14J006k31n91k82R98O62k22j025
2440d28M45Q54j92r63L0J048Q27j116m73P18P52j065j265R71J155l96r45l57P19
2459C19M06j457j043J212J058o75j174L29J377p74j004j11J034Q47m87p20Q80
2476A7J052q46j416M40J610K8o00m73J006K1j069j085Q15J110L0j372L22J114
2494G04j16j689l98J159R85o73n86R05O92k79r10k73J301O02r55k72J166M22j117
2513F68j107J48J295l96r78p9J274m0j197j246M53R76n24q84M92J409k74j294
2531a304m26J023O55p61m32J282J357l77j654l04J642K10j203q3J387R40j244
$$ plain form
2548 708 -834 -183 446 206 -1541 -955 868 1083 -553 -1207 -246 361 -326 -1105 76 1654 1142 -175
2566 -175 -260 904 1054 -486 -612 1162 2264 1190 -548 146 1326 320 -847 -426 807 1078 29
2583 29 -876 -201 153 -739 -2037 -1202 205 311 -1032 -1132 -176 -46 -1210 -1453 -449 730 427 -457
2601 -457 -354 935 276 -952 -677 426 1213 654 -39 439 1095 253 -836 -578 966 1043 27 -85
2619 -85 646 512 2 -1089 -390 816 858 51 -18 815 694 -624 -810 103 895 499 -210 459 1113 769
2639 769 -755 -960 505 699 26 -408 283 723 -209 -1453 -1250 4 -76 -615 -420 187 297 -823 -1322
2658 -1322 -1105 103 -153 -843 -284 673 459 -440 -768 143 764 257 198 679 1373 523 -134 -300 588 572
2678 572 -76 288 650 998 67 -548 -295 106 -263 -728 -552 625 759 -516 -960 -382 321 -312 -811
$$ packed form
2548G08j542O51O29k40j747N86J823K15j636o54R61O07o87p79J181J578n12j317
2566a75q5J164J50j540j26J774J102j074j738O94J180j006j167M21J233K71j049
2583B9r05O75L54q92j298Q35J407J06j343j00R56J30j164k43J004J179l03q84
2601d57J03J289o59j228K75J103P87n59o93M78O56q42j089K58J544P7j016j12
2619h5P31j34n10j091O99J206M2q07o9Q33j21j318j86R13P92l96p09O69O54l44
2639G69j524k05J465J94o73m34O91M40r32j244K03J254q0n39J95O07J10j120m99
2658a322K17J208k56o90N59R57k14q99l28R11O21n07n9M81O94q50o57j66Q88j6
2678E72o48L64L62L48r31o15K53M01l69m65J76J177J34j275m44N78P03o33m99
$$ plain form
2697 -811 175 832 558 -300 -468 355 354 -83 -257 419 898 391 -469 -419 -72 -101 -727 -320 230 356 -346
2718 -346 -641 -408 179 -284 -931 -383 523 382 -164 -115 350 275 -78 -279 180 782 649 29 135 655 38
2739 38 -326 -360 320 588 -146 -248 23 166 -9 -825 -535 39 448 -217 -293 -179 224 258 -273 -64 548
2760 548 111 -11 241 87 217 -250 -163 -317 300 360 -244 111 216 -68 -535 -331 160 22 -265 -203 158
2781 158 178 -28 -206 -64 279 267 189 -14 150 128 76 -352 4 264 105 -139 -60 252 -37 -140 -350 -2
2803 -2 103 -280 -195 -190 235 -96 -24 -109 437 9 -169 61 154 65 315 -232 53 73 62 48 -245 -128 -420 -215
2827 -215 -134 -78 -15 -30 -173 66 39 235 -217 157 209 93 37 147 -135 18 37 9 211 192 148 188 284 -91
2851 -91 -67 -35 -77 10 -108 -294 -190 104 -238 -269 40 -380 55 -136 271 -203 -179 -74 -368 198 270 -40 28
$$ packed form
2697h11R86O57k74q58j68Q23jm37j74O76M79n07q60N0L47k9o26M07N50J26p02
2718c46k95K33N87m63o47N48R06j41n46M9M65p5l53k01M59O02j33o20J06N20o17
2739C8l64l4O80K68p34j02K71J43j75q16K90N74M09o65p6J14M03L4n31K09O12
2760E48m37j22K52j54J30m67Q7j54O17O0o04L55J05k84m67K04M91j38k87O2L61
2781A58K0k06j78J42L43j2p8k03J64k2n2m28L56K60j59k44P9L12k89j03k10L48
2803bJ05l83Q5NM25l31P2q5N46m28j78K30R3q9K50n47K85K0j1j4k93J17k92K05
2827b15Q1N6O3j5j43K39k7J96m52L74N2j16n6J10k82J53J9k8K02j9m4M0R6l75
2851i1K4L2m2Q7j18j86J04K94l42l1L09m20M35j91M07m74K4J05k94N66P2l10O8
$$ plain form
2874 28 64 -195 218 180 320 -198 -226 245 69 40 170 -80 -30 -149 -129 -176 40 -157 14 19 253 297 -106 98
2898 98 17 321 -37 209 97 198 -170 162 301 121 -18 -200 -144 -123 -229 -111 -46 195 124 -201 16 -164
2920 -164 -103 -148 -56 -340 -228 -161 -169 -120 -167 -378 -37 -99 -108 -118 81 -316 -9 -67 63 82 276 77 279 63 -150
2945 -150 210 135 284 349 174 221 206 278 249 45 69 216 50 164 126 -30 -171 -129 -112 -27 368 -172 -28 198
2969 198 18 -66 -127 -274 -34 -21 -162 94 184 99 -63 -150 31 160 0 -213 -381 -240 -348 -523 -198 -36
2991 -36 -371 -120 25 -97 -45 -182 -152 -71 314 51 25 104 283 373 -97 539 408 626 -50 206 308 281 39
3014 39 -263 102 257 -18 -278 -27 172 -188 -224 -312 -125 101 -62 -154 -156 93 -3 -165 -288 193 128 35 -165
3037 -165 301 255 120 -340 162 74 68 81 39 -53 80 -129 -391 41 125 -144 -94 31 228 178 -53 -234 0
$$ packed form
2874B8L6k59M13l8J40n18k8M71j76k9J30k50N0j19K0m7K16j97J71NK34M4m03K04
2898I8q1L04l58K46j12J01l68L32J39j80j39j82N6K1j06J18O5K41p1l25K17j80
2920a64O1m5R2k84J12O7qM9m7k11L41o2rj0J99l97L07n8J30J9J94j99K02k16k13
2945a50L60p5J49O5j75M7j5P2k9k04K4J47j66J14l8j56j41M2J7Q5L95n40J44K26
2969A98j80q4o1j47K40J3j41K56R0q5j62q7J81J29j60k13j68J41j08j75L25J62
2991c6l35K51J45j22N2j37L0Q1L85k63k6P9J79R0m70O36j31K18o76K56J02k7k42
3014C9l02L65J55k75k60K51J99l60l6q8J87K26j63r2kK49r6j62j23M81o5r3k00
3037a65M66m6j35m60N02q8oJ3m2r2J33k09k62M32Q4k69N0J25J97n0k31j81K34
$$ plain form
3060 0 276 -80 -163 0 -119 -2 -227 -33 324 231 39 -37 351 334 -52 -44 61 202 204 -123 -55 328 181 -83
3084 -83 -153 -212 65 -93 55 -143 362 210 -336 -415 -68 217 -308 -371 150 112 -249 -474 -117 -1 129 53
3106 53 -47 351 104 83 -440 -155 221 191 -168 96 368 379 202 -360 120 -107 -160 -357 -62 332 57 -248
3128 -248 -186 208 -68 -268 -184 295 580 85 -165 -77 377 127 -31 36 283 606 -75 131 47 172 27 -268
3150 -268 79 355 89 -163 -194 -93 -114 -459 -444 148 630 255 -64 -112 -92 -63 -272 -114 232 555 272 -256
3172 -256 -188 -11 60 -379 -255 388 215 -118 -221 37 50 -195 -570 -174 417 -11 -24 -151 214 150 -291 -455
3194 -455 -121 389 21 -517 273 221 61 -514 -369 302 276 -82 -280 99 112 -141 -632 -65 287 176 -30
3215 -30 21 125 154 -371 -353 26 381 287 -115 92 537 3 -446 -452 -173 155 87 -222 17 273 110 -487 -475
$$ packed form
3060@K76l56q3J63j19J17k25J94L57r3j92p6L88j7l86QJ05J41Kl27O8L83j47k64
3084h3p0n9K77j58J48j98N05j52n46p9L47K85n25o3N21l8l61k25L57J16J30p6
3106E3j00L98k47k1n23K85L76l0l59K64K72J1j77n62M80k27n3j97K95L94k75l05
3128b48O2L94k76k00Q4M79K85m95k50Q8M54k50j58O7K47L23o81K06q4J25j45k95
3150b68L47K76k66k52l1J01k1l45J5N92M82l75l19m8K0K9k09J58L46L23k83n28
3172b56O8J77P1m39J24O43j73l33j03K58J3k45l75L96N91m28j3j27L65o4m41j64
3194d55L34N10l68n38P90n2j60n75J45O71k6l58j98L79J3k53m91N67L52j11k06
3215c0N1J04K9n25J8L79L55r4m02K07M45n34m49oK79L28o8l09K39K56j63n97J2
$$ plain form
3238 -475 220 180 -3 196 340 406 -81 -284 -260 340 70 -142 91 217 362 -319 -299 -81 186 -161 -311
3259 -311 145 262 19 -309 -466 -216 247 -52 -224 261 444 -8 -164 -46 160 143 -181 39 327 515
3279 515 28 -152 142 -117 -7 -342 166 400 334 67 -207 128 -98 -304 -83 -145 407 -103 -478 -102 80
3300 80 -130 -463 -173 162 204 280 -111 -136 258 59 -360 -189 125 179 95 -208 16 -64 -234 -483 -199 15
3322 15 -158 -126 -261 -22 -122 -226 -151 267 287 -100 -60 -48 250 112 -16 95 114 522 223 182 131 255 -13
3345 -13 -78 -100 243 136 -63 20 240 -78 -144 -82 -227 212 -52 -399 -59 -74 60 -120 -146 201 296 -40 -26
3368 -26 -157 -242 117 -163 -113 291 0 -23 -152 148 -18 -46 -211 217 -26 85 -238 -325 197 -137 -243 -152
3390 -152 -1 23 98 28 124 170 261 -155 256 102 440 29 37 183 25 21 1 -15 179 190 -52 -59 25 282 -247
$$ packed form
3238d75O95m0j83J99J44O6m87k03K4O00k70k12K33J26J45o81K0K18K67l47j50
3259c11M56J17k43l28j57K50M63k99j72M85J83m52j56J18K06j7l24K20K88J88
3279E15m87j80K94k59J10l35N08K34o6k67k74L35k26k06K21o2N52n10l75L76J82
3300H0k10l33K90L35M2P6l91k5L94j99m19J71L14N4q4l03K24q0j70k49K84K14
3322A5j73L2j35K39j00j04P5M18K0l87M0J2K98j38j28J11J9M08k99m1n1J24k68
3345a3o5k2L43j07j99Q3K20l18o6O2j45M39k64l47L40j5J34j80k6L47R5l36J4
3368b6j31q5L59k80N0M04k91k3j29L00j66k8j65M28k43J11l23q7N22l34j06R1
3390a52J51K4P5p0R6M6R1m16M11j54L38m11QJ46j58mk0j6J94J1k42pQ4K57n29
$$ plain form
3415 -247 -189 -251 146 -336 -9 -259 -105 -92 -45 -233 -380 -40 -163 133 -116 15 -122 -279 0 -73 -122 -65
3437 -65 70 -45 98 166 209 396 -25 3 128 -273 -54 -101 172 153 -276 60 -61 -66 -131 68 301 127 0
3460 0 152 231 226 187 232 45 378 127 238 285 99 212 33 103 93 -97 207 295 -75 -149 34 -326 120 -121
3484 -121 11 25 -296 -35 -110 -37 6 -41 155 -47 293 39 253 97 159 312 134 244 -41 -85 -21 -4 -92
3507 -92 75 112 -4 -184 58 3 -256 -36 163 60 -13 69 -1 5 280 24 322 10 104 88 -112 -48 203 64
3531 64 191 -117 236 271 93 -68 -14 310 -164 -111 -98 -174 -118 -134 -122 210 -99 -89 99 142 61 58 -82 -79 -85 148
3557 148 54 111 -54 -99 74 17 -242 71 17 -17 -102 14 -164 260 95 41 -9 -38 -136 295 71 -191 62 168
3581 168 -167 2 -4 -127 -35 -14 -3 -79 -89 -100 163 -102 126 175 3 -125 131 9 -42 15 -110 -134 21 -91
$$ packed form
3415b47N8o2L97m82L27k50J54J3M7j88j47L40j23K96k49J31j37j57K79p3m9N7
3437f5J35j15J43O8M3J87m21K8J25m01K19m7K73j9m29L36j21no5J99K33j74j27
3460@J52P9nl9M5j87L33k51J11M7j86J13j79P0j0j90L04Q8l70p4J83l60M46k41
3484a21J32J4l21K61p5P3M3m7J96k02L40k54K14j56O2J53j78J10k85m4O4J7q8
3507i2J67L7j16j80K42n5k59K20J99j03p3Q2p0OK75k56K98l12R4j6k00O4K51j39
3531F4J27l08L53L5j78j61N4L24m74N3J3p6N6j6J2L32l09J0J88M3q1lj40LoK33
3557A48r4N7j65m5J73n7k59L13n4l4q5J16j78M24j65n4n0k9r8M31k24k62K53J06
3581A68l35J69oj23R2K1J1p6j0j1K63k65K28M9j72j28K56j22n1N7j25k4J55j12
$$ plain form
3605 -91 87 206 0 4 -47 188 3 -261 192 90 -169 -145 102 -263 -215 -130 -186 152 202 166 -161 -41 84
3628 84 -173 237 225 51 42 119 -35 -191 73 -17 11 129 29 6 43 146 -8 -62 -143 -163 78 -133 -301 31
3652 31 -218 100 -85 -60 101 39 -153 -149 73 78 33 -10 -1 -194 -45 135 38 -141 -96 -149 -95 -93 55 -1 -309 -89
3678 -89 -131 151 -101 -131 153 -160 -1 214 6 -29 434 -197 -65 45 63 -267 30 126 -196 48 -213 -142
3700 -142 -95 -212 -3 -128 239 -74 -12 131 15 53 10 -26 1 -127 219 43 -235 -250 38 -31 -91 86 160
3723 160 179 -100 -48 77 119 -5 217 -81 88 55 -42 -90 196 -17 -73 -73 -86 147 378 32 109 188 -301 -182
3747 -182 -7 -40 51 214 -115 115 117 -173 -86 225 265 87 -263 52 -40 -27 6 -121 186 24 -148 -115 -189 78
3771 78 238 -39 -24 -4 -83 -300 -25 113 -106 11 -11 -155 58 180 121 49 66 237 -101 -134 7 98 -169
$$ packed form
3605i1J78J19k06Mn1K35j85k64M53j02k59K4K47l65M8Q5n6L38N0l6l27J20J25
3628H4k57M10j2j74rP7j54j56K64r0K8J18j00k3L7J03j54n4q1k0K41k11j68L32
3652C1k49L18j85K5J61o2j92MK22Nm5m3Rj93J49J80r7j79M5n3N4KJ48n6l08K20
3678h9m2K82k52l0K84l13J59K15k08l5M63o31J32J10J8l30K97R6l22K44k61P1
3700a42M7j17K09j25L67l13O2J43j16L8m3l6K7j28L46j76k78j5K88o9o0J77P4
3723A60J9k79N2J25M2j24K22k98J69l3r7m8K86k13n6%j3K33K31l46P7P9m89J19
3747a82J75l3R1J63l29K30Kk90Q7L11M0j78l50L15r2J3L3j27L07j62j72L3p4K67
3771G8J60k77J5K0p9k17K75J38k19J17k2j44K13J22n9p2J7J71l38l3J41R1k67
$$ plain form
3794 -169 142 -88 20 219 148 152 12 -104 -160 240 -23 61 206 126 -35 184 -109 -86 -91 -372 21 -237 -120
3817 -120 -41 -186 -28 20 -12 -57 -65 -286 5 84 270 -21 30 447 63 29 137 -183 -42 76 -243 -227 226
3840 226 67 57 -4 65 171 234 1 180 137 22 -22 -25 44 182 12 -206 86 -24 136 -96 37 112 118 93
3864 93 -187 -138 72 224 -182 -135 189 76 -161 63 21 86 302 -118 87 300 -107 -155 -8 -39 192 137 97
3887 97 59 -146 144 -304 -111 216 199 17 24 14 146 85 -159 -130 15 -154 159 75 67 -34 -18 -117 -216 82 -20
3912 -20 291 -259 -39 -159 4 -234 -97 54 14 138 -31 -23 96 215 -289 349 -121 -174 -17 14 -25 -114 -242
3935 -242 -165 360 -156 -12 -184 -230 113 -145 -113 68 74 291 92 87 312 115 -45 -116 128 176 -137 -310 -10
3958 -10 255 36 54 76 134 67 -13 85 53 76 -50 -91 132 134 77 -215 -198 19 200 57 -7 7 38 -149 67 114
$$ packed form
3794a69L11k30J08J99p1Mj40j16n6M00k63Q4J45q0j61K19k93K3nk81L93k58J17
3817a20P9j45J58M8l2m5qk21K91P9J86k91N1M17l84l4J08l20J41J18l19J6M53
3840B26j59j0o1O9J06O3k33J79m3j15m4lO9J38j70k18K92j10J60k32J33P5Ok5
3864I3k80M9K10J52m06M7L24j13k37K24m2O5K16m20K05K13m07m8J47l1K31n5m0
3887I7l8k05K90m48J93L27j7j82Pj0J32o1k44K9J45j69L13q4qj01J6r9r9K98j02
3912b0L11n50K20j20J63k38J37J51m0J24j69QJ19J19n04O38m70n3J57L1l9q9j28
3935b42P7N25n16J44j72m6L43k58L2J81OK17j99nK25j97j60p1K44M8l13j73L00
3958a0K65k19J8K2N8o7q0R8l2K3j26m1K23Kn7k92J7K17J81j43o4J4L1j87K16M7
$$ plain form
3984 114 -57 81 51 -101 -52 81 -173 -17 -43 90 -29 167 43 -21 -168 39 -14 -146 192 121 -221 -69
4006 -69 166 89 43 25 265 33 11 -53 100 173 53 -75 83 194 22 414 89 61 -3 181 -75 167 31
4029 31 23 286 -91 332 -248 -158 -214 -102 -49 -220 -268 1 101 -40 -82 -34 42 368 19 190 -108 143 117 -166
4053 -166 314 117 30 -28 41 115 174 -40 46 -50 22 93 -322 125 -18 -118 170 -177 94 58 139 -5 18 128
4077 128 -106 -125 266 -82 -55 -104 45 32 219 136 111 -143 -58 34 -190 25 -250 2 54 11 118 -44 -12 -296
4101 -296 115 -132 -41 -72 -241 -313 -36 -156 -133 -53 207 290 91 6 -283 -300 -56 99 228 -205 -24 202 28
4124 28 -92 171 394 -393 -13 230 -305 -65 96 14 106 -68 162 6 -114 45 3 -57 128 165 195 193 -18
4147 -18 141 -192 -365 -18 52 -83 145 -178 -112 72 167 -75 -57 -81 -224 -165 124 -81 103 -34 106 -34
$$ packed form
3984A14j71J38l0j52M9J33k54J56k6J33j19J96j24o4j47K07n3j32L38p1l42J52
4006f9K35p7m6j8K40k32k2o4J53P3j20j28J58J11j72L92l25k8o4J84k56K42j36
4029C1qK63l77M23n80R0n6J12N3j71m8K69J00j41m2M8P6L26l49J71k98K51k6k83
4053a66M80j97q7n8O9P4N9k14Q6r6P2P1m15M47j43j00K88l47K71l6Q1j44K3J10
4077A28k34j9L91l48K7m9J49j3J87q3k5k54Q5R2k24K15k75K52N2m3J07j62L2k84
4101b96M11k47R1l1j69p2K77j20K3Q0K60Q3j99q5k89j7K44J55J29m33J81K26j74
4124B8j20K63K23p87L80K43n35K40J61q2R2j74K30j56j20J59m2o0J85L7L0kk11
4147a8J59l33j73L47P0j35K28l23O6J84R5k42J8k4j43N9K89k05J84j37J40j40
$$ plain form
4169 -34 155 140 -147 -230 41 -127 35 -292 270 93 -40 -162 -145 66 146 34 80 80 62 -137 -49 18 66 -294
4193 -294 10 124 206 -233 -39 -114 -201 -103 -81 -272 -26 89 -187 78 46 -186 46 -157 -142 151 -88 -193
4215 -193 95 -101 4 -92 -119 -28 27 90 228 144 -44 -28 -28 35 -40 40 -250 219 -53 20 -102 45 -59 18 -140
4240 -140 -231 -282 30 -53 -214 36 -220 -150 -18 -66 274 157 157 200 -42 59 86 60 205 -129 80 189 -176
4263 -176 -170 117 -7 -91 -87 1 -106 17 -150 -37 45 -263 20 93 165 22 -136 -255 76 -150 94 63 -10 26
4287 26 -40 -2 8 84 213 111 57 23 -63 -88 106 138 -193 -21 -90 100 -152 12 -141 127 -117 90 77 107
4311 107 108 -117 -137 65 34 -75 119 145 -99 16 -10 -79 -45 -11 -142 -52 -106 -67 175 212 -256 -36 248 -315
4335 -315 -134 -37 149 -47 -100 139 -78 125 0 -227 157 145 -204 -35 44 274 -44 -44 -35 -50 -96 -80 -267 -185
$$ packed form
4169c4J89j5k87q3K71j68J62l27N62j77j33j22J7K11Q0j12M6%j8j99Q8O7M8l60
4193b94L04J14Q2m39J94p5q7R8K2j91K46J15k76K65l2k32K32k03J5K93k39j05
4215a93K88j96J05r6k7R1N5O3J38q4j88J6%O3p5Q0k90M69k72P3j22J47j04P7j58
4240a40r1n1L12q3j61K50k56P0J32m8L40j17%M3k42J01K7k6J45l34K09J09l65
4263a76OK87j24q4MQ8j07J23j67J13Q2l08K83P3P2j43j58j19L31k26K44l1p3L6
4287B6o6L8J0P6J29j02n4l4q6k5J94L2l31J72o9J90k52J64j53K68k44K07j3L0
4311A07Jk25k0K02l1j09J94K6k44J15k6o9L4L4j31R0n4L9K42L7m68K20K84n63
4335c15J81R7J86j96n3K39k17K03j25k27L84j2l49J69P9K30l18%Rj5m6J6j87Q2
$$ plain form
4359 -185 2 68 -215 -74 -26 -64 -147 30 314 -233 -177 -157 -1 131 94 100 16 97 -41 -146 166 63 163 67
4383 67 -263 212 203 -137 -227 -166 -79 2 -9 12 236 161 110 131 -61 -140 -108 -372 -173 338 75 -229 146 41 95
4408 95 21 100 54 292 432 -59 147 93 -6 106 -108 146 159 -14 -152 50 -179 -78 -235 -87 185 325
4430 325 -155 -46 72 161 -357 -41 -146 -17 195 -7 331 199 262 -258 -162 103 358 -8 135 -6 -122
4451 -122 140 -68 -70 195 -15 -111 -23 22 -60 -181 -261 161 -17 134 443 226 -83 43 -43 -195 49 338 16
4474 16 40 383 -51 256 84 -215 -147 128 -90 -71 -114 137 -165 -231 -376 -143 69 -192 -12 -84 -249 -17
4496 -17 -48 -116 177 -3 -107 -28 163 -149 48 45 208 177 8 -19 84 217 108 53 -384 51 123 14 -25 12
4520 12 244 200 -138 69 -150 -63 237 -225 -14 332 164 47 -212 -229 -126 -171 -122 20 138 -23 -208 -24
$$ packed form
4359a85J87O6k83J41M8l8q3J77K84n47N6K0J56J32l7Oq4Q1j38j05L12j03J00r6
4383F7l30M75rl40r0O1Q7Q1j1K1K24p5n1K1j92p9L2k64J99N11k63l04L75j05N4
4408I5p4P9m6K38J40m91K06n4r9J12k14K54J3j73j38K02k29J01j57J48K72J40
4430C25m80J09J18Q9n18L16j05J29K12k02L38j32O3n20R6K65K55l66J43j41j16
4451a22K62k08kK65k10r6Q8M5q2j21q0M22j78J51L09k17l09J26q6j52K44K89l22
4474A6K4L43m34L07j72k99O8K75k18J9m3K51l02o6j45K33K12k61J80p2j65K32
4496a7l1o8K93j80j04P9J91l12J97lJ63l1j69k7J03J33j09n5m37M35P2j09l9L7
4520A2K32m4l38K07k19Q7L00m62K11L46j68j17k59j7J03m5M9J42J18j61j85J84
$$ plain form
4542 -24 -84 -215 245 43 314 188 -179 -7 106 50 -269 -243 -87 46 24 -184 119 -85 0 -145 74 -9
4564 -9 125 1 35 -119 130 -158 5 45 164 239 -115 -122 164 79 -100 -149 -19 428 243 -2 -173 209 81
4587 81 36 -31 -125 34 -282 66 -204 -154 -29 -405 -107 -77 41 33 -131 -6 -25 -34 222 73 90 111 -1 -78 76
4612 76 77 -156 -61 57 60 79 39 159 135 -112 58 -77 166 85 82 -140 167 105 -242 -236 127 -25 -37 -47 -131 -120
4638 -120 5 106 -156 35 -27 -81 -177 11 101 -112 -32 -56 -23 -68 -229 -73 -29 -25 125 0 -379 -79 -152 -20
4662 -20 -65 179 0 11 -2 162 223 109 -91 37 123 53 -156 -98 -157 78 92 -78 303 -32 -141 -164 1 -98
4686 -98 -149 144 -141 189 -37 -29 -132 142 113 119 -58 18 -204 76 62 -61 -69 134 -14 -11 111 8 75 91 111
4711 111 -108 -20 -6 121 -74 66 -13 17 -46 81 146 -93 5 -76 -139 240 -102 -56 130 47 46 -316 -224 -23 -140
$$ packed form
4542b4o0j31M60k02K71j26l67J72J13n6l19K6J56J33k2k08L03k04Q5j45K19q3
4564iJ34j24L4j54K49k88J63M0J19P5l54pK86q5j79m9J30M47j85k45j71L82j28
4587H1m5o7r4J59l16L48k70N0J25l76K98L0J18qj64J25j9rK56j49J7K1j12p7J54
4612G6Jk33R5J18LJ9m0J20k4k47J70j35K43q1lk22L07o2l47OL63j52j2j0q4J1
4638a20J25J01k62J91o2n4r6J88R0k13Q0k4L3m5j61J56M4MJ50j25l79L00p3J32
4662b0m5K44j79J1j3J64O1j14k00J28Q6p0k09N8n9K35J4j70L81l35j09k3J65r9
4686i8n1K93k85L30k26Qj03K74k9Oj77P6k22K80j4j23qK03j48LJ22j03O7J6K0
4711A11k19Q8J4J27j95J40p9L0o3J27O5k39R8q1o3L79l42M6J86q3jl62R2K01j17
$$ plain form
4736 -140 216 -214 119 1 -244 -328 -144 259 68 -346 -66 30 -78 89 134 89 66 -83 255 94 -28 -54
4758 -54 -128 -41 -89 -201 -89 -120 -95 14 -77 3 3 -310 109 140 -75 20 -51 -144 78 286 -16 134 -5 -6 -37 230
4784 230 30 147 -162 -212 -132 104 -86 38 -95 -113 -176 -157 160 -20 75 87 -78 45 43 -100 171 213 -111
4807 -111 -40 46 -49 260 2 -2 201 73 -420 -27 171 -154 -223 -57 -77 -121 51 -35 -101 31 16 5 -58 177
4831 177 76 280 -27 16 11 -98 40 96 36 -239 -117 85 152 -78 -52 181 -16 -92 139 202 121 33 49 -110
4855 -110 35 111 2 -37 -142 -187 10 160 137 148 14 37 12 -23 229 -59 -100 -245 126 2 79 -159 -177 -42
4879 -42 136 84 45 -49 -167 -80 -3 186 167 -129 -63 120 139 -28 -13 137 -11 -147 63 138 233 67 -116 70
4903 70 207 -112 42 -282 42 43 154 29 58 32 69 24 -125 385 107 -270 -211 68 -56 -16 -197 15 14 233
$$ packed form
4736a40L56m30L33j18k45q4J84M03j91m14K80R6j08J67M5m5k3j49L38j61j22k6
4758e4p4Q7m8j12J12l1K5J09r1Q0%l13M19L1k15R5p1r3K22K08l02J50j39jl1K67
4784B30k00J17l09n0Q0K36j90J24j33j8o3J9L17j80R5J2j65J23kj43K71M2l24
4807a11P1Q6r5L09k58mK03j28m93L93J98l25o9J66k0m4J72q6o6J32j5j1o3K35
4831A77j01K04l07M3nj09J38N6o0k75J22K02O7k30K6K33j97p6K31O3q1q8J6j59
4855a10J45P6j09l9j05m5J97J50k3J1j34K3k5l5K52k88m1j45L71j24P7k38j8J35
4879d2J78n2l9r4j18Q7P7J89j9k96O6J83J9j67J5J50j48j36K10P5R5j66j83J86
4903G0J37l19J54l24L24JJ11j25K9k6L7m5j49N10k78l77N9K79j24M0j81K12jK19
$$ plain form
4927 233 -78 29 69 127 -153 -153 -139 113 156 -274 -195 281 298 95 -71 115 132 -8 -119 168 223 33 -67
4950 -67 51 41 -85 -41 56 -2 -119 -1 -79 81 -150 60 -81 -102 132 192 50 283 89 124 145 -180 110
4973 110 34 175 73 -245 189 -284 -9 -63 -20 -6 -139 -162 -80 96 -142 -127 -184 217 137 -192 112 116 -75 -147
4997 -147 47 22 112 67 75 -208 -234 -136 -216 -86 132 12 117 -125 108 55 -104 -223 -37 -58 -357 45 20 203
5021 203 8 -50 -154 -209 -29 -205 7 -203 301 164 -84 -218 169 -85 -194 -107 117 -60 -53 -117 -35 32 -64
5044 -64 -30 57 -63 -299 283 -275 -256 163 302 85 -58 38 -233 -94 191 105 27 31 -262 -164 80 -73 -294
5067 -294 -69 193 75 -169 -274 331 400 -206 82 7 341 182 -35 -91 21 138 52 -103 -118 -61 -65 -130 58
5090 58 143 49 -136 -270 16 88 -55 -105 -35 307 -159 -109 -74 145 23 37 32 242 154 -148 -350 -32 81 41
$$ packed form
4927B33l11J07M0N8k80%J4K52M3m30P9M76J7k03j66J86J7j40j11K87N5j90j00
4950f7J18j0j26M4R7n8j17J18p8J60k31K10j41k1K34O0j42K33j94L5K1l25K90
4973A10p6J41j02l18M34m73K75n4M3J4j33k3Q2J76k38J5n7M01q0l29L04Mj91p2
4997a47J94k5R0m5Qk83k6R8q0J30K18j20J05k42K33n3j59j19J86k1k99M02k5J83
5021B03j95n8j04n5J80j76K12k10N04j37k48j34L87k54j09Q7K24j77Po4Q2O7r6
5044f4L4Q7j20k36N82n58J9M19J39k17j43R6k71J39K85q6p8Mk93R8K44j53k21
5067b94K25K62j18k44j05O05O9o06K88p5L34j59k17n6J12J17q6j55j5N7mo5J88
5090E8Q5r4j85j34K86P2j43n0P0L42m66N0L5K19j22J4nK10q8l02k02L18J13m0
$$ plain form
5114 41 -233 12 -47 -76 -203 -384 -10 101 -84 -124 -292 21 80 -196 -278 25 -57 -148 -121 181 133 210 -104 -222
5138 -222 87 -130 -87 -281 310 153 -73 -276 48 359 -248 88 -122 143 338 94 -115 -5 229 -207
5158 -207 40 418 129 120 -14 -98 64 141 -210 -349 -77 74 -39 -52 135 248 124 -154 -265 -50 -4 -237
5180 -237 2 128 -101 -48 -90 -175 -132 -30 12 -284 166 -190 -170 -421 -182 202 119 152 -18 60 64 84 -243 240
5204 240 -59 -31 76 231 257 95 -249 49 306 239 83 -38 21 5 -176 127 43 -39 -184 83 10 -1 148
5227 148 240 31 -162 273 -81 182 143 106 348 120 11 85 -20 228 -45 -35 218 -84 -38 -94 99 188 205
5250 205 99 182 -43 -181 -276 -121 -7 -3 -156 67 43 -3 -104 -254 62 -96 66 141 143 44 -98 -75 -81 32
5274 32 35 -314 -223 77 132 17 -133 -180 212 36 -58 -67 -37 140 -48 19 -19 199 -319 253 -37 389 252 -5
$$ packed form
5114D1k74K45n9k9j27j81L74J11j85m0j68L13N9k76q2L03q2r1K7L02m8P7l14j18
5138b22L09k17M3j94N91j57k26k03L24L11o07L36k10K65J95k44k09J10K34m36
5158b07K47L78k89rj34q4J62P7l51j39K72J51j13j3J87J13j24k78j11K15M6k33
5180b37K39J26k29N3m2q5M3J02M2k96M50l56K0k51K39L84q3L3j70P8MK0l27M83
5204B40k99K8J07J55K6j62l44K98K57o7j56j21N9j6j81L03q4q2j45K67p3j1J49
5227A48R2k09j93M35l54K63l9l7K42k28j09P4j05K48k73J0K53l02M6n6J93Q9J7
5250B05j06Q3k25j38r5J55J14Mj53K23k4m6j01j50L16j58J62P5Kr9j42K3oJ13
5274C2Ll49R1L00N5j15j50m7L92j76r4rL0J77j88O7l8K18n18N72k90M26j37k57
$$ plain form
5298 -5 -89 -36 172 33 0 143 322 91 104 -69 369 112 -86 -73 -71 -11 50 -82 -46 -196 10 214 36 -18
5322 -18 -83 81 -106 -149 -19 88 30 -44 -88 122 74 92 142 190 -111 -175 -78 109 -76 -244 217 37 177 -167
5346 -167 -245 178 -17 -107 -73 -122 -129 259 -68 -103 450 -14 37 -47 -94 -209 -141 175 -36 61 19 30 14 2 209
5371 209 68 -68 -59 30 184 -257 199 -43 -51 -369 60 168 -155 191 -105 218 -214 -50 13 260 -322 -75
5393 -75 -90 -129 -217 174 -153 6 263 56 -41 227 247 -150 291 82 105 55 127 187 126 131 41 101 -38 -27 -125 -32
5419 -32 -127 9 -96 -38 96 218 302 -30 46 -58 -67 64 34 188 -156 26 32 296 -69 -282 127 161 -16 60
5443 60 -17 -197 -145 -206 -64 -102 194 -49 -54 -48 -374 -5 -291 -171 -37 -20 131 240 232 -154 18 73 129 -20 -80
5468 -80 23 12 67 114 108 -121 -143 63 -261 -45 70 -40 -171 64 48 192 -66 41 -62 -58 -48 -131 136 157
$$ packed form
5298eq4N3K08j39l3J43J79k31J3j73M38k57j98J3KO0O1j32L6j50K06K04j78n4
5322a8o5J64j87m3J30J07n8p4m4K10m8J8N0M8l01o4R7J87j85j68M61j80J40l44
5346a67p8M23j95r0L4m9pL88l27l5N53m64N1q4m7j15O8L16k11R7m2J1j6j2K07
5371B09j41j36RQ9J54m41M56k42ql18M29J08l23L46k96L23m32J64O3K47n82K47
5393g5j5l9q8L91l27J59K57k07r7K68K0l97M41k09K3n0P2O0o1Nr0O0j39J1r8R3
5419c2r5J36j05N8J34J22Q4l32P6j04rJ31l0J54l44J82OK64l65k13M09L4j77P6
5443F0p7j80N2o1J42l8K96k43nOl26L69k86J20J34J7J51J09ql86J72N5N6j49o0
5468h0J03j1N5M7ok29k2K06l24K16J15j10j31K35j6J44k58J07j03MJ0q3K67K1
$$ plain form
5492 157 304 -23 -67 16 27 64 46 29 -14 52 -41 -67 -65 124 24 -9 56 -128 189 -195 137 12 -123 165 -55
5517 -55 -122 -43 -47 -67 41 126 16 -9 182 69 -61 -3 1 54 9 -161 -123 -5 9 -166 -33 -32 265 -98 -110 -181
5543 -181 -88 -15 156 110 -104 -1 3 -50 2 -222 264 -235 -50 -56 -109 -65 127 277 -125 66 18 94 -92 123
5567 123 -5 14 -151 4 211 -94 -138 41 -128 -56 -299 -43 -64 -6 186 70 166 -13 -111 -112 108 -97 -21
5590 -21 7 -92 -125 -265 -27 -88 83 -72 -82 -91 96 13 -90 -93 -20 -11 -383 -146 -38 51 -17 6 32 -48 12 14 -116
5617 -116 -69 -34 10 -45 308 22 -108 -139 -52 192 264 -188 6 185 124 -160 -63 -14 113 86 -17 -160 -87 231
5641 231 -102 180 109 -106 -87 10 -124 186 -12 -61 140 77 105 0 85 25 334 -186 -233 -197 182 -17 -152
5664 -152 -273 138 -139 -130 -69 237 -159 -176 44 -218 -44 101 -56 -78 75 78 13 -116 5 82 -12 36 -77 179
$$ packed form
5492A57J47l27m4Q3J1L7j8j7m3O6r3k6KJ89j00l3O5j84L17l84L32j25j35K88k20
5517e5o7P9mk0J08Q5j10k5J91j13j30N8MN3m5j70L8J18J4j75J33JK97l63j2p1
5543a81R3P3J71m6k14J03Mn3N2k24M86m99J85on3M4J92J50m02J91m8P6j86K15
5567A23j28J9j65J55K07l05m4J79j69P2k43K56k1N8J92j16R6j79r8jK20k05P6
5590b1K8r9l3j40K38o1J71j55j0rJ87q3j03lP3Rl72K37J08Q9o8K3K6q0O0Kj30
5617a16M7L5M4n5L53k86j30l1Q7K44P2m52J94J79o1k84R7M9J27k7j03j43P3L18
5641B31l33K82p1k15J9R7j34L10j98m9K01o3K8j05Q5o0L09n20m7L6L79j99j35
5664a52j21M11k77RO1L06l96j7K20k62J74J45j57k2J53Lo5j29J21P7r4M8j13K56
$$ plain form
5688 179 -62 -214 -122 -75 260 -193 -90 69 229 217 -43 -169 234 -136 -28 -80 185 -14 -167 -112 -150 -77
5710 -77 -84 -322 -63 198 -33 -109 -151 51 -51 -95 -223 -128 -21 -74 -222 -139 68 -95 -145 -121 50 236 66 -55
5734 -55 92 53 -373 -104 84 334 59 100 -28 -73 167 5 -46 -18 123 101 -11 -263 -36 5 -186 66 -90
5757 -90 116 265 -81 -120 -66 62 -278 -84 117 224 51 -50 13 360 180 -194 -113 68 -196 -26 -219 -97
5779 -97 -100 -335 -190 -100 161 -73 -188 -42 35 -38 -112 -52 18 42 -154 156 130 146 32 -153 -135 107 324 -46
5803 -46 -47 -57 235 -134 -22 56 -33 281 151 -125 396 59 -150 -81 -71 24 69 55 272 -33 -117 -310 -259 115
5827 115 111 187 -120 138 90 -196 -112 -77 -91 -210 -187 97 -107 -102 -142 -45 104 41 -237 28 8 83 52 23 50 213
5853 213 -97 -282 -54 83 216 44 -151 -128 -42 -97 -396 -167 99 180 -214 99 251 203 15 -193 138 85
$$ packed form
5688A79k41j52R2M7L35m53J03J59J60j2k60j26M03l70J08n2K65j99j53N5l8P3
5710g7pk38K59K61k31p6m2K02j02m4j28R5J07n3j48Q3K07j63n0K4J71J86j70j21
5734e5J47l9m26K69J88K50k75M1j28m5K40j62n1K8J41k2j12k52K27M1j91K52j56
5757i0K06J49l46l9N4J28l40J94K01J07j73j01O3L47j80l74Q1J81k64J70j93J22
5779i7lk35J45R0K61k34j15J46P7p3p4O0P0K4j96L10k6J6j14j85J8K42K17l70
5803d6jj0K92l69J12P8q9L14j30k76N21l37k09O9J0R5M5j4K17l05q4j93N1L74
5827A15mP6l07K58m8k86Q4L5j4j19K3K84k04Nm0R7J49o3k78K65k0P5l1k9K7J63
5853B13l10j85K28J37J33j72j95K3Q6n5k99K29K66Q1l94L13J52m8j88k08L31n3
$$ plain form
5875 85 34 112 89 -127 -113 -4 -24 54 -101 -55 -150 -137 27 -111 -174 -116 86 116 -3 -56 166 43 -101 -69 -64 139
5901 139 26 -103 37 11 28 -72 -228 -75 -46 -162 -103 -62 126 46 98 -88 135 248 -7 -82 -31 91 -222
5924 -222 -325 -29 239 255 -108 31 109 -78 154 244 -37 259 -81 -38 -109 72 68 -120 38 -130 -219 83 -119
5947 -119 -85 19 -87 -210 -6 -128 43 -82 20 -121 110 -17 -191 82 31 -159 97 -100 38 26 -86
5968 -86 -218 -231 -20 -16 4 -303 181 54 22 -31 -274 -11 141 -46 -384 -25 224 47 -182 316 -31 32 -51
5991 -51 -71 47 147 -281 -135 133 -263 -120 103 37 -319 -146 -315 -85 250 -205 -36 277 -140 -32 197
6012 197 -137 -310 -11 -45 -30 88 114 -20 -235 -15 -150 -145 -162 -342 -168 100 -343 -209 21 130 61 149 122
6035 122 27 232 -188 210 -84 -141 -29 -65 -69 -54 -24 244 -39 -134 -2 212 -159 -8 83 -73 -65 21 -52 27 -273
$$ packed form
5875H5n1P8k3k16J4J09k0P8j55M6r5J3J64j38o3N8K02L0j19n3K22j23j44L2NK03
5901A39j13j29J40k6J7j00j56J53K9j16N9M1J88q0N2j86K23J13k55p5N1J22l13
5924b22j03K96K68J6l63J39P8j87K32R0k81K96l40M3p1J81mj88J58j68q9L02k02
5947a19L4J04j06j23K04j22J71j25J02j41K31j27j74K73n1j90K56j97J38j2j12
5968h6j32j3K11MK0l07M84j27l2n3k43K63J52j87l38L59K49j77k29M98l47O3q3
5991e1k0J18J00m28J46K68l96J43K23o6l56J73j69K30L35m55J69L13m17J08K29
6012A97l34j73K99l4J5J18K6j34k15K20j35Nj7j80J74K68m43J34K30J09o9Q8k7
6035A22r5K05m20L98k94n7J12l6mJ5L0K68k83r5J32K14l71J51R1j56QQ6p3P9l00
$$ plain form
6060 -273 18 211 -2 91 -16 76 12 -128 -3 -57 -202 17 34 -143 112 32 82 -174 -81 17 -55 39 -133 -23
6084 -23 -50 -293 -3 -157 -21 184 -207 -15 86 86 -147 -12 13 214 167 -142 -13 257 168 190 -62 -367 -25
6107 -25 3 79 -124 -4 -31 125 109 111 -54 -69 90 -1 108 -15 36 14 148 68 -220 -63 180 49 -160 28
6131 28 -50 134 -292 -327 87 -299 50 -19 -274 -15 0 93 5 -120 74 -106 157 338 -143 63 76 -198 2
6154 2 -65 -118 15 10 40 -16 -374 -46 27 -3 -192 116 1 -467 -2 11 333 -195 -58 129 137 238 45 179
6178 179 205 289 16 -135 -110 135 -24 -93 -368 -108 29 -89 -34 384 25 -175 -50 41 20 250 88 -31
6200 -31 -63 -107 -10 21 -108 165 -72 -2 -229 10 -6 -60 -153 112 -91 -75 52 -189 35 -63 6 -222 -116 -86
6224 -86 -10 41 -107 145 313 -101 92 177 -333 128 48 -132 53 -46 -157 235 94 -53 62 -75 204 -225
$$ packed form
6060b73K91J93k13R3j07R2o4j40J25n4j45K19J7j77K55q0N0k56R3R8p2R4j72J10
6084b3k7k43K90j54J36K05l91J92J01%k33J35K5K01m7l09J29K70q9K2k52l05L42
6107b5K8P6k03J20k7J56j6Kj65j5J59r1J09j23N1k2J34q0k88J57K43j31k09J88
6131B8p8J84m26l5M14l86L49o9k55K59J5R3q8j25J94j80K63J81m81K06J3k74K00
6154Bo7n3J33nL0n6l58L28P3l0j89L08j15m68M65J3L22n28J37J87QJ01j93J34
6178A79K6Q4k73j51K5K45j59o9k75K60J37j18N5M18l59k00J25R1k1K30j62j19
6200c1l2m4R7L1j29K73k37P0k27K39j6n4r3K65k03J6J27k41K24r8O9k28J06L0
6224h6P6N1j48K52J68m14J93Q5n10M61q0j80J85r9j11L92j41j47J15j37K79m29
$$ plain form
6246 -225 -213 -258 58 61 -154 -47 84 128 -28 13 32 -23 151 -292 -20 -18 -56 -71 -163 13 56 99 196 -50 297
6271 297 -51 -370 70 125 184 -67 -44 -27 -136 109 -87 -29 21 195 -123 -35 67 173 279 -94 17 215
6293 215 1 127 -265 -144 24 -76 -132 292 326 -290 268 -219 -152 -101 -134 21 77 -87 -125 -144 -72 -1 242
6316 242 -188 -236 -83 -68 78 -239 340 -58 -67 -165 99 110 12 -139 -224 357 185 -56 -11 99 -44 -151 -6
6339 -6 62 -53 -185 -79 -216 -116 -35 -194 -4 136 22 -279 -191 100 227 56 92 8 -175 -2 24 -31 134
6362 134 209 -175 -159 69 142 -147 78 48 -30 90 63 51 143 150 122 -318 33 352 -90 133 -128 113 186 -18
6386 -18 105 -189 289 39 -57 189 176 -81 334 19 80 262 267 -129 64 48 -127 -206 -38 -116 232 120 -67
6409 -67 -113 -192 -315 -233 245 148 -15 -233 -262 192 311 203 -110 12 -118 189 66 -127 249 -123 -141 -85 111
$$ packed form
6246b25J2m5L16Lk15J07J31M4j56M1J9n5J74m43K72Kl8j5r2J76M3M3R7k46L47
6271B97l48l19M40N5N9k51K3J7j09K45j96N8N0J74l18Q8J02J06J06l73J11J98
6293B15k14J26l92J21J68j00n6M24L4o16N58m87O7N1l3J55N6j64l8j9P2P1K43
6316B42m30m8J53J5J46l17N79l98rr8K64J1r8j51q5N81j72k41M5J10j43j07J45
6339fO8j15j32J06j37J00Q1j59J90J40j14l01Q8K91J27j71L6q4j83J73K6n5J65
6362A34P5l84J6K28P3k89K25l0p8J20k7j2R2Pk8m40L51L19m42K23k61K41P3k04
6386a8J23k94M78k50r6K46j3k57M15l15O1J82Nl96J93j6j75p9J68p8L48j12j87
6409f7m6p9j23Q2M78r7j63k18k9M54J19j08l13J22j30L07j23j93L76l72j8N6J96
$$ plain form
6432 111 -85 -94 85 -147 79 -19 -197 -198 67 -86 35 25 198 278 228 -57 191 -5 -91 -316 47 319 -50
6455 -50 -23 -34 265 -114 -89 -130 104 151 -212 -137 141 -209 -17 -366 -52 136 84 157 -153 64 187 -215 190
6478 190 62 223 223 -7 -103 97 -121 131 -42 117 -36 -175 141 31 -21 -294 -47 -41 190 221 128 -52 7
6501 7 -141 41 -231 -171 -34 72 -40 105 -91 -18 93 26 -230 -58 -171 -19 23 -79 -43 102 125 -100 -40
6524 -40 -170 -9 27 208 194 -180 -103 -230 185 -47 -59 81 284 131 -310 -60 -91 110 -19 44 -99 68
6546 68 144 -32 91 58 -107 220 133 102 -9 77 -411 193 33 179 -59 -106 311 31 73 -133 195 1 -185
6569 -185 20 332 -15 196 -258 -45 -19 -51 -10 42 -87 61 101 154 47 -155 207 -18 156 12 -31 -159
6591 -159 -16 1 -163 -48 -126 -34 -182 -10 -186 156 135 -168 74 -21 -47 208 -41 -105 -42 -41 86 116 -247 78
$$ packed form
6432A11j96rJ79k32K26r8j78jK65j53J21j0J73Q0n0k85K48j96q6k25L63K72l69
6455e0K7j1K99l79K5m1K34M7l63P5K78l50J92l49L14J88n2P3l10K17J23m02M05
6478A90j28J61%k30r6K00k18K52j73J59j53j39L16j10n2k73K47OK31L1r3j80N9
6501Gj48J82k72O0J37J06j12J45j96P3J11o7k56J72j13J52M2j02L6J45K3k25O0
6524d0j30J61L6J81j4l74P7j27M15k32j2J40K03j53m41K50l1K01j29O3j43J67
6546F8P6j76J23l3j65L27q7l1j11Q6m88O04j60J46k38m7M17k80M2k06L28j94j86
6569a85K05L12l47K11m54K13K6l2M1N2j29J48M0N3j07k02L62k25J74j44m3j28
6591a59J43J7j64J15p8R2j48J72j76L42k1l03K42r5k6K55k49o4O3JJ27L0l63L25
$$ plain form
6615 78 194 72 -15 346 90 31 -226 334 -48 -17 -152 -126 61 144 125 153 112 -131 163 95 -103 -32 114 -66
6639 -66 -45 -34 31 -268 -143 -2 117 53 45 -119 -215 49 -39 177 260 133 -150 -168 175 11 -60 -42 7 202 260
6664 260 -183 58 257 -59 64 44 -91 -54 73 -81 -180 44 106 -139 42 -34 294 222 248 127 216 -183 74
6687 74 -122 -61 -80 274 -69 300 66 -139 116 42 209 -129 -156 -100 -205 3 -53 -65 -93 93 12 -277 -25
6710 -25 -77 -47 -108 -168 -36 229 27 51 26 234 273 -6 22 -88 78 5 -27 -222 271 84 35 -345 -247 186
6734 186 1 -74 -302 -124 -232 -86 -42 -51 -102 22 113 13 -4 14 194 -264 179 249 -32 -12 123 -85 54
6757 54 -76 -123 -111 59 73 119 -24 51 24 -119 -24 -42 -280 145 55 -99 190 72 18 -95 -248 45 58 -174
6781 -174 -158 -5 180 25 96 -155 29 348 -28 60 -221 80 142 -86 -93 147 -68 57 87 -216 167 -45
$$ packed form
6615G8J16j22q7L61k56n9k57N60l82L1j35K6J87Q3j9K8m1k43K94o8j98P1J46j80
6639f6K1J1O5k99J25J41J19o4qj64r6K64q8K16Q3j27k83j8L43j64p1J8M9J95N8
6664B60m43K41J99l16J23k0j35L7J27j54r9K24O2k45J81p6L28p2K6j21Q9l99K57
6687G4j96O1j9L54l43L69k34k05K55p4J67l38k7N6j05K08n6j2k8J86q1k89K52
6710b5n2L0o1o0J32K65k02K4k5K08L9k79K8j10J66p3l2j95M93j87m9l80R8M33
6734A86j85p5k28J78j08J46M4rn1J24R1j00j7J8J80m58M43P0k81K0J35k08J39
6757E4j30m7J2J70J4M6j43P5k7j43R5j8k38M25r0j54K89j18n4j13j53K93J3k32
6781a74J6J53J85j55P1k51J84L19l76Q8k81L01O2k28pK40k15J25L0l03L83k12
$$ plain form
6803 -45 0 -144 59 41 202 230 46 -14 164 20 -67 129 146 -2 -126 43 189 118 97 90 195 212 80 -415
6827 -415 -114 309 142 -95 34 38 -86 -220 -58 -77 99 5 -172 -23 -31 144 -244 136 98 -243 68 -27 141
6850 141 140 -88 -109 182 -37 125 -96 -138 283 234 -124 -262 -66 2 -38 -8 -32 -69 -102 -220 -307 173 -219 -252
6874 -252 -145 11 162 -125 54 18 201 157 -93 -95 -25 15 112 -328 56 100 -99 -138 112 180 212 16 -271 -181
6898 -181 62 97 -47 3 -220 -105 -212 -40 -87 -117 34 154 108 104 -81 -252 -118 44 164 44 -53 184 84
6921 84 -93 -46 -263 -263 173 -163 38 203 -85 -132 59 -70 -207 100 314 -23 -163 169 175 -174 119 5
6943 5 -103 196 293 4 -177 -209 8 248 28 -7 147 -99 119 -99 -73 1 11 89 -158 165 5 -220 -14
6966 -14 -66 56 202 -321 -106 253 181 -2 159 174 208 -315 34 104 -119 -105 -90 -498 62 -75 20 0 -104
$$ packed form
6803d5M5j44K03j8J61K8j84o0J78j44q7J96J7j48j24J69J46p1k1pJ05J7j32m95
6827d15L01M23j67k37J29Mj24j34J62j9J76r4j77J49qJ75l88L80l8l41L11r5J68
6850A41jk28k1K91k19J62k21m2M21m9l58j38J96O8m0L0k4l7l3j18q7M80l92l3
6874b52J07J56J51k87J79l6J83m4k50kP0M0R7m40L84M4j99l9K50O8L2j96k87R0
6898a81K43L5j44N0k23J15j07J72m7l0J51J20m6mj85j71J34J62J20j20r7K37j00
6921H4j77M7k17%M36l36K01J65k88m7J91j29j37L07K14l37j40L32Ol49K93j14
6943Ej08K99R7k89j81l2K17K40k20l5J54k46K18k18K6P4J0P8k47L23j60k25K06
6966a4n2J22J46n23K15L59p2j83J61J5L4n23L49P0k23J4J5m08N60j37R5k0j04
$$ plain form
6989 -104 -157 -4 -325 97 -48 -154 -187 2 -63 207 160 -95 -89 -107 147 -129 -3 -21 -29 -225 -12 -150 105
7012 105 189 -250 101 75 7 -79 142 177 -172 -233 -21 47 -31 159 -274 -29 34 323 -215 -23 13 -5 -26 67
7036 67 -38 235 83 -171 128 120 240 -135 -159 -237 114 -81 -6 384 157 247 35 2 142 97 -213 -153 -149 -2
7060 -2 12 32 53 42 152 -392 -38 -107 -103 -244 -101 14 37 19 -130 -37 -64 183 -16 -200 -126 107 73 -59 39
7085 39 -78 117 -99 74 -53 153 -82 69 143 86 -83 -326 -264 258 14 -44 -60 -42 -42 97 179 28 109 -143
7109 -143 127 100 110 -105 106 -93 265 -39 -229 -276 -98 104 53 113 -26 -159 -114 -56 300 -93 89 14 -29
7132 -29 62 210 -62 -95 -175 257 -136 -193 -224 -48 17 108 11 -220 87 -41 134 -224 230 -160 67 193 -151
7155 -151 69 34 77 202 149 -55 29 -88 203 -172 -83 -44 -321 -4 96 116 -155 76 126 -170 -60 102 131
$$ packed form
6989a04n3J53l21M22j45j06l3J89o5K70m7k55Oj8K54k76J26j8qj96K13j38K55
7012A05Q4m39L51k6o8q6K21L5l49o1K12O8p8J90m33K45O3K89n38J92L6j8k1R3
7036F7j05K73j52k54K99qJ20l75k4p8L51j95P5L90k27R0k12l3J40m5l10O0MJ47
7060bJ4K0K1j1J10n44L54o9Mj41J43J15K3j8j49R3k7K47j99j84P4K33l4j32R8
7085C9j17J95k16J73j27K06k35J51P4n7j69k43O2N22k44n8j6J8%J39Q2j51Q1k52
7109a43K70k7J0k15K11j99L58l04j90m7J78K02n1O0j39j33M5N8L56l93J82p5m3
7132b9R1J48k72l3q0M32l93n7l1J76O5R1r7k31L07j28J75l58M54l90K27J26l44
7155a51K20l5M3J25n3k04Q4j17K91l75Q9L9k77L17J00K0k71K31N0k96J10J62K9
$$ plain form
7178 131 -61 -187 161 -104 -30 -51 34 -94 -144 220 -70 -222 -277 71 92 72 54 -186 149 -28 -133 11 -120
7201 -120 -77 30 116 -169 -129 -126 75 168 -188 5 158 93 -32 16 -14 187 9 -33 4 176 159 80 -13 -115 -75
7226 -75 -108 57 -53 -228 -80 -144 -37 -112 47 7 -112 -170 -120 -145 59 -83 33 44 18 223 254 3 -64 90
7250 90 174 16 -18 244 -103 30 63 71 -83 -50 -67 2 234 53 17 -129 -276 -53 -182 21 -93 68 117 29
7274 29 -85 190 71 -20 6 154 -72 -41 110 306 82 -125 103 -345 -185 -222 38 -57 202 -159 29 58
7296 58 -236 -209 -249 -339 -212 -281 -260 -218 112 -28 178 200 -108 -63 308 136 127 -106 -224 -59 51 -132 -237 11
7320 11 197 152 148 177 20 -36 58 -25 -55 63 -228 18 72 46 45 -45 -204 97 -40 -44 -242 23 -51 165 11 -51
7346 -51 17 -70 36 -38 -175 131 -277 36 -251 -129 125 -31 96 -107 -178 2 77 110 -211 183 184 -90 302
$$ packed form
7178A31j92j26L48k65P4k1Q5j28n0L64k90j52n5L48K1k0j8k40L35j77j05J44j31
7201a20M3J07Q6k85M0LK01R3l56J93J53o5j25M8l0K01j78m2L7J72j7p9r3j02M0
7226g5l3J65j10j75J48o4J07p5J59m0j19n8N0k5K04j42J16J1k6K05L1k51o7J54
7250I0Q4j58l4K62l47J33L3Qj54L3j7O9K32j81l6j46j47K23j29K03j14J61M9q8
7274B9j14K75j19r1K6J48k26L1J51J96k24k07K28m48J60l7K60r5K59l61J88K9
7296E8k94K7m0r0J27o9K1M2L30j40K06K2l08M5L71j72rk33j18J65J10j83j05K48
7320A1J86m5mK9j57n6R4q3l0J18k91K46N4k6jr0j59L01j37mj98K65p4K16j54o2
7346e1O8q7J06p4j37L06m08L13k87J22K54j56J27k03p1J80P5L3l21L94Jk74L92
$$ plain form
7369 302 22 51 175 -119 161 57 -161 -72 -259 154 -20 55 257 142 -51 -108 50 -196 -2 -212 -111
7390 -111 -17 119 33 14 177 82 9 -183 -54 167 -73 47 -355 133 -61 -121 9 204 -88 -292 -23 -107
7412 -107 -118 -101 82 -176 9 -41 -8 3 3 146 3 139 14 133 102 -36 136 83 60 -41 -184 -37 -40 -297
7436 -297 -45 -324 -42 252 -24 -171 -211 -159 -272 225 -55 -27 -117 3 19 -134 14 -92 53 -93 -179 38
7458 38 -196 -195 -41 130 333 24 -8 -46 -138 -95 -192 -187 11 -32 276 -64 182 25 -192 191 -20 138 -33 59
7482 59 -337 -10 -77 109 82 -284 156 110 100 -40 52 37 41 123 -17 -7 8 -82 64 -23 103 65 -69 15 86 21
7508 21 57 289 -25 -69 35 101 -171 -137 88 -189 -3 277 -17 62 -86 -52 171 -4 -90 -16 191 199 -52 -86
7532 -86 86 -65 -326 100 -170 -19 122 -212 -379 -5 85 -147 -131 146 11 -54 270 13 -98 77 25 -74
$$ packed form
7369C02k80K9J24k94K80j04k18Q9j87M13j74P5K02j15j93n7J58k46J94k10J01
7390a11R4J36q6j9J63r5p3j92J29K21k40J20m02M88j94o0J30J95k92k04K69q4
7412a07j1J7J83k58J85n0L3J1%J43j43J36j25J19l1j38J72n3k3j01j43J47lk57
7436b97K52k79K82K94k76j47m0N2j13M97k80K8r0J20J6j53J48j06J45j46q6K17
7458C8k34JJ54J71K03l09l2l8r2M3r7NJ98m3L08l40K46j57k17L83k11J58j71R2
7482E9l96L27o7J86k7l66M40m6j0j40R2j5MQ2j40J0J5r0J46q7J26l8j34Q4P1o5
7508B1L6K32l14m4J04O6k72L4K25k77J86K80k94P9j48L4K23j75q6P4K07Qk51l4
7532h6J72j51k61M26k70J51J41l34j67L74R0k32J6K77j35o5L24k57j11J75n2r9
$$ plain form
7554 -74 112 40 -12 -39 -283 105 -6 -7 -104 55 -106 -159 -35 53 -74 -29 134 -54 17 51 90 -76 15 19 145
7579 145 174 137 206 73 80 -132 -15 91 130 -102 -51 73 157 -128 69 41 4 -42 45 214 37 -11 -85 -62 48
7604 48 134 -4 34 86 138 15 -93 -45 138 5 -82 82 -132 -110 -91 78 -37 -45 79 67 57 -200 -236 9 -59
7629 -59 267 75 47 -75 -44 309 -178 -152 187 -66 -98 166 -18 -10 -216 -136 -6 -147 109 235 228 84 -60
7652 -60 145 57 -63 -51 169 76 59 238 82 -155 -31 191 -86 -92 -430 0 83 80 -191 -42 105 -121 86
7675 86 -27 -28 -82 79 -81 -169 69 155 -11 -162 12 48 -72 -311 -86 127 227 -143 -72 184 111 -29 113
7698 113 145 291 -242 -88 391 296 52 -127 110 15 335 100 -105 160 -133 213 -91 -134 -31 -41 -215 228
7720 228 174 59 469 -232 60 93 -45 101 -134 121 55 -72 84 75 -126 254 63 150 274 26 45 -90
$$ packed form
7554g4J86p2n2k7k44L88j11jr7J59j61n3J24Q8j27M5J63j88P1L4L9j66R1MJ26
7579A45K9l7O9j33Pk12J17J06L9k32N1J24Q4k85J97k8l7m6Q7J69j77m8p4K3J10
7604D8Q6j38L8N2N2j23j08M8J83j33q7J64k14K2J9J69j15qJ24j2j0k57l6K45o8
7629e9L26j92k8j22L1L53m87K6L39k53l2K64j84Qk06Q0J30j41K56J26pj44j44
7652f0K05q8j20J2K20r3j7J79j56k37J24K22k77ol38M30Q3lk71J49J47k26K07
7675H6j13jn4J61j60q8K38Q6j66j51J74L6j20k39K25K13J00l70P1K56p3j40J42
7698A13L2J46n33J54M79r5k44j79K37r5L20k35k05K65k93L46l04m3J03j0j74M43
7720B28n4j15M10p01K92L3j38J46k35K55o6j27J56rk01L80j91Q7J24k48J9j35
$$ plain form
7742 -90 31 141 24 -44 276 82 -32 26 -131 64 -72 -32 -61 -162 -88 109 27 142 -186 32 -32 -147 172
7765 172 -228 -164 79 -73 -195 -28 -128 71 -20 180 12 -45 144 87 -91 46 7 -29 -60 -73 -73 -21 -329 -204
7789 -204 48 -98 135 -29 76 128 182 173 -92 159 147 74 -236 -209 18 -118 -95 -124 70 77 -30 -20 55 41 -113
7814 -113 -72 226 -27 86 -144 91 -36 -55 76 284 -62 -73 -199 -83 127 -89 62 96 -267 40 192
7835 192 102 -59 -67 221 -1 -107 188 52 -105 -33 165 -39 -117 -15 67 -30 -114 88 -106 243 -20 -13 109
7858 109 -7 133 -119 165 -24 -231 -78 -72 -57 222 -14 124 101 -131 -37 -8 -135 -66 -9 24 125 -117 -94
7881 -94 -107 100 -8 -31 -186 210 94 121 -106 50 -35 -43 -60 -82 65 113 12 79 -4 -104 57 84 106 -5 -53
7906 -53 -79 51 25 -134 190 28 184 -85 182 -303 -177 14 97 81 71 98 242 183 125 120 148 293 -342 74
$$ packed form
7742i0J21J10j17o8L20j94j14N8j57J95j36M0k9j01P4J97q2J15l28K18o4j15L19
7765A72m00O4K43j52j22J67j00J99r1K00j68n7J89n7j78J37l9l6l1j3%N2l08J25
7789b04K52j46K33j64J05N2N4rk65K51j2p3l10K7K27j36K3k9J94Pj07J0P5j4j54
7814a13M1K98k53J13k30K35j27j9J31K08l46j1j26J16K10k16J51L4l63L07J52
7835A92r0j61qK88k22j06K95j36j57P2J98k04p8J02Q2r7q4K02j94L49k63PJ22
7858A09j16J40k52K84j89k07J53OJ5K79k36J38k3k32R4K9j27O9N7L3J01k42K3
7881i4j3K07j08k3j55L96j16K7k27J56q5qj7k2J47M8j01O7q3j00J61K7K2j11m8
7906e3k6J30k6j59L24j62J56k69K67m85J26J91Q3j6j0K7J44n9n8nK8J45o35M16
$$ plain form
7930 74 26 61 19 49 154 105 135 67 69 -119 13 -234 -167 -218 -75 -233 61 156 -136 25 9 105 -41 -167 -16
7955 -16 -175 90 -262 7 117 -29 186 72 -27 50 -132 0 -67 102 -220 -69 -139 -312 -174 -30 140 -136
7977 -136 43 -59 2 64 29 80 -62 -182 -222 51 -47 -14 -144 102 -68 25 -51 102 160 12 70 -161 -50 143
8001 143 123 82 -11 178 -116 -106 107 -75 -15 -69 -85 -189 -2 -135 149 -192 102 -107 -20 217 79 -29 -270
8024 -270 -131 -159 -314 70 53 -86 234 78 -170 48 -18 -3 -65 154 52 -62 -110 68 206 -2 -249 25
8046 25 24 -57 -77 124 82 307 -96 -8 145 -20 -49 -255 -15 -103 -190 -40 -76 -130 -54 42 293 -8 158 124 -166
8071 -166 -43 -264 -111 -64 -71 30 23 -159 -96 -35 -58 -135 94 -409 -100 162 151 -66 128 111 67 169 66 -181
8095 -181 -142 -117 252 -238 -17 46 -75 94 69 -187 27 126 178 4 102 -44 -254 107 26 204 -3 3 -97
$$ packed form
7930G4m8L5m2L0J05m9L0o8Kj88J32k47O7n1J43j58K94R5k92J61j6R6j46j26J51
7955a6j59K65l52K69J10j46K15j14r9P7j82J32o7J69l22J51p0j73J38J44J70k76
7977a36J79j02O1O2l5N1j42j20m0K73r8L3j30K46j70R3p6J53N8j48N8k31J11J93
8001A43k0m1r3J89k94J0K13j82O0n4j6j04J87j33K84l41K94k09Q7K37j38j08k41
8024b70J39k8j55L84j7j39L20j56k48K18o6J5o2K19j02j14m8J78J38k08k47K74
8046B5jq1k0K01m2K25m03Q8J53j65k9k06K40q8q7J50l6n4P6R6K51l01J66l4k90
8071a66J23k21J53M7pJ01pj82O3O1k3p7K29n03L09K62j1k17J94j7m4J02j03k47
8095a81L9K5L69m90K21O3j21J69k5k56K14R9N2j74R8j46k10L61q1J78k07Oj00
$$ plain form
8118 -97 12 -68 -67 27 -66 2 -72 26 -74 -127 -48 -135 -44 119 -193 99 251 117 18 -52 -71 -33 -62 -27 98 121 -70
8145 -70 275 120 16 8 -139 75 13 -87 128 22 -199 108 244 -91 115 -122 162 -3 -157 -48 -139 262
8167 262 -96 92 68 -154 -62 293 109 -17 -54 43 -115 114 -51 11 -73 114 -9 -71 -110 -34 158 -165 -140
8190 -140 82
$$ packed form
8118i7J09q0JR4r3O8p4R8j00n3P9q7R1J63l12K92J52j34r9p0j9L8k9L5J25K3j91
8145g0L45j55j04qj47K14o2j00K15j06k21L07J36l35K06k37K84j65j54J09r1M01
8167B62l58J88k4k22R2L55j84j26l7R7j58K29j65O2q4J87j23o2l9P6J92l23K5
8190a40K22
8191H2
$$ Imaginary data points
##PAGE= N=2
##DATA TABLE= (X++(I..I)), XYDATA
$$ plain form
0 0 0 0 0 0 0 0 0 0 0 0 0 0 0 0 28 -32 32 -32 32 -33 64 -64 65 -96 97 -128 132 -161 193 -225 257 -289 321
33 321 -356 416 -454 516 -580 645 -720 804 -897 993 -1095 1214 -1339 1477 -1627 1793 -1976
50 -1976 2178 -2399 2643 -2919 3228 -3571 3973 -4429 4963 -5597 6360 -7303 8504 -10087
64 -10087 12280 -15544 20897 -31230 58585 -280722 -713797 -122304 229979 119946 -46326
75 -46326 233682 434355 220980 -63451 112911 409175 329385 20758 81059 406971 429868
86 429868 53781 -156566 -19006 85025 -64659 -140099 27206 156405 2433 -204242
96 -204242 -186171 -35740 -34597 -161066 -163420 17984 138628 64105 -56582 -61113 -8718 514
108 514 -2835 57031 149184 167517 67510 -46772 -46262 30778 27118 -63258 -72977 43987 110063
$$ packed form
0@%%%%%%%%%%%%%%K8o0O4o4O4o5R7j28J29j61J93k25K60k93L54m18M82n46O10
33C21o77P72q70R70j096J225j365J524j701J890k088K309k553K816l104L420l769
50a976M154m577N042n562O147o799P544q402R392j0560J1957j3663J5807j8591
64a0087K2367k7824L6441n2127Q9815l39307m33075N91493L52283j10033j66272
75d6326K80008K00673k13375k84431J76362K96264p9790l08627O0301L25912K2897
86D29868l76087k10347J37560J04031j49684p5440J67305J29199j53972k06675
96b04242J8071J50431J143j26469k354J81404J20644p4523j20687m531N2395R232
108E14l349N9866R2153J8333j00007j14282N10P7040l660r0376r719J16964O6076
$$ plain form
121 110063 16812 -105241 -112885 -74096 -119388 -187839 -121132 31206 44772 -106557 -180450
132 -180450 -72560 9716 -63334 -104276 34481 174196 119726 -7761 7505 109921 94891
143 94891 -14719 -4663 151505 226693 119639 21832 69091 112239 10061 -96280 -32779
154 -32779 100352 103245 -6158 -57669 -21138 -24705 -107129 -139866 -46526 50883 22166 -59143
166 -59143 -50605 17637 7945 -76123 -91205 5582 89809 69439 15429 28798 68853 33606
178 33606 -46212 -41757 50594 86839 13099 -43870 -3796 29103 -44407 -136948 -119072 -30569
190 -30569 -8676 -57768 -64865 -11342 -9721 -89511 -122722 -38533 46993 25380 -28830 -191
202 -191 71057 67890 4698 -6326 53285 87058 55809 38228 81407 110666 56112 -18668 -14566
$$ packed form
121A10063r3251j22053p644L8789m5292o8451O6707J52338J3566j51329p3893
132a80450J07890Q2276p3050m0942J38757J39715n4470j27487J5266J02416j5030
143I4891j09610J0056J56168P5188j07054r7807M7259M3148j02178j06341O3501
154c2779J33131K893j09403n1511L6531l567q2424l2737R3340R7409k8717q1309
166e9143Q538O8242r692q4068j5082R6787Q4227k0370n4010J3369M0055l5247
178C3606p9818M455R2351L6245p3740n6969M0074L2899p3510r2541J7876Q8503
190c0569K1893m9092p097N3523J621p9790l3211Q4189Q5526k1613n4210K8639
202a91P1248l167o3192j1024N9611L3773l1249j7581M3179K9259n4554p4780M102
$$ plain form
215 -14566 47338 65483 20801 -4879 21506 34878 -8949 -53948 -40015 -5612 -17514 -54342
227 -54342 -43286 6090 10109 -48836 -84331 -43386 5338 -7898 -36711 -9203 35520 18186
239 18186 -34577 -31702 20648 31566 -13742 -28391 19955 50927 7783 -43047 -28233 9961
251 9961 -3765 -37364 -18431 25499 15324 -33246 -37978 3602 16916 -12011 -19851 16501 42582
264 42582 23038 -237 14869 37601 24041 -211 11613 39788 36827 11739 6067 15397 11168
277 11168 -3834 -6886 1343 5272 558 -7353 -13147 -15191 -15058 -14472 -14282 -15128 -14287 -8154 -3643 -10155
293 -10155 -15112 -6813 -958 -10752 -13610 5584 17699 2651 -11291 -513 13727 8031 -4202
306 -4202 191 13263 11291 -4284 -5587 12481 16065 -6737 -17885 3173 18577 3616 -11067
$$ packed form
215a4566O1904J8145m4682k5680K6385J3372m3827m4999J3933L4403j1902l6828
227e4342J1056M9376M019n8945l5495M0945M8724j3236k8813K7508M4723j7334
239A8186n2763K875N2350J0918m5308j4649M8346L0972m3144n0830J4814L8194
251I961j3726l3599J8933M3930j0175m8570m732M1580J3314k8927p840L6352K6081
264D2582j9544k3275J5106K2732j3560k4252J1824K8175k961k5088n672R330m229
277A1168j5002l052Q229L929m714p911n794k044J33N86J90q46Q41O133M511o512
293a0155m957Q299N855r794k858J9194J2115j5048j3942J0778J4240n696j2233
306d202M393J3072j972j5575j303J8068L584k2802j1148K1058J5404j4961j4683
$$ plain form
319 -11067 -2498 6560 -2337 -10050 -429 9393 3540 -11039 -10658 5018 11167 -2881 -12613 -2851
333 -2851 4925 -2909 -6176 3511 5312 -5100 -9358 -1311 6186 5388 -877 -5356 -1713 4922 4828 962
349 962 3319 4639 -990 -1980 5234 6691 894 -1836 -1325 -1856 -591 1162 -1798 -4466 -2751 -3239
365 -3239 -5427 -1413 3095 -434 -4570 375 5441 5218 5403 7358 7914 9081 10744 9188 8775 11281
381 11281 10402 4134 3310 5564 1419 -4464 -3962 -4801 -11466 -15254 -13779 -14104 -16661 -17619 -18636 -17942 -14814
398 -14814 -13762 -14912 -11149 -5113 -5489 -6784 -439 5984 5511 5287 8080 9917 11584 14566 14885 12375
414 12375 11660 12568 12175 11753 11894 8555 5460 6938 7395 3675 2300 3585 1021 -2842 -323 2419
430 2419 796 -1864 -1463 -1199 -956 161 489 681 1678 -500 -3697 -833 3521 -1557 -9363 -7330 -704
$$ packed form
319a1067Q569R058q897p713R621R822n853j4579L81J5676O149j4048r732R762
333b851P776p834l267R687J801j0412m258Q047P497p98o265m479L643O635r4l866
349I62K357J320n629r90P214J457n797k730N11n31J265J753k960k668J715m88
365c239k188M014M508l529m136M945N066k23J85J955N56J167J663j556m13K506
381A1281q79o268q24K254m145n883N02q39o665l788J475l25k557r58j017O94L128
398a4814J052j150L763O036l76j295O345O423m73k24K793J837J667K982L19k510
414A2375p15R08l93m22J41l339l095J478M57l720j375J285k564l863K519K742
430B419j623k660M01K64K43J117L28J92R97k178l197K864M354n078p806K033O626
$$ plain form
447 -704 -2757 -10453 -11566 -8259 -8950 -14112 -17021 -11253 -5869 -10779 -17448 -12456 -2080 -4950 -14253
462 -14253 -10555 2343 4083 -3693 -2103 8266 10792 1930 -1388 9413 18661 12926 4352 10410
476 10410 21580 17428 4435 5283 16999 17549 7990 6948 14605 14651 2578 -5740 -1136 5124 1769
491 1769 -5955 -5915 -864 -2589 -10753 -14057 -10100 -6879 -7356 -7057 -3499 1097 890 -5454 -10637 -6429
507 -6429 3117 4807 -1225 -2418 5144 6725 -5335 -14772 -8562 860 -4440 -14060 -8126 5554 118
522 118 -20705 -25194 -7949 1372 -10778 -16071 1826 14912 -696 -17464 -5900 14080 9214
535 9214 -6179 5211 31650 32433 7388 -1425 18071 28140 12985 3867 23218 39831 22807
548 22807 -1972 1849 17752 9633 -12527 -11888 10179 15491 -4887 -20806 -15587 -8479 -18260 -28570
$$ packed form
447g04k053p696j113L307o91n162k909N768N384m910o669M992J0376k870r303
462a4253L698J2898J740p776J590J0369K526q862l318J0801R248n735q574O058
476A0410J1170m152j2993Q48J1716N50r559j042P657M6j2073q318M604O260l355
491A769p724M0N051j725q164l304L957L221m77K99L558M596k07o344n183M208
507f429R546J690o032j193P562J581j2060r437O210R422n300r620N934J3680n436
522A18k0823m489J7245R321j2150n293J7897J3086j5608j6768J1564J9980m866
535I214j5393J1390K6439P83k5045q813J9496J0069j5155r118J9351J6613j7024
548B2807k4779L821J5903q119k2160O39K2067N312k0378j5919N219P108r781j0310
$$ plain form
562 -28570 -16927 3535 3715 -12840 -18384 -7463 -3428 -13924 -18180 -3912 13686 13675 -901 -8124
576 -8124 -2213 -2012 -15127 -19642 -1720 16214 6644 -13353 -15445 -3389 -4769 -20768 -21952 1319
590 1319 20664 11601 -5307 852 15200 5917 -12120 -288 31723 39674 19283 10212 24018
603 24018 28445 6753 -10347 6163 32114 28460 5258 2301 15588 5188 -27623 -34541 -5826
616 -5826 13087 -1979 -19956 -12278 -787 -15003 -39651 -36373 -7526 5955 -8958 -14260 5265
629 5265 12522 -14092 -35842 -19133 10674 14197 -478 1911 19302 17035 -11291 -26453 -5736
642 -5736 17138 8904 -4440 10594 29593 12963 -20654 -24728 -898 11662 2105 -967 15684
655 15684 24141 1486 -25097 -18854 4477 6562 -6333 1001 24695 25620 -64 -17295 -8664
$$ packed form
562b8570J1643K0462J80j6555n544J0921M035j0496m256J4268J7598j1j4576p223
576h124N911K01j3115m515J7922J7934r570j9997k092J2056j380j5999j184K3271
590A319J9345r063j6908O159J4348r283j8037J1832L2011P951k0391r071J3806
603B4018M427k1692j7100J6510K5951l654k3202k957J3287j0400l2811o918K8715
616e826J8913j5066j7977P678J1491j4216k4648L278K8847J3481j4913n302J9525
629E265P257k6614k1750J6709K9807L523j4675K389J7391k267k8326j5162K0717
642e736K2874q234j3344J5034J8999j6630l3617m074K3830J2560r557l072J6651
655A5684Q457k2655k6583O243K3331K085j2895P334K3694R25k5684j7231Q631
$$ plain form
668 -8664 6232 7140 3395 14485 30183 23620 -3665 -17988 -4523 7717 -737 -7842 4594
681 4594 19356 10422 -15043 -27774 -17928 -8968 -17462 -21407 161 20340 4035 -27973 -29919
694 -29919 -7757 -2240 -15782 -11525 17836 30285 5429 -19878 -9783 11562 2438 -16515 1053
707 1053 36584 33708 -3621 -16585 5075 11467 -12610 -20432 9921 33939 14746 -15150 -10575
720 -10575 10175 -573 -27260 -18393 20463 31818 5112 -9584 5965 11761 -10022 -21674
732 -21674 1947 29869 25444 4703 1668 12839 5456 -17390 -19508 3904 17912 5629 -6251
745 -6251 -2058 -127 -15201 -30287 -25960 -7037 3364 -1844 -7120 -3232 -2563 -13950 -23992 -15509
759 -15509 3574 13388 9056 4947 8338 9964 1112 -8497 -3743 12095 18231 10967 7802 13755
$$ packed form
668h664J4896R08l745J1090J5698o563k7285j4323J3465J2240q454p105J2436
681D594J4762q934k5465j2731R846Q960q494l945K1568K0179j6305l2008j946
694b9919K2162N517j3542M257K9361J2449k4856k5307J0095K1345r124j8953J7568
707A053L5531k876l7329j2964K1660O392k4077p822L0353K4018j9193k9896M575
720a0575K0750j0748k6687Q867L8856J1355k6706j4696J5549N796k1783j1652
732b1674K3621K7922m425k0741l035J1171p383k2846k118K3412J4008j2283j1880
745f251M193J931j5074j5086M327J8923J0401n208n276L888O69j1387j0042Q483
759a5509J9083R814m332m109L391J626q852r609M754J5838O136p264l165N953
$$ plain form
773 13755 11637 -5398 -17029 -6926 9571 11151 1866 1230 8019 3390 -13436 -18921 -4380 8848
787 8848 3651 -3649 4200 12641 2188 -15930 -15801 667 9505 2402 -1427 6821 10181 -3299
801 -3299 -16407 -9763 4690 3964 -5824 -3007 11012 11777 -5313 -16415 -7605 3332 639 -3576
815 -3576 5075 14878 6180 -11829 -14164 94 6669 -2249 -6040 5235 12777 2471 -10787 -8235
829 -8235 1777 10 -6997 -1871 12014 12573 -1300 -9985 -3088 4684 927 -4091 2987 12149 8238
844 8238 -2562 -4347 1883 1378 -5281 -6006 3298 9798 4058 -5186 -7206 -2957 -2534 -6490 -5111 2128
860 2128 5598 -474 -6097 -3662 552 -614 -5168 -3365 4875 9770 4315 -1346 1079 4750 998
875 998 -3442 2195 11042 8816 -686 -2752 2684 3818 -2501 -5809 72 5505 -127 -6814 -2813
$$ packed form
773A3755k118j7035j1631J0103J6497J580r285o36O789m629j6826n485J4541J3228
787H848n197p300P849Q441j0453j8118J29J6468Q838p103l829Q248L360j3480
801c299j3108O644J4453p26r788K817J4019P65j7090j1102Q810J0937k693m215
815c576Q651R803q698j8009k335J4258O575q918l791J1275P542j0306j3258K552
829h235J0012j767p007N126J3885N59j3873q685O897P772l757n018P078R162l911
844H238j0800j785O230n05o659p25R304O500n740r244k020M249M23l956J379P239
860B128L470o072n623K435M214j166m554J803Q240M895n455n661K425L671l752
875I98m440N637Q847k226r502k066N436J134o319l308N881N433n632o687M001
$$ plain form
890 -2813 3442 -1860 -10530 -7447 2297 3121 -3447 -3859 1072 1204 -4238 -5371 945 5305 1974 -2666
906 -2666 332 4262 1263 -3720 -1887 1794 -252 -2751 265 2412 -890 -4556 -4231 -1450 -355
921 -355 -436 -637 72 -16 -1235 251 2789 3225 270 1816 5997 5123 2922 4785 6652 3141 -87
938 -87 3091 7378 6051 1272 -229 1506 2028 -395 -2391 -599 62 -4159 -6543 -2060 822 -4711
954 -4711 -8909 -5574 -2244 -3900 -5760 -3640 -2050 -3576 -5580 -4049 243 1354 -2438 -3252 598
969 598 3095 1135 422 3056 3609 1033 1428 4487 5117 2099 726 1643 2459 2175 1335 253 842 61
987 61 -1257 -627 1473 767 -1835 -1112 978 1222 659 1935 2336 1581 1987 3782 3896 3756 3579 2825 2465
1006 2465 3147 2733 1096 447 260 -1557 -2726 -2396 -3406 -5443 -5479 -5421 -6531 -6839 -5617 -5972 -6841 -6203
$$ packed form
890b813O255n302q670L083R744Q24o568m12M931J32n442j133O316M360l331m640
906b666K998L930k999m983J833L681k046k499L016K147l302l666L25K781J095
921c55q1k01P09q8j219J486K538M36k955J546M181q74k201J863J867l511l228
938h7L178M287j327m779j501J735N22k423j996J792O61m221k384M483K882n533
954d711m198L335L330j656j860K120J590j526k004J531M292J111l792q14L850
969E98K497j960p13K634N53k576L95L059O30l018j373R17Q16k84q40j082N89p81
987F1j318O30K100p06k602P23K090K44n63J276M01p55M06J795J14j40j77p54l60
1006B465O82m14j637o49j87j817j169L30j010k037l6N8j110l08J222l55q69O38
$$ plain form
1024 -6203 -4593 -3945 -3463 -2215 -1332 -713 571 1239 1830 3289 3967 2989 3309 4527 4519 3076 2978 3501 1979
1043 1979 1082 997 1085 75 -876 -1265 -1249 -703 -565 -1061 -572 586 777 1003 1899 3197 2864 3485 4651
1062 4651 4990 4555 4836 5174 3670 2650 2793 2602 1075 -626 -2206 -2760 -3672 -5342 -7061 -7479 -6996
1079 -6996 -7903 -8813 -8241 -6677 -7496 -8275 -6753 -4504 -3394 -3124 -2035 310 1840 1490 1841 3758 5307
1096 5307 5272 4232 5770 7665 6694 3545 2860 4513 5031 3179 1507 2221 2795 946 -1482 -903 614
1113 614 138 -1432 -948 1397 2242 -487 -1850 -422 1737 1452 367 1676 3552 2845 -564 -1177 326
1130 326 842 -1321 -2904 -1748 655 -779 -4217 -5872 -4041 -3371 -4601 -4701 -2450 -807 -2278 -4799
1146 -4799 -4216 -1431 -969 -3220 -3058 1945 4705 1935 -1356 37 2712 1496 -531 2025 6888 7101
$$ packed form
1024f203J610O48M82J248Q83O19J284O68N91J459O78r78L20J218qj443r8N23j522
1043A979q97q5Q8j010r51l89J6N46J38m96M89J158J91K26Q96J298l33O21J166
1062D651L39m35K81L38j504j020J43j91j527j701j580n54r12j670j719m18M83
1079f996r07r10N72J564q19p79J522K249J110K70J089K345J530l50L51J917J549
1096E307l5j040J538J895r71l149o85J653N18j852j672P14N74j849k428N79J517
1113F14m76j570M84K345Q45k729j363J428K159k85j085J309J876p07l409o13J503
1130C26N16k163j583J156K403j434l438j655J831O70j230j00K251J643j471k521
1146d799N83K785M62k251J62N003K760k770l291J393K675j216k027K556M863K13
$$ plain form
1162 7101 1811 -774 2700 5124 1455 -1762 2331 7529 5355 -348 -713 2603 1190 -4015 -4103 2349
1178 2349 5528 998 -4240 -2313 1471 -1920 -7228 -4601 2847 3125 -2159 -3029 1208 1409 -4295 -7026
1194 -7026 -1413 4892 4164 -728 -1022 2847 1370 -5506 -6188 856 4563 767 -2201 -70 1891 -1811
1210 -1811 -7511 -6528 67 2830 -468 -2613 1100 3248 -2013 -7166 -3385 3724 4606 2132 1852 5473
1226 5473 5728 -176 -4623 -183 6328 5580 622 2614 7596 4596 -4738 -7465 -1018 3487 1031
1241 1031 -1841 1364 5000 -164 -9368 -9174 135 3293 -2448 -3342 3763 6165 -2150 -8569 -4997
1256 -4997 2298 1741 -2428 51 7365 6770 -3815 -8919 -2187 4134 -214 -3796 3061 9343 4055
1271 4055 -5800 -6337 411 2153 -2956 -3210 5684 10511 2490 -6862 -4498 1731 -413 -4870 -241
$$ packed form
1162G101n290k585L474K424l669l217M093N198k174n703l65L316j413n205q8O452
1178B349L179m530n238J927L784l391n308K627P448K78n284q70M237K01n704k731
1194g026N613O305p28m892k94L869j477o876o82P044L707l796k968K131J961l702
1210a811n700R83O595K763l298k145L713K148n261n153L781P109Q82k474k80L621
1226E473K55n904m447M440O511p48m958J992M982l000r334k727O447M505k456
1241A031k872L205L636n164r204J94R309L158n741q94P105K402q315o419L572
1256d997P295n57m169K479P314n95j0585n104O732O321m348l582O857O282n288
1271D055r855n37O748J742n109k54Q894M827q021r352K364O229k144m457M629
$$ plain form
1286 -241 8294 7503 -1689 -6662 -2600 428 -2978 -5883 141 8094 5689 -3176 -5142 -645 -840 -5942
1302 -5942 -4893 2883 7814 4274 -2210 -3246 8 -640 -4912 -3613 4639 8606 4224 -1510 -858
1317 -858 1233 -1774 -5909 -2869 5226 8709 2977 -3292 -1734 1435 -2204 -7548 -2152 7383 7850
1332 7850 -383 -3321 1855 3015 -3791 -7438 621 9291 6381 -1948 -1792 4515 1268 -8523 -8507 2682
1348 2682 7244 -282 -5596 -692 2736 -4195 -12423 -7517 3312 3505 -3773 -3578 3493 3256 -6668
1363 -6668 -9723 -231 7599 3923 -793 3444 7976 3660 -4831 -4445 3897 7180 2239 182 4563
1378 4563 6416 -459 -7100 -4596 1433 2292 -916 -219 4077 3719 -2401 -6502 -3061 2487 2775 506
1394 506 1847 6050 5057 -1011 -4674 -1232 3064 1767 -1013 1489 5556 2658 -5437 -8195 -3269
$$ packed form
1286b41Q535p91r192m973M062L028l406k905O024P953k405q865j966M497j95n102
1302e942J049P776M931l540o484j036L254o48m272J299Q252L967m382n734O52
1317h58K091l007m135L040Q095L483n732o269J558L169l639n344N396R535M67
1332G850q233k938N176J160o806l647Q059Q670k910q329J56O307l247r791J6J1189
1348B682M562p526n314M904L428o931q228M906J0829J93p278J95P071k37r924
1363f668l055R492P830l676m716M237M532m316q491L86Q342L283m941k057M381
1378D563J853o875o641K504O029Q59l208O97M296l58o120m101L441N548K88k269
1394E06J341M203r93o068l663L442M296j297k780K502M067k898q095k758M926
$$ plain form
1409 -3269 341 -2958 -5053 -926 2783 -1885 -8870 -8001 -1791 -768 -4891 -4372 2123 4500 -1610
1424 -1610 -6495 -3086 2318 943 -2705 864 7317 6547 -135 -2020 2866 5282 1706 -448 5011
1439 5011 9510 6399 98 -183 3764 3735 -614 -1087 4456 6798 1531 -3782 -2092 753 -1397 -5182
1455 -5182 -3430 1381 1825 -2829 -5585 -2315 -292 -3411 -6140 -2113 3005 1803 -2754 -2698 708 496
1471 496 -3353 -3876 591 3650 754 -3334 -2053 1026 -1002 -4985 -4487 322 1422 -1869 -2980 -773
1487 -773 505 -2304 -3682 -912 3140 3573 910 1045 4598 5171 2136 1538 4805 6409 4987 3936
1503 3936 4480 4958 3580 487 202 1948 2606 275 -2071 -1433 -743 -2642 -4910 -4185 -2851 -2626 -3608
1520 -3608 -3791 -2357 -1570 -2376 -3615 -2427 780 1059 -323 -56 1789 1805 373 132 1037 1484 603 -353
$$ packed form
1409c269L610l299k095M127L709m668o985Q69O210J023m123N19O495K377o110
1424a610m885L409N404j375l648L569O453p70o682j885M886K416l576k154N459
1439E011M499l111o301k81L947k9m349m73N543K342n267n313J690K845k150l785
1455e182J752M811M44m654k756L270K023l119k729M027N118j202m557N6L406k12
1471D96l849n23M467L059k896m088J281L079k028l983M98M809J100l291j111K207
1487g73J278k809j378K770M052M33k663J35L553N73l035n98L267J604j422j051
1503C936N44M78j378l093k85J746O58k331k346O38O90j899k268P25J334K25r82
1520c608j83J434P87q06j239J188L207K79j382K67J845J6j432k41R05M47q81r56
$$ plain form
1538 -353 -325 620 -369 -2721 -3444 -2098 -1302 -2622 -2710 -1672 -1485 -1991 -1622 -821 167 846 970 1297 2638
1557 2638 3939 3632 2947 3546 4561 4503 4310 4279 3862 3573 3019 2275 1244 1653 1280 -609 -1265 -296 -155
1576 -155 -1926 -3239 -2707 -2198 -2684 -3092 -3142 -2289 -1894 -2897 -3074 -1291 -443 -1861 -2729 -767 557 -360
1594 -360 -1158 -453 536 6 -503 -174 661 765 -507 -992 247 1176 170 -1008 26 972 -327 -603
1612 -603 559 1356 711 312 914 1610 1765 1459 1277 1950 2240 2045 1825 2200 2431 1412 1250 1757 1461
1631 1461 475 166 286 -43 -405 -526 -1401 -1453 -1747 -2087 -2622 -1920 -2234 -2598 -2422 -2158 -2183 -2122 -1572 -1163 -1400
1652 -1400 -1073 -367 -141 306 489 458 222 897 1157 1074 1274 1342 1067 951 1024 1204 822 796 516 457 55 147
1674 147 -22 151 -215 -130 -180 -300 25 -7 -216 -56 303 216 308 699 534 481 571 939 1181 742 370 437 629
$$ packed form
1538c53K8R45r89k352p23J346P96j320q8J038J87n06L69Q01R88O79J24L27J341
1557B638J301l07o85N99J015n8j93l1m17k89n54p44j031M09l73j889o56R69J41
1576a55j771j313N32N09m86m08n0Q53L95j003j77J783Q48j418q68J962J324r17
1594c60p98P05R89n30n09L29Q35J04j272m85J239R29j006j178J034R46j299k76
1612f03J162P97o45l99O02O96J55l06j82O73K90j95k20L75K31j019j62N07k96
1631A461r86l09J20l29l62j21q75n2k94l40n35P02l14l64J76K64k5O1N50M09k37
1652a400L27P06K26M47J83l1k36O75K60q3K00O8k75j16P3J80l82k6k80n9m02R2
1674A47j69J73l66Q5n0j20L25l2k09J60L59q7R2L91j65n3R0L68K42m39l72O7J92
$$ plain form
1697 629 820 15 -378 10 46 -387 -1250 -647 -522 -1161 -1594 -1310 -1108 -833 -1519 -1389 -703 -471 -1162 -1230 9
1718 9 514 319 -185 640 1650 1258 468 540 1297 1156 490 73 1177 1670 344 -775 -261 474 -13 -1162
1738 -1162 -557 397 585 -763 -1233 -251 534 -852 -1404 -336 889 789 -469 -638 295 761 -354 -836
1756 -836 257 1353 243 -955 -342 843 495 -1539 -1163 373 1507 170 -978 -189 856 339
1772 339 -1210 -471 1868 2027 -106 -677 1102 1729 -334 -1621 -185 1874 971 -915 -661 862 566
1789 566 -2026 -2486 74 1610 -352 -2052 -323 1435 -102 -2075 -1417 1301 1969 -306 -1064 1218
1805 1218 2205 -608 -3260 -750 2112 940 -1935 -1464 1302 766 -2508 -3915 -920 1461 -707 -2384
1821 -2384 -81 2820 876 -2693 -1632 2238 3020 619 477 3503 4535 1467 -1086 550 3392
$$ packed form
1697F29J91q05l93L88L6m33q63O03J25o39m33K84K02K75o86J30O86K32o91o8J239
1718IN05j95n04Q25J010l92p90P2P57j41o66m17J104M93j326j119N14P35m87j149
1738a162O05R54J88j348m70R82P85j386n52J068J225j00j258j69R33M66j115m82
1756h36J093J096j110j198O13J185l48k034L76J536J134j337j148P89J045n17
1772C39j549P39K339J59k133n71J779O27k063j287J436K059r03j886K54J523k96
1789E66k592m60K560J536j962j700J729J758j537j973O58K718O68k275p58K282
1805A218R87k813k652K510K862j172k875M71K766n36l274j407K995K381k168j677
1821b384K303K901j944l569J061L870P82k401j42L026J032l068k553J636K842
$$ plain form
1836 3392 2432 -493 -55 3182 3015 -1211 -3469 -1027 756 -1308 -3094 -1133 1535 -109 -3668 -4394
1852 -4394 -1196 -54 -2309 -2773 568 3413 929 -2255 -1662 1129 882 -812 -687 2988 4074 783
1868 783 -2529 -1127 1643 -95 -2915 -1360 2616 2118 -2017 -3576 -1239 134 -2000 -3653 -725
1883 -725 3406 2401 -1580 -1681 2003 2251 -968 -1132 3266 6114 3263 163 1109 3659 2468 -1887
1899 -1887 -1279 3816 5097 979 -2021 129 1696 -1889 -4862 -2350 2320 1711 -2715 -3624 -696 -86
1915 -86 -4331 -5861 -1174 2781 465 -3231 -1723 1717 145 -4054 -3604 1786 3790 462 -1524 806
1931 806 3355 -65 -4067 -1881 3004 2920 -724 -945 2182 2408 -1890 -4403 -1101 3109 2137 -637
1947 -637 -100 3150 2282 -2316 -3349 1319 4308 1918 -134 2105 4734 2339 -2132 -1624 2462 4034
$$ packed form
1836C392r60k925M38L237j67m226k258K442J783k064j786J961K668j644l559p26
1852d394L198J142k255m64L341K845k484l184N93K791k47j694J25L675J086l291
1868G83l312J402K770j738k820J555L976m98m135j559K337J373k134j653K928
1883g25M131j005l981j01L684K48l219j64M398K848k851l100R46K550j191m355
1899a887O08N095J281m118l000K150J567l585k973K512M670o09m426r09K928O10
1915h6m245j530M687L955k316l696J508L440j572m199M50N390K004l328j986K330
1931H06K549l420m002K186M885q4l644k21L127K26m298k513L302M210r72k774
1947f37N37L250q68m598j033M668K989k390k052K239K629k395m471N08M086J572
$$ plain form
1963 4034 816 -431 2176 3343 -653 -4374 -2974 869 217 -2823 -2554 618 580 -4005 -6544 -3626
1979 -3626 -138 -1743 -4075 -1945 2392 990 -3703 -4753 80 1949 -442 -1557 2109 5710 2321
1994 2321 -2192 -1216 3107 2804 -519 -87 4162 4794 90 -2912 -723 2388 163 -2805 -577 3431
2010 3431 2635 -1930 -3173 291 1423 -1286 -2363 1508 4388 2074 -1344 -813 2340 1799 -1515 -838
2026 -838 2754 3846 708 -1892 -761 958 -792 -3369 -2107 915 1160 -2215 -3750 -1732 -575
2041 -575 -2895 -4143 -2037 1057 544 -2288 -1962 288 550 -1398 -1826 1194 3847 1919 -271 569
2057 569 2850 1946 -952 -729 2103 3339 1023 -764 530 1970 -390 -2376 -1138 2176 2273 -887
2073 -887 -943 1198 1754 -746 -2033 419 2479 1518 -398 -4 2230 1716 -1486 -1781 998 2173 246
$$ packed form
1963D034l218j247K607J167l996l721J400L843o52l040K69L172l8m585k539K918
1979c626L488j605k332K130M337j402m693j050M833J869k391j115L666L601l389
1994B321m513R76M323l03l323M32M249O32m704l002K189L111k225k968K228M008
2010C431p96m565j243L464J132k709j077L871K880k314l418N31L153n41l314O77
2026h38L592J092l138k600J131J719j750k577J262L022K45l375j535K018J157
2041e75k320j248K106L094n13k832L26K250K62j948m28L020K653j928k190Q40
2057E69K281r04k898K23K832J236k316j787J294J440k360j986J238L314R7l160
2073h87n6K141N56k500j287K452K060r61j916L94K234n14l202k95K779J175j927
$$ plain form
2090 246 -1466 -185 1152 -526 -2895 -2253 158 98 -1925 -2506 -118 509 -1731 -3132 -1818 649
2106 649 -46 -1572 -998 716 493 -1112 -1618 33 1186 227 -814 224 1935 1031 -702 -305 1375
2123 1375 1646 517 167 1515 2581 1256 -410 340 1969 1664 410 196 1555 1284 -202 -1024 108
2140 108 470 -355 -1265 -672 424 -148 -1119 -1668 -542 -220 -1133 -1348 -39 524 -268 -1222 -690 -162 -81
2159 -81 -493 -734 -37 606 -323 -1216 -539 381 -228 -1128 -917 375 110 -622 -662 -106 399 145 -384 24
2179 24 875 695 144 249 1186 1065 611 536 999 1107 949 599 689 905 664 529 -306 334 355 -95 -729
2200 -729 -300 -207 -285 -583 -532 -335 -31 -461 -726 -627 -83 -146 -619 -427 413 103 -318 -170 218 106 -19 11
2222 11 61 23 200 -197 -732 238 78 -637 -663 -90 -183 -249 -471 -48 110 262 -454 -44 369 344 -205 294
$$ packed form
2090B46j712J281J337j678k369O42K411o0k023n81K388O27k240j401J314K467
2106F49o95j526N74J714k23j605n06J651J153r59j041J038J711r04j733L97J680
2123A375K71j129l50J348J066j325j666P50J629l05j254k14J359k71j486q22J132
2140A08L62q25r10N93J096n72r71n49J126L22r13k15J309N63p92r54N32N28Q1
2159h1m12k41O97O43r29q93O77R20o09r00K11J292k65p32m0N56N05k54n29M08
2179B4Q51j80n51J05R37j21m54p5M63J08j58l50R0K16k41j35q35O40K1m50o34
2200g29M29R3p8k98N1J97L04m30k65R9N44o3m73J92Q40l10m21J48L88j12j25L0
2222A1N0l8J77l97n35R70j60p15k6N73r3o6k22M23J58J52p16M10M13k5n49M99
$$ plain form
2244 294 684 629 519 -38 628 769 410 144 327 548 111 -193 269 226 -21 39 -407 97 19 9 -389 -276
2266 -276 -213 -558 -388 -269 1 -178 -443 -189 -214 -253 -114 -295 -74 -314 -117 -248 243 194 -117 -205 -3 -108
2288 -108 95 -47 35 202 97 350 150 213 304 304 342 260 263 101 299 84 -36 256 95 -41 -424 15 -238
2311 -238 -144 -523 -341 -150 -91 -239 -120 -36 -90 -60 -194 113 210 286 205 165 480 484 -196 66 283 186 -100 -239
2335 -239 20 186 20 -232 -65 99 -115 -679 -559 -75 196 -13 -278 74 307 370 -181 252 786 340
2355 340 230 380 651 644 277 -152 33 282 219 -588 -71 190 -134 -761 -978 -297 -27 -828 -920 -393 -242
2376 -242 -518 -935 -395 445 210 -399 -164 481 644 -256 29 377 743 546 -88 108 791 883 -22 -785
2396 -785 374 530 118 -494 216 699 300 -423 -511 563 49 -340 -378 151 871 220 -540 -157 754 70
$$ packed form
2244B94L90n5j10n57O66J41l59k66J83K21m37l04M62m3k47O0m46N04p8j0l98J13
2266b76O3l45J70J19K70j79k65K54k5l9J39j81K21k40J97j31M91m9l11q8K02j05
2288a08K03j42Q2J67j05K53k00O3R1%L8q2Lj62J98k15j20K92j61j36l83M39k53
2311b38R4l79J82J91N9j48J19Q4n4L0j34L07R7P6q1m0L15Mo80K62K17r7k86j39
2335b39K59J66j66k52J67J64k14n64J20M84K71k09k65L52K33O3n51M33N34m46
2355C40j10J50K71pl67m29J85K49o3q07N17K61l24o27k17O81K70q01r2N27J51
2376b42k76m17N40Q40k35o09K35O45J63r00K85L48L66j97o34J96O83R2r05p63
2396g85J159J56m12o12P10M83l99p23q8J074n14l89l8N29P20o51p60L83R11o84
$$ plain form
2416 70 -139 -128 730 475 -363 -757 137 271 192 -613 -239 620 37 -737 -1030 7 120 -913 -1000 211
2436 211 367 -352 -1011 -685 -17 -388 -1126 -821 293 1125 -366 -797 -2 979 233 -396 520 1549 1472
2455 1472 456 -158 1087 1455 312 -243 1241 2209 914 -234 115 946 227 -909 -1059 526 1075
2472 1075 -254 -1248 -391 240 -549 -1796 -969 417 575 -529 -771 28 446 -430 -1242 178 1091 912
2490 912 40 -264 392 310 -1136 -1114 22 745 -63 -772 -329 126 -618 -1748 -1170 -80 617 -374 -723
2509 -723 614 1281 -169 -921 244 1381 1670 857 640 1807 1622 547 -467 471 1722 1023 16
2526 16 218 1415 533 -1081 -1431 -628 158 -622 -1380 -169 585 -171 -1638 -1707 129 375 -601 -964 690
2545 690 1234 -135 -1354 -342 800 410 -615 124 1543 1220 -540 -1667 -270 558 -605 -1366 18
$$ packed form
2416G0k09J1Q58k55q38l94Q94J34p9q05L74Q59n83p74k93J037J13j033q7J211
2436B11J56p19o59L26O68l71p38L05J114Q32j491m31P95R81p46o29R16J029p7
2455A472j016o14J245L68j143n55J484R68j295j148L49Q31p19j136j50J585N49
2472A075j329r94Q57O31p89j247Q27J386J58j104k42P99M18q76q12J420R13j79
2490I12q72l04O56q2j446K2J136P23q08p09M43M55p44j130N78J090O97r91l49
2509g23J337O67j450p52J165J137K89q13k17J167j85j075j014R38J251o99j007
2526A6K02J197q82j614l50Q03P86p80p58J211P54p56j467o9J836K46r76l63J654
2545F90N44j369j219J012J142l90j025P39J419l23j760j127J397Q28j163p61J384
$$ plain form
2562 18 1165 116 -1345 -1597 -62 -50 -1104 -974 696 1666 82 -987 -53 933 641 -391 270 2061
2580 2061 1906 244 -301 489 1069 265 -336 347 1577 1034 -566 -802 -23 -61 -839 -1338 225 654 -247
2599 -247 -1240 -1071 -13 -320 -1356 -1061 466 960 -179 -969 -394 119 -488 -1362 -311 1032 1049 53
2617 53 -663 349 665 -410 -1039 222 1164 635 -259 -128 384 257 -994 -1071 405 1224 413 -589 76
$$ packed form
2562A8J147j049j461k52J535J2j054J30J670R70j584j069R34R86k92j032O61J791
2580B061j55j662n45P90N80q04o01O83J230n43j600k36P79l8p78m99J563M29r01
2599b47r93J69J058l07j036K95J527M94j139p90N75N13o07q74J051J343J7r96
2617E3p16J012L16j075o29J261R42n29q94J31N12j27j251p7J476Q19q11j002O65
$$ [...]
8191b4
##END NTUPLES=NMR FID
##END=
