##TITLE=1H ikalashn
H2O(nlock)
25.10.2024
##JCAMPDX= 6.0         $$ Bruker NMR JCAMP-DX V2.0
##DATA TYPE= NMR FID
##DATA CLASS= NTUPLES
##ORIGIN= UXNMR, Bruker Analytische Messtechnik GmbH
##OWNER= root
$$ TOPSPIN		Version 1.3
$$ 2024-10-25 16:05:55.125 +0400  Irina@DPX200
$$ Compression mode = diff/dup
##.OBSERVE FREQUENCY= 200.131300845
##.OBSERVE NUCLEUS= ^1H
##.DELAY= (6, 6)
##.ACQUISITION MODE= SIMULTANEOUS
##.ACQUISITION SCHEME= undefined
##.AVERAGES= 16
##.DIGITISER RES= 18
##SPECTROMETER/DATA SYSTEM= spect
##.PULSE SEQUENCE= zg
##.SOLVENT NAME= DMSO
##.SHIFT REFERENCE= INTERNAL, DMSO, 1, 17.49637
##AUDIT TRAIL= $$ (NUMBER, WHEN, WHO, WHERE, WHAT)
$$ ##TITLE= Audit trail, TOPSPIN		Version 1.3
$$ ##JCAMPDX= 5.01
$$ ##ORIGIN= Bruker BioSpin GmbH
$$ ##OWNER= Irina
$$ $$ F:/spectra/data/iren/nmr/1H/4/audita.txt
$$ ##AUDIT TRAIL=  $$ (NUMBER, WHEN, WHO, WHERE, VERSION, WHAT)
(   1,<2024-10-25 16:04:30.421 +0400>,<Irina>,<DPX200>,<TOPSPIN 1.3>,
      <created by zg
	started at 2024-10-25 16:03:22.453 +0400,
	POWCHK disabled, PULCHK disabled
       configuration hash MD5:
       BE 6D 3F 07 2A EA 11 49 91 17 2B D3 AF B3 58 0D
       data hash MD5: 16K
       F4 B3 15 0E 58 26 B6 17 16 53 6F B1 1E 9A F9 7C>)
$$ ##END=
$$ 
$$ $$ hash MD5
$$ $$ 34 B0 6C ED 7A 1A F9 EE E3 FC D4 BF C8 41 2F B0
##$RELAX= 
##$RELAX= 
##$RELAX= 
##$RELAX= 
##$RELAX= 
##$RELAX= 
##$RELAX= 
##$RELAX= 
##$RELAX= 
$$ Bruker specific parameters
$$ --------------------------
##$DU= <F:/spectra>
##$EXPNO= 4
##$NAME= <1H>
##$PROCNO= 1
##$TYPE= <nmr>
##$USER= <iren>
##$AMP= (0..31)
100 100 100 100 100 100 100 100 100 100 100 100 100 100 100 100 100 100 
100 100 100 100 100 100 100 100 100 100 100 100 100 100 
##$ANAVPT= -1
##$AQSEQ= 0
##$AQ_mod= 1
##$AUNM= <au_zg>
##$AUTOPOS= <>
##$BF1= 200.13
##$BF2= 200.13
##$BF3= 200.13
##$BF4= 200.13
##$BF5= 200.13
##$BF6= 200.13
##$BF7= 200.13
##$BF8= 200.13
##$BYTORDA= 1
##$CFDGTYP= 0
##$CFRGTYP= 5
##$CHEMSTR= <none>
##$CNST= (0..63)
1 1 145 1 1 1 1 1 1 1 1 1 1 1 1 1 1 1 1 1 1 1 1 1 1 1 1 1 1 1 1 1 1 1 
1 1 1 1 1 1 1 1 1 1 1 1 1 1 1 1 1 1 1 1 1 1 1 1 1 1 1 1 1 1 
##$CPDPRG= <>
##$CPDPRG1= <>
##$CPDPRG2= <>
##$CPDPRG3= <>
##$CPDPRG4= <mlev>
##$CPDPRG5= <mlev>
##$CPDPRG6= <mlev>
##$CPDPRG7= <mlev>
##$CPDPRG8= <mlev>
##$CPDPRGB= <>
##$CPDPRGT= <>
##$D= (0..63)
0 2 0 0 0 0 0 0 0 0.06 0 0.03 0 0 0 0 0.0002 0 0 0 0 0 0 0 0 0 0 0 0 0 
0 0 0 0 0 0 0 0 0 0 0 0 0 0 0 0 0 0 0 0 0 0 0 0 0 0 0 0 0 0 0 0 0 0 
##$DATE= 1729857867
##$DBL= (0..7)
120 120 120 120 120 120 120 120 
##$DBP= (0..7)
150 150 150 150 150 150 150 150 
##$DBP07= 0
##$DBPNAM0= <>
##$DBPNAM1= <>
##$DBPNAM2= <>
##$DBPNAM3= <>
##$DBPNAM4= <>
##$DBPNAM5= <>
##$DBPNAM6= <>
##$DBPNAM7= <>
##$DBPOAL= (0..7)
0.5 0.5 0.5 0.5 0.5 0.5 0.5 0.5 
##$DBPOFFS= (0..7)
0 0 0 0 0 0 0 0 
##$DE= 6
##$DECBNUC= <off>
##$DECIM= 32
##$DECNUC= <off>
##$DECSTAT= 4
##$DIGMOD= 1
##$DIGTYP= 9
##$DL= (0..7)
0 120 120 120 120 120 120 120 
##$DP= (0..7)
150 150 150 150 150 150 150 150 
##$DP07= 0
##$DPNAME0= <>
$$ [...]
##$SW= 21.9926040160658
##$SWIBOX= (0..15)
0 0 2 0 0 0 0 0 0 0 0 0 0 0 0 0 
##$SW_h= 4401.40845070422
##$TD= 16384
##$TD0= 1
##$TE= 300
##$TE2= 300
##$TE3= 300
##$TEG= 300
##$TL= (0..7)
0 120 120 120 120 120 120 120 
##$TP= (0..7)
150 150 150 150 150 150 150 150 
##$TP07= 0
##$TPNAME0= <>
##$TPNAME1= <>
##$TPNAME2= <>
##$TPNAME3= <>
##$TPNAME4= <>
##$TPNAME5= <>
##$TPNAME6= <>
##$TPNAME7= <>
##$TPOAL= (0..7)
0.5 0.5 0.5 0.5 0.5 0.5 0.5 0.5 
##$TPOFFS= (0..7)
0 0 0 0 0 0 0 0 
##$TUNHIN= 0
##$TUNHOUT= 0
##$TUNXOUT= 0
##$USERA1= <user>
##$USERA2= <user>
##$USERA3= <user>
##$USERA4= <user>
##$USERA5= <user>
##$V9= 5
##$VALIST= <valist>
##$VCLIST= <CCCCCCCCCCCCCCC>
##$VD= 0
##$VDLIST= <DDDDDDDDDDDDDDD>
##$VPLIST= <PPPPPPPPPPPPPPP>
##$VTLIST= <TTTTTTTTTTTTTTT>
##$WBST= 1024
##$WBSW= 25
##$XGAIN= (0..3)
0 0 0 0 
##$XL= 0
##$YL= 0
##$YMAX_a= 1278065
##$YMIN_a= -1345151
##$ZGOPTNS= <>
##$ZL1= 120
##$ZL2= 120
##$ZL3= 120
##$ZL4= 120
##$ABSF1= 10
##$ABSF2= 0
##$ABSG= 5
##$ABSL= 3
##$ALPHA= 0
##$AQORDER= 0
##$ASSFAC= 0
##$ASSFACI= 0
##$ASSFACX= 0
##$ASSWID= 0
##$AUNMP= <proc_1d>
##$AXLEFT= 0
##$AXRIGHT= 0
##$AXTYPE= 0
##$AXUNIT= <>
##$AZFE= 0.1
##$AZFW= 0.1
##$BCFW= 1
##$BC_mod= 2
##$BYTORDP= 1
##$COROFFS= 0
##$CY= 7568.61572265625
##$DATMOD= 1
##$DC= 2
##$DFILT= <>
##$DTYPP= 0
##$F1P= 17.9538593292236
##$F2P= -4.03888763876832
##$FCOR= 0.5
##$FTSIZE= 32768
##$FT_mod= 4
##$GAMMA= 1
##$GB= 1
##$INTBC= 1
##$INTSCL= 1
##$ISEN= 128
##$LB= -0.5
##$LEV0= 0
##$LPBIN= 0
##$MAXI= 945.577
##$MC2= 0
##$MEAN= 0
##$ME_mod= 0
##$MI= -402.1523
##$NCOEF= 0
##$NC_proc= 0
##$NLEV= 6
##$NOISF1= 8.587773
##$NOISF2= 6.764455
##$NSP= 1
##$NTH_PI= 0
##$NZP= 0
##$OFFSET= 17.49637
##$PC= 1
##$PHC0= 9.804742
##$PHC1= 39.71371
##$PH_mod= 0
##$PKNL= yes
##$PPARMOD= 0
##$PPDIAG= 0
##$PPIPTYP= 0
##$PPMPNUM= 100
##$PPRESOL= 1
##$PSCAL= 0
##$PSIGN= 0
##$REVERSE= no
##$SF= 200.13
##$SI= 32768
##$SIGF1= 18.5376
##$SIGF2= -6.396296
##$SINO= 400
##$SIOLD= 32768
##$SREGLST= <1H.CDCl3>
##$SSB= 3
##$STSI= 0
##$STSR= 0
##$SW_p= 4401.40845070422
##$SYMM= 0
##$S_DEV= 0
##$TDeff= 0
##$TDoff= 0
##$TI= <>
##$TILT= no
##$TM1= 0
##$TM2= 0
##$TOPLEV= 0
##$USERP1= <user>
##$USERP2= <user>
##$USERP3= <user>
##$USERP4= <user>
##$USERP5= <user>
##$WDW= 1
##$XDIM= 8192
##$YMAX_p= 0
##$YMIN_p= 0
$$ End of Bruker specific parameters
$$ ---------------------------------
##NTUPLES= NMR FID
##VAR_NAME=  TIME,          FID/REAL,        FID/IMAG
##SYMBOL=    X,             R,               I
##VAR_TYPE=  INDEPENDENT,   DEPENDENT,       DEPENDENT
##VAR_FORM=  AFFN,          ASDF,            ASDF
##VAR_DIM=   8192,          8192,            8192
##UNITS=     SECONDS,       ARBITRARY UNITS, ARBITRARY UNITS
##FACTOR=    0.0002272,     1,               1
##FIRST=     0,             0,               0
##LAST=      1.8609952,     -134,            162
##MIN=       0,             -1345151,        -1345151
##MAX=       1.8609952,     1278065,         1278065
$$ Real data points
##PAGE= N=1
##DATA TABLE= (X++(R..R)), XYDATA
$$ [...]
60 11166 -12692 14570 -16967 20131 -24507 31007 -41664 62201 -116296 560921 1278065
71 1278065 -212584 -1141475 -719333 469686 921972 500310 -433542 -968583 -510603 721348
81 721348 1175059 124924 -1174876 -918764 474122 1159232 392422 -652116 -862075
90 -862075 -213965 595764 869321 184687 -856953 -953942 223165 1173800 594930 -720530
100 -720530 -1021239 -91757 780273 694512 -40551 -690616 -681708 93321 905947 673093
110 673093 -493056 -1087674 -255028 874766 821394 -194511 -820887 -483032 264382 698123
120 698123 461832 -317692 -864154 -385286 681494 924999 -54331 -937757 -578196 424890
130 424890 783113 255187 -427529 -638587 -237596 473614 756856 113438 -784117 -712632
140 -712632 315000 915392 318506 -590919 -680321 -30776 528830 523295 23540 -557863
150 -557863 -594774 124338 799269 469882 -509087 -815862 -65666 682420 526876 -168663
160 -168663 -562822 -370661 157578 572140 405402 -310008 -742768 -224545 633074 660591
170 660591 -162683 -702577 -340102 328540 532616 201429 -290302 -527793 -214118 437378
180 437378 634905 -3834 -690958 -469164 354138 658286 137785 -439547 -447692 -32578
190 -32578 369530 436098 35736 -502656 -487376 198070 679892 260824 -489397 -557708 53311
201 53311 492759 328240 -114818 -398690 -316671 117483 512167 317629 -347609 -609236
211 -609236 -55297 563203 416733 -217241 -490883 -189481 230887 381782 183418 -235104
221 -235104 -471961 -143669 445308 493363 -130632 -577839 -251387 344514 439121 43856
231 43856 -307220 -323041 -51242 308000 392288 -15912 -488486 -349427 281891 538701
241 538701 80082 -425989 -347949 91527 340527 236480 -65861 -338308 -287693 151240
251 151240 482019 191389 -390584 -453607 82022 457814 229805 -203713 -332738 -134459
261 -134459 159566 329093 169233 -253312 -430152 -34797 449198 334770 -218711 -441625
271 -441625 -100385 284174 290191 28811 -223865 -285414 -50075 315420 343651 -104464 -458647
282 -458647 -198763 320732 385685 -27568 -329643 -219822 70385 254718 215809 -56684
292 -56684 -337117 -236848 216374 426102 58953 -384869 -298028 144721 337780 128834
302 128834 -152323 -250281 -131427 140048 322121 123587 -294158 -359628 71946 408550
312 408550 189303 -239677 -310236 -29784 209320 216643 43703 -196248 -277097 -13588 335123
323 335123 267256 -182997 -391583 -71452 303540 252775 -64941 -237804 -161525 38003
333 38003 223924 210100 -83698 -339468 -159967 265947 339418 -43792 -333000 -172953
343 -172953 146623 236325 92148 -104420 -222287 -131807 158747 312274 51170 -316980
353 -316980 -261765 146673 329117 79589 -208371 -206609 -17375 148887 195368 52843 -207325
364 -207325 -260832 49421 335266 167353 -228679 -293614 16854 243654 154507 -52172
374 -52172 -169275 -150831 19279 229603 192012 -134558 -321076 -65464 282241 231596 -104596
385 -104596 -250079 -89240 108772 167781 96052 -79558 -226673 -113045 197628 277970
395 277970 -32864 -303781 -152173 174922 230233 19417 -148317 -147074 -37363 123174
405 123174 201377 33260 -234702 -213790 118590 295319 64532 -223573 -187997 48735
415 48735 167665 110025 -17798 -146301 -159729 38269 246005 138004 -185525 -261295 22924
426 22924 248084 128733 -108409 -165706 -62315 63283 149169 108358 -95772 -233334 -58429
437 -58429 228955 206477 -101239 -246982 -60472 152890 145258 11391 -95954 -134969 -52806
448 -52806 136231 199811 -17492 -246125 -137609 162736 222271 -8479 -178691 -110513 36956
459 36956 113913 107025 -625 -157196 -151276 82499 238825 63316 -203940 -178980 72387
470 72387 185261 65093 -78100 -115150 -69642 45065 158885 96161 -131425 -211991 9027
481 9027 224467 122635 -126744 -172843 -13343 107373 100302 29127 -76104 -144597 -41140
492 -41140 162599 170552 -73785 -224101 -58758 166421 143183 -37930 -121616 -73595 8971
503 8971 93329 118536 -9637 -175529 -118710 125823 203590 -5831 -187476 -100835 82202
514 82202 120974 40352 -41005 -97577 -84428 52542 170883 61969 -161364 -166452 64838
525 64838 189422 51011 -115629 -106406 -4368 63809 89607 47405 -83849 -151787 -6656
536 -6656 179618 118283 -114064 -174039 1794 135914 79624 -30060 -74716 -71911 -12563
547 -12563 102219 122651 -42585 -181285 -64001 150184 143394 -52339 -140966 -44332 58357
558 58357 74008 48561 -17112 -108262 -86729 82509 166881 8741 -169537 -101218 94391
569 94391 131053 6447 -77565 -64145 -22908 40421 102972 47322 -109995 -138573 41680
580 41680 171210 53292 -123877 -108907 29625 86902 47308 -2288 -55461 -87911 -9173
591 -9173 123702 101254 -82841 -157580 -4601 140115 77595 -61318 -85794 -24889 23735
602 23735 60698 66621 -23226 -124634 -60371 112659 132176 -40864 -143092 -40145 86065
613 86065 74500 -49 -38762 -56936 -42567 47727 114672 19705 -129679 -97891 79149 132967
625 132967 975 -100954 -55253 23745 46766 46616 18278 -63633 -95568 17633 133131
636 133131 58317 -106692 -111347 35574 104950 30940 -43504 -47642 -31625 3702 70395 70488
648 70488 -48184 -124533 -17981 122527 81669 -66864 -98829 -3669 57621 41045 14167
659 14167 -20336 -68539 -43604 70091 107074 -19570 -127155 -46927 91153 83206 -24249
670 -24249 -64166 -27743 2574 30037 60405 18110 -83208 -83289 52125 121075 9962 -106159
682 -106159 -59511 49306 62251 10654 -16054 -33449 -48107 4596 87602 55234 -77074
693 -77074 -104741 25330 110160 31068 -68026 -53084 7057 25502 31845 33074 -23327 -83361
705 -83361 -25500 92349 80406 -55270 -103429 -1309 78854 38208 -23284 -30012 -25959 -17622
717 -17622 36509 72635 -2546 -98295 -51445 78379 87902 -27564 -81570 -18681 36556 28631
729 28631 16971 4407 -43556 -57968 26538 95979 21066 -93405 -65662 52976 76222 -2981
741 -2981 -45188 -22337 -6780 5953 45170 40666 -45222 -85704 8346 98852 38936 -71766
753 -71766 -63539 23426 48191 13154 -2947 -13468 -42097 -22083 57430 68838 -33972 -94800
765 -94800 -10885 82554 45660 -40691 -45957 -2160 11431 17377 35053 4801 -62538 -48385
777 -48385 53572 83328 -15512 -85678 -24684 54015 38978 -9864 -17340 -17077 -25789 9228 61622
790 61622 27079 -66744 -66460 38828 81693 2028 -62291 -27225 21461 19316 13418 16547 -19334
803 -19334 -56263 -6721 73537 46040 -57532 -71192 20197 64716 12371 -30864 -17654 -7646
815 -7646 -7935 25409 47069 -11306 -73384 -23876 69701 55367 -39198 -61055 3365 36905 13268
828 13268 1088 580 -27667 -35227 25784 67165 2111 -74925 -35969 53830 51984 -18773 -38864
841 -38864 -6165 5171 4107 26723 23200 -36034 -56972 17586 74318 14910 -63815 -38396
853 -38396 33067 36389 -3226 -9834 -5527 -23656 -12301 42147 44254 -34098 -68255 6208 68152
866 68152 21580 -44154 -29596 12794 12105 4921 19506 2594 -44262 -29453 46319 56929 -25307
879 -25307 -65958 -3473 50432 19784 -20779 -12121 -3097 -14498 5664 42390 14020 -53239
891 -53239 -41761 40538 58131 -13767 -51703 -8169 26675 10086 282 9487 -11538 -37401
903 -37401 287 55094 24878 -51193 -46091 29089 48437 -4413 -30008 -5698 2982 -5640 14964
916 14964 30812 -12443 -52866 -7790 57268 31122 -41524 -40973 16952 30271 -442 -5829 3275
929 3275 -16244 -23301 21882 46919 -8158 -58161 -14587 49688 30185 -27576 -27455 7015 7897
942 7897 -1807 15692 15195 -27988 -37753 21489 53951 -1536 -52822 -17526 35251 22201 -13170
955 -13170 -8973 1383 -13579 -7518 30668 26892 -31358 -45965 16098 51617 4076 -39914 -14757
968 -14757 18829 8445 -2393 11023 1463 -30733 -15958 37970 35708 -28480 -46767 9578
980 9578 41522 5381 -23335 -5748 4389 -8965 2931 29107 5744 -41421 -23896 38119
992 38119 38651 -22148 -39586 4886 25823 1556 -6413 7390 -5918 -25781 3474 41349 11411
1005 11411 -43892 -27894 32148 34277 -14513 -25827 3293 7946 -6143 7682 21150 -11048
1017 -11048 -38109 653 45680 15741 -38956 -26292 22903 23446 -8545 -8669 5750 -8385 -16260
1030 -16260 16754 32874 -11464 -44219 -3057 42774 16275 -29663 -18563 13999 8023 -6349
1042 -6349 8710 11787 -20783 -26326 20700 39891 -9324 -43182 -4855 34009 11592 -18632
1054 -18632 -5834 7320 -8918 -7544 23048 18689 -27570 -32789 20104 39973 -6397 -35151
1066 -35151 -3651 21492 2863 -7999 8600 3544 -23143 -10528 31365 23747 -28144 -33652
1078 -33652 16251 33235 -4250 -22499 655 8474 -8070 -247 21668 2895 -32395 -13945
1090 -13945 33383 25365 -24367 -28891 11914 21793 -4791 -8602 7985 -2172 -19406 3743 31421
1103 31421 4299 -36052 -15819 30529 22462 -18907 -19280 9358 8092 -8438 3932 16731 -9137
1116 -9137 -28588 4679 35992 5792 -34045 -14490 24283 15113 -13440 -6789 8880 -5139
1128 -5139 -13538 13085 24089 -12171 -33161 3702 34603 6012 -27416 -9902 16566 4997
1140 4997 -9233 5748 10251 -15324 -18587 17795 28323 -11998 -32660 2467 28541 3878
1152 3878 -18742 -2349 9722 -6320 -7374 16564 12938 -21854 -22261 19098 28739 -10752 -27710
1165 -27710 2946 19783 -1365 -10104 7391 4952 -17176 -7395 24471 15375 -24701 -22978 18237
1178 18237 24792 -9816 -19239 5593 9874 -8554 -2653 16923 2099 -25187 -7958 27987 15827
1191 15827 -23734 -19889 15661 17040 -9437 -8866 9417 554 -15664 2686 23988 786 -28813
1204 -28813 -8048 27040 13691 -20080 -13479 12800 7171 -10154 1308 13956 -6626 -21531
1216 -21531 5770 27735 201 -28340 -6619 23126 8704 -15594 -4594 10931 -3242 -12135
1228 -12135 9980 18302 -11463 -24995 7353 27672 -881 -24402 -2964 17442 1272 -11309
1240 -11309 5243 10081 -12495 -14257 15991 20768 -13808 -24924 7944 23724 -2788 -17853
1252 -17853 2186 11050 -6830 -7737 13803 9777 -18654 -15417 18456 20501 -13701 -21264 7948
1265 7948 16951 -5384 -10241 7955 5422 -14041 -5339 19756 9690 -21358 -15044 18151 17462
1278 17462 -12507 -14947 8555 8967 -9077 -3218 13898 1267 -19778 -3927 22944 9005 -21399
1291 -21399 -12543 16470 11859 -11641 -7018 10322 1033 -13432 2476 18902 -1540 -23031 -2709
1304 -2709 23100 6940 -19197 -7908 14029 4577 -11141 1068 12402 -5585 -16909 6295
1316 6295 21474 -3196 -22966 -1209 20345 3513 -15392 -1862 11393 -2934 -10975 7906
1328 7906 14195 -10061 -18695 8303 21305 -4237 -20112 1042 15868 -1137 -11291 4792
1340 4792 9374 -9772 -11139 13037 15155 -12715 -18446 9432 18605 -5781 -15367 4567 10711
1353 10711 -6857 -7603 11376 7856 -15297 -10954 16262 14479 -13997 -15759 10276 13633 -7994
1366 -7994 -9362 8814 5478 -12396 -4342 16488 6333 -18453 -9687 17210 11839 -13808 -10966
1379 -10966 10725 7389 -10153 -3236 12553 979 -16338 -1742 19058 4647 -18871 -7283
1391 -7283 16094 7567 -12668 -4957 10960 942 -12119 2107 15344 -2499 -18412 399
1403 399 19238 2396 -17331 -3625 13968 2084 -11433 1479 11358 -5000 -13736 6451 16815
1416 16815 -5255 -18424 2617 17412 -718 -14410 1163 11315 -3946 -10150 7512 11485
1428 11485 -9720 -14224 9449 16330 -7225 -16191 4857 13798 -4237 -10533 6069 8475 -9249
1441 -9249 -8764 11945 10964 -12491 -13279 10814 13970 -8292 -12317 6885 9254 -7650 -6605 10286
1455 10286 5930 -13145 -7369 14464 9682 -13532 -10993 11183 10172 -9210 -7511 9058 4571
1468 4571 -10990 -3059 13781 3677 -15650 -5675 15488 7368 -13552 -7299 11284 5249 -10319
1481 -10319 -2281 11420 160 -13824 47 16013 1470 -16471 -3314 15051 3963 -12695
1493 -12695 -2602 11076 -45 -11250 2520 13086 -3445 -15255 2520 16256 -678 -15381
1505 -15381 -474 13202 -100 -11125 2278 10506 -4823 -11652 6314 13652 -6001 -15025 4403
1518 4403 14743 -2944 -12938 2809 10668 -4410 -9392 6851 9815 -8763 -11446 9089 13016
1531 13016 -7889 -13255 6318 11875 -5635 -9610 6598 7849 -8694 -7540 10811 8678 -11641
1544 -11641 -10154 10935 10845 -9396 -9952 8275 7905 -8528 -5830 10126 4900 -12127 -5465 13331
1558 13331 6822 -13050 -7782 11634 7427 -10186 -5736 9765 3610 -10767 -2284 12496 2270
1571 2270 -13892 -3345 14006 4461 -12872 -4608 11283 3391 -10367 -1384 10754 -259 -12123
1584 -12123 809 13611 -84 -14083 -1041 13343 1537 -11797 -768 10559 -939 -10371
1596 -10371 2766 11329 -3699 -12675 3448 13450 -2448 -13069 1705 11704 -1991 -10207 3332
1609 3332 9529 -5095 -9969 6323 11107 -6432 -12007 5617 11935 -4715 -10842 4507 9284
1622 9284 -5397 -8237 6911 8183 -8255 -9015 8691 9936 -8137 -10180 7132 9397 -6575
1635 -6575 -7948 6991 6643 -8203 -6161 9556 6644 -10248 -7476 9986 7953 -9091 -7493 8329
1649 8329 6242 -8294 -4803 9190 3980 -10438 -4035 11354 4712 -11389 -5260 10670 5106
1662 5106 -9778 -4069 9399 2667 -9881 -1561 10920 1242 -11895 -1670 12157 2233 -11631
1675 -11631 -2346 10669 1627 -9999 -341 10024 -887 -10752 1488 11649 -1300 -12061 747
1688 747 11716 -402 -10803 811 9908 -1835 -9567 3063 9959 -3852 -10697 3951 11239
1701 11239 -3450 -11074 3021 10305 -3071 -9296 3875 8682 -5008 -8721 5950 9279 -6265
1714 -6265 -9804 5954 9804 -5475 -9216 5328 8171 -5828 -7324 6799 7051 -7803 -7342 8306
1728 8306 7817 -8175 -7958 7650 7499 -7343 -6542 7517 5566 -8232 -5001 9152 5074 -9729
1742 -9729 -5398 9736 5676 -9249 -5412 8732 4608 -8604 -3592 9032 2875 -9751 -2697
1755 -2697 10384 2954 -10464 -3236 10071 3182 -9465 -2543 9090 1614 -9273 -815 9798
1768 9798 409 -10384 -524 10614 778 -10339 -857 9725 395 -9221 429 9094 -1324 -9474
1782 -9474 1874 9962 -1969 -10248 1752 10093 -1614 -9500 1885 8888 -2564 -8557 3412
1795 3412 8668 -4046 -9012 4294 9338 -4107 -9240 3897 8777 -3962 -8054 4424 7558
1808 7558 -5145 -7459 5823 7694 -6100 -7927 5996 7943 -5730 -7540 5617 6888 -5894
1821 -5894 -6283 6459 5979 -7076 -6041 7464 6247 -7427 -6305 7171 6016 -6988 -5386 7056
1835 7056 4720 -7485 -4282 8037 4171 -8454 -4274 8551 4344 -8321 -4103 8062 3562
1848 3562 -7989 -2855 8269 2295 -8680 -2007 9091 2020 -9192 -2059 9022 1924 -8703
1861 -8703 -1465 8480 814 -8522 -202 8806 -161 -9101 247 9216 -218 -9086 260 8716 -582
1876 -582 -8375 1127 8233 -1717 -8365 2114 8581 -2266 -8700 2259 8596 -2230 -8212 2446
1890 2446 7804 -2875 -7539 3432 7520 -3872 -7621 4127 7743 -4115 -7632 4098 7320
1903 7320 -4198 -6827 4548 6466 -5002 -6271 5476 6306 -5738 -6329 5832 6274 -5762 -5952
1917 -5952 5769 5500 -5961 -5033 6330 4745 -6717 -4658 6972 4642 -7055 -4599 6942 4329
1931 4329 -6849 -3887 6884 3422 -7100 -3084 7400 2907 -7647 -2863 7697 2800 -7582
1944 -7582 -2627 7418 2283 -7340 -1795 7464 1442 -7650 -1156 7882 1087 -7940 -1012 7847 871
1959 871 -7624 -535 7496 116 -7481 324 7645 -619 -7795 798 7847 -858 -7744 986 7520
1974 7520 -1276 -7317 1642 7171 -2103 -7207 2428 7281 -2625 -7340 2708 7212 -2806 -6949
1988 -6949 2981 6674 -3298 -6472 3677 6426 -3965 -6398 4151 6406 -4228 -6282 4274 6050
2002 6050 -4375 -5732 4594 5492 -4862 -5305 5166 5270 -5344 -5216 5409 5100 -5436 -4864 5479
2017 5479 4537 -5625 -4223 5846 3974 -6094 -3843 6285 3759 -6329 -3630 6343 3353 -6363
2031 -6363 -3032 6420 2685 -6575 -2396 6776 2199 -6951 -2072 6980 1923 -6919 -1685 6879 1376
2046 1376 -6863 -1037 6911 703 -7015 -473 7120 346 -7100 -185 7045 19 -6891 276 6850
2061 6850 -556 -6763 871 6831 -1047 -6855 1215 6836 -1328 -6699 1492 6552 -1711 -6397 1978
2076 1978 6302 -2252 -6282 2474 6263 -2639 -6219 2767 6049 -2902 -5878 3059 5687 -3314 -5527
2091 -5527 3579 5426 -3806 -5359 3950 5230 -4074 -5082 4185 4871 -4335 -4629 4531 4428 -4728 -4284
2107 -4284 4923 4163 -5018 -4007 5121 3860 -5155 -3617 5258 3383 -5358 -3146 5498 2987 -5626
2122 -5626 -2842 5719 2709 -5725 -2538 5723 2321 -5755 -2079 5832 1866 -5900 -1680 5979 1495
2137 1495 -6052 -1365 6044 1188 -6015 -988 5987 737 -5999 -495 6053 262 -6090 -77 6101
2152 6101 -67 -6076 266 6013 -474 -5931 729 5907 -978 -5892 1201 5893 -1375 -5841 1553
2167 1553 5776 -1702 -5654 1909 5558 -2116 -5441 2346 5384 -2543 -5338 2693 5283 -2826 -5171
2182 -5171 2934 5013 -3085 -4885 3258 4714 -3474 -4641 3611 4540 -3772 -4487 3847 4334 -3936 -4169
2198 -4169 4032 3973 -4187 -3821 4348 3660 -4497 -3563 4590 3451 -4661 -3278 4725 3094 -4791 -2866
2214 -2866 4904 2652 -5020 -2472 5140 2323 -5224 -2168 5272 1990 -5278 -1780 5303 1540 -5351
2229 -5351 -1318 5411 1101 -5508 -955 5516 811 -5538 -662 5469 448 -5446 -260 5409 0
2244 0 -5455 167 5460 -337 -5471 423 5424 -554 -5353 732 5257 -927 -5189 1150 5186 -1308
2260 -1308 -5172 1460 5153 -1564 -5070 1693 4984 -1809 -4830 2023 4738 -2217 -4656 2412 4636
2275 4636 -2554 -4579 2649 4476 -2754 -4342 2869 4177 -3033 -4029 3200 3907 -3389 -3824 3510 3721
2291 3721 -3600 -3657 3641 3465 -3751 -3307 3839 3093 -3987 -2975 4108 2854 -4225 -2772 4279 2658
2307 2658 -4293 -2507 4295 2319 -4346 -2135 4467 1977 -4540 -1832 4640 1751 -4660 -1624 4671
2322 4671 1505 -4610 -1318 4641 1102 -4697 -920 4770 746 -4848 -657 4830 527 -4822 -385
2337 -385 4745 191 -4708 21 4705 -264 -4750 407 4763 -571 -4776 663 4691 -796 -4607
2352 -4607 954 4522 -1181 -4445 1392 4434 -1567 -4419 1694 4406 -1771 -4305 1881 4190 -1991
2367 -1991 -4052 2159 3951 -2330 -3893 2505 3861 -2583 -3786 2676 3728 -2711 -3583 2789 3421
2382 3421 -2929 -3282 3078 3199 -3236 -3137 3316 3053 -3381 -2970 3397 2803 -3470 -2650 3546 2437 -3701
2399 -3701 -2318 3805 2200 -3899 -2104 3938 2004 -3935 -1845 3956 1654 -4002 -1429 4068 1260
2414 1260 -4181 -1136 4230 1053 -4246 -946 4231 820 -4185 -641 4174 432 -4192 -239 4256
2429 4256 130 -4298 -38 4296 -57 -4248 154 4179 -318 -4116 481 4083 -697 -4111 799
2444 799 4139 -901 -4138 971 4055 -1074 -3969 1191 3866 -1391 -3805 1533 3764 -1727 -3756
2459 -3756 1807 3755 -1860 -3667 1954 3546 -2031 -3392 2212 3295 -2360 -3217 2544 3184 -2617
2474 -2617 -3135 2690 3076 -2718 -2926 2797 2754 -2897 -2608 3025 2499 -3170 -2460 3266 2395 -3303 -2317
2491 -2317 3293 2189 -3308 -2026 3377 1846 -3505 -1750 3585 1666 -3676 -1629 3684 1539 -3678
2506 -3678 -1434 3626 1248 -3671 -1073 3730 932 -3821 -823 3873 734 -3912 -665 3876 571
2521 571 -3813 -391 3794 203 -3791 2 3853 -126 -3880 220 3911 -280 -3840 392 3749
2536 3749 -520 -3683 713 3640 -917 -3637 1043 3655 -1164 -3661 1178 3607 -1265 -3486 1354
2551 1354 3364 -1527 -3299 1684 3257 -1849 -3263 1901 3235 -1948 -3196 1964 3074 -2049 -2923
2566 -2923 2169 2812 -2306 -2744 2461 2717 -2531 -2681 2567 2626 -2559 -2488 2608 2354 -2680 -2177 2809
2583 2809 2107 -2937 -2011 3042 1992 -3057 -1913 3059 1767 -3050 -1605 3087 1424 -3187 -1290
2598 -1290 3279 1200 -3365 -1146 3364 1072 -3335 -981 3289 819 -3300 -642 3338 481 -3391
2613 -3391 -373 3464 342 -3451 -287 3432 208 -3348 -72 3310 -85 -3312 259 3370 -350
2628 -350 -3394 453 3417 -446 -3340 544 3281 -618 -3165 803 3168 -949 -3153 1110 3173
2643 3173 -1166 -3171 1217 3121 -1274 -3026 1337 2900 -1495 -2811 1637 2768 -1791 -2755 1868
2658 1868 2733 -1915 -2691 1938 2568 -1996 -2428 2110 2328 -2229 -2220 2366 2196 -2425 -2160 2483 2145 -2468
2676 -2468 -2003 2494 1902 -2545 -1742 2668 1641 -2746 -1586 2851 1578 -2865 -1499 2852 1418 -2831
2692 -2831 -1292 2860 1140 -2921 -1014 3015 922 -3093 -873 3111 817 -3094 -752 3048 604
2707 604 -3027 -429 3042 273 -3109 -170 3151 100 -3192 -64 3139 -24 -3072 140 3016
2722 3016 -291 -2986 465 3000 -596 -3035 653 3043 -691 -2996 752 2932 -818 -2831 947
2737 947 2766 -1089 -2763 1225 2777 -1307 -2770 1327 2738 -1343 -2649 1384 2552 -1497 -2470
2752 -2470 1612 2410 -1753 -2401 1829 2392 -1863 -2364 1853 2258 -1898 -2168 1960 2034 -2078 -1948 2202
2769 2202 1922 -2281 -1879 2303 1850 -2291 -1744 2306 1626 -2320 -1475 2430 1366 -2511 -1280 2614
2785 2614 1274 -2621 -1205 2626 1149 -2567 -1018 2579 870 -2616 -721 2701 645 -2769 -615
2800 -615 2794 614 -2751 -546 2699 418 -2700 -304 2697 154 -2739 -76 2785 27 -2808
2815 -2808 6 2782 -47 -2728 143 2661 -261 -2624 409 2638 -530 -2672 599 2687 -620
2830 -620 -2648 657 2607 -716 -2482 858 2430 -976 -2392 1107 2408 -1175 -2419 1229 2392
2845 2392 -1248 -2285 1294 2182 -1383 -2086 1505 2033 -1607 -2020 1688 1999 -1738 -1982 1728 1876 -1734
2862 -1734 -1794 1791 1672 -1895 -1598 1990 1556 -2077 -1531 2104 1521 -2084 -1457 2092 1345 -2096 -1220
2879 -1220 2170 1136 -2233 -1041 2329 1030 -2354 -1006 2348 959 -2290 -840 2308 697 -2328
2894 -2328 -577 2396 489 -2446 -429 2482 417 -2444 -346 2396 252 -2379 -123 2361 -16
2909 -16 -2397 102 2412 -177 -2464 195 2425 -247 -2373 296 2307 -418 -2275 536 2281
2924 2281 -647 -2287 710 2318 -726 -2290 760 2240 -782 -2141 895 2100 -975 -2045 1113
2939 1113 2071 -1146 -2076 1215 2062 -1201 -1990 1250 1923 -1301 -1832 1390 1766 -1499 -1740 1569 1744
2956 1744 -1608 -1715 1616 1645 -1626 -1544 1662 1436 -1741 -1366 1821 1298 -1910 -1288 1939 1261 -1936
2973 -1936 -1205 1942 1105 -1928 -988 1992 890 -2057 -824 2107 792 -2155 -768 2159 737 -2099
2989 -2099 -633 2114 572 -2108 -412 2187 369 -2205 -311 2265 289 -2242 -263 2204 209
3004 209 -2173 -93 2154 -19 -2181 112 2205 -178 -2252 187 2216 -234 -2190 281 2118
3019 2118 -384 -2081 493 2053 -609 -2076 661 2098 -713 -2071 747 2025 -758 -1948 847
3034 847 1884 -932 -1812 1066 1840 -1116 -1828 1162 1833 -1161 -1755 1197 1693 -1220 -1596 1314 1549
3051 1549 -1404 -1520 1464 1510 -1499 -1501 1503 1460 -1513 -1382 1529 1270 -1614 -1206 1675 1148 -1760 -1154
3069 -1154 1756 1125 -1788 -1099 1763 982 -1776 -906 1792 789 -1845 -722 1917 702 -1968 -667
3085 -667 1948 629 -1927 -545 1916 464 -1897 -328 1947 272 -1979 -196 2016 178 -1995
3100 -1995 -151 1960 84 -1934 1 1901 -113 -1911 196 1936 -258 -1957 270 1957 -301
3115 -301 -1914 322 1876 -403 -1839 497 1810 -598 -1835 652 1849 -698 -1839 703 1803
3130 1803 -727 -1739 800 1697 -865 -1643 968 1636 -1009 -1629 1083 1621 -1083 -1588 1117 1523 -1145
3147 -1145 -1402 1225 1369 -1301 -1316 1381 1315 -1416 -1297 1410 1246 -1437 -1189 1436 1093 -1484 -1016 1552
3165 1552 953 -1625 -948 1652 920 -1682 -885 1656 806 -1659 -751 1655 652 -1715 -603 1770
3181 1770 542 -1812 -546 1821 504 -1788 -438 1799 374 -1779 -284 1822 200 -1854 -140
3196 -140 1887 133 -1869 -85 1861 43 -1809 35 1805 -120 -1781 218 1817 -282 -1835
3211 -1835 304 1822 -346 -1797 384 1737 -459 -1702 543 1688 -644 -1670 677 1657 -735
3226 -735 -1679 741 1633 -780 -1584 811 1528 -891 -1492 957 1468 -1027 -1472 1078 1470 -1071 -1425
3243 -1425 1116 1398 -1111 -1316 1189 1276 -1244 -1216 1318 1214 -1347 -1194 1375 1190 -1359 -1106 1375
3260 1375 1044 -1424 -968 1481 916 -1542 -878 1554 856 -1582 -845 1566 757 -1580 -709 1581 592
3277 592 -1637 -541 1648 477 -1700 -469 1688 413 -1715 -389 1681 312 -1661 -214 1689
3292 1689 152 -1706 -102 1739 56 -1750 -48 1736 16 -1698 62 1689 -132 -1678 210
3307 210 1708 -270 -1699 314 1723 -318 -1701 356 1643 -425 -1627 475 1596 -574 -1602
3322 -1602 615 1578 -671 -1604 672 1547 -723 -1534 745 1452 -829 -1410 891 1385 -972 -1377 1006
3339 1006 1345 -1031 -1322 1056 1276 -1071 -1209 1141 1166 -1170 -1087 1254 1091 -1278 -1060 1300 1052 -1289
3357 -1289 -983 1318 923 -1334 -840 1397 807 -1437 -776 1476 753 -1508 -738 1485 683 -1491 -621
3374 -621 1486 533 -1534 -491 1561 438 -1603 -426 1609 369 -1620 -356 1599 270 -1602
3389 -1602 -184 1577 127 -1602 -49 1638 38 -1631 15 1634 -35 -1582 125 1595 -169
3404 -169 -1548 270 1565 -312 -1548 380 1570 -395 -1561 422 1524 -463 -1479 521 1469
3419 1469 -583 -1438 645 1434 -706 -1443 732 1426 -758 -1406 767 1341 -833 -1314 881 1277 -945
3436 -945 -1271 1005 1248 -1040 -1232 1048 1197 -1061 -1130 1101 1087 -1150 -1020 1202 1027 -1235 -984 1288
3454 1288 965 -1275 -936 1307 884 -1292 -776 1362 758 -1397 -677 1419 651 -1457 -639 1447 585
3471 585 -1462 -530 1447 442 -1466 -413 1498 337 -1528 -315 1530 274 -1554 -258 1525
3486 1525 189 -1534 -146 1532 65 -1556 -26 1562 -22 -1599 51 1594 -62 -1549 135
3501 135 1553 -178 -1522 264 1536 -316 -1550 360 1547 -383 -1526 431 1518 -462 -1452
3516 -1452 528 1431 -598 -1416 625 1387 -699 -1390 714 1353 -772 -1335 776 1291 -846 -1250 881
3533 881 1209 -942 -1188 972 1159 -1013 -1163 1039 1115 -1058 -1071 1066 1007 -1118 -973 1177 941 -1209
3551 -1209 -921 1230 898 -1257 -861 1278 832 -1267 -752 1316 709 -1344 -651 1396 640 -1407 -599
3568 -599 1426 572 -1397 -525 1424 450 -1424 -401 1460 332 -1491 -301 1486 251 -1514 -217
3584 -217 1471 159 -1484 -96 1460 27 -1484 11 1475 -55 -1513 94 1482 -143 -1467
3599 -1467 173 1452 -227 -1419 304 1421 -346 -1405 411 1433 -413 -1409 459 1388 -475
3614 -475 -1351 535 1338 -579 -1307 653 1315 -686 -1300 733 1293 -747 -1260 786 1214 -819 -1191
3631 -1191 860 1147 -921 -1111 952 1082 -995 -1080 1026 1044 -1041 -999 1063 939 -1113 -898 1153 847
3649 847 -1172 -829 1208 785 -1220 -734 1245 717 -1246 -641 1290 598 -1302 -556 1343 511 -1347
3666 -1347 -467 1377 450 -1373 -392 1384 362 -1386 -300 1419 248 -1423 -207 1436 174 -1454
3682 -1454 -142 1440 72 -1449 -49 1421 -36 -1447 63 1454 -133 -1469 160 1442 -212
3697 -212 -1446 235 1417 -311 -1403 351 1385 -393 -1376 458 1398 -502 -1345 543 1339 -559
3713 -559 -1296 627 1274 -650 -1233 709 1227 -752 -1206 786 1168 -818 -1150 843 1130 -884 -1092
3730 -1092 932 1042 -978 -1041 990 995 -1049 -986 1066 948 -1097 -933 1096 876 -1144 -839 1156 792
3748 792 -1213 -769 1224 732 -1250 -696 1268 646 -1287 -597 1305 547 -1316 -504 1359 470 -1330
3765 -1330 -426 1378 391 -1365 -346 1384 294 -1386 -247 1387 185 -1385 -148 1403 111
3780 111 -1416 -67 1392 11 -1396 31 1385 -81 -1386 141 1378 -192 -1399 207 1360
3795 1360 -244 -1371 297 1364 -341 -1362 392 1350 -430 -1328 478 1333 -508 -1303 558 1313
3811 1313 -573 -1266 652 1256 -670 -1216 727 1215 -752 -1164 822 1166 -822 -1122 875 1107 -884
3828 -884 -1040 936 1019 -967 -985 998 950 -1038 -915 1052 877 -1083 -848 1096 801 -1135 -744 1148
3846 1148 701 -1193 -669 1192 643 -1210 -599 1250 558 -1257 -521 1273 470 -1260 -425 1305 399
3863 399 -1321 -350 1346 310 -1337 -281 1355 242 -1343 -166 1384 150 -1365 -76 1387
3878 1387 57 -1370 4 1370 -47 -1389 76 1364 -142 -1351 182 1339 -242 -1352 271
3893 271 1322 -334 -1311 349 1297 -412 -1291 466 1260 -509 -1240 547 1230 -590 -1213 622 1184
3910 1184 -665 -1163 688 1154 -719 -1117 785 1107 -793 -1064 857 1039 -866 -1007 912 1006 -927
3927 -927 -955 973 944 -986 -874 1048 879 -1076 -843 1108 805 -1129 -772 1143 719 -1171 -688 1185
3945 1185 637 -1221 -603 1231 542 -1266 -530 1264 466 -1289 -421 1275 385 -1292 -335 1301 312
3962 312 -1314 -234 1336 201 -1337 -161 1329 134 -1326 -51 1349 29 -1348 17 1347
3977 1347 -44 -1327 117 1358 -158 -1331 159 1324 -216 -1338 285 1327 -318 -1328 358
3992 358 1301 -419 -1318 425 1286 -485 -1290 506 1236 -561 -1252 587 1209 -660 -1185 667 1162
4009 1162 -716 -1139 760 1115 -806 -1076 830 1061 -860 -1004 913 996 -924 -940 966 938 -981 -887
4027 -887 1027 867 -1036 -800 1080 788 -1093 -749 1138 689 -1156 -678 1167 633 -1205 -589 1197
4044 1197 545 -1236 -502 1247 460 -1283 -431 1281 371 -1296 -363 1297 287 -1338 -253 1327
4060 1327 224 -1354 -178 1349 136 -1357 -77 1346 54 -1352 -7 1343 -39 -1328 98
4075 98 1349 -134 -1326 200 1327 -234 -1294 291 1314 -325 -1280 358 1275 -413 -1251 454
4091 454 1226 -488 -1223 526 1189 -574 -1189 599 1162 -649 -1150 680 1118 -722 -1111 739 1083
4108 1083 -796 -1052 827 1024 -864 -998 913 981 -927 -930 956 923 -988 -878 1046 860 -1053 -822
4126 -822 1093 782 -1101 -729 1134 718 -1145 -641 1193 643 -1189 -566 1254 546 -1244 -493 1253
4143 1253 443 -1266 -394 1263 369 -1285 -312 1283 262 -1303 -221 1296 166 -1328 -149 1326
4159 1326 83 -1326 -44 1328 -14 -1330 51 1325 -91 -1337 135 1348 -156 -1317 221
4174 221 1335 -253 -1307 327 1320 -339 -1307 408 1313 -426 -1266 496 1274 -517 -1238 568 1251
4191 1251 -612 -1206 644 1189 -705 -1163 731 1142 -774 -1112 807 1068 -848 -1069 878 1014 -928
4208 -928 -990 948 955 -982 -923 991 890 -1038 -870 1068 816 -1086 -765 1129 749 -1128 -681 1184
4226 1184 693 -1175 -612 1232 611 -1225 -549 1265 527 -1263 -470 1305 447 -1317 -407 1348 366
4243 366 -1330 -316 1352 262 -1386 -218 1363 163 -1387 -140 1383 62 -1419 -34 1389
4258 1389 4 -1393 40 1372 -108 -1403 161 1371 -221 -1382 243 1357 -296 -1361 326
4273 326 1332 -374 -1310 425 1296 -458 -1270 528 1289 -548 -1247 595 1248 -624 -1232 691 1188
4290 1188 -711 -1158 764 1160 -792 -1138 829 1099 -876 -1090 892 1046 -954 -1042 964 986 -1024
4307 -1024 -973 1041 916 -1096 -904 1121 852 -1141 -827 1165 776 -1192 -728 1195 720 -1222 -652
4324 -652 1265 625 -1277 -565 1290 528 -1286 -452 1318 446 -1301 -368 1344 343 -1356 -292 1370
4341 1370 258 -1363 -195 1379 176 -1360 -106 1388 74 -1391 -7 1401 -23 -1396 54
4356 54 1382 -128 -1413 153 1379 -216 -1385 264 1366 -313 -1365 343 1365 -402 -1352 432
4372 432 1341 -478 -1315 525 1291 -575 -1260 621 1270 -635 -1241 703 1220 -735 -1184 794 1157
4389 1157 -794 -1102 855 1104 -897 -1048 938 1039 -951 -1001 992 965 -1021 -922 1045 877 -1078 -849
4407 -849 1108 813 -1161 -792 1152 731 -1206 -717 1209 660 -1250 -620 1254 574 -1292 -524 1315
4424 1315 492 -1330 -455 1373 412 -1356 -372 1385 326 -1389 -242 1410 232 -1392 -165 1424
4440 1424 147 -1421 -74 1422 30 -1410 16 1414 -65 -1421 116 1419 -156 -1410 191
4455 191 1390 -259 -1389 270 1365 -361 -1363 382 1324 -449 -1336 469 1312 -538 -1306 556
4471 556 1266 -609 -1253 646 1241 -681 -1214 747 1194 -788 -1174 829 1148 -834 -1118 908 1116
4488 1116 -915 -1053 970 1056 -996 -996 1073 969 -1068 -933 1121 901 -1126 -858 1173 823 -1192 -776
4506 -776 1223 724 -1244 -691 1258 648 -1302 -610 1298 566 -1317 -526 1311 462 -1359 -420 1365
4523 1365 395 -1392 -335 1376 275 -1387 -230 1397 176 -1392 -131 1401 92 -1416 -44
4538 -44 1429 12 -1402 50 1444 -79 -1406 153 1422 -187 -1407 255 1419 -285 -1406
4553 -1406 338 1401 -380 -1371 423 1362 -479 -1348 498 1337 -604 -1324 599 1302 -655 -1272 690
4570 690 1247 -734 -1225 751 1184 -807 -1150 860 1121 -893 -1096 919 1048 -936 -1020 975 993 -1009
4588 -1009 -944 1053 922 -1067 -865 1122 860 -1127 -792 1184 778 -1187 -725 1220 684 -1251 -648
4605 -648 1267 586 -1305 -564 1310 509 -1338 -488 1340 428 -1376 -384 1347 339 -1401 -314 1395
4622 1395 219 -1410 -211 1415 156 -1420 -107 1422 38 -1419 8 1416 -62 -1414 115
4637 115 1416 -144 -1385 199 1390 -218 -1366 289 1382 -330 -1341 394 1340 -438 -1338 473
4653 473 1321 -510 -1297 560 1268 -604 -1239 643 1227 -714 -1205 736 1180 -785 -1179 802 1126
4670 1126 -873 -1128 877 1063 -934 -1070 964 1015 -1020 -986 1037 940 -1081 -923 1100 890 -1133 -831
4688 -831 1158 794 -1180 -735 1219 721 -1224 -657 1276 644 -1259 -574 1321 544 -1280 -481 1315
4705 1315 437 -1351 -386 1350 352 -1353 -323 1357 261 -1392 -220 1384 142 -1382 -130 1397
4721 1397 70 -1413 -33 1385 -44 -1401 49 1393 -115 -1397 178 1392 -226 -1389 266
4736 266 1394 -318 -1383 347 1370 -413 -1355 447 1326 -488 -1304 549 1312 -564 -1286 637
4752 637 1266 -659 -1241 693 1217 -752 -1185 768 1141 -832 -1123 849 1078 -907 -1080 916 1005 -954
4770 -954 -1002 957 941 -1034 -929 1049 854 -1089 -857 1110 807 -1148 -779 1159 735 -1196 -693 1214
4788 1214 636 -1239 -601 1270 567 -1292 -527 1308 489 -1326 -444 1335 404 -1355 -340 1375 302
4805 302 -1381 -237 1380 194 -1398 -169 1395 113 -1403 -56 1395 -5 -1400 37 1393
4820 1393 -81 -1386 114 1358 -177 -1391 197 1358 -273 -1336 296 1298 -376 -1316 411
4835 411 1283 -459 -1276 507 1271 -538 -1254 571 1241 -606 -1205 655 1196 -710 -1167 762 1158
4852 1158 -784 -1118 833 1098 -860 -1055 912 1028 -944 -995 984 968 -1022 -939 1045 901 -1071 -869
4870 -869 1094 813 -1123 -792 1138 735 -1189 -709 1184 640 -1242 -631 1237 582 -1244 -549 1274
4887 1274 489 -1283 -424 1304 392 -1295 -336 1329 309 -1324 -265 1348 217 -1337 -159 1344
4903 1344 132 -1340 -48 1368 38 -1334 32 1357 -43 -1346 124 1343 -172 -1332 208
4918 208 1322 -251 -1353 288 1334 -355 -1326 382 1299 -439 -1297 462 1268 -541 -1263 571
4934 571 1217 -625 -1237 643 1182 -692 -1170 692 1136 -774 -1093 811 1087 -832 -1047 875 1016
4951 1016 -904 -980 941 963 -957 -898 992 897 -1018 -836 1059 815 -1083 -763 1120 730 -1144 -703
4969 -703 1147 652 -1176 -622 1191 564 -1229 -549 1240 497 -1288 -477 1281 393 -1312 -377 1312
4986 1312 311 -1341 -277 1320 206 -1369 -179 1356 136 -1367 -87 1360 50 -1361 -6
5001 -6 1358 -38 -1340 102 1350 -133 -1326 177 1343 -227 -1307 284 1299 -302 -1270 358
5017 358 1278 -409 -1273 434 1240 -492 -1244 514 1193 -564 -1198 588 1157 -666 -1145 679 1096
5034 1096 -741 -1134 754 1053 -816 -1059 833 1011 -883 -998 903 953 -948 -930 998 902 -997 -875
5052 -875 1049 823 -1064 -785 1095 749 -1118 -698 1146 670 -1156 -629 1190 583 -1190 -546 1209
5069 1209 507 -1220 -463 1232 419 -1257 -389 1258 319 -1290 -303 1264 234 -1283 -228 1272
5085 1272 145 -1305 -98 1276 75 -1308 -25 1290 -25 -1306 66 1304 -124 -1297 152
5100 152 1290 -189 -1280 262 1291 -282 -1269 350 1272 -377 -1258 429 1243 -448 -1196 511
5116 511 1212 -553 -1187 600 1169 -626 -1138 667 1107 -712 -1104 735 1051 -774 -1057 793 1000
5133 1000 -864 -978 866 938 -930 -912 905 872 -962 -841 980 799 -1023 -778 1022 735 -1085 -703
5151 -703 1089 661 -1114 -621 1129 574 -1140 -536 1178 489 -1186 -468 1222 432 -1216 -373 1252
5168 1252 350 -1247 -287 1256 243 -1286 -210 1267 149 -1308 -118 1290 61 -1302 -44
5183 -44 1279 -21 -1322 35 1289 -128 -1296 122 1256 -183 -1274 214 1260 -264 -1256 305
5199 305 1244 -357 -1223 386 1204 -441 -1180 483 1173 -500 -1145 548 1119 -584 -1111 629 1111
5216 1111 -660 -1049 714 1051 -738 -1027 777 1003 -811 -969 845 952 -879 -935 911 880 -968
5233 -968 -866 968 824 -1022 -810 1017 727 -1066 -727 1072 668 -1116 -650 1129 606 -1157 -580
5250 -580 1171 522 -1187 -489 1177 442 -1205 -386 1221 361 -1211 -307 1237 296 -1227 -226 1259
5267 1259 193 -1230 -157 1265 118 -1252 -60 1249 11 -1278 28 1270 -57 -1257 82
5282 82 1248 -145 -1260 186 1230 -245 -1242 269 1214 -316 -1221 351 1208 -407 -1202 428 1183
5299 1183 -481 -1173 527 1132 -582 -1140 587 1098 -625 -1074 682 1069 -692 -1023 740 1008 -760
5316 -760 -968 820 947 -832 -916 849 895 -873 -878 909 847 -944 -773 954 762 -999 -733 992 695
5335 695 -1039 -671 1048 613 -1080 -594 1082 537 -1118 -510 1131 463 -1152 -430 1161 391 -1172
5352 -1172 -346 1191 305 -1203 -264 1207 217 -1229 -188 1222 147 -1233 -108 1229 63 -1244
5368 -1244 -4 1235 -18 -1231 55 1237 -111 -1228 150 1222 -193 -1209 244 1198 -269
5383 -269 -1189 303 1155 -352 -1157 388 1133 -441 -1127 457 1108 -501 -1097 518 1072 -576 -1057
5400 -1057 592 1026 -629 -1003 673 992 -700 -971 743 944 -757 -894 813 897 -821 -843 873
5417 873 857 -888 -789 943 787 -942 -719 981 703 -987 -652 1028 639 -1041 -596 1078 573 -1073
5435 -1073 -520 1101 484 -1108 -450 1115 411 -1131 -380 1121 330 -1166 -308 1141 255 -1164 -227
5452 -227 1149 180 -1171 -143 1159 105 -1177 -52 1191 43 -1186 15 1179 -54 -1167
5467 -1167 118 1181 -123 -1146 192 1180 -212 -1154 278 1149 -295 -1124 340 1142 -385 -1101
5483 -1101 445 1102 -473 -1082 503 1067 -532 -1049 572 1037 -596 -1029 635 972 -682 -959 686
5500 686 929 -732 -910 743 868 -775 -848 814 826 -814 -800 865 766 -854 -714 911 719 -919
5518 -919 -650 950 654 -942 -594 993 592 -1004 -519 1021 509 -1026 -473 1052 437 -1080 -388
5535 -388 1071 359 -1086 -318 1100 293 -1105 -257 1123 196 -1137 -178 1140 114 -1152 -93 1126
5552 1126 34 -1148 -20 1128 -42 -1150 47 1131 -110 -1129 142 1107 -187 -1114 200
5567 200 1087 -254 -1087 301 1074 -305 -1061 377 1046 -379 -1039 437 1037 -454 -997 502 983
5584 983 -535 -963 545 944 -599 -922 624 913 -664 -898 674 857 -717 -832 735 800 -804
5601 -804 -796 769 744 -844 -726 848 705 -875 -660 908 635 -928 -606 947 578 -965 -549 990
5619 990 513 -984 -464 1006 445 -1009 -386 1031 377 -1012 -309 1079 308 -1043 -252 1071 225
5636 225 -1042 -197 1073 155 -1071 -118 1060 78 -1077 -51 1065 5 -1092 12 1080 -69
5652 -69 -1064 108 1061 -133 -1081 168 1058 -217 -1056 246 1047 -295 -1028 331 1022 -350 -998 408
5670 408 996 -424 -973 485 980 -489 -927 536 920 -541 -903 592 891 -604 -857 662 845
5687 845 -668 -812 684 781 -731 -768 740 730 -769 -713 769 662 -822 -671 828 618 -850 -607
5705 -607 843 545 -880 -555 887 498 -919 -464 935 441 -952 -411 963 392 -964 -330 999
5722 999 305 -999 -274 1027 246 -1014 -191 1043 167 -1024 -116 1046 82 -1040 -47 1039 23
5739 23 -1036 16 1026 -56 -1044 80 1039 -118 -1027 145 1021 -174 -1004 200 1004 -257 -995
5756 -995 256 967 -300 -961 332 946 -377 -945 386 908 -433 -880 454 874 -503 -857 526
5773 526 847 -547 -839 570 811 -600 -793 655 772 -649 -742 698 719 -709 -682 741 692 -761
5791 -761 -647 774 610 -809 -598 831 554 -837 -539 836 494 -892 -479 897 430 -912 -439
5808 -439 899 373 -934 -366 931 312 -949 -290 939 243 -961 -220 959 196 -977 -144 961
5825 961 125 -962 -84 962 63 -983 -23 962 -11 -964 47 981 -48 -951 107 969 -134 -946
5843 -946 183 945 -202 -952 235 922 -291 -921 299 896 -352 -909 347 869 -430 -887 433
5860 433 863 -462 -855 492 828 -515 -801 525 786 -567 -773 573 748 -602 -725 619 709 -652
5878 -652 -674 677 645 -682 -623 717 606 -738 -570 755 555 -761 -520 773 508 -777 -466 813
5896 813 436 -843 -412 843 372 -847 -352 860 311 -892 -310 875 259 -903 -236 906 174
5913 174 -936 -162 907 134 -933 -106 912 63 -941 -45 930 8 -924 17 919 -65 -922 88
5931 88 927 -124 -916 153 915 -173 -902 188 894 -230 -873 255 871 -290 -846 318 847 -332
5949 -332 -831 384 813 -386 -797 435 778 -448 -785 469 746 -505 -746 512 706 -565 -710
5966 -710 579 669 -626 -655 609 639 -648 -634 674 571 -691 -558 697 550 -719 -497 751 500
5984 500 -764 -459 783 442 -793 -412 807 389 -810 -352 826 331 -822 -297 840 277 -848
6001 -848 -257 842 225 -860 -207 834 155 -868 -150 852 71 -881 -89 845 33 -871 -45 830
6019 830 -23 -869 19 840 -70 -873 96 849 -133 -845 143 860 -201 -837 215 839 -236 -815 270
6038 270 819 -282 -786 337 796 -355 -767 389 772 -405 -739 419 742 -439 -705 466 674
6055 674 -495 -690 510 653 -530 -646 533 613 -582 -603 573 572 -627 -552 609 541 -645 -527 645
6074 645 485 -658 -484 676 430 -706 -431 715 387 -717 -377 722 358 -752 -322 767 295
6091 295 -758 -261 785 246 -775 -205 792 164 -786 -153 808 126 -812 -96 788 60 -824 -56 800
6110 800 11 -835 5 799 -40 -813 49 784 -105 -816 94 753 -151 -794 161 778 -183 -769 214 765
6130 765 -252 -748 269 729 -266 -732 305 723 -309 -693 361 707 -375 -660 398 674 -401
6147 -401 -642 451 626 -462 -606 489 607 -509 -565 528 553 -558 -544 577 523 -597 -514 591 462
6166 462 -623 -469 629 421 -667 -423 653 368 -687 -377 677 326 -714 -320 691 290 -709
6183 -709 -275 715 241 -723 -233 725 197 -748 -191 741 155 -714 -114 753 95 -737 -69 749 59 -754
6203 -754 -39 746 6 -741 17 746 -53 -751 76 735 -109 -736 115 728 -150 -735 168 691 -224 -718
6223 -718 212 690 -264 -697 273 693 -305 -678 326 654 -361 -649 366 636 -384 -624 403 626
6241 626 -411 -583 458 586 -449 -557 476 566 -473 -512 532 534 -509 -481 545 472 -547 -461 562
6260 562 442 -585 -424 578 390 -608 -390 606 351 -643 -332 603 294 -668 -309 650 272 -672 -257
6279 -257 673 216 -687 -207 675 175 -696 -150 695 132 -691 -110 721 87 -694 -49 734 41 -694 -2
6299 -2 723 -12 -705 25 722 -38 -692 77 675 -94 -677 119 686 -148 -679 160 661 -202 -651 198 640
6320 640 -233 -647 250 619 -273 -630 277 610 -318 -606 324 595 -348 -583 360 564 -383 -544 408 537
6340 537 -427 -530 457 521 -464 -486 471 480 -501 -442 523 445 -520 -412 541 401 -533 -382 567 360 -562 -335
6362 -335 567 328 -588 -306 591 283 -616 -263 599 227 -615 -224 613 196 -641 -198 610 152 -628 -137
6382 -137 616 108 -636 -92 631 68 -642 -48 649 38 -628 -14 639 -16 -627 33 636 -44 -626 77
6402 77 656 -80 -620 124 624 -135 -604 156 613 -178 -602 212 591 -232 -609 246 578 -266 -582 276
6422 276 554 -313 -561 308 520 -354 -542 339 495 -383 -516 367 475 -402 -492 404 453 -420 -444 447 432
6443 432 -445 -401 448 406 -463 -381 478 367 -469 -354 522 344 -499 -317 527 299 -525 -281 551 253 -556
6464 -556 -250 566 218 -585 -197 559 167 -610 -174 588 132 -600 -132 573 90 -625 -113 585 45 -610
6484 -610 -59 587 1 -607 -9 600 -23 -586 37 601 -51 -602 73 586 -82 -593 114 573 -117 -565
6504 -565 130 582 -144 -577 178 553 -197 -543 202 533 -230 -520 229 513 -282 -515 277 484 -302 -506
6524 -506 298 465 -347 -481 337 429 -387 -464 369 411 -418 -424 386 384 -431 -409 427 367 -446 -363 452 332 -472
6547 -472 -318 476 311 -467 -279 493 279 -497 -258 516 266 -514 -221 525 193 -521 -184 514 198 -535
6567 -535 -161 539 139 -547 -126 541 100 -549 -102 549 68 -566 -40 538 20 -551 -16 540 -15 -553
6587 -553 19 527 -52 -542 52 546 -78 -528 114 529 -126 -522 153 533 -155 -504 197 521 -183 -494
6607 -494 224 500 -217 -484 225 489 -226 -475 270 463 -278 -455 294 454 -303 -444 312 406 -335 -428 328
6628 328 383 -348 -391 358 374 -382 -353 373 334 -413 -333 409 313 -423 -292 425 293 -441 -275 453 261 -460
6650 -460 -234 488 223 -464 -205 488 198 -472 -158 512 182 -491 -143 502 126 -490 -100 514 103 -490
6670 -490 -67 501 53 -522 -42 519 17 -521 -19 501 -18 -522 17 497 -56 -518 34 499 -66 -496
6690 -496 74 490 -112 -505 109 486 -131 -472 158 468 -151 -455 183 462 -196 -465 228 450 -237 -428
6710 -428 257 449 -247 -415 288 427 -282 -397 322 401 -300 -369 336 371 -342 -357 341 333 -372 -329 355 312 -391
6733 -391 -320 381 277 -410 -288 403 260 -412 -256 407 239 -437 -238 445 205 -458 -193 424 173 -460
6753 -460 -165 459 165 -443 -136 458 125 -464 -117 469 99 -456 -85 472 83 -476 -40 488 41 -455
6773 -455 -18 479 -1 -480 20 474 -27 -479 61 470 -70 -485 65 466 -108 -472 121 451 -136 -470
6793 -470 134 429 -155 -427 161 426 -187 -427 190 429 -209 -419 224 414 -219 -392 267 412 -243 -361
6813 -361 285 385 -265 -349 300 369 -299 -347 329 339 -304 -332 336 308 -337 -296 362 294 -365 -263 369 266 -378
6836 -378 -242 385 238 -405 -238 392 202 -411 -189 425 174 -430 -168 421 142 -426 -143 418 100 -426
6856 -426 -100 455 95 -428 -72 459 74 -423 -31 453 51 -422 -5 449 11 -442 3 443 -18 -434
6876 -434 45 449 -42 -436 74 430 -69 -423 103 424 -107 -420 118 401 -139 -431 143 395 -169 -401
6896 -401 163 389 -188 -390 208 381 -216 -360 247 381 -239 -343 254 358 -252 -320 302 332 -283 -290 307
6917 307 309 -294 -290 329 281 -317 -263 327 271 -337 -239 350 239 -359 -220 370 219 -369 -207 356 180 -393 -194
6940 -194 376 162 -399 -174 381 148 -399 -143 400 111 -418 -113 414 79 -421 -86 407 66 -405 -45
6960 -45 409 34 -410 -9 437 12 -407 35 426 -4 -399 63 431 -31 -395 77 411 -76 -385 95
6980 95 403 -100 -415 117 402 -122 -386 133 378 -162 -378 155 373 -188 -397 180 356 -216 -373 207
7000 207 331 -223 -343 229 322 -235 -324 251 317 -262 -322 287 318 -268 -287 296 290 -311 -262 330 280 -301 -231 331
7024 331 232 -321 -199 371 211 -335 -195 359 187 -354 -167 363 160 -369 -140 381 150 -357 -119 385
7044 385 114 -390 -94 390 82 -414 -84 384 63 -390 -44 385 39 -389 -29 391 29 -394 -2 395
7064 395 -5 -367 24 393 -13 -377 46 400 -31 -375 80 394 -54 -374 92 367 -87 -369 138 381
7084 381 -121 -372 145 344 -147 -338 154 349 -186 -333 192 323 -213 -339 210 309 -240 -294 220 283 -234
7105 -234 -304 242 260 -272 -277 272 255 -266 -251 283 260 -280 -216 298 225 -300 -214 321 227 -301 -183 332 215 -316
7129 -316 -169 345 179 -333 -158 344 137 -341 -127 337 113 -344 -104 360 86 -357 -82 361 58 -361
7149 -361 -65 342 33 -371 -41 333 11 -372 -19 354 -11 -364 16 375 -9 -355 46 348 -53 -352
7169 -352 76 354 -69 -349 108 348 -90 -327 126 341 -113 -313 146 340 -123 -303 146 330 -153 -301
7189 -301 175 308 -172 -286 200 304 -199 -292 204 274 -222 -286 219 256 -244 -272 258 250 -262 -245 262 228 -271
7212 -271 -209 285 202 -286 -184 301 209 -280 -169 302 187 -297 -133 328 146 -302 -115 341 150 -293 -111
7233 -111 337 135 -307 -76 347 100 -309 -77 326 64 -330 -58 343 56 -343 -35 349 28 -339 -13
7253 -13 352 0 -350 4 321 -26 -351 24 324 -42 -333 53 344 -60 -334 78 348 -72 -311 102
7273 102 329 -101 -297 129 332 -112 -293 154 329 -131 -275 184 307 -149 -271 186 273 -175 -268 209 268
7294 268 -210 -268 196 250 -232 -254 210 238 -220 -244 232 207 -262 -222 258 201 -270 -195 259 190 -258 -179 264 184
7318 184 -264 -165 269 158 -279 -129 304 152 -280 -130 306 123 -286 -93 327 117 -276 -74 314 80
7338 80 -299 -52 321 60 -322 -27 314 32 -321 -29 305 0 -326 -21 310 -13 -318 23 294 -32
7358 -32 -321 34 302 -58 -310 65 296 -65 -303 61 282 -90 -288 110 307 -106 -268 128 286 -113
7378 -113 -261 154 293 -133 -250 164 278 -153 -241 182 261 -161 -231 191 243 -177 -228 201 237 -187 -211 206
7400 206 209 -229 -209 222 181 -239 -196 223 162 -236 -166 229 161 -246 -159 234 148 -272 -146 267 135 -267 -129
7423 -129 275 117 -269 -86 305 113 -271 -70 298 83 -271 -50 303 77 -264 -39 283 47 -278 -10
7443 -10 316 29 -276 -6 297 -1 -291 14 284 -14 -290 14 288 -44 -292 59 287 -67 -285 70
7463 70 275 -76 -283 86 273 -89 -265 123 249 -109 -267 124 260 -132 -235 135 274 -127 -242 169
7483 169 247 -140 -208 171 239 -172 -199 188 226 -176 -203 197 210 -192 -188 212 201 -197 -187 213 181 -221 -182 219
7507 219 151 -240 -162 242 153 -236 -140 239 123 -240 -138 258 130 -254 -89 254 97 -264 -70 256 81
7528 81 -252 -74 281 65 -252 -51 258 59 -248 -12 279 41 -266 -15 269 6 -260 18 296 0
7548 0 -256 34 279 -17 -269 32 277 -46 -258 43 258 -60 -277 53 251 -67 -260 91 261 -85 -253
7569 -253 94 232 -100 -226 108 253 -97 -241 132 237 -139 -218 155 228 -139 -196 169 229 -132 -169 200 197
7591 197 -160 -185 184 198 -187 -165 202 175 -198 -157 224 154 -188 -152 223 129 -202 -139 207 119 -245 -125 212
7614 212 102 -256 -116 214 104 -235 -100 236 76 -245 -97 234 72 -243 -65 249 52 -242 -50 266
7634 266 59 -234 -25 269 22 -235 3 255 1 -231 12 258 -18 -243 27 254 -45 -237 43 247
7654 247 -67 -243 45 226 -67 -237 66 226 -83 -247 80 212 -97 -229 79 217 -120 -222 99 217
7674 217 -134 -208 118 192 -134 -196 119 192 -140 -173 155 190 -141 -175 169 192 -154 -155 191 184 -161 -136 194 180 -183
7699 -183 -134 206 135 -206 -125 212 139 -210 -138 206 113 -215 -99 224 100 -218 -101 215 81 -222 -95 220
7721 220 59 -226 -52 215 60 -238 -46 230 43 -228 -23 255 33 -221 -21 242 18 -219 -3 247
7741 247 3 -225 34 245 -8 -208 50 258 2 -209 49 248 -42 -226 60 235 -71 -218 69 221
7761 221 -82 -217 86 210 -98 -229 101 200 -119 -210 104 184 -115 -207 125 201 -113 -193 147 190 -135 -177 147
7784 147 180 -152 -165 173 174 -154 -155 181 168 -177 -149 197 163 -157 -114 194 139 -188 -112 202 134 -180 -116 193 118
7809 118 -193 -91 204 92 -201 -82 198 74 -218 -90 210 67 -228 -70 226 51 -228 -59 212 44
7829 44 -225 -42 214 36 -226 12 232 27 -201 6 224 27 -211 16 230 -10 -200 42 238 -2
7849 -2 -197 56 227 -23 -207 67 210 -66 -193 64 217 -81 -208 90 199 -86 -211 100 192 -96 -201
7870 -201 94 191 -111 -190 102 179 -134 -183 135 185 -127 -180 122 163 -135 -159 156 168 -140 -161 152 149 -150 -120
7894 -120 182 151 -168 -106 200 139 -171 -101 205 118 -176 -90 199 111 -178 -87 205 94 -192 -61 195 83 -200
7917 -200 -62 198 46 -208 -57 215 48 -216 -36 207 32 -218 -36 206 11 -213 -27 203 8 -206
7937 -206 8 227 7 -219 15 213 -32 -206 14 214 -29 -195 53 214 -25 -192 79 220 -39 -185
7957 -185 75 230 -66 -193 85 192 -70 -179 93 193 -98 -189 96 168 -119 -188 114 150 -131 -174 110 151
7979 151 -145 -161 125 148 -164 -164 142 162 -158 -148 152 149 -155 -162 174 139 -156 -127 173 134 -169 -99 178 120 -164
8004 -164 -92 216 96 -177 -77 207 95 -173 -64 215 77 -187 -46 209 43 -210 -58 183 46 -211
8024 -211 -51 199 28 -209 -34 187 -1 -216 -28 201 -5 -223 2 208 -6 -208 5 210 -4 -197
8044 -197 46 208 -13 -204 39 207 -42 -192 54 213 -49 -195 80 212 -66 -183 91 190 -76 -177
8064 -177 91 197 -98 -176 97 178 -99 -168 104 159 -111 -165 127 166 -125 -170 132 134 -140 -147 140 138 -146 -160 143
8089 143 129 -163 -131 173 135 -145 -105 175 123 -165 -101 183 115 -159 -87 181 100 -177 -81 208 99 -167 -60
8112 -60 199 74 -187 -41 206 66 -184 -62 204 49 -189 -45 188 43 -194 -34 197 17 -206 1
8132 1 201 22 -196 2 198 -15 -191 25 200 -17 -194 18 189 -42 -194 50 194 -33 -175 66 198
8153 198 -48 -176 92 204 -58 -173 87 195 -60 -158 110 200 -69 -154 109 179 -105 -150 119 152 -105 -158
8175 -158 119 140 -121 -157 118 148 -137 -131 140 151 -144 -134 156 118 -152 -134
8191a34
$$ Imaginary data points
##PAGE= N=2
##DATA TABLE= (X++(I..I)), XYDATA
0 0 0 0 0 0 0 0 0 0 0 0 -16 16 -16 16 -17 32 -48 48 -49 67 -81 97 -115 145 -161 193 -226 258 -304 349 -392
31 -392 451 -515 580 -655 743 -832 930 -1045 1165 -1294 1445 -1602 1772 -1964 2172 -2391
47 -2391 2640 -2914 3205 -3534 3894 -4287 4731 -5228 5782 -6411 7137 -7969 8948 -10124
61 -10124 11548 -13325 15621 -18708 23090 -29873 41770 -68518 251181 -536405 -1345151
72 -1345151 -273340 850676 936688 18006 -749354 -831919 -17592 931780 917930 -343498
82 -343498 -1267576 -570829 891267 1128474 -20084 -988611 -705862 226515 821376 602823
92 602823 -239215 -957791 -608265 596178 1153284 199904 -1020082 -885519 325720 983703
102 983703 452800 -445350 -778311 -358447 446950 875111 303699 -769542 -950771 129503
112 129503 1060021 592033 -567653 -902012 -177886 594525 666772 110037 -573676 -728553
122 -728553 -22602 846753 704951 -400047 -1007081 -292523 730960 751731 -75292 -667746
132 -667746 -507761 106501 625808 543286 -211071 -841528 -440880 596906 880446 9706
142 9706 -812317 -555995 291941 670242 319402 -282616 -607154 -334381 386131 759043
152 759043 179305 -710091 -695344 233778 810906 335140 -454549 -607160 -123642 403115
162 403115 529080 128989 -493877 -622551 55035 745921 478112 -425973 -739833 -108858
172 -108858 556516 489936 -59945 -461483 -409303 50739 537117 456870 -247928 -717403
182 -717403 -250401 561809 613458 -106096 -596361 -333794 216600 459978 263587 -193563
192 -193563 -520255 -276972 388028 629801 32066 -629755 -446987 284923 573639 163811
202 163811 -330007 -411098 -114164 294292 457277 99410 -472805 -498074 160190 631988
212 631988 259714 -416032 -498443 2712 395873 325404 -25700 -349424 -359440 60222
222 60222 501932 339740 -313439 -577525 -69605 495059 382192 -153518 -412373 -212498
232 -212498 142930 356531 240660 -187036 -479726 -174211 418060 478431 -105210 -519947
242 -519947 -240589 274132 383188 89250 -227984 -324383 -116749 276645 416834 14719
252 14719 -472405 -346864 252061 492759 88702 -355335 -316127 30294 277110 261519
262 261519 -1413 -325878 -322000 125309 474942 197840 -358219 -421059 56175 393011
272 393011 223001 -134768 -290329 -177465 103173 333994 208318 -233847 -432159 -48910
282 -48910 418981 318045 -181983 -389700 -114717 216516 269270 82673 -179253 -305681
292 -305681 -90750 305216 355528 -87184 -436304 -195421 281447 348417 602 -268267
302 -268267 -217129 10788 222804 249161 -17235 -337789 -257062 199784 413149 65969
312 65969 -346985 -275800 106188 286606 144006 -92291 -234923 -174417 108079 333794
322 333794 146575 -281486 -353964 57855 373618 181481 -194167 -272654 -60952 154615
332 154615 219072 91113 -175764 -297890 -35312 327957 267679 -165122 -362477 -75992
342 -75992 256487 229678 -23185 -191884 -178921 -10195 214942 238694 -64357 -339826 -166721
353 -166721 248388 319232 -30423 -289796 -163503 99583 201354 121706 -58820 -225473
363 -225473 -166006 144762 320616 61237 -302527 -249638 127416 291443 82940 -158913
373 -158913 -184962 -57420 110489 211610 87859 -202098 -274504 39643 323675 161561
383 161561 -204560 -262910 558 195479 148771 -5593 -143120 -178151 -11212 233373
393 233373 207497 -126464 -311960 -65862 255161 210370 -77655 -208230 -98911 61347
403 61347 155517 130304 -56211 -238163 -128911 192174 272658 -27557 -277857 -140882 142382
414 142382 197450 40579 -104013 -147327 -75519 107526 219955 48748 -233638 -213259 110786
425 110786 273541 61909 -189579 -165469 19259 129437 121836 20894 -139819 -183500 25494
436 25494 249280 140617 -176391 -244111 17308 214669 118009 -72863 -137375 -84864 28601
447 28601 152999 133658 -88097 -239490 -62499 218836 194189 -88148 -216725 -61840
457 -61840 115035 128894 41586 -68429 -147808 -77181 133914 208437 -12532 -237113 -131171
468 -131171 145532 198106 2180 -142781 -105033 2955 93830 126831 22238 -160362 -163306
479 -163306 77704 233553 61959 -186590 -161896 55938 153514 68612 -42716 -102876 -95335
490 -95335 25055 168280 110409 -129012 -210741 7213 208328 112027 -106045 -146567 -25625
501 -25625 72917 97489 58763 -62115 -159751 -54447 163394 171506 -69944 -209183 -54681
512 -54681 142480 124280 -17505 -91443 -80979 -21238 87356 137322 394 -179274 -120765
523 -120765 120735 190706 -3996 -162839 -90070 56451 97055 55997 -12661 -99339 -105563
534 -105563 46202 177893 64951 -156931 -156902 59089 166591 47299 -87578 -89289 -26342
545 -26342 38635 98679 69646 -82225 -162103 -9276 176983 111521 -105989 -153823 -899
556 -899 107185 70205 -3292 -55158 -87938 -33137 106234 134057 -41691 -179374 -59409
567 -59409 139396 126614 -42724 -113653 -44236 29247 62716 69609 -1418 -117146 -96891 83157
579 83157 164826 6693 -156684 -89487 78880 107971 15016 -49483 -61526 -46330 30356
590 30356 115204 55803 -112117 -137257 41445 158541 46769 -105661 -91388 15149 61851
601 61851 51673 21732 -50540 -102960 -16098 127969 101474 -81721 -146877 -2310 121543
612 121543 65688 -43088 -64959 -35274 719 61261 83365 -18991 -130991 -61110 111214
623 111214 123316 -39376 -125032 -34484 65080 59559 15731 -19216 -63492 -58892 47301 121779
635 121779 19827 -127737 -90758 74033 116393 1569 -79180 -47221 4301 32201 57995
646 57995 32640 -66812 -102964 18111 131425 53339 -99612 -97786 30323 84605 28887
657 28887 -22697 -37956 -46378 -8569 76830 78471 -49737 -124261 -14677 115402 71201 -58860
669 -58860 -80758 -6385 36533 36044 31675 -10842 -78566 -51448 73753 107908 -22447 -120431
681 -120431 -38989 80965 67742 -16909 -43971 -28431 -16502 24959 73200 23819 -88885
692 -88885 -83881 54495 114016 4989 -93855 -48092 37331 45073 17365 2145 -33869 -61759
704 -61759 2244 94138 54789 -78516 -97594 26973 96789 24415 -52850 -40176 -4564 9573
716 9573 37195 46675 -24180 -90843 -24278 93812 74007 -54878 -90615 1534 62434 29316
728 29316 -8498 -16685 -35325 -30829 40364 80976 -4753 -100347 -46016 76589 76372 -26913
740 -26913 -65209 -14430 19742 19286 29681 15285 -50604 -65570 30188 97459 16165 -89736
752 -89736 -55722 48288 60878 -1699 -27727 -18490 -21699 -910 54663 46146 -50024 -86052
764 -86052 12372 93549 31444 -63835 -50788 17344 32071 14418 12290 -10509 -52768 -25681
776 -25681 62764 68792 -36802 -89300 -6296 73180 36247 -31626 -32282 -7320 -3206 17686 46409
789 46409 6640 -68751 -48276 56079 78308 -18228 -76033 -18116 42998 27666 -1520 -3713
801 -3713 -20724 -37715 9545 68904 26435 -69472 -61893 40069 72183 -1630 -50103 -19179
813 -19179 10458 8059 20294 27427 -22177 -63305 -5033 75622 41700 -56783 -62217 20286 52090
826 52090 8487 -18102 -10057 -17260 -16612 30622 53102 -14160 -74861 -19900 67469 47340 -36628
839 -36628 -49018 3644 23373 8846 12517 7254 -34998 -40788 29803 68836 -1724 -72544 -29114
852 -29114 49844 40988 -16566 -25375 -4573 -7465 -461 35889 27840 -41462 -58533 21585 71653
865 71653 9093 -58395 -28829 28042 23707 -1163 3156 -4362 -33980 -14600 48563 44459 -38040
878 -38040 -64542 10576 60968 14215 -36218 -19037 6885 261 7492 29554 1992 -50742
890 -50742 -28122 49586 52373 -27827 -57915 1021 40677 12106 -12228 -2458 -8674 -23563 8527
903 8527 48527 11566 -56020 -37098 41645 50124 -15913 -41353 -3215 16500 2567 8099 17457
916 17457 -16433 -43328 3817 57775 20175 -51486 -38496 29282 38079 -6737 -18902 -783
928 -783 -6537 -11780 21626 35711 -17083 -54839 -3095 56293 24195 -39518 -31347 16066 19153
941 19153 -1999 4397 6494 -23987 -26256 27042 47543 -12423 -55829 -9086 45558 22187 -23809
954 -23809 -17551 5244 -2021 -2210 23671 16254 -33314 -37405 25242 51000 -5667 -47694 -11315
967 -11315 29702 13759 -9192 322 -308 -21757 -7230 36425 26083 -35132 -43020 19419 46242
980 46242 -764 -33431 -7713 13096 -128 1237 19184 -450 -36959 -14400 41795 32497
992 32497 -31163 -41182 12838 34168 189 -16030 1136 -1313 -16081 6663 34699 2967
1004 2967 -44586 -20250 39478 32870 -23331 -31806 7440 17426 -2810 893 12625 -11205 -30134
1017 -30134 7252 43607 7531 -44007 -22400 31493 26696 -14764 -17094 5359 -294 -9608 14156
1030 14156 24467 -15765 -39842 4763 45238 10528 -37259 -19126 21431 14651 -8690 223
1042 223 7468 -15979 -18472 22406 33884 -16047 -43176 1910 39939 9647 -26483 -10251 11852
1055 11852 -925 -5824 16678 12125 -26863 -26018 25162 37746 -13437 -39057 334 28957 4808
1068 4808 -14104 1889 4313 -16101 -5763 28543 16918 -31186 -29665 22834 34927 -9644
1080 -9644 -28856 1051 15302 -3131 -3174 14602 189 -27919 -7799 34303 20204 -29839 -28457
1093 -28457 17996 26551 -7252 -15478 5045 2402 -13062 4286 25882 -663 -34982 -10162
1105 -10162 34449 20186 -25023 -22140 13386 14320 -7605 -1653 11679 -7730 -22725 8044 33289
1118 33289 260 -36251 -10854 29826 16039 -18487 -11854 10053 831 -10129 10007 18488
1130 18488 -13785 -29265 8578 35057 1467 -31916 -9028 22008 8488 -12047 31 8601
1142 8601 -11144 -13778 17659 23710 -15762 -31487 7270 31610 1502 -24004 -4194 13690
1154 13690 -1353 -7507 11678 9305 -20130 -17525 21458 26237 -15300 -29257 6386 24407 -1143
1167 -1143 -14736 3570 6676 -12162 -5230 21524 11016 -25556 -19607 22096 24845 -13879 -22804
1180 -22804 6876 14659 -6156 -5644 12365 1436 -21446 -4404 27464 12024 -26682 -18640 19851
1193 19851 19321 -12001 -13368 8520 4376 -11939 1882 19906 -1723 -27116 -4248 28780 11403
1206 11403 -23984 -14441 16135 10917 -10681 -2864 11333 -4646 -17553 7018 25128 -3174
1218 -3174 -28845 -3679 26332 8427 -19318 -7358 12638 882 -10742 7076 14836 -11487
1230 -11487 -21884 9979 27056 -4109 -26734 -1635 21132 2869 -13957 1585 9940 -9077
1242 -9077 -11621 14911 17508 -15584 -23397 11085 25042 -4996 -21192 1801 14264 -3947 -8764
1255 -8764 10276 8106 -16741 -12373 19256 18323 -16484 -21545 10670 19658 -6070 -13632 6041
1268 6041 7379 -10750 -4707 17205 7136 -21170 -12494 20293 16832 -15397 -16796 10118 12198
1281 12198 -8198 -5808 11099 1637 -16933 -2089 21898 6399 -22783 -11200 19187 12804
1293 12804 -13824 -9852 10403 3941 -11399 1200 16084 -2558 -21347 -349 23636 5073
1305 5073 -21526 -7958 16547 6711 -12135 -1853 11246 -3675 -14426 6490 19424 -5105
1317 -5105 -22712 940 22117 2809 -17962 -3192 13096 -268 -10659 5628 12216 -9481
1329 -9481 -16471 9623 20402 -6396 -21190 2338 18231 -603 -13420 2608 9904 -7300
1341 -7300 -9844 11775 13038 -13354 -17085 11306 18980 -7494 -17332 4752 13028 -5299 -8812
1354 -8812 8973 7255 -13586 -9179 16229 12828 -15480 -15523 12135 15098 -8829 -11627 7965 7202
1368 7202 -10368 -4513 14552 5022 -17838 -7991 18222 11084 -15648 -11777 12089 9415 -10051
1381 -10051 -5222 11032 1757 -14433 -992 17980 3052 -19351 -6152 17731 7813 -14333
1393 -14333 -6592 11483 2985 -11202 807 13572 -2699 -17057 1675 19171 1059 -18602
1405 -18602 -3319 15689 3173 -12449 -442 11034 -3381 -12326 6052 15304 -6141 -17900
1417 -17900 3978 18227 -1444 -16059 613 12733 -2292 -10415 5781 10534 -8877 -12792
1429 -12792 9906 15462 -8470 -16588 5911 15220 -4282 -12135 4879 9272 -7607 -8320 10776
1442 10776 9714 -12520 -12239 11857 13901 -9563 -13420 7348 10837 -6964 -7765 8813 5947 -11825
1456 -11825 -6447 14057 8514 -14263 -10563 12431 10859 -10057 -8996 8852 5970 -9808 -3556
1469 -3556 12380 3111 -14888 -4571 15826 6668 -14664 -7588 12354 6468 -10562 -3773 10641
1482 10641 1044 -12545 203 15064 561 -16488 -2459 15976 3878 -13900 -3502 11697
1494 11697 1357 -10916 1405 11999 -3258 -14207 3183 15951 -1629 -16070 -81 14364
1506 14364 418 -12054 1022 10585 -3596 -10902 5759 12626 -6383 -14496 5290 15111 -3569
1519 -3569 -13973 2670 11749 -3437 -9830 5625 9383 -7960 -10537 9152 12343 -8604 -13336
1532 -13336 7084 12763 -5790 -10775 5921 8596 -7553 -7481 9863 7988 -11437 -9447 11457
1545 11457 10677 -10213 -10599 8697 8988 -8201 -6799 9174 5164 -11165 -5045 12887 6104 -13402
1559 -13402 -7441 12426 7804 -10843 -6718 9786 4669 -10101 -2797 11607 2071 -13302 -2718
1572 -2718 14125 3982 -13576 -4706 12100 4147 -10694 -2433 10401 476 -11346 702 12950
1585 12950 -533 -13979 -478 13872 1420 -12615 -1308 11095 -3 -10295 1899 10726
1597 10726 -3410 -12020 3720 13179 -2990 -13423 1983 12441 -1705 -10924 2534 9731 -4221
1610 -4221 -9632 5812 10499 -6534 -11642 6111 12119 -5137 -11514 4481 10085 -4825 -8659
1623 -8659 6115 8066 -7659 -8513 8624 9513 -8499 -10168 7642 9904 -6772 -8707 6651 7225
1637 7225 -7508 -6281 8919 6305 -10021 -7054 10241 7805 -9589 -7845 8660 6948 -8211
1650 -8211 -5506 8651 4271 -9831 -3902 10992 4330 -11512 -5053 11102 5288 -10214 -4691
1663 -4691 9493 3371 -9540 -2017 10349 1289 -11465 -1365 12125 1964 -11998 -2369 11160
1676 11160 2075 -10248 -1016 9913 -295 -10324 1282 11228 -1472 -11918 1051 12007
1688 12007 -501 -11298 527 10345 -1256 -9642 2456 9693 -3541 -10316 3987 11044 -3730
1701 -3730 -11259 3198 10745 -2967 -9776 3391 8907 -4429 -8607 5512 8945 -6194 -9572
1714 -9572 6169 9890 -5716 -9586 5331 8699 -5507 -7719 6279 7091 -7330 -7138 8134 7602
1728 7602 -8301 -7938 7963 7829 -7462 -7052 7367 6049 -7812 -5201 8715 4973 -9499 -5213
1742 -5213 9799 5599 -9518 -5587 8981 5042 -8610 -4087 8754 3180 -9390 -2718 10097
1755 10097 2788 -10479 -3131 10322 3281 -9797 -2931 9243 2099 -9130 -1176 9489 522
1768 522 -10127 -421 10573 657 -10539 -865 10035 683 -9435 -7 9103 -894 -9238 1680
1782 1680 9739 -1992 -10141 1871 10238 -1643 -9832 1709 9180 -2158 -8668 2983 8568
1795 8568 -3789 -8837 4222 9231 -4220 -9356 3974 9037 -3879 -8426 4134 7770 -4792
1808 -4792 -7482 5499 7519 -6019 -7840 6074 7980 -5880 -7795 5625 7221 -5723 -6551 6131
1822 6131 6060 -6784 -5981 7299 6143 -7492 -6308 7338 6189 -7054 -5726 6987 5064 -7222
1836 -7222 -4446 7768 4168 -8278 -4184 8552 4338 -8457 -4241 8219 3860 -7991 -3215
1849 -3215 8106 2546 -8455 -2116 8918 2004 -9189 -2051 9128 2007 -8864 -1722 8557
1862 8557 1130 -8460 -506 8606 -34 -8971 222 9194 -239 -9181 208 8890 -402 -8546 840
1877 840 8267 -1414 -8280 1951 8493 -2236 -8642 2287 8695 -2217 -8404 2311 8011 -2626
1891 -2626 -7630 3167 7507 -3661 -7549 4041 7714 -4140 -7712 4121 7493 -4121 -7083
1904 -7083 4359 6647 -4769 -6358 5262 6267 -5633 -6327 5808 6326 -5808 -6120 5746 5711
1918 5711 -5842 -5265 6106 4849 -6527 -4671 6865 4634 -7043 -4648 6989 4483 -6889
1931 -6889 -4122 6852 3665 -6978 -3227 7271 2973 -7528 -2863 7714 2867 -7647 -2732
1944 -2732 7512 2479 -7362 -2040 7396 1609 -7551 -1262 7800 1125 -7929 -1068 7912 965 -7738
1959 -7738 -718 7563 322 -7501 101 7544 -497 -7716 710 7825 -841 -7815 899 7634 -1119
1974 -1119 -7407 1437 7217 -1880 -7175 2272 7237 -2523 -7291 2679 7269 -2756 -7092 2889 6825
1989 6825 -3119 -6563 3504 6453 -3819 -6397 4084 6419 -4194 -6366 4257 6206 -4286
2002 -4286 -5884 4483 5595 -4747 -5379 5040 5277 -5268 -5236 5390 5176 -5422 -5006 5430 4686
2017 4686 -5561 -4402 5731 4088 -5992 -3916 6203 3797 -6330 -3717 6344 3503 -6337
2030 -6337 -3204 6372 2851 -6520 -2544 6672 2279 -6847 -2121 6971 1992 -6943 -1802 6905 1537
2045 1537 -6837 -1167 6866 852 -6961 -576 7084 416 -7115 -273 7093 125 -6974 113 6847
2060 6847 -420 -6780 730 6809 -971 -6825 1142 6841 -1267 -6779 1394 6638 -1595 -6482 1849
2075 1849 6326 -2124 -6299 2369 6286 -2563 -6227 2694 6146 -2809 -5964 2979 5784 -3184 -5590
2090 -5590 3463 5476 -3694 -5380 3920 5308 -3996 -5148 4118 4995 -4225 -4731 4427 4511 -4622 -4329
2106 -4329 4836 4211 -4992 -4086 5081 3926 -5127 -3742 5186 3478 -5313 -3260 5424 3057 -5581
2121 -5581 -2910 5660 2773 -5738 -2639 5725 2433 -5762 -2221 5766 1974 -5864 -1762 5940 1597
2136 1597 -6024 -1432 6022 1282 -6024 -1086 6004 862 -5971 -605 6029 374 -6063 -156 6112
2151 6112 9 -6080 153 6051 -341 -5954 604 5920 -843 -5880 1098 5877 -1297 -5868 1458
2166 1458 5818 -1641 -5735 1780 5584 -2021 -5511 2229 5387 -2461 -5354 2625 5296 -2779 -5234
2181 -5234 2873 5090 -3008 -4932 3194 4784 -3361 -4666 3547 4593 -3692 -4507 3805 4405 -3877
2196 -3877 -4251 3994 4096 -4108 -3882 4278 3767 -4394 -3592 4562 3519 -4629 -3351 4716 3182 -4760
2212 -4760 -2961 4841 2751 -4971 -2552 5076 2402 -5190 -2258 5235 2078 -5264 -1896 5270 1667
2227 1667 -5310 -1439 5371 1204 -5469 -1027 5524 886 -5520 -736 5515 578 -5460 -348 5428
2242 5428 133 -5431 88 5475 -252 -5471 381 5464 -476 -5389 646 5326 -811 -5225 1053
2257 1053 5190 -1215 -5156 1401 5177 -1494 -5112 1652 5036 -1757 -4887 1919 4776 -2106 -4689
2272 -4689 2317 4635 -2467 -4600 2590 4514 -2714 -4425 2796 4253 -2953 -4086 3109 3947 -3300
2287 -3300 -3869 3463 3785 -3560 -3695 3623 3560 -3701 -3377 3786 3190 -3905 -3029 4060 2919 -4172 -2802
2304 -2802 4262 2737 -4264 -2576 4312 2435 -4322 -2200 4402 2046 -4496 -1907 4603 1791 -4660
2319 -4660 -1706 4652 1571 -4660 -1422 4629 1205 -4679 -1010 4716 822 -4831 -713 4829 583
2334 583 -4837 -474 4770 275 -4740 -73 4711 -158 -4720 345 4767 -493 -4767 618 4738
2349 4738 -739 -4639 890 4548 -1065 -4448 1290 4440 -1481 -4426 1657 4425 -1718 -4344 1835
2364 1835 4259 -1911 -4092 2080 3992 -2246 -3886 2435 3885 -2548 -3837 2629 3761 -2713 -3667
2379 -3667 2742 3489 -2863 -3360 3010 3232 -3176 -3172 3269 3096 -3364 -3014 3393 2891 -3429 -2696 3506
2396 3506 2520 -3619 -2351 3755 2255 -3846 -2143 3932 2088 -3922 -1914 3957 1741 -3944 -1529
2411 -1529 4035 1367 -4109 -1182 4227 1119 -4241 -1001 4263 899 -4222 -712 4169 522 -4181
2426 -4181 -346 4213 168 -4283 -81 4295 -25 -4283 95 4200 -236 -4149 392 4081 -615
2441 -615 -4106 751 4128 -870 -4125 932 4098 -1018 -4023 1120 3931 -1269 -3817 1483 3774
2456 3774 -1621 -3775 1781 3796 -1826 -3703 1913 3632 -1978 -3459 2137 3356 -2292 -3236 2468
2471 2468 3209 -2583 -3175 2681 3094 -2696 -2986 2735 2834 -2844 -2676 2937 2525 -3120 -2471 3216 2409
2488 2409 -3297 -2371 3288 2261 -3304 -2117 3338 1933 -3438 -1788 3535 1686 -3638 -1633 3685
2503 3685 1589 -3679 -1475 3656 1349 -3645 -1157 3704 991 -3764 -850 3868 785 -3891 -689
2518 -689 3899 639 -3827 -488 3779 283 -3777 -77 3827 -66 -3873 184 3912 -251 -3868
2533 -3868 321 3799 -451 -3719 637 3640 -821 -3645 972 3648 -1113 -3674 1176 3629 -1221
2548 -1221 -3548 1331 3419 -1432 -3305 1610 3274 -1755 -3240 1893 3285 -1914 -3204 1963 3128
2563 3128 -1989 -2970 2100 2873 -2240 -2762 2386 2713 -2481 -2696 2557 2680 -2555 -2573 2599 2424 -2647
2580 -2647 -2257 2755 2111 -2901 -2058 2981 1982 -3074 -1948 3048 1829 -3065 -1682 3059 1491 -3136
2596 -3136 -1351 3231 1226 -3314 -1184 3352 1114 -3357 -1031 3320 887 -3285 -710 3325 557
2611 557 -3369 -419 3446 382 -3467 -290 3473 260 -3370 -132 3338 -1 -3293 183 3342
2626 3342 -300 -3378 414 3404 -424 -3391 478 3317 -580 -3238 695 3167 -864 -3146 1020
2641 1020 3149 -1131 -3178 1195 3137 -1246 -3075 1298 2964 -1429 -2862 1566 2784 -1717 -2759
2656 -2759 1840 2748 -1899 -2708 1949 2640 -1962 -2489 2049 2373 -2152 -2252 2314 2216 -2410 -2188 2477
2673 2477 2179 -2468 -2064 2503 1960 -2514 -1804 2597 1685 -2706 -1601 2802 1566 -2872 -1538 2873
2689 2873 1464 -2869 -1370 2837 1202 -2877 -1063 2957 950 -3064 -900 3089 850 -3101 -785
2704 -785 3057 689 -3034 -522 3019 344 -3063 -217 3127 146 -3157 -71 3181 38 -3096
2719 -3096 97 3038 -204 -2982 389 3006 -526 -3010 617 3058 -674 -3041 708 2969 -762
2734 -762 -2862 880 2775 -1026 -2762 1166 2754 -1272 -2769 1327 2746 -1352 -2712 1358 2585
2749 2585 -1445 -2501 1537 2420 -1708 -2415 1782 2386 -1853 -2380 1858 2315 -1854 -2219 1937 2096 -2010
2766 -2010 -1965 2148 1925 -2246 -1895 2314 1883 -2291 -1791 2307 1699 -2311 -1542 2390 1430 -2477 -1317
2783 -1317 2570 1274 -2628 -1256 2624 1186 -2604 -1083 2561 940 -2582 -810 2648 674 -2756
2798 -2756 -654 2773 612 -2794 -573 2733 489 -2701 -369 2670 220 -2687 -99 2747 43
2813 43 -2798 15 2808 -30 -2735 100 2705 -189 -2628 369 2634 -464 -2659 584 2689
2828 2689 -611 -2667 649 2634 -674 -2532 785 2455 -914 -2411 1035 2388 -1166 -2426 1208
2843 1208 2393 -1240 -2356 1266 2242 -1350 -2131 1444 2041 -1579 -2006 1657 1988 -1718 -1997 1730
2859 1730 1934 -1728 -1833 1766 1740 -1832 -1624 1943 1573 -2020 -1543 2091 1558 -2078 -1482 2099 1428
2876 1428 -2077 -1277 2134 1177 -2185 -1085 2295 1067 -2328 -1016 2347 979 -2322 -902 2294
2891 2294 781 -2321 -636 2344 513 -2427 -475 2463 421 -2474 -391 2416 309 -2386 -194
2906 -194 2345 56 -2371 60 2397 -145 -2461 176 2432 -210 -2382 254 2339 -344 -2288
2921 -2288 487 2263 -590 -2265 679 2311 -709 -2302 748 2266 -754 -2174 833 2120 -942
2936 -942 -2068 1055 2069 -1143 -2080 1197 2075 -1196 -2038 1210 1949 -1276 -1869 1334 1792 -1452 -1761
2953 -1761 1542 1722 -1608 -1727 1619 1683 -1629 -1615 1639 1492 -1705 -1385 1795 1327 -1867 -1271 1938
2970 1938 1270 -1937 -1234 1945 1161 -1906 -1024 1958 957 -2008 -829 2098 802 -2137 -775 2159
2986 2159 763 -2129 -677 2112 592 -2098 -484 2128 384 -2190 -331 2230 294 -2261 -286
3001 -286 2216 220 -2193 -155 2143 42 -2149 82 2183 -163 -2241 184 2239 -215 -2203
3016 -2203 241 2134 -320 -2082 437 2066 -554 -2063 654 2093 -675 -2083 712 2052 -734
3031 -734 -1962 808 1911 -891 -1836 998 1819 -1088 -1833 1128 1822 -1157 -1805 1163 1717 -1212 -1640
3048 -1640 1259 1562 -1375 -1534 1437 1494 -1520 -1512 1484 1466 -1517 -1435 1513 1311 -1550 -1240 1624 1190
3066 1190 -1712 -1146 1746 1131 -1779 -1100 1760 1045 -1767 -926 1788 852 -1817 -737 1923 718
3082 718 -1934 -670 1953 656 -1929 -577 1910 497 -1908 -400 1910 286 -1958 -222 2000
3097 2000 185 -2004 -166 1980 112 -1949 -48 1904 -67 -1907 133 1913 -247 -1961 246
3112 246 1958 -308 -1943 307 1893 -371 -1834 452 1807 -553 -1833 644 1840 -670 -1843
3127 -1843 711 1839 -720 -1767 770 1716 -825 -1638 946 1641 -991 -1614 1069 1641 -1069 -1590
3143 -1590 1076 1555 -1115 -1467 1176 1395 -1268 -1334 1342 1333 -1396 -1308 1419 1250 -1416 -1223 1413 1124
3161 1124 -1465 -1051 1492 972 -1598 -960 1630 924 -1664 -915 1657 860 -1644 -768 1658 701 -1690
3178 -1690 -606 1759 568 -1791 -530 1838 533 -1806 -464 1794 416 -1768 -335 1795 248
3193 248 -1827 -180 1869 125 -1870 -126 1850 60 -1849 -17 1789 -93 -1801 159 1791
3208 1791 -274 -1836 299 1808 -362 -1822 343 1761 -427 -1718 495 1666 -582 -1648 657
3223 657 1687 -707 -1664 751 1658 -758 -1604 794 1554 -844 -1504 947 1495 -989 -1468 1077 1468
3240 1468 -1061 -1438 1107 1426 -1111 -1343 1153 1283 -1208 -1230 1289 1219 -1344 -1229 1364 1192 -1384
3257 -1384 -1157 1368 1070 -1406 -1004 1435 907 -1526 -896 1535 860 -1586 -850 1577 796 -1579 -720
3274 -720 1571 638 -1586 -559 1642 512 -1674 -476 1718 435 -1702 -401 1694 353 -1636
3289 -1636 -253 1668 191 -1679 -111 1734 96 -1757 -47 1746 18 -1706 29 1683 -88
3304 -88 -1671 167 1665 -257 -1701 273 1714 -313 -1713 337 1666 -396 -1637 442 1595
3319 1595 -534 -1590 602 1583 -645 -1595 682 1590 -718 -1530 743 1495 -779 -1407 883 1389 -928
3336 -928 -1356 1007 1379 -1020 -1342 1041 1317 -1055 -1229 1093 1178 -1140 -1108 1200 1093 -1257 -1061 1289
3354 1289 1059 -1312 -1029 1306 941 -1325 -880 1353 823 -1416 -791 1444 756 -1510 -751 1478 703
3371 703 -1478 -658 1493 569 -1524 -520 1560 461 -1572 -418 1617 395 -1614 -352 1594 312
3387 312 -1575 -216 1597 165 -1589 -77 1631 68 -1632 -6 1645 -4 -1595 96 1596
3402 1596 -129 -1553 226 1549 -284 -1561 349 1583 -378 -1567 400 1533 -436 -1504 484
3417 484 1450 -573 -1453 615 1438 -679 -1442 708 1425 -750 -1404 757 1355 -789 -1319 865 1293
3434 1293 -918 -1262 982 1279 -1011 -1218 1037 1230 -1040 -1154 1089 1116 -1110 -1058 1188 1025 -1223
3451 -1223 -997 1264 966 -1276 -935 1288 892 -1300 -814 1327 752 -1368 -710 1390 664 -1450 -649
3468 -649 1441 591 -1443 -568 1429 462 -1464 -425 1484 369 -1518 -324 1534 299 -1557 -271
3484 -271 1540 230 -1521 -153 1519 113 -1549 -16 1571 6 -1579 47 1610 -59 -1557
3499 -1557 117 1558 -154 -1512 223 1531 -271 -1521 344 1534 -388 -1535 407 1508 -444
3514 -444 -1480 486 1431 -558 -1427 601 1388 -698 -1415 692 1369 -747 -1344 780 1293 -819 -1255
3531 -1255 852 1233 -908 -1200 965 1177 -987 -1147 1019 1141 -1033 -1081 1077 1052 -1113 -969 1169
3548 1169 971 -1198 -916 1237 921 -1232 -877 1260 850 -1272 -790 1294 715 -1338 -679 1372 631
3565 631 -1399 -612 1404 563 -1434 -545 1404 468 -1434 -410 1430 334 -1472 -326 1489 266
3581 266 -1505 -236 1471 180 -1462 -140 1466 72 -1455 7 1479 -27 -1472 109 1483
3596 1483 -93 -1466 165 1450 -197 -1408 285 1416 -309 -1403 367 1426 -404 -1403 451
3611 451 1392 -468 -1372 512 1336 -555 -1322 619 1291 -672 -1314 685 1289 -756 -1279 752 1228
3628 1228 -801 -1198 850 1160 -900 -1138 945 1098 -981 -1080 1032 1060 -1019 -995 1078 975 -1072 -898
3646 -898 1140 879 -1154 -819 1206 810 -1205 -748 1254 734 -1236 -658 1260 632 -1277 -563 1331
3663 1331 525 -1326 -502 1362 453 -1374 -439 1353 371 -1381 -326 1379 245 -1434 -229 1433
3679 1433 167 -1464 -168 1454 104 -1451 -68 1426 -4 -1453 38 1454 -102 -1448 166
3694 166 1468 -182 -1452 227 1435 -263 -1406 341 1408 -359 -1366 435 1374 -458 -1364 527
3710 527 1354 -534 -1303 585 1286 -642 -1248 672 1212 -749 -1220 762 1183 -819 -1190 821 1129
3727 1129 -891 -1113 900 1057 -954 -1053 979 1004 -1041 -1007 1049 973 -1069 -925 1109 904 -1127 -860
3745 -860 1156 816 -1192 -771 1229 756 -1231 -705 1264 686 -1264 -629 1308 592 -1277 -523 1338
3762 1338 504 -1348 -442 1379 407 -1378 -369 1381 312 -1374 -276 1384 201 -1412 -180 1392
3778 1392 100 -1408 -95 1402 18 -1411 -16 1378 -76 -1389 101 1377 -156 -1395 180
3793 180 1379 -245 -1382 279 1366 -315 -1345 359 1338 -396 -1318 465 1325 -510 -1329 548
3809 548 1301 -586 -1292 605 1250 -646 -1226 694 1199 -752 -1202 775 1157 -827 -1143 838 1086
3826 1086 -895 -1063 894 1013 -959 -1001 963 956 -1025 -942 1041 891 -1080 -844 1084 803 -1101 -770
3844 -770 1149 720 -1184 -676 1185 674 -1206 -604 1249 602 -1238 -541 1270 513 -1269 -436 1303
3861 1303 405 -1312 -369 1339 338 -1342 -287 1349 244 -1344 -201 1347 140 -1364 -110
3876 -110 1387 58 -1395 -23 1375 -44 -1386 40 1359 -127 -1361 164 1345 -210 -1350
3891 -1350 262 1336 -299 -1332 322 1312 -378 -1275 428 1266 -462 -1236 536 1249 -555 -1203
3907 -1203 611 1211 -629 -1171 692 1158 -702 -1116 752 1103 -770 -1064 825 1060 -874 -1053 880
3924 880 999 -921 -974 969 930 -984 -926 1006 865 -1075 -862 1082 803 -1111 -778 1130 738 -1166
3942 -1166 -698 1177 652 -1203 -617 1231 584 -1241 -525 1252 504 -1271 -442 1289 428 -1283 -339
3959 -339 1318 319 -1311 -256 1333 224 -1323 -179 1345 141 -1330 -95 1341 58 -1342
3974 -1342 -3 1318 -46 -1350 87 1346 -114 -1351 151 1326 -213 -1343 243 1298 -308
3989 -308 -1335 334 1305 -391 -1309 416 1284 -464 -1266 516 1242 -558 -1233 594 1228 -620 -1186
4006 -1186 681 1176 -712 -1138 751 1132 -774 -1082 808 1063 -833 -1030 897 1020 -911 -951 959
4023 959 935 -959 -900 1012 866 -1035 -832 1055 777 -1085 -745 1099 717 -1149 -689 1146 626 -1200
4041 -1200 -616 1196 569 -1231 -526 1247 476 -1257 -447 1278 406 -1286 -364 1313 327 -1306 -274
4058 -274 1337 240 -1329 -168 1359 157 -1332 -94 1344 71 -1351 -7 1356 -27 -1326
4073 -1326 74 1351 -116 -1332 182 1325 -206 -1304 255 1301 -307 -1297 342 1268 -376
4088 -376 -1276 407 1226 -486 -1232 491 1197 -569 -1204 575 1145 -640 -1170 662 1144 -700 -1106
4105 -1106 750 1100 -785 -1052 831 1037 -853 -998 897 993 -901 -957 958 946 -963 -888 1034 869
4123 869 -1046 -833 1081 782 -1100 -763 1111 711 -1152 -683 1170 627 -1204 -599 1188 535 -1240
4140 -1240 -520 1247 467 -1267 -425 1248 363 -1295 -333 1285 282 -1297 -245 1305 195 -1314
4156 -1314 -164 1311 121 -1310 -55 1328 25 -1317 34 1338 -61 -1329 121 1349 -142
4171 -142 -1324 208 1322 -238 -1318 304 1306 -342 -1304 366 1303 -441 -1285 461 1264 -525
4187 -525 -1278 529 1233 -608 -1245 627 1176 -692 -1193 710 1130 -765 -1128 778 1087 -821 -1058
4204 -1058 855 1047 -893 -1000 928 969 -975 -934 989 905 -1010 -852 1050 839 -1058 -794 1114 777
4222 777 -1111 -720 1158 699 -1174 -644 1224 616 -1204 -575 1249 522 -1277 -502 1282 438 -1302
4239 -1302 -438 1321 349 -1337 -350 1348 270 -1374 -260 1356 185 -1386 -130 1377 92 -1396
4255 -1396 -71 1406 5 -1378 47 1393 -65 -1376 127 1377 -163 -1361 234 1364 -261
4270 -261 -1332 335 1338 -346 -1307 420 1306 -429 -1287 498 1283 -533 -1268 579 1232 -610 -1233
4287 -1233 636 1189 -697 -1181 721 1144 -780 -1138 810 1104 -871 -1095 878 1063 -917 -1035 960
4304 960 999 -1004 -957 1035 938 -1056 -907 1095 871 -1120 -827 1153 817 -1151 -740 1235 720 -1214
4322 -1214 -669 1269 633 -1255 -581 1298 553 -1282 -493 1298 452 -1320 -400 1324 352 -1341 -318
4339 -318 1357 251 -1360 -229 1358 184 -1380 -155 1360 84 -1399 -44 1381 -10 -1412
4354 -1412 28 1380 -104 -1413 148 1381 -211 -1396 240 1369 -286 -1355 338 1393 -378
4369 -378 -1335 429 1354 -462 -1318 524 1303 -537 -1276 619 1261 -649 -1251 684 1218 -717 -1191
4386 -1191 757 1157 -803 -1136 833 1092 -883 -1068 904 1025 -972 -1016 958 951 -1014 -949 1025 878
4404 878 -1092 -865 1076 810 -1126 -791 1140 743 -1174 -726 1202 677 -1237 -620 1266 605 -1280
4421 -1280 -531 1313 516 -1314 -463 1350 444 -1339 -377 1378 341 -1377 -284 1400 250 -1404
4437 -1404 -197 1414 157 -1417 -117 1424 57 -1441 -15 1402 -35 -1416 76 1392 -135
4452 -135 -1420 166 1398 -242 -1397 264 1372 -337 -1350 363 1332 -418 -1310 462 1327 -504
4468 -504 -1305 567 1299 -579 -1254 639 1251 -664 -1217 731 1204 -763 -1173 819 1153 -832 -1134
4485 -1134 880 1102 -916 -1073 950 1047 -1000 -1023 1025 983 -1076 -966 1080 907 -1129 -889 1140 824
4503 824 -1188 -816 1201 741 -1241 -716 1246 654 -1301 -628 1287 592 -1308 -525 1319 494 -1331
4520 -1331 -429 1367 408 -1363 -322 1394 328 -1365 -248 1410 228 -1376 -156 1419 121
4535 121 -1421 -59 1422 16 -1419 34 1414 -64 -1408 117 1413 -163 -1425 223 1401
4550 1401 -282 -1414 315 1404 -367 -1406 389 1368 -453 -1355 494 1322 -537 -1317 587 1295
4566 1295 -629 -1272 683 1258 -718 -1226 750 1213 -791 -1137 839 1123 -859 -1080 915 1076 -918
4583 -918 -1028 994 1005 -987 -966 1038 913 -1057 -884 1095 852 -1125 -826 1146 755 -1177 -751 1194
4601 1194 701 -1232 -668 1238 602 -1303 -584 1306 519 -1351 -494 1323 448 -1349 -410 1361 334
4618 334 -1396 -313 1394 246 -1395 -211 1421 170 -1412 -122 1430 92 -1382 3 1434
4633 1434 -4 -1420 87 1408 -127 -1397 177 1407 -201 -1369 275 1373 -311 -1360 344
4648 344 1334 -414 -1331 466 1304 -500 -1300 513 1280 -573 -1275 598 1224 -690 -1201 709 1186
4665 1186 -765 -1179 795 1156 -832 -1122 868 1095 -919 -1067 965 1036 -962 -993 1032 972 -1052 -923
4683 -923 1101 910 -1102 -844 1150 815 -1164 -756 1207 740 -1218 -689 1252 656 -1254 -614 1283
4700 1283 556 -1283 -506 1306 455 -1339 -419 1331 343 -1372 -346 1347 263 -1377 -246 1346
4716 1346 183 -1385 -138 1377 86 -1393 -49 1405 14 -1394 54 1405 -87 -1384 156
4731 156 1412 -167 -1377 267 1413 -277 -1379 345 1387 -344 -1340 419 1349 -483 -1306 524
4747 524 1305 -559 -1265 603 1278 -654 -1258 684 1212 -738 -1201 752 1140 -811 -1159 840 1075
4764 1075 -903 -1076 903 1024 -948 -1006 968 979 -1003 -930 1034 888 -1060 -845 1094 828 -1121 -790
4782 -790 1182 768 -1161 -696 1202 691 -1218 -609 1265 587 -1277 -528 1281 519 -1326 -461 1333
4799 1333 413 -1337 -360 1340 309 -1368 -270 1387 213 -1394 -187 1386 116 -1412 -98
4814 -98 1396 24 -1403 3 1372 -73 -1400 110 1380 -147 -1375 196 1353 -246 -1346
4829 -1346 288 1329 -338 -1296 392 1316 -435 -1280 483 1294 -493 -1247 554 1239 -587 -1205 639
4846 639 1194 -682 -1162 730 1148 -766 -1124 802 1097 -838 -1088 871 1020 -922 -1017 950 980 -1013
4864 -1013 -942 1030 905 -1075 -901 1064 814 -1128 -806 1138 759 -1143 -723 1166 678 -1204 -646
4881 -646 1222 596 -1240 -542 1278 525 -1247 -428 1296 413 -1286 -357 1306 334 -1306 -262 1324
4898 1324 247 -1324 -176 1327 143 -1331 -83 1348 40 -1362 -1 1340 -51 -1353 75
4913 75 1323 -153 -1352 171 1312 -248 -1351 266 1313 -322 -1348 360 1318 -417 -1287 440
4929 440 1282 -493 -1255 549 1244 -574 -1205 642 1218 -674 -1169 705 1171 -725 -1090 786 1101
4946 1101 -806 -1057 878 1027 -878 -995 918 969 -936 -938 980 890 -1001 -851 1033 814 -1059 -800
4964 -800 1099 735 -1132 -730 1137 674 -1176 -659 1166 582 -1212 -545 1237 495 -1271 -478 1267
4981 1267 443 -1293 -379 1310 342 -1305 -301 1327 253 -1325 -203 1367 167 -1347 -94 1354
4997 1354 99 -1350 -1 1360 -26 -1338 91 1356 -116 -1336 156 1340 -217 -1333 233
5012 233 1302 -291 -1305 328 1262 -389 -1274 419 1246 -480 -1257 499 1214 -555 -1204 576 1175
5029 1175 -634 -1152 666 1123 -705 -1107 755 1102 -777 -1051 819 1039 -842 -996 910 975 -922
5046 -922 -933 988 893 -1001 -868 1026 843 -1050 -793 1089 755 -1104 -723 1123 682 -1160 -646 1169
5064 1169 584 -1220 -582 1188 507 -1232 -492 1209 422 -1256 -398 1241 339 -1275 -318 1287 272
5081 272 -1269 -231 1273 181 -1283 -135 1316 73 -1282 -41 1318 7 -1283 57 1307
5096 1307 -74 -1286 137 1283 -172 -1280 241 1296 -264 -1269 337 1268 -353 -1252 394
5111 394 1242 -440 -1230 468 1196 -540 -1207 574 1151 -623 -1167 634 1113 -694 -1114 704 1062
5128 1062 -766 -1060 781 1001 -836 -1002 855 958 -885 -926 928 891 -928 -831 991 822 -993 -772
5146 -772 1019 768 -1029 -703 1076 692 -1095 -648 1110 609 -1144 -559 1171 524 -1183 -476 1202
5163 1202 447 -1223 -407 1238 362 -1243 -317 1255 262 -1273 -233 1278 156 -1301 -152 1294
5179 1294 91 -1309 -75 1283 17 -1294 24 1296 -91 -1282 143 1289 -164 -1283 229
5194 229 1274 -248 -1254 298 1230 -320 -1212 390 1231 -419 -1194 476 1178 -484 -1156 535 1143
5211 1143 -555 -1116 601 1087 -654 -1073 683 1040 -725 -1041 758 980 -811 -1002 813 945 -873
5228 -873 -926 899 893 -936 -875 949 831 -1026 -819 1016 773 -1042 -736 1079 679 -1084 -641 1137
5246 1137 634 -1126 -565 1169 557 -1164 -500 1188 476 -1183 -408 1209 381 -1200 -330 1243 296
5263 296 -1239 -256 1230 207 -1242 -189 1234 126 -1262 -117 1231 34 -1275 -8 1242
5278 1242 -42 -1261 66 1233 -150 -1264 154 1234 -220 -1224 256 1227 -304 -1229 339
5293 339 1209 -394 -1195 421 1186 -451 -1158 507 1166 -537 -1133 585 1137 -606 -1082 661 1074
5310 1074 -670 -1034 714 1032 -747 -988 775 961 -806 -920 817 894 -866 -886 891 827 -923 -820
5328 -820 922 755 -971 -758 978 693 -1030 -688 1030 624 -1078 -610 1072 550 -1097 -525 1113
5345 1113 487 -1144 -444 1162 415 -1188 -361 1190 339 -1187 -268 1208 249 -1208 -174 1239 167
5362 167 -1222 -120 1235 82 -1236 -34 1247 -17 -1245 39 1216 -89 -1238 137 1199
5377 1199 -186 -1232 186 1180 -260 -1205 278 1159 -356 -1163 370 1130 -407 -1134 422 1105 -474
5394 -474 -1099 507 1074 -536 -1051 597 1048 -608 -1010 665 1006 -685 -951 731 947 -743 -908
5411 -908 786 894 -817 -873 857 841 -878 -815 908 777 -948 -752 955 722 -989 -700 1007 642
5429 642 -1045 -613 1037 549 -1086 -550 1080 504 -1102 -477 1097 421 -1122 -384 1124 347 -1136
5446 -1136 -298 1163 280 -1139 -228 1158 200 -1149 -143 1171 131 -1158 -75 1192 41 -1165
5462 -1165 -2 1187 -20 -1165 94 1168 -133 -1177 163 1163 -198 -1155 248 1139 -287
5477 -287 -1151 321 1128 -371 -1119 387 1089 -462 -1097 468 1063 -528 -1051 555 1040 -578 -1023
5494 -1023 623 1000 -657 -965 682 933 -706 -900 732 900 -771 -851 800 844 -808 -790 839 784
5512 784 -854 -715 886 712 -886 -674 932 660 -963 -611 957 599 -985 -559 1011 509 -1026
5529 -1026 -493 1029 435 -1068 -419 1054 349 -1094 -345 1089 268 -1114 -262 1099 202 -1143 -170
5546 -170 1122 127 -1146 -107 1157 75 -1130 -12 1128 -23 -1134 58 1142 -99 -1121
5561 -1121 140 1122 -149 -1105 225 1106 -228 -1089 271 1079 -303 -1064 339 1042 -384 -1037 402
5578 402 1027 -451 -1016 473 980 -531 -996 529 937 -593 -935 573 898 -647 -916 664 859
5595 859 -715 -860 727 804 -771 -800 794 773 -807 -721 854 702 -844 -673 922 674 -885 -600
5613 -600 933 589 -941 -531 976 535 -973 -470 1002 443 -1001 -412 1030 388 -1033 -351 1045
5630 1045 314 -1055 -278 1032 228 -1057 -224 1050 163 -1054 -150 1058 85 -1066 -53 1070 17
5647 17 -1076 5 1070 -52 -1065 80 1069 -129 -1057 184 1073 -194 -1027 259 1059 -257 -1027
5664 -1027 321 1043 -339 -984 399 1007 -407 -973 459 967 -484 -942 517 937 -551 -915 577
5681 577 876 -605 -869 619 849 -658 -824 677 781 -715 -777 731 736 -755 -728 768 680 -803 -657
5700 -657 810 639 -837 -609 855 591 -874 -548 894 534 -901 -464 935 454 -928 -423 976
5717 976 396 -956 -323 991 322 -985 -266 1004 251 -1002 -200 1030 175 -1021 -142 1041 104
5734 104 -1033 -78 1028 34 -1041 -6 1034 -35 -1047 58 1031 -115 -1036 128 999 -181
5750 -181 -1016 215 999 -248 -979 261 975 -294 -961 326 957 -362 -941 395 932 -402 -897
5767 -897 449 906 -460 -859 505 882 -513 -829 566 828 -580 -797 619 780 -628 -758 681
5784 681 717 -690 -715 726 667 -756 -668 758 625 -797 -620 807 549 -843 -558 830 493 -888
5802 -888 -489 872 457 -898 -413 916 393 -921 -344 933 332 -922 -289 938 263 -947 -227
5819 -227 963 215 -945 -170 958 144 -951 -98 961 78 -954 -48 958 7 -970 25 942 -61
5837 -61 -971 85 943 -143 -983 151 949 -192 -955 222 922 -265 -924 291 886 -334 -904 345
5855 345 886 -388 -892 414 850 -441 -849 477 834 -499 -793 533 815 -535 -752 580 751
5872 751 -592 -722 638 701 -630 -674 663 662 -673 -643 705 611 -723 -611 716 548 -753 -537 768
5891 768 490 -801 -487 809 428 -831 -442 823 374 -864 -366 834 334 -880 -317 881 271
5908 271 -905 -243 902 208 -897 -172 915 133 -915 -119 928 74 -913 -42 942 29 -912 21
5926 21 930 -30 -902 89 921 -104 -917 134 903 -153 -901 182 894 -228 -873 242 857 -274
5944 -274 -873 282 819 -355 -854 341 818 -394 -819 393 773 -435 -792 450 753 -481 -764
5961 -764 501 723 -539 -696 567 693 -597 -672 612 658 -630 -623 659 596 -680 -589 700 550 -704
5980 -704 -523 724 499 -748 -485 756 436 -786 -444 791 384 -793 -393 781 339 -837 -327
5997 -327 807 269 -841 -267 832 193 -859 -224 830 150 -871 -160 831 129 -865 -90 846 62
6015 62 -866 -39 866 6 -855 26 866 -37 -858 90 862 -110 -836 144 864 -165 -836 192 829 -230
6035 -230 -823 253 805 -294 -812 302 776 -339 -793 360 752 -408 -764 415 739 -446 -725
6052 -725 447 684 -495 -708 473 657 -537 -656 548 623 -588 -624 569 577 -607 -575 618 554 -642
6071 -642 -511 652 513 -644 -464 671 493 -687 -437 713 410 -715 -374 729 354 -724 -317
6088 -317 745 304 -762 -279 777 253 -790 -225 783 183 -800 -177 785 131 -813 -126 799 59
6106 59 -819 -53 806 17 -811 -1 808 -42 -816 62 797 -82 -785 98 792 -126 -781 156 779 -177
6126 -177 -752 206 760 -207 -750 257 750 -264 -709 316 719 -314 -701 359 692 -348 -678 392
6144 392 676 -398 -645 442 644 -475 -615 475 583 -510 -597 504 551 -557 -555 556 519 -595 -516
6163 -516 596 480 -615 -462 616 452 -633 -419 631 387 -675 -377 692 357 -678 -316 718
6180 718 311 -688 -250 724 259 -705 -221 730 231 -726 -176 743 161 -740 -125 743 134 -751 -79 738
6200 738 51 -754 -40 734 8 -750 -11 730 -40 -746 68 725 -97 -753 125 722 -142 -712 158 726
6220 726 -198 -711 245 709 -242 -697 283 696 -280 -662 322 677 -323 -630 361 661 -356 -625 407
6239 407 625 -411 -575 446 588 -442 -555 454 554 -482 -553 514 519 -511 -495 519 467 -554 -473
6258 -473 552 431 -565 -436 576 392 -609 -405 601 371 -631 -339 644 323 -641 -290 654 298
6276 298 -649 -257 674 241 -675 -194 696 195 -668 -123 702 140 -679 -93 723 94 -693 -53 712 42
6296 42 -707 -14 707 -19 -714 29 684 -45 -705 69 686 -102 -681 102 671 -160 -671 156 663 -166
6316 -166 -683 195 637 -232 -654 228 622 -259 -634 269 607 -305 -594 316 592 -324 -576 360 592 -387
6336 -387 -529 398 554 -394 -514 447 518 -439 -462 476 479 -487 -462 486 434 -493 -422 532 404 -539 -381 539
6358 539 361 -576 -350 568 317 -577 -316 588 278 -596 -275 596 243 -616 -226 610 204 -607 -186 629
6378 629 164 -615 -151 647 135 -607 -104 634 89 -626 -54 653 36 -623 -7 644 -2 -615 34 648
6398 648 -45 -632 73 637 -91 -632 116 628 -133 -623 158 603 -184 -624 178 581 -227 -598 233 570
6418 570 -257 -579 264 556 -300 -560 310 537 -351 -523 356 523 -343 -499 384 491 -357 -454 402 478 -406
6439 -406 -443 452 448 -447 -406 479 424 -452 -382 493 380 -475 -339 520 347 -503 -308 523 310 -526 -285 540
6461 540 272 -556 -239 564 227 -569 -212 584 174 -579 -181 578 152 -587 -136 607 118 -579 -71 605
6481 605 71 -603 -29 609 40 -588 1 608 6 -586 67 617 -26 -576 79 595 -75 -579 106 613
6501 613 -109 -577 156 593 -161 -550 193 574 -181 -541 205 539 -222 -533 241 508 -261 -536 269 500
6521 500 -308 -491 310 484 -326 -462 340 473 -361 -436 373 447 -388 -399 421 415 -390 -364 447 393 -443 -332
6543 -332 468 364 -423 -298 490 328 -454 -276 497 301 -483 -251 525 248 -496 -218 506 206 -517 -205
6563 -205 519 170 -545 -179 531 145 -547 -131 533 104 -528 -89 535 55 -548 -46 531 31 -547 -16
6583 -16 562 11 -525 30 552 -31 -555 67 551 -67 -515 109 549 -117 -506 132 533 -134 -499 158
6603 158 506 -190 -499 184 499 -215 -493 235 463 -250 -477 247 448 -283 -455 267 429 -323 -434 314
6623 314 409 -326 -415 337 390 -341 -401 359 358 -372 -362 369 345 -391 -325 422 337 -413 -314 431 304 -415 -270 465
6647 465 274 -440 -234 471 241 -463 -203 497 212 -476 -182 496 167 -489 -151 497 133 -510 -107 499
6667 499 88 -506 -71 498 51 -532 -48 507 11 -518 -8 499 -9 -507 12 512 -38 -495 43 505
6687 505 -44 -474 100 498 -100 -476 129 499 -108 -470 153 494 -150 -468 195 482 -172 -447 211 460
6707 460 -205 -437 249 439 -245 -421 279 414 -283 -406 289 389 -318 -401 307 352 -347 -361 330 337 -352 -347
6729 -347 357 319 -388 -309 387 302 -392 -285 382 264 -405 -251 428 258 -422 -219 437 240 -439 -196 456
6750 456 205 -437 -152 451 178 -455 -144 477 144 -465 -114 480 119 -471 -75 471 72 -468 -76 476
6770 476 35 -487 -24 462 -9 -476 9 480 -39 -490 44 451 -71 -477 79 461 -94 -460 109 462
6790 462 -132 -451 125 453 -151 -433 168 447 -171 -433 205 428 -197 -409 224 424 -227 -396 247 404
6810 404 -250 -376 271 385 -255 -379 293 379 -299 -359 293 332 -309 -329 323 309 -340 -321 333 287 -379 -274
6832 -274 366 262 -400 -267 382 237 -404 -218 376 198 -400 -174 403 177 -408 -155 435 155 -413 -121
6852 -121 443 140 -410 -100 448 101 -420 -73 442 94 -436 -50 435 43 -430 -25 447 20 -448 -10
6872 -10 432 -17 -428 13 420 -63 -440 71 414 -83 -442 70 404 -93 -417 119 415 -119 -413 148
6892 148 417 -139 -410 176 411 -191 -373 225 393 -192 -359 238 375 -220 -359 257 363 -255 -326 289
6912 289 341 -273 -321 295 297 -314 -301 306 293 -325 -274 328 271 -334 -265 325 228 -363 -230 337 199 -394 -227
6935 -227 363 181 -386 -193 370 160 -406 -168 396 161 -410 -134 414 127 -389 -91 426 99 -393 -73
6955 -73 419 77 -401 -29 435 50 -411 5 438 9 -406 15 430 -22 -409 37 403 -51 -412 66
6975 66 408 -102 -411 93 391 -116 -407 115 402 -132 -393 149 372 -145 -395 160 369 -178 -367 186
6995 186 365 -210 -361 219 365 -203 -336 233 343 -240 -312 260 332 -245 -288 286 307 -262 -283 309 307 -290
7017 -290 -259 307 278 -310 -243 329 238 -323 -230 331 210 -343 -221 343 193 -371 -197 350 147 -392 -164 361
7039 361 126 -397 -143 367 106 -409 -108 382 79 -397 -91 395 75 -398 -58 402 50 -402 -20 398
7059 398 27 -390 -9 404 1 -382 24 394 -25 -381 32 400 -45 -370 51 378 -86 -388 82 382
7079 382 -114 -390 97 360 -140 -389 121 349 -174 -349 147 322 -191 -356 171 323 -185 -321 197 311
7099 311 -233 -312 218 284 -250 -282 250 297 -238 -266 271 284 -263 -261 273 245 -271 -241 296 238 -294 -220 309 214
7123 214 -296 -210 316 193 -321 -192 302 162 -337 -165 323 138 -341 -151 325 87 -357 -126 336 68
7143 68 -374 -104 344 62 -350 -71 352 46 -371 -32 366 24 -355 -1 363 -8 -357 25 372 -33
7163 -33 -354 52 367 -46 -350 83 373 -73 -355 78 359 -99 -349 112 339 -122 -344 129 326 -157
7183 -157 -344 149 317 -164 -330 143 287 -187 -325 181 293 -198 -301 184 280 -227 -296 222 261 -236 -251
7204 -251 246 246 -245 -244 262 253 -263 -228 271 228 -263 -184 304 207 -281 -163 322 188 -291 -138 310 159 -319
7227 -319 -147 325 128 -311 -129 325 118 -337 -130 323 99 -346 -94 330 66 -340 -81 315 39 -350
7247 -350 -63 338 26 -348 -23 331 12 -329 5 335 -24 -351 15 336 -32 -315 55 333 -47 -329
7267 -329 80 330 -63 -304 100 334 -84 -300 136 312 -126 -304 134 319 -145 -301 155 284 -153 -281
7287 -281 157 273 -185 -287 184 256 -198 -252 196 247 -219 -261 236 258 -236 -241 228 227 -238 -222 248 239 -249 -204
7311 -204 257 199 -245 -191 269 183 -280 -153 282 177 -274 -141 301 161 -284 -118 303 116 -292 -103 295
7332 295 86 -309 -104 318 59 -317 -74 312 50 -314 -47 308 10 -323 -40 289 -8 -328 -1 298
7352 298 -21 -316 6 307 -42 -313 41 309 -46 -298 71 298 -51 -287 76 321 -71 -279 95 300
7372 300 -89 -282 114 301 -112 -272 140 272 -123 -268 140 264 -154 -273 156 252 -180 -261 183 236 -206
7393 -206 -244 184 218 -218 -228 212 212 -231 -207 223 188 -239 -193 219 178 -230 -161 248 158 -246 -148 272 146 -254
7417 -254 -124 273 143 -258 -110 268 118 -252 -85 306 112 -263 -69 288 89 -286 -60 291 67 -301
7437 -301 -47 292 42 -295 -27 292 18 -303 -15 288 4 -292 -4 278 -21 -309 8 285 -44 -289
7457 -289 33 301 -56 -278 75 283 -75 -270 96 281 -81 -268 104 279 -102 -257 136 263 -122 -247
7477 -247 159 266 -146 -239 158 235 -151 -234 179 233 -172 -226 168 210 -204 -233 173 199 -198 -209 188 175 -223
7500 -223 -195 210 174 -208 -188 239 161 -235 -165 227 140 -251 -145 239 121 -244 -124 254 126 -245 -97 253
7522 253 110 -246 -69 280 96 -256 -59 267 60 -261 -47 281 63 -265 -18 274 31 -275 -14 267
7542 267 19 -260 -6 271 -11 -275 -4 257 -22 -271 11 260 -31 -285 33 260 -62 -266 55 241
7562 241 -72 -269 86 267 -83 -241 112 273 -79 -237 120 246 -93 -208 120 243 -135 -219 142 229 -146
7583 -146 -209 169 215 -154 -204 168 200 -189 -190 170 196 -184 -186 186 158 -193 -179 191 149 -211 -160 179 132 -219 -160
7608 -160 212 116 -236 -144 202 105 -219 -128 227 106 -232 -103 237 91 -244 -66 252 85 -234 -56 270
7629 270 84 -228 -24 247 42 -228 -19 247 19 -238 -20 239 7 -240 -5 257 -20 -254 23 220
7649 220 -31 -257 27 225 -69 -262 45 216 -65 -261 49 235 -90 -238 73 217 -78 -226 88 218
7669 218 -86 -235 124 240 -117 -203 131 235 -118 -192 154 206 -140 -175 161 203 -126 -190 178 194 -149 -162 164
7692 164 190 -171 -172 177 165 -202 -161 181 130 -204 -147 180 113 -221 -136 200 108 -220 -126 206 81 -225 -105 208
7716 208 74 -230 -86 211 76 -221 -47 236 67 -208 -43 233 57 -218 -13 246 47 -230 -5 243
7736 243 14 -239 15 246 2 -237 21 241 1 -229 21 241 -30 -243 31 210 -48 -244 35 216
7756 216 -73 -234 48 207 -91 -240 70 201 -96 -218 85 218 -114 -215 113 215 -127 -184 138 211 -118
7777 -118 -192 137 212 -127 -171 163 187 -137 -162 152 170 -159 -151 177 173 -162 -133 181 151 -188 -158 175 138 -181 -136
7802 -136 185 114 -202 -130 199 97 -196 -123 203 96 -212 -93 199 81 -212 -93 206 71 -230 -81 209
7823 209 58 -226 -61 212 35 -217 -37 232 41 -219 -20 236 18 -224 6 234 20 -220 20 227
7843 227 -10 -220 26 223 -43 -211 35 219 -47 -222 44 191 -67 -219 54 203 -72 -212 76 175
7863 175 -98 -216 78 184 -106 -198 95 193 -112 -187 104 174 -114 -164 134 186 -132 -163 138 178 -145 -149 158
7886 158 188 -130 -140 160 155 -142 -121 180 142 -152 -126 179 114 -173 -93 170 98 -180 -128 183 81 -199 -107 180
7910 180 69 -223 -100 189 58 -200 -78 189 51 -201 -65 191 48 -221 -50 203 34 -218 -22 211
7930 211 46 -196 -9 225 17 -208 10 230 4 -207 14 227 0 -189 34 209 -26 -188 33 215
7950 215 -37 -197 56 205 -42 -193 55 198 -73 -196 73 178 -104 -216 78 166 -110 -198 94 173 -111
7971 -111 -195 100 160 -125 -173 105 154 -116 -155 131 161 -123 -163 157 174 -145 -138 180 161 -147 -139 173 149 -156 -120
7996 -120 181 126 -154 -106 184 108 -178 -97 176 100 -202 -100 191 56 -197 -104 164 64 -213 -86 186 47
8018 47 -206 -61 182 31 -215 -53 212 30 -210 -28 200 34 -208 -9 205 19 -196 1 214 9
8038 9 -208 30 210 -5 -198 33 220 -16 -191 40 225 -35 -200 45 209 -75 -190 60 197 -70 -202
8059 -202 60 180 -75 -204 73 172 -97 -188 75 162 -120 -198 100 164 -112 -178 114 168 -123 -165 113 165 -143
8082 -143 -149 145 140 -131 -134 160 163 -145 -112 155 151 -138 -105 161 132 -161 -101 179 112 -161 -89 180 105 -186 -93 177
8108 177 61 -181 -79 172 69 -190 -69 196 58 -201 -54 182 47 -208 -51 199 18 -204 -35 187
8128 187 15 -203 -9 181 23 -205 -5 201 12 -192 24 198 -12 -172 44 199 -17 -184 52 209
8148 209 -40 -201 77 202 -40 -169 62 173 -70 -194 74 191 -90 -179 87 158 -95 -172 73 165 -126
8169 -126 -176 108 152 -119 -165 114 141 -123 -168 108 128 -135 -140 137 150 -132 -151 145 128 -145 -115 162
8191A62
##END NTUPLES=NMR FID
##END=
