##TITLE=1H ikalashn
ED
18.12.2024
##JCAMPDX= 6.0         $$ Bruker NMR JCAMP-DX V2.0
##DATA TYPE= NMR FID
##DATA CLASS= NTUPLES
##ORIGIN= UXNMR, Bruker Analytische Messtechnik GmbH
##OWNER= root
$$ TOPSPIN		Version 1.3
$$ 2024-12-18 11:02:46.687 +0400  Irina@DPX200
$$ Compression mode = diff/dup
##.OBSERVE FREQUENCY= 200.131300845
##.OBSERVE NUCLEUS= ^1H
##.DELAY= (6, 6)
##.ACQUISITION MODE= SIMULTANEOUS
##.ACQUISITION SCHEME= undefined
##.AVERAGES= 64
##.DIGITISER RES= 18
##SPECTROMETER/DATA SYSTEM= spect
##.PULSE SEQUENCE= zg
##.SOLVENT NAME= CDCl3
##.SHIFT REFERENCE= INTERNAL, CDCl3, 1, 17.49637
##AUDIT TRAIL= $$ (NUMBER, WHEN, WHO, WHERE, WHAT)
$$ ##TITLE= Audit trail, TOPSPIN		Version 1.3
$$ ##JCAMPDX= 5.01
$$ ##ORIGIN= Bruker BioSpin GmbH
$$ ##OWNER= Irina
$$ $$ F:/spectra/data/iren/nmr/1H/4/audita.txt
$$ ##AUDIT TRAIL=  $$ (NUMBER, WHEN, WHO, WHERE, VERSION, WHAT)
(   1,<2024-12-18 11:02:06.875 +0400>,<Irina>,<DPX200>,<TOPSPIN 1.3>,
      <created by zg
	started at 2024-12-18 10:57:53.843 +0400,
	POWCHK disabled, PULCHK disabled
       configuration hash MD5:
       BE 6D 3F 07 2A EA 11 49 91 17 2B D3 AF B3 58 0D
       data hash MD5: 16K
       52 20 95 62 0D 2C C7 BD 55 91 2C AF B7 37 B1 3F>)
$$ ##END=
$$ 
$$ $$ hash MD5
$$ $$ 63 9A A8 F8 CE 12 E0 61 D7 D2 12 5A 5A 66 1B 50
##$RELAX= 
##$RELAX= 
##$RELAX= 
##$RELAX= 
##$RELAX= 
##$RELAX= 
##$RELAX= 
##$RELAX= 
##$RELAX= 
$$ Bruker specific parameters
$$ --------------------------
##$DU= <F:/spectra>
##$EXPNO= 4
##$NAME= <1H>
##$PROCNO= 1
##$TYPE= <nmr>
##$USER= <iren>
##$AMP= (0..31)
100 100 100 100 100 100 100 100 100 100 100 100 100 100 100 100 100 100 
100 100 100 100 100 100 100 100 100 100 100 100 100 100 
##$ANAVPT= -1
##$AQSEQ= 0
##$AQ_mod= 1
##$AUNM= <au_zg>
##$AUTOPOS= <>
##$BF1= 200.13
##$BF2= 200.13
##$BF3= 200.13
##$BF4= 200.13
##$BF5= 200.13
##$BF6= 200.13
##$BF7= 200.13
##$BF8= 200.13
##$BYTORDA= 1
##$CFDGTYP= 0
##$CFRGTYP= 5
##$CHEMSTR= <none>
##$CNST= (0..63)
1 1 145 1 1 1 1 1 1 1 1 1 1 1 1 1 1 1 1 1 1 1 1 1 1 1 1 1 1 1 1 1 1 1 
1 1 1 1 1 1 1 1 1 1 1 1 1 1 1 1 1 1 1 1 1 1 1 1 1 1 1 1 1 1 
##$CPDPRG= <>
##$CPDPRG1= <>
##$CPDPRG2= <>
##$CPDPRG3= <>
##$CPDPRG4= <mlev>
##$CPDPRG5= <mlev>
##$CPDPRG6= <mlev>
##$CPDPRG7= <mlev>
##$CPDPRG8= <mlev>
##$CPDPRGB= <>
##$CPDPRGT= <>
##$D= (0..63)
0 2 0 0 0 0 0 0 0 0.06 0 0.03 0 0 0 0 0.0002 0 0 0 0 0 0 0 0 0 0 0 0 0 
0 0 0 0 0 0 0 0 0 0 0 0 0 0 0 0 0 0 0 0 0 0 0 0 0 0 0 0 0 0 0 0 0 0 
##$DATE= 1734505325
##$DBL= (0..7)
120 120 120 120 120 120 120 120 
##$DBP= (0..7)
150 150 150 150 150 150 150 150 
##$DBP07= 0
##$DBPNAM0= <>
##$DBPNAM1= <>
##$DBPNAM2= <>
##$DBPNAM3= <>
##$DBPNAM4= <>
##$DBPNAM5= <>
##$DBPNAM6= <>
##$DBPNAM7= <>
##$DBPOAL= (0..7)
0.5 0.5 0.5 0.5 0.5 0.5 0.5 0.5 
##$DBPOFFS= (0..7)
0 0 0 0 0 0 0 0 
##$DE= 6
##$DECBNUC= <off>
##$DECIM= 32
##$DECNUC= <off>
##$DECSTAT= 4
##$DIGMOD= 1
##$DIGTYP= 9
##$DL= (0..7)
0 120 120 120 120 120 120 120 
##$DP= (0..7)
150 150 150 150 150 150 150 150 
##$DP07= 0
##$DPNAME0= <>
$$ [...]
##$SW= 21.9926040160658
##$SWIBOX= (0..15)
0 0 2 0 0 0 0 0 0 0 0 0 0 0 0 0 
##$SW_h= 4401.40845070422
##$TD= 16384
##$TD0= 1
##$TE= 300
##$TE2= 300
##$TE3= 300
##$TEG= 300
##$TL= (0..7)
0 120 120 120 120 120 120 120 
##$TP= (0..7)
150 150 150 150 150 150 150 150 
##$TP07= 0
##$TPNAME0= <>
##$TPNAME1= <>
##$TPNAME2= <>
##$TPNAME3= <>
##$TPNAME4= <>
##$TPNAME5= <>
##$TPNAME6= <>
##$TPNAME7= <>
##$TPOAL= (0..7)
0.5 0.5 0.5 0.5 0.5 0.5 0.5 0.5 
##$TPOFFS= (0..7)
0 0 0 0 0 0 0 0 
##$TUNHIN= 0
##$TUNHOUT= 0
##$TUNXOUT= 0
##$USERA1= <user>
##$USERA2= <user>
##$USERA3= <user>
##$USERA4= <user>
##$USERA5= <user>
##$V9= 5
##$VALIST= <valist>
##$VCLIST= <CCCCCCCCCCCCCCC>
##$VD= 0
##$VDLIST= <DDDDDDDDDDDDDDD>
##$VPLIST= <PPPPPPPPPPPPPPP>
##$VTLIST= <TTTTTTTTTTTTTTT>
##$WBST= 1024
##$WBSW= 25
##$XGAIN= (0..3)
0 0 0 0 
##$XL= 0
##$YL= 0
##$YMAX_a= 1027078
##$YMIN_a= -980565
##$ZGOPTNS= <>
##$ZL1= 120
##$ZL2= 120
##$ZL3= 120
##$ZL4= 120
##$ABSF1= 10
##$ABSF2= 0
##$ABSG= 5
##$ABSL= 3
##$ALPHA= 0
##$AQORDER= 0
##$ASSFAC= 0
##$ASSFACI= 0
##$ASSFACX= 0
##$ASSWID= 0
##$AUNMP= <proc_1d>
##$AXLEFT= 0
##$AXRIGHT= 0
##$AXTYPE= 0
##$AXUNIT= <>
##$AZFE= 0.1
##$AZFW= 0.1
##$BCFW= 1
##$BC_mod= 2
##$BYTORDP= 1
##$COROFFS= 0
##$CY= 7568.61572265625
##$DATMOD= 1
##$DC= 2
##$DFILT= <>
##$DTYPP= 0
##$F1P= 17.9538593292236
##$F2P= -4.03888763876832
##$FCOR= 0.5
##$FTSIZE= 32768
##$FT_mod= 4
##$GAMMA= 1
##$GB= 1
##$INTBC= 1
##$INTSCL= 1
##$ISEN= 128
##$LB= 0.02
##$LEV0= 0
##$LPBIN= 0
##$MAXI= 945.577
##$MC2= 0
##$MEAN= 0
##$ME_mod= 0
##$MI= -402.1523
##$NCOEF= 0
##$NC_proc= 0
##$NLEV= 6
##$NOISF1= 8.587773
##$NOISF2= 6.764455
##$NSP= 1
##$NTH_PI= 0
##$NZP= 0
##$OFFSET= 17.49637
##$PC= 1
##$PHC0= 94.71922
##$PHC1= 4.797655
##$PH_mod= 0
##$PKNL= yes
##$PPARMOD= 0
##$PPDIAG= 0
##$PPIPTYP= 0
##$PPMPNUM= 100
##$PPRESOL= 1
##$PSCAL= 0
##$PSIGN= 0
##$REVERSE= no
##$SF= 200.13
##$SI= 32768
##$SIGF1= 18.5376
##$SIGF2= -6.396296
##$SINO= 400
##$SIOLD= 32768
##$SREGLST= <1H.CDCl3>
##$SSB= 3
##$STSI= 0
##$STSR= 0
##$SW_p= 4401.40845070422
##$SYMM= 0
##$S_DEV= 0
##$TDeff= 0
##$TDoff= 0
##$TI= <>
##$TILT= no
##$TM1= 0
##$TM2= 0
##$TOPLEV= 0
##$USERP1= <user>
##$USERP2= <user>
##$USERP3= <user>
##$USERP4= <user>
##$USERP5= <user>
##$WDW= 1
##$XDIM= 8192
##$YMAX_p= 0
##$YMIN_p= 0
$$ End of Bruker specific parameters
$$ ---------------------------------
##NTUPLES= NMR FID
##VAR_NAME=  TIME,          FID/REAL,        FID/IMAG
##SYMBOL=    X,             R,               I
##VAR_TYPE=  INDEPENDENT,   DEPENDENT,       DEPENDENT
##VAR_FORM=  AFFN,          ASDF,            ASDF
##VAR_DIM=   8192,          8192,            8192
##UNITS=     SECONDS,       ARBITRARY UNITS, ARBITRARY UNITS
##FACTOR=    0.0002272,     1,               1
##FIRST=     0,             0,               0
##LAST=      1.8609952,     264,             -38
##MIN=       0,             -980565,         -980565
##MAX=       1.8609952,     1027078,         1027078
$$ Real data points
##PAGE= N=1
##DATA TABLE= (X++(R..R)), XYDATA
$$ [...]
1772a08M13r89N65R82j073o66J673K66j473j18R32o9l24L74q24j60J223J33j779
1791a022L42J313q29p03J388o0j329M78R39n23p02R68j49k18O04l62r92J033J618
1810A794j592j188J268O99j622K32J097q18l78P93l15o20M64N17j132P21P63j556
1828h73k60J877M90k109M24J407o44p58N56M1m18R58J06j492o4J308p25o67J651
1847H08j17k020O99J584j320r43J511N88j068J84J7p90R99J362j451r66J567J67
1865H11j699O37J522j012j074J328p2j667M94J256n75j49M92p27m32J438n6j640
1883a125P26J800j436j154J265O36j007P86N41j065m41P08j72m67J094j51j442
1900i04O86J186j751o93K090M33k034M81Q54p76k55J163r4p23P49K64j279N43
$$ plain form
1772 -108 305 -684 -119 863 -210 -876 797 1063 -410 -528 404 335 11 385 -439 -599 624 757 -1022
1791 -1022 -680 633 -196 -899 489 429 -900 -422 517 -6 -708 260 111 -107 497 135 -857 176 1794
1810 1794 202 -986 282 981 -641 -409 688 -130 -508 285 -30 -650 -186 331 -801 -80 683 -873
1828 -873 -1133 744 1234 -875 -451 956 312 -446 110 151 -267 691 797 -695 -759 549 -176 -843 808
1847 808 691 -1329 -630 954 -366 -1309 202 790 -278 -94 -77 -867 132 1494 43 -923 644 811
1865 811 -888 -251 1271 259 -815 513 441 -1226 -732 524 -51 -200 292 -435 -867 571 515 -1125
1883 -1125 -399 1401 -35 -1189 76 712 -295 491 1032 -33 -474 234 62 -405 689 538 -904
1900 -904 -218 968 -783 -1476 614 1047 -987 -506 348 -428 -683 480 386 -337 412 676 -603 -60
1918f0J002j246j48J428m37j989J014J461p67q96N86L04q89L24R1m04P73J022
1936A169j351n19J136j08j147R13J169j385o40J155L17q99J80P65n31k45j8p82
1954h21J88J509m11j303P28J073j569m90J403K13p67J50M33o09J95L38l82K44
1972A22R30o25j346P65R61r25k84J140j46j253K29M89j35P7J6k17j08L59m51l16
1992g18J420L52j440k32J206m9j195L97J071l43j80m01k46L53O02l55p60P21L34
2011E37j354J82J002l53m65N30L36j047J1N98Q6K55J53m79k27R76m35j020P08
2030fJ325j080j053P89L28n22J46K42k47R0Km43j75R23J1q86M71P49j088k58J089
2051D07L28q58K32L82n50j43O20n08J32M65l76q55Q78L42r87l1J090k26j247L43
$$ plain form
1918 -60 942 -304 -452 976 539 -1450 -436 1025 258 -638 -52 252 -637 -313 -222 -626 147 1169
1936 1169 -182 -701 435 327 -820 93 1262 -123 -763 392 709 -190 -10 755 224 -21 -39 -821
1954 -821 -633 876 465 -838 -110 963 -606 -1096 307 520 -247 -97 336 -273 -78 260 -122 122
1972 122 1052 427 -919 -154 807 -118 -402 738 592 -661 -432 57 -78 -1 15 -202 -310 49 -402 -718
1992 -718 702 1054 -386 -618 588 539 -656 -259 812 469 289 -112 -358 -5 597 242 -518 203 537
2011 537 -817 -635 367 14 -451 79 415 -632 -621 -23 63 318 471 -8 -235 741 306 -714 -6
2030 -6 1319 239 -814 -25 303 -219 -73 169 -78 12 14 -429 -604 319 330 -556 -85 664 -424 -682 407
2051 407 735 -123 109 491 -59 -202 418 -90 42 507 131 -724 154 496 -491 -522 568 342 -905 -562
2071e62R20o45L64J23k33r3O89l76q95J004N52q93l08J115p68n85Q32M11j073
2090d21P7Q09n87n09N84Pn09P20K68j092J15J346p57q98J077M40q68p0O44m05
2110b9k54Q68l03p91P45L21j165O9J069m83r96R46J94q27K24J223q06p68R57N0
2130B44p21O07N01r90J86Q35n02q20J219J95j094L0R53m48r02R59O6r55N20O41
2150E24j168R3J197p01p40J146J19j003K33J114q67m91J213L2j368O82Q33j098
2168b50r2J072o81q41J097J65j315K93J228o15j014J067K92q56K68P01q54k30
2186e65J403n18r07O47N34r44L3J053o64n51Q74Mj138N13Q49q28m42Q00k10o42
2206f99R42L49j364M25J062p12n78Q16L95r57O5R66q17k01Q11k23r92R16L10q02
$$ plain form
2071 -562 358 -287 77 200 -33 -126 563 187 -708 296 848 -45 -353 762 -6 -591 241 652 -421
2090 -421 -344 465 -122 -631 -47 -40 -549 171 439 -653 -538 808 51 -847 230 670 -198 -268 376 -29
2110 -29 -283 585 282 -509 236 557 -608 -539 530 47 -949 -3 191 -636 -412 811 5 -763 194 244
2130 244 -477 130 631 -359 -173 662 160 -660 559 754 -340 -310 643 195 -707 252 318 -637 -117 524
2150 524 -644 -551 646 -55 -795 351 470 -533 -300 814 -53 -544 669 701 -667 15 848 -250
2168 -250 -342 730 49 -792 305 470 -845 -552 676 61 -953 114 406 -450 -182 519 -335 -565
2186 -565 838 320 -587 60 594 -350 -317 736 72 -479 395 399 -739 -226 623 -205 -647 153 -57 -699
2206 -699 243 592 -772 -347 715 3 -575 241 636 -321 -256 710 -107 -308 503 280 -712 204 514 -288
2226b88j59Q04k64n88P01K37j107N68O00p77l41R67R1q84N43M12o49J84P61q25
2246a4m10R09J33j077M07N59o69k51Q25n27n28O09L16p84k43J113j79o18N64J43
2266B78p80M31N85o53j53R25n1j000M48O01p27J0M23m69k57P54n7q26L54L87l42
2287a19k60N45j24n23O38K08p93L08N27m42k18N06J52n87K32M00n49J5O30m80
2307F6l62L07K31n92L24K84n39k30O54k94n41P72L28p07k0O34l84q0N39o5m03
2328g8J26M38n37j38N92j46n83L08K41m88J13M62n56j56O49no59K97J71k85R5
2349a39L24k58J4M45j37m99K64M14l40l83N08Qm84N37Mn68l9O29n38l51Q60j89
2371H2n75M73M31p04j80P98m7o49L10M66m79j97O70m42k89O28oo44M02M19p11
$$ plain form
2226 -288 -447 357 93 -495 206 443 -664 -96 504 -273 -614 353 444 -440 103 515 -134 50 811 -14
2246 -14 -424 485 618 -459 -52 507 -162 -413 412 -115 -643 -34 282 -502 -745 368 189 -429 135 278
2266 278 -502 -71 514 -139 -292 633 582 -418 30 631 -96 -86 337 -132 -389 365 308 -518 -164 223 -119
2287 -119 -379 166 42 -481 157 365 -428 -120 407 -35 -253 253 405 -182 50 450 -99 -84 546 66
2307 66 -296 11 242 -350 -26 258 -281 -511 143 -151 -692 80 408 -299 -319 315 -69 -149 390 325 -78
2328 -78 48 486 -51 -189 403 257 -326 -18 223 -265 -152 310 -246 -402 247 242 -417 -120 51 -234 -139
2349 -139 185 -73 -59 386 249 -250 14 428 88 -295 213 221 -263 274 278 -290 -329 300 -238 -589 271 82
2371 82 -493 -20 411 -293 -473 325 278 -371 -61 405 -74 -271 399 -43 -332 296 290 -354 48 467 -244
2392b44j62P63k46q83P88K81q39J87N75j81j83L57j46n39O17O48p72l62R09m50
2412A18o02O78L63r37K00N72m49m64L98K83o03L18K95m91k38J012l84o96Q86L41
2432F00q33j07O51q5n23M57K79o42J93L24o37K02O06k10r80Q45M70j103j29J185
2452E63m58n75M89K69p81M17N92o67R2M42k54q61R90M26r90o5J166k75j228M81
2472b27M78l96j5L46l88j6M01l90o45R88P03j387M3J038k46q77Q94M19p08m6M05
2493C74n27j6P04l62m53O26j4j065K89J108m04r90P91M00p32j69O40j85jJ49j21
2514D2n48P78J58r04K35J141o39j043P68N81n94q4M79j43o37K69J00n47O26K41
2534B79p87K87O89n27o34R12M04q03k38N61J00o15O06J13p6J19j20o82J42P79
$$ plain form
2392 -244 -406 357 111 -772 16 297 -542 -355 220 39 -144 213 67 -472 145 793 21 -341 568 118
2412 118 -484 194 557 -380 -180 392 -57 -521 -123 160 -443 -125 170 -321 -559 453 69 -627 259 600
2432 600 -233 -340 311 226 -297 160 439 -203 -10 314 -323 -121 485 275 -705 140 610 -493 -622 563
2452 563 105 -470 19 288 -493 -76 516 -151 -59 383 129 -732 258 684 -306 -371 795 520 -708 -227
2472 -227 251 -145 -160 186 -202 -218 183 -207 -852 136 839 -548 -505 533 287 -590 304 723 15 -31 374
2493 374 -153 -169 535 173 -280 346 332 -733 -444 664 260 -730 61 461 -271 -440 200 15 14 163 42
2514 42 -506 272 430 -474 -239 902 263 -780 -12 569 -25 -109 370 227 -410 -141 -41 -588 38 279
2534 279 -508 -221 468 -59 -693 219 623 -180 -418 143 243 -372 234 347 271 390 270 -412 -270 509
2554E09l97n99O60J49p68N4O63m21k38N85q7m64J96J74j14Q3N11n07k40N33Q6
2575C68q21L42R00m92p38L02L64m46J05L02j92p1J21l55k95Q49L8n62K95O44p94
2596a36k43O73R0n24L08J99m78M0K30q6r7N16k97p07N07L66p91l1O28K70q10J76
2618a97K65k35J52K09k98J97J71j84o46P38N77q38j21M64k25m87L86N31n45K5
2638f1K14m44K48Q7k04j50M33K44r99J23J006l35m65L51M79m08m09L46k2j59M73
2659C48m27k22N60J21q83K82Q28m70o75M77J94m93J11O19l97L2K62l17k24L82
2679A08L41o35M12L10n63l42M92M29p52J0K53j3k83K40j69j07N38O6p36J61O46
2700D06o45l27Q58P3o88K80N50n97j77O15j17l35L64M8q05M07N39o58k21O59Q8
$$ plain form
2554 509 112 -487 173 322 -446 -392 271 -150 -388 197 110 -354 -158 16 -98 -15 496 -11 -251 282 368
2575 368 -453 -111 789 297 -441 -139 225 -221 -116 186 -6 -77 44 -311 -606 243 281 -281 14 658 -136
2596 -136 -379 294 384 -140 168 367 -111 -71 159 73 -24 492 195 -512 -5 361 -430 -461 167 437 -373 -197
2618 -197 68 -167 -15 194 -104 93 264 80 -566 172 749 -89 -210 254 29 -458 -72 459 -86 -61
2638 -61 153 -291 -43 44 -160 -310 123 367 -632 -509 497 162 -303 48 527 119 -290 56 34 -125 348
2659 348 -79 -301 259 380 -503 -221 607 137 -538 -61 133 -360 -249 370 -27 5 267 -50 -274 108
2679 108 449 -186 226 536 -27 -369 123 552 -200 -190 63 50 -233 7 -162 -269 269 335 -401 -240 406
2700 406 -239 -566 292 365 -323 -43 507 -90 -267 348 231 -104 260 308 -497 -90 449 -209 -430 229 317
2721C17p30oP07k18l79L59j21l88N38N41r75L54O50p26l99J073j79r01M46M61
2741D24m71l85O77j34m51M61K01o97P7O23m35n71J038r0p89M16N56m20n28P80
2761B82J0o24M61L65o09M8M72k72n45N91L5q02M55M08m53k40P00l94m75M47M39
2782B99o12j08O07j20n22N63P3n82M37M91n07l23N72J17p21J97O11n51k06N80
2802B95k90m60N74K50r40L96N47n45k58O51J66o35K77M49o85J12P19l57p28M42
2822b0L06m65p2O14m19l74O33k8o42K99M80n90j13O57j43m86L76K09m89KO15l88
2844c8k60N77M9m24K53L42o49j40M83k13m33M46K58n85J95K80l33l26N83J5o07
2865e27N82J37l94L2K17K13l65L05J37n46J85M43m05l71O01l4m03K75K10n33j41
$$ plain form
2721 317 -413 -419 288 70 -309 50 -71 -459 79 620 -355 -1 649 -77 -476 597 418 -483 -37 424
2741 424 -47 -432 245 111 -340 121 322 -375 -298 325 -110 -681 357 267 -522 -106 450 30 -498 282
2761 282 292 -332 129 494 -115 -67 405 133 -412 179 214 -588 -133 275 -178 -418 282 -112 -587 -140 299
2782 299 -313 -421 186 66 -456 107 180 -402 35 526 19 -304 268 385 -336 -139 472 -79 -285 295
2802 295 5 -455 119 369 -571 -175 372 -173 -431 220 386 -249 28 477 -208 -96 623 266 -462 -20
2822 -20 286 -179 -251 363 -56 -430 203 175 -467 -168 312 -278 -391 266 123 -363 13 222 -267 -265 350 -38
2844 -38 -298 279 328 -96 157 499 -150 -290 193 -20 -453 -7 251 -334 -139 141 -192 -518 65 80 -527
2865 -527 55 192 -202 -170 47 260 -105 200 337 -209 -24 419 14 -357 244 210 -193 82 292 -241 -382
2886c82O40k60n98P47R4l29O1K20k47j94M64q1k45M14N3n13J53L93j90o05N95
2907A90j86k62J73K06m06j25M08o2k61L40J39n29L48K02n95J43O97k63l12J86
2927C1L90n37R2M36m79j91N61r8o20L66M50p33Q6K65ql82M93M3l15k3L64k36l12
2950c57O06j01m24L12L86l00m41N16O1n51L76L2k82n8L51m12j78N52j69k87L74
2971FJ71l07j21N47k61m58M93K89m91K51J29j96l15O53j91m75M55k0m85J9O70
2992C63l30n79P25r7n93M37L02k62k59M59j02l95M36L00l70k06O35m04m26N45
3012A79K86o13q8O08k60l02K65M1k11l2K34m54R2O67m23n73N61L12m71m6L51k72
3034a49j11N36K1k04Q4J19n47J16M68l29m04O61J31p56n4P67l32m96N80N0m48
$$ plain form
2886 -382 258 -2 -600 147 241 -88 -27 193 -54 -248 216 135 -110 304 357 -156 -3 390 200 -405 190
2907 190 4 -258 -85 121 -285 -410 -2 -64 -325 15 154 -375 -27 175 -420 -277 420 157 -155 31
2927 31 421 -116 -24 412 -67 -258 303 205 -415 -49 401 -332 -246 19 11 -371 122 165 -150 -173 191 -45 -357
2950 -357 249 148 -276 36 422 122 -319 197 258 -293 83 115 -167 -225 126 -286 -464 88 -81 -368 6
2971 6 177 -130 -251 296 35 -423 70 359 -132 119 248 52 -263 390 199 -276 179 159 -326 -307 363
2992 363 33 -546 179 82 -511 -74 228 -34 -293 166 64 -331 105 405 35 -171 464 60 -366 179
3012 179 465 -148 -236 372 112 -190 75 116 -95 -127 107 -347 -255 412 -11 -584 -23 289 -182 -228 123 -149
3034 -149 -260 276 297 93 177 296 -251 -135 333 4 -400 261 392 -364 -418 349 17 -479 101 151 -297
3055b97K4O62n96j7O75l94m88N17K40p19L89P94o58n39P64k00n38L04K89l15j44
3076b47L85j72n11N54K02n83K13N41m73m05P23J80n40k5K97p2l29M74k51j30M14
3097B45M5n56p0P46n51m73Q32Q9p19k8O88n43n6O38k05l18P7L10m21K32P56q84
3119a66l58P97J50p51R3O18k52l05K09r5l57N32j31k14K95J20o58l9Q18n8n35
3140b87K9O65l75m44M12K43k25J0K08m53J22L79n59J21O01j46q70M58L44l88k78
3161d33M88J01k61o5k7J4L27O5l48K7M52j09o70M52M50n02p8K81m7m38J63J06
3183e2j29J93j70j32PM11l12r9K95M93n60l30M22K66m67K11J22j41k8J17k39K20
3205I8L34l41j90L30q6l87j57O39qm18rK56l26J01M48k72j10L58m87k14O56N6
$$ plain form
3055 -297 -273 389 -207 -224 451 57 -431 86 326 -393 -4 790 132 -407 357 157 -381 -77 212 -103 -247
3076 -247 138 -34 -545 9 211 -372 -159 382 -91 -496 227 407 -133 -158 139 67 -262 212 -39 -169 245
3097 245 290 -266 -336 410 -141 -614 218 307 -412 -440 248 -295 -351 287 82 -236 -159 151 -270 -38 718 -166
3119 -166 -524 273 423 -328 -235 383 131 -174 35 -60 -417 115 -16 -230 65 185 -473 -512 306 248 -287
3140 -287 -258 407 32 -412 0 243 18 28 236 -217 -95 284 -275 -154 447 301 -569 -111 233 -155 -433
3161 -433 55 156 -105 -170 -197 -183 144 209 -139 -112 340 231 -439 13 463 -39 -117 164 117 -321 -158 -52
3183 -52 -181 12 -158 -290 -283 128 -184 -283 12 505 -55 -385 37 303 -164 47 169 28 0 117 -122 98
3205 98 432 91 -99 231 145 -242 -399 240 232 -186 -195 61 -265 -164 284 12 -98 260 -227 -441 215 271
3227B71m22J59M85n12k84L90J20l00o6K25j25k39L50j79n2M52k79l09j5N35l59
3248a54j70M53K26m77P1K59k55M9O9r1j1K38k48l30M20P1j32k76N94l63k80RM47
3271A19k08q5J90j00k07K73L5l08M04J92k28k76K80J15n14M67K63n61M8R2j7k51
3293b77L57j1k90J2L75p17K63P14k90m71K72K58m57J04K65RL6J25j57m28M36J31
3315B59l96Q7M45k96m56J57N53m27r6L15j69k34K27O2l18J32M27n58J25M07j39
3336A07m29N50K63o70M8L04j30l12K08K66m13K81o2j66r4L31j34l21M63K44o59
3357c25J00M97m0m03J74K18l55J15K82l02kM06j55l91L85k1l97L7N20k43n10N09
3379I9o7k81J89L7J10l72L89jl20K92J78m14Q2L65j58m38M37K2k02JK29p3l95
$$ plain form
3227 271 -151 8 493 -19 -303 87 207 -93 -159 66 -59 -298 52 -127 -179 273 -6 -315 -330 205 -154
3248 -154 -324 129 355 -122 -51 208 -47 2 71 -20 -31 207 -41 -371 49 120 -12 -288 306 -57 -337 -328 119
3271 119 -89 -174 16 -84 -291 -18 17 -291 113 305 77 -199 81 196 -318 149 412 -149 -101 -9 -26 -277
3293 -277 80 69 -221 -209 166 -551 -288 426 136 -335 -63 195 -262 -158 107 116 152 277 120 -308 128 259
3315 259 -137 -50 395 99 -357 -200 353 -74 -170 145 -24 -258 -31 31 -287 -155 272 -286 -161 246 107
3336 107 -322 228 491 -179 -131 173 43 -269 -61 205 -208 73 11 -155 -249 82 -52 -373 90 334 -325
3357 -325 -225 272 232 -171 3 221 -134 -19 263 -39 -41 365 210 -181 204 183 -214 -177 343 100 -410 99
3379 99 32 -249 -60 -23 87 -285 104 103 -217 75 253 -161 -79 286 128 -310 127 149 -53 -52 177 104 -291
3402b91M52n0m65M42J48l93nL57n2n09M81N2k81kL07k87l0J93n9j69L42L14l95
3425A00j27N5Mk03K74O1k41j58M95l49j58L23k06r8J45K55m16J53K66k72RK15
3447A27K2j34n7M23n11M8M52l05k51M07j41r7l27N04k23k30N79k2m27O8K12k08
3469i1J94nk3k70P9M05j37j94K69j70r1K05q4l06J72J99l32l4J60J15l13j3M84
3492B19l69J33J83r3l55M80j9j53J8P3l17P4M50m74n5K97p7j64K26N1l21N4J76
3515C7J9k95R3K12k63J73M59l30k55J98O9k57R8K33k28q4M9J76k67J04K97n0j64
3538B4r3p8l03M27J08l67J35L03k93J51j66RK3K09K15l14L2L01j12j43J12M3k47
3561b4j07K64k41o0M50l06j33J26O2k37J63L70m53j20L47j20q4K35J11k33j03
$$ plain form
3402 -291 161 111 -354 88 236 -157 -162 195 143 -366 115 167 -114 -116 191 -96 -126 67 8 -161 181 495 100
3425 100 -27 28 32 -171 103 164 -77 -235 260 -89 -247 76 -130 -228 -83 172 -244 -91 175 -97 -88 127
3447 127 149 15 -42 381 -130 -82 370 65 -186 221 80 -17 -344 160 -63 -293 286 264 -163 -95 117 -91
3469 -91 103 98 75 -195 -116 289 152 -42 227 57 -34 171 87 -219 -47 152 -180 -214 -54 61 -252 -265 219
3492 219 -150 -17 166 73 -282 198 179 26 44 117 -200 -126 324 -150 -205 92 15 -149 77 128 -193 -139 37
3515 37 56 -239 -146 66 -197 -24 435 105 -150 48 117 -140 -42 191 -37 -121 -72 104 -163 -59 238 188 24
3538 24 -69 -147 -450 -23 85 -282 -147 156 -137 14 -152 -143 -120 89 304 -10 22 323 211 68 180 223 -24
3561 -24 -131 133 -108 -168 282 -24 -157 -31 31 -206 -43 327 -126 -246 101 -19 -103 132 243 10 -93
3582i3K96l08L6N8j9p0J02P3k30K6M1R1j75K38M8l97LM06l7j93m4K71l02K00J25
3607A46k21j93N30k25k74L02N3j54N7R9j70J30P3L4j08q7K26k55k87M49j53j65
3629a93K68pl62K95J51j09j80K84k4k79L5K93l31n6J64R2l46L98p2j29j8K56n2
3652G8k60K29o6j76KK38j20mJ80j4k35K13j9Pj96K34J5j96J49P5m8K3k60m2l0
3677b23N13l49j36K44O5j17k56N68l65k71L76J65l26L7K0J44j50K40j16j62LL18
3699B22l79j37M74o5j96m2L33l47Q1J78m1p4Jl9j34J81Q0j42j96L64j9n17L08
3722a06N16n30K45j44On8N5J15k15J67J13l14J35J47j62j90K59O0k15j46M10p5
3744G3n1J52k36o7K23r0j27N2L60l19j06L28p6k57Q4J55p1K2k06J45Nk24L30L4
$$ plain form
3582 -93 203 -105 -69 -11 -30 -100 2 75 -155 -129 -88 3 -172 66 114 -283 -280 126 89 -104 -148 123 -179 21 146
3607 146 -75 -268 262 37 -237 65 118 -36 21 120 -50 80 153 187 79 -8 218 -37 -324 125 -28 -193
3629 -193 75 68 -294 1 152 43 -137 147 123 -156 -121 172 -159 -215 -51 41 -305 93 21 -108 -126 130 78
3652 78 -182 47 -19 -195 -193 45 -75 -79 101 87 -148 65 46 53 -143 91 106 -90 59 134 86 109 -151 -193 -223
3677 -223 290 -59 -195 49 114 -3 -259 309 -56 -327 49 214 -112 -75 -55 89 -61 179 63 -99 -96 222
3699 222 -157 -294 180 115 -81 -123 210 -137 -56 122 81 7 8 -31 -165 16 96 -46 -242 122 103 -414 -106
3722 -106 410 -120 125 -19 -13 -71 -16 99 -116 51 164 -150 -15 132 -30 -220 39 99 -116 -262 148 73
3744 73 22 174 -62 -129 94 4 -123 -71 289 -30 -136 192 116 -141 -57 98 27 49 -157 -12 -7 -231 99 133
3768A33k17J59j15m4N0J62m36J36L49j24k07J56Q1j30P0Kp9J49J04j79k07R1J68
3791G2j21l01M07j15k1m1R2n6rJ57N1j41K28k37j93L12n5K5j29N9J16k77K65j13
3815b5j3k88K77K0J0o7Q2K2J12o9l17L66J22k78Kk1J54k59K16n8K00j41j24J78
3839A01k01J33r3r5K41J5k33j05K37J29m00K82M6j69j8J90j63J69k6M3k97J90
3861b4j06m8N6K17n4k88J64K91k60p2K29j25J50lj28k15M07j6l29K56J93l06j71
3884a82K37L1o2j35J16J61k52J63p3p7L1q3j47J73K36j05k61L41j4m9k33L75j43
3907D8q2J67l54J96j14P0L5k0K34n2k74J65k0J10k17L35k01j75L1J72j24J7L37
3930B84m48L66j47rj62L45p7j69n3L53l47j27R4K20k6j84k1J47m7O6j32p6K74
$$ plain form
3768 133 -84 75 -40 -84 -34 128 -308 -172 177 53 -154 2 83 -47 23 25 -54 95 199 20 -187 -96 72
3791 72 -49 -350 57 -58 -79 -120 -28 -84 -93 64 115 -26 202 -35 -228 84 29 54 -75 -16 100 -177 88 -25
3815 -25 -38 -326 -49 -29 -19 -86 -4 18 130 61 -256 110 232 -46 -44 -65 89 -170 46 -12 188 47 -77 101
3839 101 -100 33 -60 -155 86 101 -132 -237 0 129 -271 11 57 -112 -130 60 -103 66 40 83 -214 -24
3861 -24 -130 -178 -122 95 41 -247 -83 208 -52 -124 105 -20 130 127 -1 -216 191 175 -154 102 295 -11 -182
3884 -182 55 86 24 -111 5 166 -86 77 4 -73 -42 -125 -272 -99 137 32 -229 112 98 49 -184 191 48
3907 48 -34 133 -221 -25 -139 -69 -34 -54 180 128 -146 19 -1 109 -108 227 26 -149 -118 54 -70 -53 284
3930 284 -164 202 55 46 -116 229 152 -17 -70 283 -64 -191 -97 123 97 -87 -108 39 -8 58 -74 -150 124
3953A24m8l36J33J32Kp0J89l1pj86l1J52n4R6K9O3j08J20l84R9L00Q5m68J11K21
3978A33k96l2K59j09P8Q8j5j81J78Rk6j10J53k04k64L89J84k38Mr6J57k72K98
4001H7r1r5K60k04p2k7Q4p9M6k8J91l91K51K15k49N9k4R2J7j96M22l62Q1L2J27
4026A46j28J91L1l94l9J89Q8j93J2J66j25o3O6Jk24M74j73n7l9J23k23L13q3q0
4050b1k23L53j07n0J2K39j99k21J50k2R9P1j66r1J28P4M4n9K06j25j28n5K61j25
4074D5Q5k9j62P3J28N0j70j23P5k0J00O4k78Q8J07p2q3J50po0j81L67j03p5J18
4099H7j18Nm8rj08N5N7j52K74p7J54k59J90R8j66k2K3J30j46J10j27n6m6J43J74
4124A66k49M8K26j53p5K28k88O8N8p0m4Q5J72k17r5K89o0j53K0k9K03k90J70M9
$$ plain form
3953 124 76 -260 -127 5 7 -63 126 95 88 -98 -129 23 -31 65 94 157 49 169 -215 -116 184 269 -199 -88 133
3978 133 -163 -195 64 -45 33 121 106 -75 103 112 86 -24 129 -75 -339 50 234 -4 0 -96 61 -211 87
4001 87 -4 -99 161 -43 -115 -142 -58 -137 -91 -119 72 -319 -68 147 -102 -43 -67 25 42 -154 268 -94 -13 19 146
4026 146 18 209 240 -154 -193 -4 84 -109 -97 69 -56 -119 -53 -52 -276 198 25 -32 -71 52 -171 142 59 -21
4050 -21 -244 109 2 -48 -36 203 4 -217 -67 -89 10 81 -85 -176 -48 26 70 11 217 92 -36 -91 170 45
4074 45 130 101 -61 12 140 190 20 -103 -28 -48 52 116 -162 -74 33 -39 -122 28 21 -39 -220 147 44 -31 87
4099 87 -31 -26 -74 -83 -191 -136 -79 -231 43 -34 120 -139 51 149 -17 -39 -16 114 -32 78 -49 -105 -151 -8 166
4124 166 -83 -35 191 38 -37 191 -97 -29 29 -41 -85 0 172 -45 -140 149 89 -64 -44 -73 130 -160 10 59
4148E9j01R6j02j60K39M2o2j12J75k40J69M1R9k33l1J40k2k52K93j67j6Q5R4k6
4172Hj81P0J65j93m1K11k6r4J47q0j08K21J44j98m9n2L5R6q5M1j0p9o8q6O4K18
4198G0R3l06J0L18k42m6K74r5K7j50j22J24L8J63j41k0jJ69j29j51L01k13p3R9
4222cn2P4Q0j50q6k0K45k31L29L9k63m3K73l01K2R7R2p5k72L16N3l65K52P0k25
4247a44L7J18j08j5%Q2j42J09O4p1P1O2j2k10J44K42k87J9K91k55r2J15J08k34
4271a08L30j61j06r8J02lp5J28L2p2J97q4k0j21N3R5o0j73K36j58j25P9M1K28
4295A57j83n8J7K8j4j04p8K40N1q8M6OLq1j4K8k08K38M5j02o3K43j61n1N8Q2j75
4322a38J34J36j66Q8K0P8j38J32j75j1j06J71J95k47j45L20k01O8Pn1n6Q8J25
$$ plain form
4148 59 -42 54 -48 -208 31 73 11 -101 74 -166 3 44 143 -90 -121 19 -3 -255 38 -129 -145 -60 34 8
4172 8 -173 -103 62 -131 -172 39 13 -81 66 -14 -122 99 243 45 -4 -56 -21 75 -10 31 21 -58 -126 -212 -148 70
4198 70 163 -143 -133 185 -57 -103 171 76 103 -47 -169 -45 -7 156 15 -5 -6 163 34 -117 184 -29 -102 -3
4222 -3 -55 19 99 -51 -137 -157 88 -143 186 225 -38 -81 192 -109 -87 10 102 27 -245 71 124 -241 11 81 -144
4247 -144 -107 11 -97 -112 -112 -30 -172 -63 1 -70 1 63 51 -159 -15 227 -60 -41 250 -5 -97 18 126 -108
4271 -108 222 61 -45 -143 -41 -44 -119 9 41 -31 166 82 62 -59 -6 89 29 -144 92 -66 -191 -112 -71 157
4295 157 -26 -84 -67 -39 -53 -157 -235 5 56 -32 14 20 23 -58 -72 -44 -252 -14 31 -71 -134 109 -52 -103 -45 37 -138
4322 -138 -4 132 -34 54 74 152 14 146 -29 -40 -146 25 220 -27 -172 148 -53 15 22 -29 -85 3 128
4345A28j12R8m1j68k4n1K05j94J91J32k95N1J56P2j15j23Q8k00K79n6lq7L69k85
4369A5j37N2L11k62M0m6J14j25O8J28k45J45Q0l6k10P5l9j01J01J17n3K0J19m3
4393H8k38K96m7k08K22J06m12K42j97J05J00J03P5k94m7K06o6o4L2L8j40K53N1
4416B04k88J2K12j27j4J0M5j04R2o8R1n8N3P6k12o1K34l9j80J72J03k86R8q8J21
4441bm9J32k02O2K37p9k13J08J05j68J7J03l6poj43J44J86j41j79N9L12q5k92
4465a37l0J65O0k7K6J08k69J20k05LJ49j0j8k46L77L2l5K0q8P7k7k2m9p4M7k6
4491g9J06J98k43j70J60p9J44m5N9K1k73QJ6J72n4M6ORk5k4o1J99j18N0o1J26
4517H8l9k98K74Q7k10J61n1p1r9N4l0R2j6L52j60k92J85Q3l28J19K30j61lJ23
$$ plain form
4345 128 16 114 73 -95 -119 -170 35 -159 32 164 -131 -80 76 148 33 -90 -2 -202 77 21 18 -69 300 15
4369 15 -122 -70 241 -21 19 -27 87 -38 30 158 -87 58 138 102 -108 -33 -72 -173 -72 45 -8 12 131 88
4393 88 -150 146 99 -109 113 219 -193 49 -148 -43 57 160 235 -59 -106 100 34 -30 2 40 -100 153 204
4416 204 -84 -72 140 13 -1 9 54 -50 42 -26 65 7 60 136 -76 -137 97 58 -122 50 153 -133 -35 -123 -2
4441 -2 -51 81 -121 -59 178 99 -114 -6 99 -69 -52 51 15 8 2 -141 3 189 48 -131 -72 240 155 -137
4465 -137 -167 -2 58 31 57 165 -104 16 -189 -186 -37 -47 -65 -311 66 98 63 83 -5 72 45 23 -26 -100 -53 -79
4491 -79 27 225 -18 -188 -28 -107 37 -8 51 72 -201 -193 -177 -5 -59 -13 -7 2 -23 -47 -108 91 -27 23 -38 88
4517 88 49 -249 25 112 -98 63 12 -59 -158 -104 -134 -42 -58 294 134 -158 27 110 -218 -99 131 -30 -33 90
4541I0j9k12P9J69k49J55J19j02k51K95j26k3J49M2j97R4o6n5RN2J71k51p6L02
4565I9p2j14M5J40l07L19O3p4l19K70j3j38j13J51P4j71L77k46j61L71J7l05K17
4588A10o4j01j69L11o6Pj45L01k60J84J29k48j7M8o8M8J46j00K4k07K22j21J3
4611b3P7Q5j69p9J05Po8J86m3j04m3J80k52R1J86l0k07Q9K15k05o5K21j26k30
4635b02L64k24O8J59m1j84o8J27Q8r8O7J36k96n9J35J29R3j92Q3r7j70J92p0j86
4659b46L28q7j06J19Q1j56M0J5J92j97O9j30j24J13RK70k75P9N5P7j81J17j5m7
4683@P6j2n0p9N8m7O6j60K70j32J88k00N3K00l51L0R1l8R3o8m6L0J13j53l9J49
4709D2q8K59l00k5J17J6o0j69K36m9l5J42j36J75j27N8K4j99K31r1L0n8J94k93
$$ plain form
4541 90 71 -141 -62 107 -142 13 132 30 -221 74 -52 -75 74 116 -81 13 -53 -108 -99 -47 124 -127 -203 99
4565 99 27 -87 -42 98 -209 110 173 99 -220 50 37 -101 -214 -63 11 -160 217 -29 -190 181 198 -107 110
4588 110 46 -55 -224 87 21 28 -117 184 -76 108 237 -11 -28 20 -48 0 146 46 70 -137 85 -36 -23
4611 -23 54 139 -30 -109 -4 3 -65 121 78 -26 -69 111 -141 -50 136 106 -101 -12 203 -2 -67 154 28 -202
4635 -202 162 -62 6 165 124 -60 -128 -1 87 -11 56 192 -104 -163 -28 101 194 2 85 -12 -182 10 -60 -246
4659 -246 82 -5 -111 8 89 -67 -27 -12 180 -17 52 -78 -202 -89 -80 190 -85 -6 49 126 -55 62 47 0
4683 0 76 64 14 -65 -7 -54 12 -148 122 -10 178 -22 31 231 -120 -90 1 -37 56 -12 -58 -28 85 -68 -107 42
4709 42 -46 213 -87 -112 5 21 -39 -208 28 -21 -56 86 -50 125 -2 56 80 -119 112 21 51 -7 187 -106
4733a06J44N6o8j64L01k22J0Rj5K67m12K34p8j02J45j24K96j79J70j49m5k0R4
4756D2j01KN3j37R2N5n7L3P8k09J53r8J41o7j20N9j36Q3K5R9j08Q0J71j2j38K2
4782EK7j09j36L38M4K2P2l08K4K5J20k52L1J59j7k06J05J17j14QJ68j55j16K40
4806I2J2k73J68J57l39J29J41p8j47J34j9o9J43N5k50L4mL49m13J09J02j03r7
4829a67L31j34k28K07J58k72K5J26M2%n2J41k08q9M01l36o9R3N9j24L2K52l29
4852a41K19j17j37K35o8J04k41p8K69j18MJ07JO4j02J86k54J17N6j82k8P4N8j88
4876a60J07l9R3p5J15q7n4J00lk15P1J61p8MK19j59l9J94j32mK8lq1J5J00n8J15
4903A35k42J39l5pm0o4j08J08J31j13L4J29j32J18O1n5k04N2K20k20O4l3J30j40
$$ plain form
4733 -106 38 94 26 -138 163 -59 -49 -40 -55 212 -200 34 -44 -146 -1 -125 171 -8 162 13 -32 -52 42
4756 42 -59 -57 -4 -141 -49 6 -51 -18 60 -149 4 -94 47 -20 -140 -81 -217 -134 -109 -10 -118 -38 133 121 -17 5
4782 5 32 -77 -213 125 169 191 263 -45 -21 4 124 -128 -97 62 45 -161 -56 61 -53 -45 123 -32 -148 92
4806 92 104 -169 -1 156 -183 -54 87 9 -138 -4 -23 -92 51 106 -144 -110 -114 235 -178 -69 33 -70 -167
4829 -167 164 30 -198 9 167 -105 -80 46 88 88 36 177 -31 -120 281 -55 -124 -31 28 -96 -64 188 -141
4852 -141 78 -39 -176 59 -9 95 -146 -224 45 -73 -69 38 39 103 1 187 -67 50 106 -76 -104 -30 28 -160
4876 -160 -53 -92 1 -74 41 -46 -100 0 -3 -218 -147 14 -64 -60 159 0 -39 155 23 19 47 44 -37 -22 78 20 135
4903 135 -107 32 -3 -10 -50 -114 -222 -114 17 -96 -62 67 -65 53 114 59 -145 -93 127 -93 -29 -62 68 -72
4927g2J22J00n4o1m0Ol5q9L03k02o0K00k4q6M5o2m8Q9j46J11j59L23j48r1J80
4952A02J19k37LL10m35J1P2K57j85k18R4J44n2K03r3k72J98M9r6j21K82j29k55
4975b49L46k5j47J4K37j57r8Q6L3j26Q7J55j85J64L5j81RP5P7j61q1K76k24R0
4999E0j30J00j25R6N9j36J59nQ9l06L39k59p7K06p6j53N5J19j70K31r3K31m57
5022b53O8K01k06J9K35nlo5J54p4k17K68k95J20m7J13j34J37o1M2r2K11r8k26
5046b08L25N1j89K5J79k93r6K22N5l1N6Kk20m7M06l52QJ2J80l69R0J12K5N3ml2
5072d0mkN8j67J96l8N1l34K30P1k0j45K48P5k10J80k60J35j31J55j93J84k9P1
5096H1j73K83k21k9Q9O7j33k09L18Q8M1m02L37j81O2K68k66k95L72J62k64m8K45
$$ plain form
4927 -72 50 150 96 35 -5 1 -34 -123 180 -22 -82 118 94 8 53 -9 -57 32 -114 -3 -162 161 13 -78 102
4952 102 221 -16 -13 297 -138 -127 -55 202 17 -201 -107 37 -15 188 95 -177 21 70 -26 -147 135 6 -249
4975 -249 97 72 -75 -61 176 19 -79 7 40 -86 1 156 -29 135 170 -11 -2 73 150 -11 -92 184 -40 50
4999 50 -80 20 -105 -9 50 -86 73 68 157 -149 190 -69 -146 60 -16 -169 -114 5 -165 66 -27 204 -253
5022 -253 -185 16 -190 -171 64 59 56 -9 145 71 -146 122 -173 -53 -100 13 -121 16 -45 -3 -95 116 18 -208
5046 -208 117 168 -21 4 183 -110 -206 16 71 40 96 98 -122 -169 237 -115 -107 -95 85 -284 -194 -82 -57 -4 -8 -40
5072 -40 -44 -46 12 -155 41 3 54 -280 -50 21 1 -144 104 179 -31 149 -111 24 -107 48 -145 39 10 81
5096 81 -92 191 -30 -59 30 97 -36 -245 73 161 202 -200 137 -44 18 286 20 -275 97 259 -5 -53 192
5119A92l11pJ21K09m67K44NMk50L37L7l84M14rp8r5J90k86O9R5R9m2j94K27k00
5144h0K35o8k22j7K11l3k47K59RP1j44J80j15O7k42K2O8o3J00%p9K76m5l38J76
5169a9J84l03P2K19j11n1lP3o1j01N7J0n9J13J09l9k60L86j02j95K88j94l31K84
5193c4J56j52j63K23m4j9P4N1p6M5O4l50K30K47k96n1J57J47j26l77L45K6k52
5216a75J15KQ0j09O5j47J17Q0j14n4L62q4j79q0K56o9j73J78j46k4Q0J2j67j26
5240c00N75k04k10J9L12r9j31J53J4k16L9O6j05L1J97L4l44K19J03r5P5j74j34
5263a75p4L48k21j17L40R5k44K7k9K09k00Q2J73m19K74P7j62j62L02m7l25K36
5285a2r5Q4P5Q6l37j8K09n1j19N4J48K3q4J39nl84L13N7kp6q0l2J95j8Oj44J30
$$ plain form
5119 192 -119 -126 -5 204 -263 -19 -14 -10 -260 77 114 -270 144 135 57 -38 152 -134 -65 30 129 87 -107 120 -80
5144 -80 155 87 -135 -152 59 26 -221 38 47 118 -26 154 39 106 -136 -114 -46 -109 -9 -9 -88 188 143 -195 -19
5169 -19 165 -138 -66 153 42 -9 -12 61 0 -101 -44 -34 -93 20 129 90 -170 216 114 -81 207 13 -318 -34
5193 -34 122 -30 -193 30 -14 -33 41 92 16 61 125 -225 5 252 -44 -95 62 209 83 -294 51 77 -175
5216 -175 -60 -58 22 -87 -22 -169 -52 28 -86 -140 222 138 -41 -121 135 66 -107 71 -75 -99 -19 -7 -174 -300
5240 -300 275 71 -139 -120 192 93 -38 115 129 -87 -48 18 -87 -56 141 175 -169 50 153 58 133 -41 -175
5263 -175 -249 99 -122 -239 101 196 -48 -21 -50 159 -41 41 214 -205 69 146 -16 -178 124 77 -248 -12
5285 -12 -107 -23 52 138 -199 -217 -8 -59 -178 -124 24 47 -37 102 97 -287 26 83 81 5 -75 -107 88 70 76 -68 62
5312F2K6j26n1K8mj33K61m9j35P0J29P0k94J86k13J98Q7p8p4J57rM0j46K5K8l05
5338b50K25J88j06r3pP6j5o5K61l94R7J24p7o3J9J38q8J4J55k40j0L55k17p2J64
5363A19k5L4j36J1J12k08%l9O3PL4q2L0J27j21L0l9K92k69R6J27q0M4O3p1k54
5389a35R5K78j42q2o9j9L4o3K5j37K12j64K18k13O7J99k33K35k56Q3J14O2M8n0
5413A07k12K54k49PK33Rl83J86J4j30O2L06k08j54J89J8l18R7L57k96K56j16l4
5436ep4O4r3j11J99Q9k24p7K08q0K22r6k9R1k14J81q2r7J36P0mq8J66n4j01J83
5462A80l7j33J43m7j08P8Q4J7k07R6r6m6O7K58k27j07L23k11j39J2J40k2L1m9
5486@j63L6J45Mj50J91R7k12N1J75k48O0j62K61k71K9K47k06R4L9K20k28j69K38
$$ plain form
5312 62 88 -38 -89 -61 -65 -198 63 14 -121 -51 78 148 -146 40 -173 25 112 34 -40 117 108 148 2 27 55 -250
5338 -250 -25 163 57 -36 -43 33 18 -47 214 -180 -83 41 -36 -99 -80 58 -30 -16 139 -101 -111 244 27 -45 119
5363 119 94 128 -8 3 115 -93 -93 -132 -69 -62 -28 -110 -80 47 -74 -44 -83 209 -60 36 163 83 127 190 119 -135
5389 -135 -40 238 96 14 -55 -74 -40 -103 -78 -215 -3 -167 51 -162 -95 104 -129 106 -150 -67 47 109 157 107
5413 107 -105 149 -100 -93 140 149 -234 -48 -34 -164 -102 204 -4 -158 31 49 -269 -172 185 -111 145 29 -5
5436 -5 -79 -15 -108 -219 -20 69 -155 -232 -24 -104 118 22 -7 84 -130 51 -31 -128 8 78 74 -14 152 98 -3 180
5462 180 143 10 153 106 -2 76 160 177 -30 66 -30 -76 -9 249 22 -85 238 27 -112 -100 40 18 49 0
5486 0 -163 -127 18 22 -128 63 160 -52 -1 174 -74 -14 -176 85 -186 -157 90 -116 -22 17 237 9 -160 78
5510G8j05J4J23j46j76K09J75l14L0K84Kl44Q5K7j8J21p2K4j76K40j39JK84j18
5534H9j61k05L74k8k11J16m3L0N6J4J26k80L23r4j24J71k0q8L4j07l2L9Kjj30
5559a50OK39j08J21n9k1j80J93K98k44j35J4R5k71K38j21o1K10n7n5O1J50j70
5582gm1J69Ol03J16K30k65nk2J39j0J34M5k05J44K05j65l82L07Ml21J24K47j60
5606a6j81L14m6l12J97R5l9j30J81m2j07K58k48n1P2J72k66N7K19j59n0J01J11
5629A30k03O9Q7N5j10J00j35r9J73J48k76J17jo9j15qJ26J63l21K36j1k37O9J35
5653B3q2J99nj87j6L33j99k11J59o5%j3q3R2Mj53L28k79J73j61K3R3J31p1j78
5678a45L39k00k8q6K78n4k72K27l5j36K18J74k68n2J44j04j43k20M49j01j02K92
$$ plain form
5510 78 -27 -13 110 -36 -212 -3 172 -142 -112 172 174 -170 -85 -58 -76 45 -27 -3 -179 61 -78 -77 207 89
5534 89 -72 -277 97 69 -142 -26 -69 -39 17 31 157 -123 200 106 -18 153 133 45 79 -28 -60 -21 -19 -20 -150
5559 -150 -144 95 -13 108 49 28 -152 41 339 95 -40 -26 69 -202 36 -85 -146 64 7 -48 13 163 -7
5582 -7 -48 121 127 -176 -60 170 -95 -100 -122 17 7 141 186 -19 125 330 165 -217 90 94 -227 -103 144 -16
5606 -16 -197 117 71 -241 -44 51 12 -118 63 21 -86 172 -76 -127 -55 117 -149 -92 127 -32 -82 19 130
5629 130 -73 -4 83 138 28 128 -7 -106 67 215 -61 56 55 -14 -129 -137 -11 152 -169 67 56 -181 -112 23
5653 23 -59 140 135 -52 -68 265 66 -145 14 -51 -51 -64 -147 -55 -51 -204 124 -155 18 -143 -120 -27 104 33 -145
5678 -145 194 -6 -34 -120 158 104 -168 59 24 -112 106 280 12 -40 104 0 -143 -363 86 -15 -117 175
5700A75k17J4m4L9K06k31J70j21j48K03M7j2L0k5q0J64j90p6r6J75R7k11J11J59
5724A39O3k09J6o9lO0n6j04J49J64j45j21Q5P4l5j85K44r3k7J42j06rk06L31N8
5749A57j91J72k00j1J72J02k52J28R4l3j96Q8J61k08L06p2k74J16R1j87N5K0J91
5772B29m20L43j9j12r2J39J03l72J31O5J0k45K13J11k99M39l74M4Q1O0k6j30K51
5795A30l06J01P2J45j48l1K62o5l10K83j10j84J56J42l6l21K79j34Q1O2M5q9n
5818A9M7j73J78R5k1k59K34J8l04L4K13j11J06j40J77j32PJ57j80j34L06j30r
5841bj4Kj16P0qJ66k46J8J00Q5k3J15j16r1jm9K55j41J58m36L3L06j29R7L2l0
5867C5j05P8L4q4Q5R4l01J44M9J93k80L3L05l12Q8j13J5p2qR0p4K50k05Q2n3p
$$ plain form
5700 175 -42 -28 -72 -33 173 -58 112 -9 -157 46 93 81 111 86 6 170 -20 -96 -192 -17 80 -131 -20 139
5724 139 202 -7 9 -60 -63 -3 -59 -163 -14 150 5 -116 -31 43 8 -177 67 -26 -53 89 -17 -26 -232 99 157
5749 157 -34 138 -62 -73 99 201 -51 77 171 138 -58 30 191 -17 289 217 -57 59 150 -37 18 38 229
5772 229 -191 152 133 21 -71 68 171 -201 -70 -5 5 -240 -27 84 -215 224 -150 -106 -25 35 9 -121 130
5795 130 -176 -75 -3 142 -6 -37 225 160 -150 133 23 -161 -5 137 101 -220 59 -75 6 68 113 24 19
5818 19 66 -107 71 166 145 -114 120 138 -166 -132 81 -30 76 -64 113 -19 -12 145 -35 -169 137 7 -2
5841 -2 -16 -14 -130 -60 -68 98 -148 -130 -30 55 32 147 31 -60 -61 -110 145 4 162 -274 -241 65 -64 33 65 35
5867 35 -70 8 42 -42 43 137 -164 -20 29 222 -58 -25 280 -32 56 -57 -42 -114 -122 -32 -106 144 -61 21 -32 -39
5893c9N2j6j11K46ml91L29M4j12J41l8k50J91Nj29J89k7K7k43J72K2m3M0NL9j42
5919d3l4n4M7J05o1J41j39J31Lnj89K80o1k62K14r4o0J95m9q5q7M5R7k19J54j26
5945a56N6J20j05O9j31K1J24Nk7q1L1n6J15O6j70K7J94O0R7k26O0r6R2k4q5j39
5971a59R9LO2K1j4j28K43K5j71O5m9j00O4Q0M5j76J64k2r1r1J60j05J5R6r6J17
5997E7j41P8j24J43L1R8k40M1J52j33N1l2o9R9J9p1PR2o1j71J28J37r4j71L10
6022A36j3k26K28j43Q4j29L06l54J61N2j04n2J4L3J55k86K28m0j75L5J21Lj57
6045a23N2J08q0k3Ol4qJ25l1k2l0L1m3J19J7j51M6O1lj22J43r8P0%K48l52n4J00
6073d8P7j46J06J66l04q0L03K5j50J50j25P5k05J76j01j0O0J32K9k81P7l4J46
$$ plain form
5893 -39 13 -3 -114 132 128 -263 66 110 -2 139 101 -149 42 47 -82 107 80 107 -136 36 58 15 55 60 99 -43
5919 -43 -77 -131 -84 21 -40 101 -38 93 96 91 -98 182 121 -141 73 -21 -81 114 65 -20 -107 -62 35 -184 -30 -156
5945 -156 -100 20 -85 -16 -147 -126 -2 3 -24 -105 -74 -130 -15 51 -119 -92 102 162 259 33 93 -3 89 65 -20 -159
5971 -159 -60 -57 5 26 12 -116 127 152 -19 46 -3 -103 -39 41 86 -90 74 52 -39 -130 30 -75 -60 36 -60 57
5997 57 -84 -6 -130 13 44 142 -98 -57 95 -38 13 -19 -88 11 30 -41 -34 58 -3 -174 -46 91 -3 -174 136
6022 136 123 -103 125 -18 66 -63 243 -111 50 102 -2 -54 -40 -7 148 -138 90 50 -125 -90 31 34 -123
6045 -123 -71 37 -43 -66 -60 -94 -102 23 -8 -30 -60 -29 -72 47 64 -87 -41 20 17 -105 38 -60 10 10 258 -94 -148 -48
6073 -48 29 -117 -11 155 -149 -229 74 99 -51 99 -26 49 -156 20 -81 -91 -31 101 130 -151 -74 -108 38
6096C8L7k05n7N0J61m8Q1L4j62N3p1R5J51j77K29j24k39K53k9o6R0r1K25k51J22
6121I9J9j76o2K39j80J09Q6j33L5j94J67q9P3j8q0N4N2nJ8kJ50j42M4o7q0n8Q0
6148f1N7P4k8n7m6J92j09r8j8j1J7L9j6J6J38k24R5o7N5oK13j09k93L93q8K4o7
6175A5J4L8j40R8P4j18P9r4Q1l6m0n3J84j14rm1N6j58K20o8o1j2N8N7p6k6L3M9
6203A0j18J47O5J66m11K9J88jj93J44Lr%Q9j27Q9JM5k3j39j7RJ84j28Qj67K51
6230I5p8k8R6k19J00N4K9r1j93J96j40J56Loj4l4J25k53K05N0j88%L66l23J56
6255F4J5j2k1k3J9J04j69j61K84J97m14K3J54l4j88J09n3L87j83j87j8l0J56J57
6279A76l68K04j8k7M5p3n5l6J03j37J59P1Kj68q2J78mJ5J96k63J79k03J2n8K63
$$ plain form
6096 38 75 -130 -187 -137 24 -24 57 91 -71 -18 -89 6 157 -20 209 85 -154 99 70 4 94 3 228 -23 99
6121 99 118 -58 -120 119 -61 48 134 1 36 -158 9 -80 -7 -25 -105 -51 1 -4 14 12 162 20 64 -3 -83 -141 -61
6148 -61 -4 70 42 -15 -61 131 22 -76 -94 -105 -88 -49 -65 -49 89 -135 -40 -107 -52 -58 155 46 -247 146 58 82 15
6175 15 29 67 -73 25 99 -19 60 -34 47 11 -29 -82 102 -12 -21 -62 -6 -164 56 -12 -73 -85 -27 30 -46 -72 -39 10
6203 10 -108 39 104 270 -141 -112 76 75 -118 26 29 20 20 109 -18 71 72 117 94 -45 -62 -53 131 3 11 -156 95
6230 95 17 -11 85 -134 -34 20 49 -42 -235 -39 -179 -23 -20 -26 -40 -74 51 -202 3 53 -135 -135 231 -92 64
6255 64 79 67 46 23 42 146 -23 -184 100 297 -117 -94 60 26 -162 -53 -106 281 98 -89 -107 -137 19 176
6279 176 -192 12 -6 -33 12 -61 -116 -152 -49 -186 -27 44 46 -122 -204 -26 -30 -15 181 -82 97 -106 -94 -152 111
6304A11j04k23J30J17Pk4K35j06j81l0J23k49J59j66P5K99j48j09N9P6o4J13k37
6327a37J62p5j06L12j85nnO2k2r5J4J31k1%R6k23m7K35k6p8p4Q9j45J32J37j12
6353A4j35Q0K1j0PL6o3q5J92Q9j09j81J63lk41J80J49j64R6j07r7M3J75J0j20
6378f0J08p6K3j06J0M6m9K99k28rp1J79j27K48l27J94N1j9O8j31J62k15J13N0
6402A33k34m0N7K8L5J16n6j06O4k57J57J91j27K9ONJ23%R9k90o0K04m7L4l1m1
6428hm6O3J14n4k28m2J71k9L9m3P8J38j69o3L0J58j66J46j60R0j5n1R6N5k6k69
6454a91L18J07k66P5q8k5J3knJ07O7j84R0O4J04k24Q7n6J4J8P8l9j12J47N2l6
6480A13j75J6jJ49o5J4j4j48j13O3L10p2k15m0j19L87j1j04N6j29K79r5j39J4
$$ plain form
6304 111 7 -216 -86 31 38 14 249 143 -38 -68 55 -194 -35 -201 -126 173 25 -84 -25 51 -13 100 -137
6327 -137 25 -50 -156 156 -29 -34 -39 23 1 -94 -80 51 30 30 126 -97 -144 91 65 -13 -87 2 -143 -11 126 14
6353 14 -121 -41 -20 -30 -23 13 -50 -135 57 146 37 -144 19 16 -225 -45 104 -60 36 -71 -168 -125 50 60 -60
6378 -60 48 -28 -5 -111 -101 -55 -104 195 -33 -42 -113 66 -61 187 -140 54 105 86 154 23 185 -30 83 133
6402 133 -101 -141 -84 -56 -21 95 39 -67 -3 -260 -103 88 -39 -10 -4 1 124 124 223 -67 -127 77 30 64 33 -8
6428 -8 -54 9 123 69 -159 -201 -30 -59 -20 -63 15 153 -16 -79 -49 109 -57 89 -71 19 4 -47 49 104 78 -191
6454 -191 127 234 -32 43 -45 -70 -57 -59 -64 43 110 -74 16 80 184 -40 47 -9 5 23 101 62 -50 97 149 113
6480 113 -62 -46 -47 102 37 51 37 -111 -224 -161 149 77 -138 -178 -297 90 79 -25 31 -98 181 86 -53 -39
6504c9n6J52j32J70j94J12N2j03q7J61j29J93j3j6k06J7M5J46j17J10j43J24J58
6527B05l51j12J95m8L8J9J4j02J70J04k81K08l3qo8N0j10O8O5k9l1j17R5J95j26
6552A0j9k4l8K49p3q0J22o5k54J96K3j06l0L7KL09k96j4q4K85m9j56m9Q1k3oj48
6579b00J13L5K5J33j05pm2J00j12rR3j2j00p5l6K64j4Q5j10P7j13p0j3J84J17
6604B08l23P1LJ72p8r0J51K5J6k26M2LJ39j11j60J16R3L2j66J55Jl7p1Q4l2R8
6630A15j99J58j01j41K45j39rNJ0J4q6L4L8K32k64o9O8K32j76p4J25l7l4RM0M4
6656D0j85J48k3j0O6kl3j31J71J13j59L5kJ6J7q1P7j10J61k10R8J1J56Q1l21L7
6682d0Q5M8p8K5j5j35J68Q8k69K23P1j39o7j9J55j11J28p5J47k99K15k73J49J08
$$ plain form
6504 -39 -95 57 -75 95 -99 13 65 -38 -125 36 -93 100 87 71 -135 -118 -73 73 -44 66 -77 47 205
6527 205 -146 -258 -63 -111 -73 -54 -40 -142 28 132 -149 59 26 18 -50 0 -110 -42 23 -6 -37 -154 -59 136 10
6552 10 -9 -33 -71 178 105 25 147 82 -172 24 47 -59 -89 -52 -50 259 -37 -51 -135 150 101 -55 -104 -23 -46 -52 -200
6579 -200 -87 -52 -27 106 1 -6 -48 52 -60 -69 24 12 -88 -163 -199 65 51 136 26 103 -10 -80 -93 91 208
6604 208 -115 -44 -41 131 53 -37 114 139 155 -71 -29 -26 113 2 -158 -42 51 83 -83 72 73 36 -35 49 17 115
6630 115 -84 74 -27 -168 77 -62 -71 -66 -56 -42 -128 -94 -56 176 -88 -157 -89 143 -33 -107 18 -19 -53 -44 -4 40
6656 40 -145 3 -20 -30 36 34 1 -130 41 154 -5 30 28 44 61 -20 57 -53 108 -102 -4 7 163 244 -77 -40
6682 -40 45 93 15 40 25 -110 58 146 -123 100 171 32 -35 -54 101 -10 118 43 190 -109 106 -167 -18 90
6706I0j26O3j22jM0O5r4P2j14K49j03r7J14j39j66K91R8j22nn7J84j86q5J93P
6731D9L6j97J26R2r5J81j20k0J61j63j21l2J78j47J87p8jJ18k27J2N0Q4l4l1j36
6756a28K37j46o6J56j64J08k7J50m6j80J19L2j20oK39j00K0j27j7J58ln4n8k6
6780d9L5n8p4K31m4Q9m1mj01p9N6P6m8Q3k06N1PJ04p1R0j05L6J47k08Q1jN4M4
6808I5j35m9J54j15p2O9K4q2O0m9O5k1J12Q4j95N8J30k06M9K11j78j92K28k1o6
6833d2P8Mj79J59N6k5j24q3J85J05j84J57p1M9j65K08j13o8J39j93k2K1J00l2
6857d0P2J25j00p2p9k8J08q8K27k02Q2K06j16j46J03n5k1K0L7M5k6lmL2oNJ35
6884B11l03Q7k20J39J23j00j33K60k6J21k19M9l2R9j85J58L9k9n7J57j33L6p2
$$ plain form
6706 90 -36 27 -95 -96 -56 9 -85 -13 -127 122 19 -78 36 -103 -269 22 120 -2 -7 -64 120 -66 -151 42 49
6731 49 85 -112 14 106 11 192 72 52 213 50 -71 -103 75 -72 115 37 36 154 -73 -61 -11 73 39 8 -128
6756 -128 109 -37 -103 53 -111 -3 -30 120 74 -106 13 45 -75 -81 158 58 78 -49 -66 92 89 35 -23 -49
6780 -49 -14 -72 -146 85 41 130 89 85 -16 -95 -39 37 -11 72 -134 -83 -76 28 -43 47 -58 -22 125 -83 -2 -3 51 95
6808 95 -40 -89 65 -50 -122 -53 -29 -111 -51 -100 -35 -56 56 140 -55 3 133 -73 -24 187 9 -183 45 24 -42
6833 -42 36 40 -139 20 76 51 -73 -156 29 134 -50 107 36 85 -80 128 15 -53 86 -107 -129 -108 -8 -40
6857 -40 32 157 57 -15 -94 -122 -14 -102 125 -77 5 211 95 -51 52 -3 -24 -4 33 78 52 49 45 77 71 76 211
6884 211 -92 -5 -225 -86 37 -63 -196 64 38 159 -60 -11 -43 56 -129 29 68 39 -18 139 6 42 -30
6907c0J47k19Q6N2o8J6K6m2rm4J48Lj08J20j53P5R3j14J75j21O0m48J95M12l60
6932a08J51J38n6J3l25J81N2LM0j94o0R1lQq2P8j07J41K2N6j02l0J87j25J89l17
6958a59K10j37K10j83o0J97j57J06j16K20j32j94K37m2j80P3J40q7o5rJ90mj19
6981f1j3k2K54j76J69k62K56j80j71K14R4j68j4K73k27J4m1o2o2R5Q6n1N4K5R4
7006A18j32j62L1J67q3J77j44J14l9J7L3K1j78J50p9k6j0r6K73O1l06M1j9k28
7030b99K13j7J4K4J19o4N9k9J61j34j48N8J96k43N9PJ0J44k29pK11Rj10j39O7
7055f8K8j03O6J02R8k14q0J60J8q9R1q0k1J4K13j44J08kMj21r7K00j89O4l1R1
7081A8j35J25k3O7k04MJ46M6j03R2k3O0l1O3k10J48q8j81R9J95j52n4K55j27n
$$ plain form
6907 -30 117 -102 -16 36 -32 -16 10 -32 -41 -85 63 66 -42 78 -75 0 93 -21 154 33 93 -355 -160 252 -108
6932 -108 43 181 125 138 -187 -6 46 49 89 -105 -165 -74 -77 -69 -151 -73 -180 -39 -17 39 -63 -93 94 -31 158 -159
6958 -159 51 -86 124 -59 -119 78 -79 27 -89 131 -1 -195 42 0 -180 -107 33 -54 -119 -128 62 58 -61
6981 -61 -74 -96 158 -18 151 -111 145 -35 -206 8 102 -66 -80 193 -34 -20 -61 -123 -185 -90 -4 -55 -1 24 118
7006 118 -14 -176 -145 22 -61 116 -28 86 47 64 97 118 -60 90 11 -15 -25 -121 152 213 -93 -52 -71 -299
7030 -299 -86 -103 -89 -65 54 -10 49 20 181 47 -101 -43 153 -90 -31 -24 -14 130 -99 -106 105 114 4 -135 -68
7055 -68 -40 -143 -77 25 123 -91 -171 -11 7 -82 9 -71 -92 -78 135 -9 99 97 101 -20 -117 83 -106 -42 -73 18
7081 18 -117 8 -15 52 -152 -148 -2 44 -59 33 10 70 39 102 -108 40 -48 -229 -130 65 -87 -141 114 -13 -18
7106a8l8R6k23K27j15j11N0R4R6j04O9k6J66q1j31J10jK7r1J63l11J89k12K67
7130I2q2M1r7K64j66j18O9K12k76l6K62j85Q2j22j47J68l8RP3l5J29j24j09K24
7154I0j21jl5J56p3j52K28m2J8L7j11n9n5K51j04l0l4k9O7l2J80j23p4k0J84k74
7180a58J88k40K50n9J69j66l0J78o4j0q9n2j25K37o7QQ0p2K17k06m7Q6l9j58J93
7205B4L7j32Q0J95k51kK29k52j2J84pk1l3j67J02j52K81j34j04J94j57J99j22
7228b1jK9P7l8R6j34O2p7j25K4J1J52o0M3kp2J05j11N3k5K7Oj34M8L83k59j40
7255h3pJ36n4J8l3L6j26R2P5q3K9oj28Q3O6J85k79J08J9j43oj12K67R7j74k0N8
7282A5m1P5n0L4r3J35n4J25r8q3J10l0j32J15k6%p9l0J67j82K73k38J20j9l0R7
$$ plain form
7106 -18 -56 40 -183 44 -71 -182 -132 -38 58 -46 23 -3 163 82 -49 61 60 87 -4 159 -152 37 -175 92
7130 92 10 51 -46 218 52 -66 3 215 -61 -97 165 -20 62 -60 -207 -39 -77 -68 5 -30 99 -25 -134 90
7154 90 -31 -32 -67 89 16 -136 92 50 68 105 -6 -65 -120 131 27 -3 -37 -66 1 -31 149 26 -48 -68 116 -158
7180 -158 30 -210 40 -19 150 -16 -46 132 68 58 -31 -83 -208 29 -38 -30 50 -22 195 -11 -58 28 -11 -169 24
7205 24 61 -71 9 204 -47 -49 180 -72 -84 100 93 72 39 -128 -26 -178 103 -31 -135 59 -98 101 -21
7228 -21 -22 7 84 46 142 8 70 -7 -132 -108 -97 55 -5 38 36 -36 69 -42 11 -14 13 19 -115 -67 316 57 -83
7255 -83 -90 46 -8 10 -23 13 -113 -21 54 -29 0 -6 -134 -51 15 200 -79 29 48 -95 -101 -213 54 151 -23 -43 15
7282 15 -26 49 -1 33 -60 75 21 146 48 -35 75 45 -87 28 2 2 -77 -107 60 -122 151 -87 33 14 -16 81
7308H1j05N1K62j73k46J75M2j77L19j2m09J38J1o8l2K39L8%m4m3k2q5J69o0j05
7333e6O6J44j40M4O5k6L0j57P4j0J84J46o64M9J79J41Mj43J7nP3mL6N3Ro3K2k04
7361a36J79j14N1M8j60J28k0J83j33j42N6m2N9J22J25q2n7j45P7j3j58J00KR8
7385B6R7k30J66L7k36K5J38j2J37m7L5j97l2K94j00Q2j70J52j17p2O7j67K61q8
7409D9jj96J35J50k18j1N4R4p6J8r9m3K11k7L9j12P2j3j58K62Nj28N2j01n0M9
7435d3K1J8j53K63j65j81J66K48j31j27J91kj57j35K81j46J36n5L4j40J45M1k16
7458a07O7m3m6M5J34j0j93O3R5j28Q5r3J04J0J8J87j28k8J87k74J07k65J47j6
7482h2qM5Q9j11P6J15j31J40j25k03O5K63j43j6K38k0k44p1n5j1J70K15j71J1
$$ plain form
7308 81 -24 27 289 116 -130 45 87 -90 229 217 -192 -54 -43 -111 -143 96 134 134 90 47 25 -60 109 49 -56
7333 -56 10 154 14 58 123 97 127 -30 44 34 218 364 -300 -251 -72 69 73 -70 -53 -58 15 11 47 100 109 46 68 -136
7361 -136 43 -71 -20 28 -132 -4 -24 159 26 -116 -60 -102 -43 79 204 122 65 -80 -3 -16 -174 -74 -72 26
7385 26 123 -107 59 96 -140 -115 23 11 148 101 136 -61 -93 201 101 183 13 165 48 -24 43 -124 137 49
7409 49 48 -148 -13 137 -81 -92 -38 56 -20 -2 -101 -144 67 40 79 -33 39 26 -132 130 135 7 59 -42 -92 -43
7435 -43 -22 -4 -157 106 -59 -240 -74 174 43 -84 107 105 -52 -187 94 -52 84 29 63 -77 68 109 -107
7458 -107 -40 -83 -129 -84 50 40 -153 -90 5 -123 -38 -131 -27 -17 1 188 60 32 219 -55 52 -213 -66 -82
7482 -82 -90 -45 44 -67 9 124 -7 133 8 -195 -130 133 -10 -26 212 192 -52 -123 -178 -189 -19 196 25 36
7506C6Mk0J70k65J86j26p7N2N6n6Km3J66q1K4o1L4p2J87k04K29O3k07n3J12mO0
7533A12R2j92j5j19J54Q%J62n1p2oO6j45j18J71J09j91K8M3k6j41K14l5j25k4
7558a01p6J21q7K10j58J00K8Pn8j06J29q2O2O4j21k3M5K6kJ12j70mj10K79o9o
7584A0J16j43k51K52J46k44J23J36j23j3j42K46j71J39j87R0L0k3O9j05q5J08
7606b2P0k90K02P3j42K35pj90N9qK6q4O4O8Ro7mJ00j94J78M8j65J4J08j65j17
7632b01K33K4l9j60L92l78R5O4K11k29m6J6R7J7j37m9K24o9q6k1Q0mJ95k61j1
7657d3m3N2O6J8rq5J54q8o4J81n8l4J25rk37QP1o2k0K94k43J3kp0M3m3k1J03j11
7686a14N5R1l4q2j32K62o7k3k8l5L8J14N1l52L32M6j59QL8R3j45M6N7j44r0J69
$$ plain form
7506 36 40 20 190 -75 111 -15 -92 -40 16 -40 -38 -81 85 4 28 -33 1 -71 116 -88 141 204 -3 -56 56 52 112
7533 112 204 12 -3 -122 32 40 40 202 151 79 73 139 -6 -124 47 156 -35 -7 36 10 -131 83 48 -77 -101
7558 -101 -177 -56 -143 67 -91 9 37 44 -14 -120 9 -73 -11 53 -68 -91 -46 -20 -22 90 -80 -84 -194 85 16 10
7584 10 126 -17 -268 -16 130 -114 9 145 22 9 -133 113 -58 81 -106 -16 14 -9 60 -45 -130 -22
7606 -22 48 -242 -40 33 -109 126 119 -71 -12 -20 6 -78 -14 54 63 -4 -8 92 -102 76 124 -41 -27 81 -84 -201
7632 -201 32 56 17 -143 249 -129 -34 30 241 12 -34 -18 79 96 -41 -90 134 65 -21 -42 38 34 229 -32 -43
7657 -43 -86 -34 32 50 41 -44 110 22 -42 139 81 47 172 163 -74 -66 5 -57 -77 217 -26 -13 -15 -85 -42 -85 -106 -3 -114
7686 -114 -59 32 -2 -84 -216 46 -21 -44 -72 -107 -69 45 96 -256 76 122 -37 -29 9 102 -43 3 60 -84 -174 -5
7712ekn7K67j47q0Q1o6k27L11k1L8l24K54L3j07LR9j07J59Nk34K00n1K0k21J95
7738A6j03K43k83J54j41q0K69r6j47K51Lj18q8J74J11n3r3k8p9J43q8L4j48J77
7762C0k3o0R5k11J09R2M6k0j83K04o9k5l6J22r9Q5j59rO9k3J40Pj59K28o6m8j28
7789i1J39k33J81L8j90J95Q7j09j57J37O4Q0k31K23j29l8J92j24j33M5J61k72
7811a65K61j67J52k4J2R9l87J74L60l70j37K30j80Q3J2O8j42J51j24Q8m1J02%
7834E5k62J59J25L8j91N8N4k3m4K6k11J77J57p7Mj25L6j66O2J89L4m00J60J04
7858f1J04N4J59k48l8J93k40O7r1J16MJ29l4K7k68J82n2j7K6p7n1P2O7m5M6r2
7884f8L6p3L4J79j25N4p5RK6J54qj11r8N8J20n7J7k7o4m3J9q1J17kn1q8P7J40
$$ plain form
7712 -5 -7 -64 203 56 -24 57 -9 -236 75 54 92 -232 22 55 -52 -49 50 -57 102 107 -127 73 22 42 -179 16
7738 16 -87 156 -127 27 -114 -194 75 -21 -168 83 86 -32 -120 54 165 112 19 -9 -88 55 -33 1 -147 30
7762 30 7 -53 42 -169 -60 32 78 58 -125 79 10 -15 -51 71 -28 57 -102 -111 -42 -65 75 82 -77 151 85 37 -91
7789 -91 48 -185 -4 34 -156 39 126 17 -140 -3 61 141 -90 133 4 -34 158 34 -99 -54 107 -165
7811 -165 96 -71 81 57 69 168 -219 -45 315 -55 -192 38 -142 -59 -47 21 -121 30 -94 -6 -47 55 55
7834 55 -207 -48 77 115 -76 -18 36 13 -31 -5 -216 -39 118 41 45 -80 -44 -210 -148 41 75 -325 -165 -61
7858 -61 43 97 256 8 -30 163 -77 -10 -101 15 19 148 114 141 -127 55 3 -14 12 -65 -116 -44 23 -22 24 -68
7884 -68 -32 -105 -71 108 -17 37 -38 -29 -3 151 143 32 -66 -8 112 55 72 45 -19 -62 -43 -124 -7 -9 -60 -148 -71 69
7912F9J04k36L12k44j85J44K13k69j9P7J25r7%J22j35K4Q0q3q6J63j55k14L54
7935F4O8j78J6j9J05j95J77j43J91j24lj08j07K87k1j21O6M6m8J6J29M8l11J67
7959BJ35l21J20J15j37Q4K9j24J58P2J8j24p0j59K74j35K09n8q8KnP2k69K42k58
7984b16K91j81J13r0L3J61k18J19j27J60k14K20Q2J9j35L1K8p0l5P7j36N8O7j2
8008B5j69J33J33o0r7J60k61R1L2J34k10m8O7j17J23j3J33r8l7J06q6O7j8o4q7
8033a61K90j51k3J77Qq3k42J69o1M3M9Ml4O7q4j47k9K48J44k21J70j21o3J48j93
8058i6J1nR9L9j8P1qm0l8Q9m9p7J84p3l7Q0l4j79O6J24j24l8M6j35R9L9K3J8p5
8087c8J20j41j50J71R2k8k9M9J02m10L11M2k06K32j20O6j81K38p6k5q8K17m17
$$ plain form
7912 69 173 -63 249 5 -180 -36 177 -92 -111 -34 91 -6 -6 116 -19 5 85 2 -84 79 -76 -290 64
7935 64 132 -46 -30 -49 56 -139 38 -105 86 -38 -41 -149 -256 31 10 -111 -45 1 -47 -31 98 146 -165 2
7959 2 137 -184 -64 51 -86 -2 27 -97 61 133 151 27 -43 -202 72 -63 146 88 0 2 -3 69 -200 42 -216
7984 -216 75 -106 7 -83 -50 111 -107 12 -115 45 -169 51 133 152 17 48 76 6 -29 48 -88 -30 37 25
8008 25 -144 -11 122 62 -35 125 -136 -45 -13 121 -89 -137 -70 -187 -64 -77 56 -42 -79 27 -59 8 -10 -74 -161
8033 -161 129 -22 -45 132 140 57 -185 -16 -77 -34 15 19 -15 52 -32 -179 -208 40 184 -37 133 12 -51 97 -96
8058 -96 -85 -90 9 48 30 101 93 53 15 104 55 -22 162 89 52 132 98 -81 -15 109 -15 -53 -7 -142 -43 -4 19 37 -38
8087 -38 82 -59 -209 -38 54 26 -3 46 148 -262 49 91 -115 117 -3 63 -118 120 44 19 -69 148 -269
8110b69J50K04%j73L17l1k41m4J2K11j87l5J87K5j83J16PN3j09J08l94L43J0n2
8134B5K8pq1j81L60k06J4J07p6J9P8o7j20LK41k03J26L3P3k48j00K76m2K5lP2
8160A46j87k0J36j04mj3p4K71k48K4J01R4j06p6n0J80o9jL1R4j06OJ58j46j40
8185a03K6J47m6j71J32K79
$$ plain form
8110 -269 -119 85 85 -88 229 198 -43 -87 -75 136 -51 -86 101 126 -57 59 66 119 10 118 -276 67 77 25
8134 25 53 46 -35 -216 144 -62 -48 59 -17 2 80 13 -107 -104 137 -66 60 93 166 -82 -182 94 52 77 74 146
8160 146 -41 -61 75 -29 -33 -46 -120 151 -97 -73 28 122 16 -60 -110 70 1 0 31 125 19 25 183 37 -103
8185 -103 -77 70 24 -147 -15 264
8191B64
$$ Imaginary data points
##PAGE= N=2
##DATA TABLE= (X++(I..I)), XYDATA
0@%%%%%%%%%%%%%O4j28J28j28J28j92K56k56L20l84M48n13N77p04Q32r60J088
30E76j217J401j593J794k050K306k562K880l241L615m023M467m962N489o070O710
46C520p403Q164r001R908j0911J2031j3258J4617j6148J7867j9809K2040k4616
59a2999K7643l1256L5650m1147M8235n7767P1389r2555J30207k17458P88511K90724
71I39177j604792l14950P14620R31639p0889o16375m92187K16954L38355J01451
81A43003l1380J66827p9101m16501k90524L07894N19918J94698m10846n86309
91d82321o4095O42571N08866k29384n70669j88255K17814K79372Q1767j01824
101I3842j20316k6244o7179o1773K05918L38756p3987m67117k28644K66842L39792
$$ plain form
0 0 0 0 0 0 0 0 0 0 0 0 0 0 0 64 -64 64 -64 64 -128 128 -128 192 -192 256 -257 320 -384 448 -512 576
30 576 -641 760 -833 961 -1089 1217 -1345 1535 -1706 1909 -2114 2353 -2609 2880 -3190 3520
46 3520 -3883 4281 -4720 5188 -5723 6308 -6950 7667 -8481 9386 -10423 11617 -12999
59 -12999 14644 -16612 19038 -22109 26126 -31641 39748 -52807 77400 -140058 648453 939177
71 939177 -665615 -980565 -265945 665694 594805 -21570 -513757 -296803 41552 143003
81 143003 111623 278450 199349 -217152 -507676 -199782 320136 514834 103988 -482321
91 -482321 -546416 96155 605021 375637 -195032 -383287 -165473 113899 195666 93842
101 93842 -26474 -52718 -119897 -181670 24248 363004 289017 -178100 -406744 -139902 199890
112A99890K3364k45249j83981J02640K07640j7156j30182Q0162J47273j38264
122D6137k67608L820K61908J85426r1466k69521j10681K40760K70222j05391k95119
133a31513l7766J91688P5183j25726j14186Q7064K14931J8621k90326j81777K68587
144b5220L50083r3391l97122j71438K26061L22571M7595k62853k10339J15492
154i8561K17941j271j27471k2178M2905k0612n7264j1833P0780J07579m115j52391
166e6491p8490J32113J35514n7372j37915m1617O2274P7045O487o0448q840P4767
178D7027J1487q9235j9771R3776L6329q5544q2000J6452Q8665O4806m4054r6091
190e8153N312R1705J4670p5130k9392M3763L3792j4502m6572k4840N7909Q2425
$$ plain form
112 199890 223254 -21995 -205976 -103336 104304 87148 -43034 37128 184401 46137
122 46137 -221471 -217651 44257 229683 138217 -131304 -241985 -1225 268997 163606 -131513
133 -131513 -169279 22409 97592 -28134 -142320 -55256 159675 178296 -112030 -293807 -25220
144 -25220 324863 231472 -165650 -337088 -111027 211544 259139 -3714 -214053 -98561
154 -98561 119380 118109 -9362 -31540 11365 -9247 -66511 -78344 -7564 100015 95900 -56491
166 -56491 -134981 -2868 132646 75274 -62641 -104258 -41984 35061 41548 -18900 -27740 47027
178 47027 58514 -30721 -50492 43284 79613 -5931 -87931 -71479 17186 81992 37938 -58153
190 -58153 -52841 38864 53534 -21596 -50988 -7225 26567 12065 -34507 -59347 -1438 80987
202H0987k3472r3534j0775O7248J9240m5916k9940K2568M3873k018o8539k5512
214f5790R8705Q6858p6164j34551p586J03609P2405l3980r9169m3253P9613R5824
226G6521j3852o9505j7826J7361N379L655L068m499O883j145l4546l687O6518
239C4325M0675n3670o7412l952L9853L9388k94m8246k5224L9056K7936k5350j984
252d899L7109p262n0651j6898K8476L6533J6215l2490n2158J6893P2909J4440
264E8217n2283k8914P655Q677J3794L461k8077q920L3842Q040k6370P406K6498
277B3026j3494k4149K102J885L419J8634o463k6517K0716L7879k1648l6137J8967
290a780K5481j3249j6655j0238q657K6539L4616k5036m1388J9662L1507j4072
$$ plain form
202 80987 57515 -36019 -46794 20454 39694 -6222 -36162 -13594 30279 28261 -40278 -65790
214 -65790 32915 119773 43609 -90942 -98528 5081 77486 43506 -55663 -98916 -19303 76521
226 76521 62669 -6836 -24662 -7301 -1922 1733 4801 302 7185 6040 -28506 -32193 34325
239 34325 75000 21330 -46082 -50034 -10181 29207 28913 -19333 -44557 -5501 22435 -2915 -4899
252 -4899 32210 24948 -25703 -42601 -14125 22408 38623 6133 -46025 -29132 43777 58217
264 58217 5934 -22980 -15325 -6648 7146 10607 -17470 -26390 7452 15492 -10878 -3472 23026
277 23026 9532 -14617 -12515 -10630 -7211 11423 4960 -21557 -841 37038 15390 -20747 -1780
290 -1780 23701 10452 -6203 -16441 -25098 1441 36057 11021 -30367 -10705 20802 6730
302F730j3507N272j1684m788K1916k77j7927K0440K1193k7807j6673K7137Q650
315A8675j8415j186l380j6311J7390K8929j8158k2167K0684P630k3547M138J7969
328A2251j5894j3777J1170m141l474L0880Q929l9303r578L3579O874j5010Q88
341C394r854j6541K3799K6816k1417j7184J8696n40j7644J4951J1706k5284r495
354a8597J7088m142m396K3912l98l1012N081K7109p892j2931R969p499j5180K1109
368B221J7000k1011m355K1435p936j7625J6391Q235k0955k437J0943j2249p43
381a1086K5624m000k6837Q522J8998j1822n335J2367j1185j3447J9750J1437j7347
394d361K232J5740j2086r308J8215J059j9902M045R755j2704J113J9398q481j8685
$$ plain form
302 6730 -6777 -1505 -13189 -17977 3939 3662 -14265 6175 27368 -439 -17112 10025 18675
315 18675 260 -926 -4306 -20617 -3227 25702 7544 -14623 6061 13691 -9856 -5718 12251
328 12251 -3643 -17420 -6250 -10391 -13865 17015 25944 -13359 -22937 10642 17516 2506 3394
341 3394 -6460 -23001 798 27614 6197 -10987 7709 7169 -10475 4476 16182 -9102 -18597
354 -18597 -1509 -5651 -10047 13865 13467 -17545 -12464 14645 6753 -6178 3791 -3708 -18888 2221
368 2221 19221 -1790 -6145 15290 7354 -10271 6120 14355 -6600 -9037 1906 -10343 -11086
381 -11086 14538 10538 -16299 -7777 11221 -601 -5936 6431 -4754 -18201 1549 12986 -4361
394 -4361 -2129 13611 1525 -7783 10432 11491 -8411 -4366 5389 -7315 -6202 13196 4715 -13970
408a3970J3544J1447j4905k280R478j0612n718J7861P85j6623R309J4583j2509
421C90n660J4893l308j3603Q374N043j3452M155J4830j0014j0168J3702K228j4313
435f903M661Q401j2946m907J4009j867q856J1254N600j4515o5J3968l948o980
449c094P071l632j1097J1262J3700j0618q056Q887k060p357Q775M145j3371l082
463h527P428l305J93J1880k811j4637M144J0847m453j897O628o614r475Q912R331
478G644m027L89K074r433k943J1965K562q684m56p81q325M517J4891k490j2078
493e175N23L308l063M199N152o171l701M291j550j417J0605M142j1832m216O669
508A764m96j334O569j774j0921KO811J229K026J784q784p253P500N599k977L181
$$ plain form
408 -13970 -426 11021 -3884 -6164 3314 -7298 -13016 4845 5630 -10993 -1684 12899 390
421 390 -5270 9623 6315 -7288 1086 6129 -7323 -3168 11662 1648 -8520 5182 7410 -6903
435 -6903 -2242 6159 -6787 -11694 2315 448 -8408 2846 8446 -6069 -6134 7834 3886 -3094
449 -3094 3977 345 -10752 510 14210 3592 -4464 4423 2363 -4994 3781 7926 -5445 -8527
463 -8527 -1099 -4404 -4211 7669 4858 -9779 -5635 5212 759 -1138 5490 -1124 -10599 -1687 7644
478 7644 3617 4006 6080 -3353 -6296 5669 8231 -453 -909 -1690 -10015 -5498 9393 6903 -5175
493 -5175 -4652 -1344 -4407 -208 4944 -1227 -4928 -637 -2187 -3604 7001 11143 -689 -4905 1764
508 1764 1268 -66 6503 4729 -6192 -6190 621 1850 3876 5660 -3124 -10377 -2877 2722 -255 2926
524B926J130j2563n671J4610J1548l349n855o943o297P776J3845p97q846m574
538c060n346l52J5844J0021j3664j4014L550M700J170N806M75r847m182M604L338
553i57O344O157j0210j4276O105J2881n2j480J040r884q590J2064J4393l076r174
568A285o832m970O504J2489k766j0321K366J409q675L560J5531k84j2016j862
582d582J525k636N858Q128m328n781R79k132M11J2361J879j6321n539J0513N39
597H74l688P931J929j3125m197Q911N458K273l61j2911r737J2539J4402k915l966
612C417o03j2038m569J9151J3625j1076j2727k717j384O460J3703n15j2818l931
626f022K64j668J0441J1782j1762j7180N043J0428o25L165M113j0047q261Q914
$$ plain form
524 2926 4056 -8507 -14178 432 11980 8631 2776 -4167 -10464 -2688 11157 10360 1514 -3060
538 -3060 -8406 -8758 7086 17107 3443 -10571 -7021 -2321 -1151 4655 5130 -4717 -8899 -4295 -957
553 -957 5387 11544 1334 -12942 -6837 6044 5992 4512 5552 -4332 -12922 -858 13535 10459 1285
568 1285 -5547 -10517 -4013 8476 5710 -4611 -2245 -836 -9511 -5951 9580 9296 -2720 -4582
582 -4582 -3057 -5693 165 8293 3965 -1816 -837 -2969 -2558 9803 11682 -4639 -10178 335 874
597 874 -2814 5117 7046 -6079 -10276 -1365 4093 6366 6005 -6906 -16643 -4104 10298 7383 3417
612 3417 2814 -9224 -13793 5358 18983 7907 -4820 -7537 -8921 -2461 11242 10727 -2091 -6022
626 -6022 -5758 -7426 3015 14797 3035 -14145 -9102 1326 701 3866 7979 -2068 -10329 -1415
640a415Q478j252r03o378j1160O064J8024l7j1676j104j293o601P840J3232o785
655E034j3146K253L568j381O109M841o658l563K594m920j704J3731M395j3054
669a901l876P707k101k731Q937J780j0715k541M890K18K315M052p595q055P736
684a880O676n246N92L648r366n200J3073P976q822m653J811k683J515R319J398
699H158o133k997n013l818J2181J3616j0035j5839L138P062j070K512M369p022
713h91o670L541L737J615M546l275r914K031J0056r58m292L129j788q024N933
728a224J1811m550j1050j072L973L058M503k120p379R09L984m213j148R685P64
743E931j0732j818P902L44k680L071J100l268p18m72o75N236L818p301n213N925
$$ plain form
640 -1415 7063 5811 4908 -1470 -12630 -6566 11458 11421 -255 -1359 -2652 -9253 -1413 11819 5034
655 5034 -8112 -5859 -2291 -3672 2437 7278 620 -2943 -349 -5269 -6973 6758 11153 -1901
669 -1901 -5777 1930 -171 -2902 6035 7815 -2900 -5441 -551 -333 1982 6034 -1561 -9616 -1880
684 -1880 4796 -450 142 3790 -5576 -10776 2297 10273 1451 -3202 -1391 -4074 -2559 6760 8158
699 8158 2025 -972 -5985 -9803 2378 15994 5959 -9880 -6742 320 -750 1762 6131 -891
713 -891 -7561 -4020 -283 1332 5878 2603 -7311 -5280 4776 3818 -474 2655 867 -7157 -1224
728 -1224 10587 6037 -5013 -6085 -2112 946 5449 3329 -4050 -3141 843 -3370 -4518 5167 5931
743 5931 -4801 -6619 1283 1627 -1053 2018 3118 -150 -868 -1340 -2015 3221 7039 -262 -5475 450
759D50K809m686O81L267l807k835N472J318m695j203J827N76K174P91l900J08
775a653M979k249o006M240P425l821o874J178L728J352J061j542l768L03J495
790a52k002M15M827j268n402J124L729j344q43K276j333k688K352K678j709r97
806c37N00o52J904K709l726l917L255L051l037o79K288j121k917J340K028p06
822a7K69k39k317R19L085j649k677L255K053k672m53J939j604o60K785l23l072
839a378R70J920j727p02J535o96n31J754j310l850K023M568k022k541J872L66
855B51j539J615J364k056J8J898j857o19L101j59l714Q45K919j733j096J918j436
872b80k692K734K560l346q95J956p08q64K640k22k501J822J689l488k89M521k59
$$ plain form
759 450 3259 -1427 -746 2521 -1286 -4121 1351 2669 -2026 -3229 -1402 -826 1348 2139 -1761 -1653
775 -1653 3326 1077 -4929 -689 6736 2915 -3959 -2781 947 2299 3360 1818 -1950 -1647 -152
790 -152 -2154 -1739 3088 1820 -3582 -2458 1271 -73 -916 1360 27 -2661 -309 2369 660 -337
806 -337 163 -489 1415 4124 398 -3519 -264 2787 -250 -929 1359 238 -2679 -1339 689 -17
822 -17 252 13 -2304 -1385 1700 51 -2626 629 2682 10 -443 1496 -108 -768 2017 1694 -1378
839 -1378 -408 1512 -215 -917 618 -78 -609 1145 -165 -4015 -1992 2576 554 -1987 -115 251
855 251 -1288 327 1691 -365 -347 1551 -306 -925 2176 2017 -1697 -852 2067 334 -762 1156 -280
872 -280 -2972 -238 2322 -1024 -1919 37 -671 -1535 1105 883 -1618 204 1893 -1595 -1884 2637 2378
889B378l985J245J982j758M4K209k300j860K697K77k868J713K103l691j125M335
905A396k34k924J293J306k805J173L939k158l140K227J202j570J424J407l630
920a094j060M552o75l847J967K025l392l91L501j104k417J992M73k868J907K878
936B447l176j732L694L42k977J820J941l331k59L509j489k613K878R74l662M16
952a218L023j996j582K771n10l411K588K617l543j095L686n62k427K583Q72l290
968a494O64L290k168j823K923K21l373J764K452k957j052K899j079k529K378J474
984A590l663K08L376j460k037K652L56k753J522K398k900q16L373n26k932K014
1000D02J662k735k08K882j822k260K629O32k970R70K142k347r75K967m9k728J679
$$ plain form
889 2378 -1607 -362 1620 -138 -94 2115 -185 -2045 652 929 -1939 -226 1877 -1814 -2939 1396
905 1396 1162 -1762 -469 837 -1968 -795 3144 986 -2154 73 1275 -295 1129 2536 -1094
920 -1094 -2154 2398 1723 -2124 -157 1868 -1524 -1915 1586 482 -1935 57 530 -2338 -431 2447
936 2447 -729 -2461 1233 1575 -1402 418 2359 -972 -1231 2278 789 -1824 1054 2028 -1634 -1218
952 -1218 1805 -191 -1773 998 488 -2923 -335 2282 -1261 -2356 1330 768 -1659 924 1796 -1494
968 -1494 -830 2460 292 -1531 1392 1613 -1760 4 2456 -501 -1553 1346 267 -2262 116 1590
984 1590 -2073 -1865 1511 51 -1986 666 1022 -1731 -209 2189 -711 -1527 1846 1320 -1612 402
1000 402 2064 -671 -879 2003 181 -2079 550 1182 -1788 -818 1324 -1023 -1998 969 920 -1808 -129
1017a29J521k593Q9L198j399k342K273R58k336P61K304k486j224K523p3k542J307
1034a90J670k540n67K388p45j511J984L90k814O56K763j149j434J804l0j959J578
1051B94J583k039n79K055q82j773K031R72k428L6J489j391n77K289n76k452J194
1068g54J551j494j17J822r28j281J228Q23j388R03J245j644j175J751O54j249
1084e3O34J52k180N04K355o61j955P95P13j557O10J191n46m77P77j024n87K154
1102H45R99k254o63J390p2l20J457j56k308N59J648p72l02L54j104o54J488J95
1120C30j315J055R10j765j169K238P52j199J33J70p02K05J350m52l74N63p39j273
1138a282J646J868k187j394J241M55j023O85L11j120N3J160q50o12J696Pj740
$$ plain form
1017 -129 1392 -1201 -1112 2086 687 -1655 618 1576 -760 1 2305 -181 -1405 1118 1045 -1497 -190
1034 -190 1480 -1060 -1627 761 16 -1495 489 879 -1935 -1279 1484 335 -1099 705 675 -1284 294
1051 294 1877 -162 -741 1314 432 -1341 690 1662 -766 -730 759 -632 -1209 1080 504 -1948 -754
1068 -754 797 -697 -814 1008 80 -1201 27 850 -538 365 1610 -34 -1209 542 1196 -53
1084 -53 581 733 -1447 -943 1412 751 -1204 -409 304 -1253 -643 548 2 -475 302 -722 -1309 845
1102 845 1844 -410 -1073 317 245 -75 1382 1226 -1082 -523 1125 353 51 405 -699 -1353 135 330
1120 330 -985 70 980 -785 -1954 284 1036 -163 -30 140 -562 -357 993 541 167 730 -9 -1282
1138 -1282 364 2232 45 -1349 -108 347 -676 9 320 -800 -747 413 -437 -1049 647 654 -1086
1155a086O00P29p87R95J923j893k840J603K455m44j020l58r90M61J855p27j891
1172a415J648J028k686n49K631L29j621O44J39j420J153K003j196j730R34L31
1188B23k12J157K06k728J06L033o64k276J356Q34k458M3K054l19q42O76n80j198
1206a589J603J347k017K06K112j553k425J888K501j558p35J190j206p32J938l0
1222I40k146Q65J528j749k55J476q89j262K452L78l467L80L527o32k803J114J466
1239I23l88P36m67k354K32L266n45k644J520J091k643k57K848p45j777J610p4
1256C32k416P75K415o12q23O85q11j183K724O93k979Q8L222r99k844J596J768
1273A631j863m45J899p08r54Q64j334j302K897J404l073r24K861m50k531K192
$$ plain form
1155 -1086 -486 243 -544 451 2374 481 -2359 -756 1699 1255 235 -123 -1113 -652 1203 476 -1415
1172 -1415 233 1261 -1425 -1974 657 986 -635 9 148 -1272 -119 1884 688 -1042 -108 223
1188 223 11 1168 1374 -1354 -1248 1785 1121 -1155 201 1035 -1423 -1380 674 355 -487 189 -391 -1589
1206 -1589 14 1361 -656 -450 1662 109 -2316 -428 2073 515 -220 970 -236 -968 970 940
1222 940 -1206 -341 1187 -562 -817 659 -230 -1492 960 1338 -2129 -1749 1778 1146 -1657 -543 923
1239 923 535 1271 804 -1550 -1318 1948 1403 -1241 279 1370 -1273 -1530 1318 573 -1204 406 332
1256 332 -2084 -1309 1106 494 -329 356 -455 -1638 1086 1779 -1200 -1112 2110 1111 -1733 -137 1631
1273 1631 -232 -677 1222 514 -440 424 -910 -2212 685 2089 -984 -1908 953 503 -2028 164
1289A64J280j958k94J778j218j094K228O31j346J58L74j935M33K561j660j857
1305a755K612J341l388j289K709Q88j233K69q46o30J454R33j933M6K625r63k319
1322a479J479J299k084K99K335j198j775J308O40j804N10J212p08j7N07j782q23
1339b081K826R43k842l02K762o57k190J101J630q62j6o6j105M99J699p78j313
1356g52J497N32j993n22J657n68q42J858O8j904l4J198j36n45N80j68j45R87n42
1375B26j567J321K408j507k360J600R95j224n68Q68K65o4N3j325n96J677N21j399
1393f76J29J158j166p45J540M61j270O97Q46j065o20P65L16L2K68q48n28J422
1411G16N51k088q07K728K11k213k65J103N9j84L36n27L27P32p25j278J203J322
$$ plain form
1289 164 1444 -514 -808 970 -248 -1342 886 1517 171 329 703 -1232 -799 1762 102 -1755
1305 -1755 857 2198 -1190 -2479 230 1118 -115 154 -692 -1322 132 1065 -868 -822 1803 840 -1479
1322 -1479 0 1299 -785 -486 1849 651 -1124 184 824 -980 -470 742 34 17 524 -1258 -2081
1339 -2081 745 1688 -1154 -1456 1306 649 -1541 -440 1190 328 312 246 -859 -360 1339 561 -752
1356 -752 745 1277 -716 -1238 419 -149 -991 867 935 -969 -1003 195 59 -486 94 -74 -219 768 226
1375 226 -1341 -20 2388 881 -1479 121 1116 -108 -676 192 457 393 446 -879 -1475 202 723 -676
1393 -676 -547 611 -555 -1300 240 701 -569 128 974 -91 -711 54 370 402 670 -178 -706 716
1411 716 1267 -821 -1628 1100 1311 -902 -1167 -64 -5 -189 147 -380 -53 679 -46 -1324 -121 1201
1429A201j120l06R41m91r50J176P49j139m24Q80k85p37M39k14j36J027l43j759
1447a491N98J787p31j936J574J621j353p14N72O9K48Q24r74q83J479M89j837J82
1465d76J340n89q90Q00L5j278P00J417j182r71J022R9n36O25O3j087R49J331j701
1484c29j005K129M94j972K91J470r78m09O63n08o09J483J89k059K63J535r38r23
1502a213J495M5j417R60J037j669k60K076k29j545J013M10j207N38R82j267m23
1519f74J897m24k190Q74J835j440j023J425j06j175J136K82j462M91J823j358
1535h9j287J938J10j251L02J453j410n65K079p00j717J198J223j722j97J212n56
1552B1q64J342j02j769J047J311j664q30K094J80j738Q28R49j296k4J763r36j176
$$ plain form
1429 1201 81 -225 716 225 -725 451 1200 61 -363 517 232 -505 -66 -280 -416 611 268 -1491
1447 -1491 -893 894 163 -1773 -199 1422 69 -645 -73 -4 244 1068 94 -789 690 1179 -658 -476
1465 -476 864 275 -615 185 220 -1058 -358 1059 -123 -1094 -72 27 -509 116 179 -908 41 1372 -329
1484 -329 -1334 795 1289 -683 -392 1078 100 -309 354 -154 -763 720 909 -1150 -887 648 -290 -1213
1502 -1213 282 327 -1090 -130 907 -762 -1022 1054 825 -720 293 703 -504 34 1016 -251 -674
1519 -674 1223 799 -1391 -517 1318 -122 -1145 280 174 -1001 135 417 -1045 -554 1269 -89
1535 -89 -1376 562 672 -579 -277 1176 -234 -799 1280 580 -1137 61 1284 -438 -635 577 21
1552 21 -843 499 397 -1372 -325 986 -678 -1508 586 766 -972 -144 805 -491 -515 1248 312 -864
1570h64J395O59k015M81J340j027p84J696m81j746J112J261j687m12J725m54j443
1587a244J430M83j487L93J346j105n55J728j34j837J118J015j246l94J491r44
1603E8r87J332M37j746O9J603j127r62J675M1j327O14J155j506k86J935n55j394
1621i71J392N06j304L30J028j001p89J353L9j431P25J216j500m78J561n15j241
1638a080J075M76j287J55J427r76m96J247J51j543P21J092r27m06J188l77r73
1655e33J092K48j282rJ039p28o14J222k41j221P23O85r14l07J376j39j327P67
1673a63P50r96M32J049j163m20J322k17j005P37K67j111J06J040o33o49Q05qr26
1692g83M64Q14p89k22P88l19o94P75O43q37O5O77m69n15J212n2j043K56N04n36
$$ plain form
1570 -864 531 1190 -825 -344 996 -31 -815 881 400 -1346 -234 1027 -660 -1072 653 199 -1244
1587 -1244 186 669 -818 -425 921 -184 -739 989 855 -982 136 1151 -95 -489 1002 58
1603 58 -929 403 840 -906 -837 766 -361 -1323 352 393 -934 -320 835 -671 -957 978 423 -971
1621 -971 421 927 -377 -47 981 -20 -809 544 583 -848 -123 1093 -407 -885 676 161 -1080
1638 -1080 -5 471 -816 -661 766 -210 -706 541 692 -851 -130 962 35 -371 817 440 -533
1655 -533 559 807 -475 -484 555 -173 -787 435 194 -1027 -304 381 -533 -840 536 397 -930 -163
1673 -163 587 -409 23 1072 -91 -511 811 594 -411 326 593 -518 -412 628 -5 -654 151 143 -783
1692 -783 -319 495 -294 -516 272 -47 -741 34 677 -160 -95 582 113 -402 810 758 -285 -29 475 -61
1712f1j77Q95o77o73Q06K83j199L03R56n72p72Q79J17o26O64O04j089k26J240
1731F75k57n25M78k71l91N14O89j192k56J080j08q48L76N25j112o3R50l09o86
1750g31R19p0q10N14N78r07J66J423l77j517P32R57q24m1N22o16m31R19j72q36
1770f02N45O23j163N3R61r07p08J566N76j597p6J235m2o02N09l41k97P62M74j668
1790f99K6J800j079q49J180K56j357k4J483r83n07Q01O9n13J90J43o69O94J409
1809A371j501j210J650Q23j572M0J306n33q39J004J41j267O10L79p42R7Q55j149
1827e37p84K020L83j887m46J974l27j300P55M90n73P83K81j364j16J571n96j033
1845g06J414L40k112L57J990j073j465J530R03j652k11N11l90M72R17j196r46
$$ plain form
1712 -61 -238 657 -20 -693 113 396 -803 -500 456 -116 -888 -9 108 -518 146 750 -339 -565 675
1731 675 418 -107 371 100 -291 223 912 -280 -536 544 436 -412 -36 489 -623 -686 264 -45 -731
1750 -731 188 118 -692 -178 400 -507 -341 1082 705 -812 -80 877 53 12 534 -82 -513 406 234 -602
1770 -602 -57 566 -597 -544 417 -490 -1198 368 944 -653 -729 506 464 -138 371 30 -267 495 969 -699
1790 -699 -673 1127 48 -801 379 635 -722 -746 737 -246 -753 48 117 -396 -206 -63 -732 -38 1371
1809 1371 -130 -1340 310 1133 -439 -399 907 374 -465 539 680 -587 23 402 -340 -243 612 -537
1827 -537 -1321 699 1082 -805 -1251 723 396 -904 -149 341 -232 551 832 -532 -648 923 327 -706
1845 -706 708 1048 -1064 -707 1283 210 -1255 275 1178 -474 -685 -174 -564 -92 825 -371 -1317
1862a317J398P84j700L18J648n75j264J142K92j531M21J341n28n71N70m08r47
1879i27J188L48j677M69J796j217j459J356J081j438L60P90r98n71J197K52o97
1896a47Q88L0j460M82J167j071q90J836L75k061j45J434n89m74J016J16j106L28
1914b71N75r01J16J214q98n58J623l10j709N81J961n85j452P32K99q39J45N83
1932C06o08L32R98j480p60J129L07j019Q14R34j258p37J324M14r27K3Q86n54m06
1951b82K78k23J8J328k12j552L99J249j434p77J512N21j107j87L83k63pM69j13
1970@j97P43m41j305J061J382j001p40J092Q1j231K33R86j97l18J92m56k32K67
1989h1k1l53P40P36j778m35J533L0j315N72J299n63o08LJ22K21O88o24n85P08
$$ plain form
1862 -1317 81 865 -835 -517 1131 556 -708 434 726 -805 -384 957 429 -142 428 20 -927
1879 -927 261 609 -1068 -599 1197 -20 -1479 -123 958 -480 -120 670 -328 -899 298 550 -147
1896 -147 741 771 -689 -207 960 -111 -1001 835 1210 -851 -996 438 -151 -625 391 507 -599 -271
1914 -271 304 -597 -481 733 -165 -723 900 590 -1119 -538 1423 838 -614 118 417 -422 -277 306
1932 306 -302 30 1028 -452 -1212 -83 224 -795 19 953 -305 -1042 282 696 -231 -208 678 124 -282
1951 -282 -4 -227 -209 1119 907 -645 -246 1003 -431 -1208 304 825 -282 -469 -86 -349 -356 113 0
1970 0 -197 546 105 -1200 -139 1243 242 -498 594 675 -556 -323 663 466 148 340 -116 -348 -81
1989 -81 -102 -455 285 1021 -757 -1192 341 371 -944 -372 927 364 -244 -241 -119 102 790 166 -419 289
2009B89K79j148J33J109j48j038N02L65r34k21R18N5j44j95k22j26O67M4j029
2028h44O23J423j097q79M97R17l91l29L80j71j27ol02j90R58k12r94M52N62n94
2048c24m18J007K20q30rO39m94k51Q16k09j3K38l76m96O40P61j020n37J385k73
2068D56j070J52R85m26l47N00l62n46Q82r8r67R69O71j065j84P96K5r23P51O50
2088H49q72j76Q01l55q10P92Q7m73K69L25j118J54J325l69j320O02Q94r10k54
2107e59R20j18o06P74k66p57O78P37r32k01J150m43r74O18P00j027j02J014m63
2126A43j015R72K74p91K69N56n79l69J031l98j008J184P92j425j61J336m14r23
2144e26N97M99j037L17Q14r40k68J075k83j103P05O12j190K20Q07l74p67J091
$$ plain form
2009 289 568 -580 -447 662 514 -524 -22 343 -591 -812 106 161 17 -178 -400 -526 141 185 -844
2028 -844 -221 1202 105 -774 -277 640 249 -80 300 129 2 -4 -306 -496 462 250 -744 -292 270 -324
2048 -324 -742 265 485 -345 -354 285 -209 -460 356 147 134 372 -4 -500 140 901 -119 -656 729 456
2068 456 -614 -462 523 97 -250 250 -112 -658 224 126 -841 128 799 -266 -450 346 371 -552 199 849
2088 849 -23 -199 602 247 -563 229 316 -157 112 437 -681 -527 798 429 -891 -289 605 -305 -559
2107 -559 361 243 -363 411 145 -612 66 803 -129 -330 820 377 -597 21 721 -306 -408 606 143
2126 143 -872 100 374 -417 -148 408 -171 -540 491 93 -915 269 1061 -364 -525 811 397 -526
2144 -526 71 570 -467 -150 664 -276 -544 531 248 -855 -150 462 -728 -508 299 -75 -842 249
2162B49K12j124L58J110o90m82Q67k28r18Q55N04j122r6J227m18j110P46N45q84
2181c99m5Q44p95k71J031k4j226P77Q59j068k0Q09k51o32P16M53j270K35J073
2200G96n81p83Q32L09r76L02O40r08j97J293o85p66O18N38r92m4J270p64n00Q79
2220B81Lp60N29Q47j128k19J224m62p76O98K69r09K49N78l31r70J056K38j137
2239g20L93P11n79l19O69m1o20N79N49r09KQ90m66l59M23K98j015O26M65p67k44
2260d34O04Oo68M90K75q20K97N30m06o04Q96k0p99M69O32k75m37Q13l89k28M20
2281C52P5p50J77P10m54n85N64Q1m77J07O00o78L0O56m29n80O18J78o06M31M82
2302E02o70RM33o2m93K99O23n60j72M15k99l38M98j19l36J76L54n03n9L79o4k33
$$ plain form
2162 249 461 -663 -305 805 115 -367 500 272 -646 209 713 -409 -505 722 304 -806 -60 485 -399
2181 -399 -444 400 -395 -666 365 341 -885 -108 751 -317 -337 472 221 -411 305 758 -512 -277 796
2200 796 215 -568 264 573 -403 -101 539 -369 -566 727 42 -724 -106 432 -560 -604 666 -98 -598 281
2220 281 284 -476 53 900 -228 -447 777 315 -461 237 506 -403 -154 424 93 -877 179 417 -720
2239 -720 -327 384 -195 -514 155 114 -506 73 622 -287 -285 605 139 -220 203 501 -514 112 577 -190 -434
2260 -434 170 176 -492 -2 273 -547 -250 280 -126 -730 166 146 -653 -184 448 173 -264 549 160 -68 352
2281 352 427 -323 -146 564 110 -475 89 170 -307 -200 400 -278 -248 408 -21 -601 17 195 -411 20 502
2302 502 -168 -159 274 212 -281 18 641 81 -91 324 25 -313 185 66 -270 -94 260 -243 -302 77 13 -220
2324b20J78K93m58k1O18k68l97P39l92l05K52L86o13L8M87j60m43N23r5o23K91
2345a90M36l26k30M93k52k60L91Q4o87L57P95m68n95O29R3k79J59K99n44j93P35
2366D47l69m47M13L11p38K41L12l71j08O00n9o17K07N02n71j04N35k12k78N46
2386B40K26o42K7O09m88k81P99k54o86M00N15p51k54Q60l39m05J84M71o70L61
2406g8N53q10j70Q35o7p14M58O90o99l06Q81l53o99O88L51o75p5N33o95k03Q67
2427C12n0r58P59M27q36k52O66K07p80N47L22n75j01O90m43n6Q34m20p42L99Q79
2448H29j254l5J186l79q62K59O55p72O1N84n30j02P33l26p59Q46N18j029M1Q88
2468E52k02j112N30Q79n30l73N09l42k04P72l98n70O02O00j204m40J424k35q29
$$ plain form
2324 -220 -42 251 -207 -228 390 122 -275 464 72 -233 19 405 -208 -170 317 157 -286 237 142 -481 -190
2345 -190 246 -80 -310 183 -69 -329 62 146 -541 -184 611 143 -452 177 270 -9 150 449 -95 -288 447
2366 447 78 -369 44 355 -383 -142 170 -201 -309 291 232 -385 -178 324 -247 -351 184 -28 -306 240
2386 240 466 -176 -149 460 -28 -309 490 236 -450 -50 465 -286 -540 320 -19 -424 -240 231 -439 -78
2406 -78 475 -335 -505 330 263 -451 7 697 -2 -308 573 220 -479 209 560 -115 -190 343 -352 -555 312
2427 312 262 -696 63 490 -346 -598 68 275 -505 42 364 -211 -312 378 -65 -121 713 293 -449 -50 829
2448 829 -425 -460 726 347 -515 -256 399 -373 -312 272 -258 -360 373 47 -712 134 652 -377 -336 552
2468 552 350 -762 -232 647 117 -256 253 -89 -293 479 81 -489 113 713 -491 -931 493 258 -571
2487e71M87O24q99j06P32k37k22M91J6n28K26N05q61R5J107l34r71L56R71j200
2507c19l49Q00n1l32L90j31o02N88O38r60j24J014m49r12N31R68o49m60R51k62
2527B80p05K28L65n22O39P3n49k03O49k84o65Q48M51j026k70P68r5m23L96M37
2547C92l74L1O4o37L72P79l06p17M11M88n73k26O50j19n95M48J20n70L1N00l38
2568a69O5L11q4p05P18K26q24K19P31l67p65O39N11o21J54M06l97m2R4k97j33
2589c30O02K44p79k28P64l95n98P87L67n70L7L51l76j19L87Q0k42K74k05l89K57
2610h1M72m43l71O17K44p95J6N26j9m77K17k1n6L47k81m69O02O66p00m22O49P5
2632B96o20L10O03k96l34K20k65n4N03k96l29J96K30q02J31Q54k14p00L44O49
$$ plain form
2487 -571 -84 540 -359 -465 267 30 -192 299 315 -213 13 518 -343 -248 859 525 -446 -90 881 -319
2507 -319 -668 132 81 -251 139 8 -594 -6 632 -328 -452 562 113 -799 -268 700 51 -409 542 280
2527 280 -425 -197 168 -354 285 358 -191 -394 255 -29 -694 154 605 -421 -691 77 -18 -441 -45 392
2547 392 18 49 113 -524 -152 627 321 -396 15 503 -70 -296 354 235 -360 88 208 -362 -331 169 -169
2568 -169 -104 207 123 -582 136 362 -462 -243 488 121 -644 -5 506 -115 39 445 48 6 100 -197 -330
2589 -330 272 516 -263 -491 273 -122 -720 67 434 -136 -99 252 -124 -243 144 224 -18 256 51 -338 -81
2610 -81 391 -52 -423 194 438 -357 -341 185 166 -311 -94 -115 -171 176 -105 -574 28 694 -6 -428 221 296
2632 296 -324 -14 589 293 -41 179 -86 -140 363 67 -262 -66 164 -638 -507 347 133 -567 -223 426
2652D26o40k29J40M45j7K9j68m19P12m5m51P3P51k52q24L80L44k90l3M94l08o12
2674d94N02j18k66L64L14o07J87L36k57r15J086O64q62j60N60k04l51L12J09j76
2694B4K78j0p05o6R65o11n36P64J54o85J9N45j22l06M28L9n66L42L88o45N9R25
2716F78n33n97Q40J16q99J17P37l01o54O69j95m57L98L77p33J91O92m46n39P71
2736B32M28r72L06N19m56m17M23M51p86L49M16n77j93O89m84k48N25L23j007K11
2756b68O70n15l78O94L30r29J73N91n09k28J002l87o17O35K00r13K47Q54n50n81
2776d79Q17Ko79K63L74m27l54P06k74n32M98J15j33j48P95n23o39Q78J80p85k1
2797c66R25n40l76P94k48m75M31K02o43o2Q09m57m47N68J31q96L92O04n63l02
$$ plain form
2652 426 -214 -443 -303 142 125 154 -14 -433 279 234 -217 -144 607 355 -469 -89 255 -35 -68 426 118 -494
2674 -494 8 -110 -376 -12 302 -305 -118 218 -39 -954 132 796 -66 -226 334 130 -221 91 200 24
2694 24 302 292 -413 -479 486 -125 -661 103 257 -428 -409 136 14 -292 136 175 -391 -49 339 -306 -247 678
2716 678 145 -452 388 504 -395 -278 459 158 -496 173 -22 -479 -81 296 -437 -246 446 0 -539 232
2736 232 660 -312 -6 513 57 -360 63 514 -272 77 493 -84 -277 412 -72 -320 205 528 -479 -268
2756 -268 402 -113 -491 203 533 -396 -223 368 -141 -369 633 246 -371 264 464 -449 -202 652 102 -479
2776 -479 338 340 -339 -76 298 -129 -483 223 -51 -583 -85 30 -103 -251 544 21 -618 260 440 -345 -366
2797 -366 559 19 -357 437 189 -286 145 347 -296 -358 451 -6 -453 115 246 -650 -258 346 -217 -519
2817e19P97o8n21K79L18m47j0N29m27j06O10k12l76J2N73m95q0J58J33l65K51
2838C4N40j114K49R25n88m83N66l2k99J13O01o85j6O51k70m94K44L80n13R4N10
2859D13l31m80M40J33m49J63L37l67j78M87p6m38L67J66n11J61N85m11m57O59
2879B13o3k95Q2M78n76q5N43l34l16L55L89o14n6N34l70l10M34K26n88L92K09
2900B48k92j06M44r4l63J13L54l22n1N13l74p5J33Lm71L87J71k80j76M17m23j53
2922c97O57M7p48L73L65l37j60M42k06k29L45J15l24Q4O6n7k67L36K83m02Q1J19
2944A86m25K9L62j95k87L17J49n49J97L35j31k01L89J80p44M39K43k66j43N41
2964D26k94l35L53M1n05K74K61m36n7M66k10n31N44J85m00j3K03%k72O34j89k63
$$ plain form
2817 -519 278 210 -311 -32 286 -161 -171 358 -69 -175 435 223 -153 -141 432 -63 -143 15 148 -217 34
2838 34 574 -540 -291 634 46 -437 129 97 -202 -89 512 -173 -189 462 192 -302 -58 322 -191 -97 413
2859 413 82 -398 42 175 -274 -111 226 -141 -319 168 92 -346 21 187 -324 -163 422 11 -446 213
2879 213 150 -145 -63 415 -161 -246 297 -37 -353 2 391 -223 -279 255 -115 -425 9 235 -353 39 248
2900 248 -44 -150 294 200 -163 -50 304 -18 -69 444 70 -5 128 131 -340 47 218 -62 -238 179 -244 -397
2922 -397 260 307 -441 -68 297 -40 -200 242 36 -193 152 267 -57 27 93 36 -231 105 388 -14 67 186
2944 186 -239 -210 152 -43 -330 -13 136 -413 -216 119 -12 -213 176 356 -388 51 294 28 -115 426
2964 426 132 -203 150 191 -314 -40 221 -215 -272 194 -16 -547 -3 182 -218 -231 -28 -28 -300 334 145 -118
2986a18J77L26o14J55M38j50n11K95M11o89L74K15j24m66K34K57n47L49N8n10
3006d40J47N57qo12M71K34m79n7M78l34l46O83O2m72J4N17l86m05N36J9m82K74
3028b9L39o93J11N87k08m99N56K72p58J85N23m03l70P87k77l77L17M09n71k11
3048c10R90o41l28K90K70m26M9L72n13k84O57p6m76M10K95p07O4R04m21m88L37
3069c2L54l91%M71l42l58M39m4m36M94P7m80L9M69n17l78P61K96q19M3N76k13
3091Il64N79j55l72M77K48q77L34O24l99m32O98K3p14N1N09k81l4J53L7l79L7
3113b28M38n04K94L03l86n29P83J56q51M17O72n18l38K42L90n20K90J44l19K67
3133B03Rk88l85O58J66p08K9N16l63k79L24J67m5K4K38m09OM00l75j13M36O2p61
$$ plain form
2986 -118 59 385 -229 -74 364 214 -297 -2 409 -280 94 309 185 -281 -47 210 -337 12 70 -440
3006 -440 -293 264 256 -356 115 349 -130 -187 291 -43 -389 294 356 -116 -102 415 29 -376 160 179 -303 -29
3028 -29 310 -383 -272 315 107 -392 164 436 -322 -137 386 -17 -387 400 123 -254 63 472 -99 -310
3048 -310 680 39 -289 1 271 -155 -106 266 -247 -531 126 50 -426 -16 279 -428 -364 540 119 -369 -32
3069 -32 322 -69 -69 402 60 -298 141 97 -339 155 232 -248 -209 260 -257 -635 126 422 -397 -354 222 9
3091 9 -355 224 69 -303 174 422 -455 -121 503 104 -328 370 393 -321 -270 239 -42 -76 77 114 -265 -228
3113 -228 210 -294 0 303 -83 -612 171 327 -524 -107 565 47 -291 -49 341 -179 111 255 -64 203
3133 203 212 -76 -461 197 363 -345 -316 200 -163 -442 -118 49 4 28 266 -143 -137 263 -112 -225 211 273 -488
3156d88K98Q10n62l33N01N2n38oJ44O4j2O0j84k2L33k2n97L50N65m04k16K58N0
3179A01k99L26K49l25k1j4p0j38L90o6l66J97L89o76k31N61K35m67m2K44L7k57
3201b43K34r0K30J01k54j57K84K01m40q8L51K6l74J38K06k97J83L5J7j00N4k18
3223b01j38K05J76k20P8K26o2o49M44N04k36k62L33o0rP7k11K5J00K1n03J14N06
3246B58j35k75K80J02n05J47J46k06p0L92p0p8K01k07l23M40L18m84j30L33O9
3267B03m37M7K59j20j93L22j9k72K76J9o61N40K94n25j74M49K23m00L06J16l56
3288a03k12L33K7j11J08j3j25j65M33k69l8M38j24o71L25K96l15j22M59J20n82
3309c11L41j12k19L80J72l12k4K93l0m45L23L39n45j77N23j92m22M45J12j90j58
$$ plain form
3156 -488 -190 620 58 -275 226 278 -260 -266 -122 -58 -70 -10 -194 -216 117 95 -502 -152 413 9 -207 51 101
3179 101 -198 128 377 52 31 17 -53 -191 199 133 -233 -36 353 -323 -554 7 242 -225 -267 -23 14 -243
3201 -243 -9 -99 131 232 -22 -179 105 306 -134 -222 129 155 -219 -81 125 -172 11 46 63 -37 17 -201
3223 -201 -339 -134 42 -178 -100 126 64 -585 -141 363 127 -135 198 138 129 206 -5 20 120 141 -362 -248 258
3246 258 123 -152 128 230 -275 -128 18 -188 -258 134 64 -14 187 -20 -343 97 415 -69 -199 134 203
3267 203 -234 -187 72 -48 -241 81 62 -210 66 85 -576 -36 258 -267 -441 8 231 -169 137 253 -103
3288 -103 -315 18 45 -66 42 29 -96 -261 172 -97 -135 303 179 -492 -167 129 -186 -308 151 271 -311
3309 -311 30 -82 -301 79 251 -61 -85 208 178 -267 56 395 -150 -327 196 4 -418 27 139 -51 -209
3330b09L69l31j39O02l72k67L47L97o78l5M92Q9l24L4L30l48J31L1j77q7N20j81
3352A94o32M23K32l52k58P48l18l13J93K02l90RM99k05j77J28Jn37N75M34n59
3373a03KM22k52m43L98K10k50j35M74l93j6K77j56k48J66L59l90j35L06k37j53
3394b97K15K78l12O8L99l66m4K6L19k97J75q4l47L1M44r8n20M21K87m03j45M86
3416B36k08l67N48j43l65M63K13m04k83M39P4l74J62M15n03M9L04k91j82K32K26
3437B41l57M2J31N0k59J60P4k57J92K12o05J57N50k30l57O49j26l58K15J37m18
3458a57N1M69m42j48K06J43k77J20M9O6m78O20j78k21O9O7N3J0O3N1k00J68R1
3481A95l25J06K98k15j14N5K14m16J63K19k94K10J79l27j97J82m0j72lM07k76
$$ plain form
3330 -209 160 -171 -310 292 -80 -347 0 397 -281 -316 176 265 -59 -25 305 -43 88 119 -58 -145 375 194
3352 194 -438 -15 217 -135 -393 355 37 -276 -83 119 -271 -262 237 32 -145 -17 -16 -553 22 456 -103
3373 -103 -101 321 69 -374 24 234 -16 -151 323 -70 -86 191 35 -213 -47 312 -78 -213 93 -144 -297
3394 -297 -82 196 -116 -48 351 -15 -59 -33 286 -11 164 80 -267 -236 208 110 -410 11 298 -105 -250 236
3416 236 28 -339 209 66 -299 164 377 -27 -310 129 203 -171 -9 406 -97 -48 256 -35 -217 15 241
3437 241 -116 -74 57 107 -152 8 82 -175 17 229 -376 -219 331 101 -256 393 267 -91 124 261 -157
3458 -157 -106 363 -79 -227 -21 122 -155 -35 14 80 -398 222 44 -177 -108 -41 12 22 85 136 -64 104 195
3481 195 -130 -24 274 59 -55 0 214 -202 -39 180 -114 96 275 -52 -249 -67 -107 -279 -282 125 -151
3502a51K6L90k98j14L13o9j35nJ31Jj46lR4j54l6K25m61M7M54j20k56K41J11k52
3526a67k5L09L6l76L36J45k78r7J96nj40J53Rj03m2K03l14K15Q6k10k8P4pl3O0
3551cO1l37J38L74k95k46L84N1k50P3L48l91J56K8J32k51J90q7k76J14K17q1j94
3574a45K29L8j78j2J23j64p3K85l2k09K70K6r3j10K84j76k89L23j21J4r1K96k39
3597d4j56M04o9l77J19K98l01lN9n8J01Q9l9N3J05p2j31m6O4J35m4j05J09k24
3621a33J23J80j84j62L29N5m86J56K78j86j63M00j22k69K91p3j11m0L62k88l20
3642c63M73O1l98L01Q5j97NJ13R8j59l1K41l10p4J72N7k12J00L7k33J62K29j15
3665D2j58J81J83k67J05J26k53j97M78j81o1J09n5j43M8l4J17k51L83R3l87Q6
$$ plain form
3502 -151 -125 265 -33 -147 166 97 -38 -43 88 89 -57 -60 34 -120 -156 69 -392 -345 109 -11 -267 -26 85 -167
3526 -167 -192 117 153 -223 113 258 -20 -117 79 74 -66 87 96 -7 -49 154 -160 55 141 -69 -97 -23 -30 -63 -3
3551 -3 58 -279 -141 233 -62 -308 76 127 -123 -50 298 -93 63 91 223 -28 162 75 -201 -87 130 49 -145
3574 -145 84 122 -56 -68 55 -109 -182 103 71 -138 132 158 65 -45 239 63 -226 97 -24 -10 -101 195 -44
3597 -44 -200 204 135 -242 -123 175 -126 -129 -70 -128 -27 62 23 76 181 109 -22 -68 -4 131 87 -18 91 -133
3621 -133 -10 170 -14 -176 153 208 -278 -122 156 -30 -193 207 85 -184 107 34 -77 -117 245 -43 -363
3642 -363 110 171 -227 74 159 -38 -33 80 178 19 -12 229 -81 -155 17 74 -138 -38 -1 -234 -72 157 42
3665 42 -116 65 248 -19 86 212 -41 -238 240 59 -2 107 52 -91 -43 -77 40 -211 172 265 -122 -36
3687c6J97k12j47J82Lj85L93j51j16P1J9m7j51L90J54l81O2K42l36j72L25m7k77
3710b20K53L0j50P3J74l84J07J33j04j79J90M15m67K9L00r1j31NK33k85O7O7p2
3733gj14J13l7o8J77L1j05qL7J17j00m5J92k07j03J16j31J81K15l14n7P8P7k99
3757b61O9J86K24l36L52L2l11K3J54j21n3nJ5q3J60K18l67M5J7M3k85K43l1J03
3781C1k3p9nM1O2N9jL4m2k27P2J63j31j60K73J89l19K6K5j48J48J99j43p7J60
3806A27n6k80J67K39j16j89J8L37l67J35J71k23j3J41j04m1P0r6j38K02Q2o7k98
3829b99K07K08k04j00L91l2l54J55N9l2J59j97L1r0J76p9N9o3J36j99j0M5oq0
3853a19J14J27k78R9j27O3N5K76k65o7J64J03j58M0Q6k14K9K1j28K3K54j34o8
$$ plain form
3687 -36 161 -51 -198 -16 -13 -198 195 44 -72 -1 18 -29 -180 210 364 -17 45 287 -49 -221 104 57 -220
3710 -220 33 63 -87 -14 160 -224 -117 16 -88 -267 -77 338 -129 -100 200 109 -22 -17 216 -69 -2 65 -7
3733 -7 -121 -8 -45 -113 64 95 -10 -18 19 136 36 -9 183 -24 -127 -11 -142 39 254 -60 -117 -39 38 -261
3757 -261 -192 -6 218 -118 234 266 -45 -22 132 11 -42 -47 -32 -115 45 263 -104 -59 -42 1 -284 -41 -72 31
3781 31 8 -71 -76 -35 27 86 85 119 77 -150 -78 85 -46 -206 67 256 -63 -37 -12 -160 -12 187 44 -33 127
3806 127 71 -209 -42 197 81 -108 -90 247 -120 15 186 -37 -50 91 -13 -54 16 -80 -218 -16 66 -1 -299
3829 -299 -92 116 -88 -188 203 171 -183 -28 31 -1 158 -39 -8 -98 78 -1 58 -5 131 -68 -78 -33 -39 -119
3853 -119 -5 122 -156 -57 -184 -121 -66 210 -55 -122 42 145 -13 27 113 -101 -72 -51 -179 -156 98 -36 -104
3876a04J62j20j55N9L28j31j66J47J25j20Jj17K38k93J12N2j18M2P7j0j71M18
3898B56k33M1j55K09j75j06K17j09n6J03J00k08k5M76m09P8J89j31k15J38K54
3919B39l99RL17nj24m4Q8J3k15J41M6j97J62J19k36J18J86k74J7J15k00rK24o6
3943B5om6K13j83M7J1P3j92J19J09l61K57K2r2j25J00J71q1j17K1J37p8J4j39
3967a01q2M09j54j96K90k12J56k65J59pl2PK06j78p2K13J9k08R4Pj89J24k6R6
3991E8j36J11J20k64p1L04j96nJ75j27m6R2J52j42j73K85k6k46K68oJ8k42J54
4014E7Rj94K12qj62J19J9r9N1RQj4J70j26k47n3M47m9k87p9L1J73j05K41j54j1
4040d2L0J79l16K35k7l24Q7K10O1k67J62P6l6k7n8j04K2K86k15L6o0K50k54J66
$$ plain form
3876 -104 58 -62 -217 -158 170 39 -127 20 145 25 26 -91 147 -146 -34 18 -100 -58 19 9 -162 256
3898 256 23 64 -91 118 -57 -163 54 -55 -111 -8 92 -116 -141 335 -74 4 193 62 -153 -15 239
3919 239 -160 -151 166 161 37 -7 81 94 -121 20 66 -131 31 150 -86 32 218 -56 -39 76 -124 -133 91 25
3943 25 19 -27 186 3 50 61 134 -58 61 170 -191 66 88 -4 -129 -29 142 61 -56 -35 102 24 38 -101
3967 -101 -183 226 72 -124 166 -46 110 -155 4 -3 -35 -28 178 0 -72 141 160 -48 46 53 -136 -12 -38 58
3991 58 -78 33 153 -111 -182 122 -74 -79 96 -31 -77 15 167 25 -148 137 111 -135 133 127 145 -97 57
4014 57 66 -128 84 76 -86 33 52 -47 4 13 21 7 177 51 -196 -249 198 149 -138 -217 -186 -13 -118 123 -31 -42
4040 -42 -12 167 -149 86 59 -265 -178 32 93 -174 -12 64 28 1 -57 -161 -139 147 -68 -32 -92 158 -96 70
4064G0J43k17n5J09p5J01q0O0j18j18J98j83K09j24J85j32N6K66k09j44k7J70
4086H5j49M4r6P6Q0k5j32K03l7L8p6l7O7j43P6R2J29j51j59PK8J3J83kj35M2J63
4113A84l15M0J80r7J46j37M9k73K75J00k14J50Q4l30R1J57k10J58n8J26k96J68
4135b2J34N5k74J33m3k4k5M3j24K82o1K4l05J30J01k06J13n1j8J06r2J30Qk8L1
4160A7k1J8J25Oj89R9R5l6p9J50j35j25K20j59j13L7k3j6L3J63O1j76nO5j90L30
4186A52q2j82R5m9M0j36J18R0j59l6N23l68J5MM6M2o5J23L2k64K37j15j85ML27
4211B07k50M1R7j45r1Q8J24j52K21k43K7m0J38q3p8J65J04k01n5K47k26P1p6L80
4235B70j48j93R2j3j77J52nj33L3rM28l86L50j11j21j0l6m4q2K18oq0J95j01j91
$$ plain form
4064 70 213 -4 -59 50 -25 76 -4 56 -62 -180 18 -165 44 -80 105 -27 29 295 86 -58 -85 85
4086 85 -64 -20 -116 -40 40 15 -117 86 49 87 11 -26 41 -102 -26 66 195 44 -115 -108 -80 -67 116 114 -21 21 184
4113 184 -131 -91 89 -8 138 1 50 -223 52 152 -62 88 172 -158 -67 90 -120 38 -20 106 -190 -22
4135 -22 112 167 -107 26 -17 -41 -66 -23 -147 135 74 98 -207 -77 24 -182 -69 -120 -138 -32 -124 6 14 -14 17
4160 17 -4 14 139 145 -44 55 150 114 35 185 50 -75 145 -14 -127 -90 -113 -129 -96 67 128 -48 -53 12 -178 152
4186 152 70 -112 -17 -66 -26 -162 -44 46 -113 -149 374 6 21 25 71 113 48 171 203 -61 176 61 -124 -120 207
4211 207 -43 -2 95 -50 -141 -53 71 -81 140 -103 -76 -116 22 -61 -139 26 130 -71 -126 121 -105 -34 -110 270
4235 270 122 -71 21 8 -169 -17 -22 -155 -122 -131 297 -89 261 150 29 19 -17 -61 -143 75 69 -11 184 83 -108
4260a08N6K86k57j44J38p3n3K92L6k35J43J37q7l18K32m3j55J27J57m7jJ25j92
4283A6k41J65J10k32k7L23j63o2R8O7r3l8K53l13J1K82q4j02J70Lj07j26K08K3
4307A41j81J49j7k28M3J32l6K4M6n6j18J7K03L6l10K84o1k97L20j13K1J62K0j74
4331Gk44K25m0p4J18R3j73m8J49k85J44M6K20n0j32N6k0J75p2j46NQ8J83k50j76
4356b01J28J44j01M6J88k8j81J24p1m5q5J33j64L53j01l25QJ52O3r0J1R4J24k06
4380c0l0L8q1R7M3k79J94J51l28J06L5l7j85L61m1l1qJ05j25L0q7J89j80K30j26
4405A1p4M6L1l3n5q0K19l57L31O4j43J07j60qJ91Moj70m0J02M2p2J36L2j79j7
4431g8J56O0j50O9R9j37m6Q8j01j2R7j10L5J86j25j9k10K26l6o9Q7N8l4R4j95
$$ plain form
4260 -108 -52 234 -23 -167 -29 -102 -155 137 173 -62 81 218 131 -187 45 2 -153 -26 131 84 83 208 16
4283 16 -225 -60 50 -182 -209 114 -49 -111 -13 54 -39 -77 176 -137 -126 156 72 -30 140 143 36 -90 118 141
4307 141 -40 109 92 -136 -93 39 3 27 73 17 -101 -84 119 155 -155 129 68 -229 91 -22 -1 161 181 7
4331 7 -237 -12 -52 -126 -8 85 -88 -136 13 -272 -128 -82 138 88 -44 12 -8 167 95 -51 -46 42 225 -25 -201
4356 -201 -73 71 -30 16 204 176 -5 119 48 3 -82 51 -113 240 139 -186 -178 -26 37 -53 -42 52 176 -30
4380 -30 -60 -22 -103 -6 37 -242 -48 103 -225 -119 -84 -121 -306 55 14 -17 -25 80 -45 -15 -102 87 -93 137 11
4405 11 -63 -17 14 -19 -74 -154 65 -292 39 103 -40 67 -93 -101 90 94 88 -82 -122 -20 22 -50 86 118 -61 -78
4431 -78 78 138 -12 57 156 19 -27 61 -40 -52 45 -65 -30 156 31 12 -198 28 -8 -77 10 68 34 128 -67
4456f7%R9n3P0j43K04Q2k69lJ66l8j77J26K84k76O0K0J9k3l2j88j15M22j54j91
4481a77K35K78k76k11R8k4J37J12m2q0J29j5k57L6J85R4m42M17k22M9m5J43l39
4504b17J91J10j34r1o8K50n5p9K21j64q9Q9J32J2j36J33J07l22Q1P1j42J29m9
4527b0n1R7O1j57j58K42J8k55JJ32K01k52J91J15k90O3J71j42J2J4n5m9O7J02
4551E8j50J52J41l80Q0J9J23j27O4q6k1R0Q1O7p7j01J79k14qL13j70j30K46j95
4575d6J30j41K04r0k7K19j91l62J95J65j88R5K3j60J57lJ28j95l9O8P0k36M52
4598B28j8l43K03K4rj36J49k06J14m7Q8l38J9L47j06k0J41j62P3J38j36k67J29
4621a35L26k02O2j9Q9k33N7O5r2J72J53j23k85R1Q3j20J27R0k39Kn0K68k15l0
$$ plain form
4456 -67 -67 32 -21 49 -94 110 192 -77 -80 86 48 -129 -3 281 5 65 85 104 81 49 -139 -254 168 14 -177
4481 -177 58 336 60 -151 -53 -77 60 172 130 50 179 164 -93 -57 128 222 -220 197 -25 24 -21 122 -217
4504 -217 -26 84 -50 -141 -209 41 -14 -93 128 -36 -125 -36 96 108 -28 105 212 -110 -29 42 -100 29 -20
4527 -20 -71 26 87 -70 -228 14 32 -223 -222 -90 111 -141 50 165 -125 -62 109 -33 -21 -7 -62 -111 -44 58
4551 58 -92 60 201 -179 -99 -80 43 -84 -20 -106 -127 -37 44 111 34 -67 112 -102 -110 203 33 -97 149 -46
4575 -46 84 -57 147 57 30 249 58 -304 -109 56 -132 -37 -14 -174 -17 -20 108 -87 -126 -58 12 -224 228
4598 228 210 -133 70 94 85 -51 98 -108 6 -41 47 -291 -272 75 -31 -51 90 -72 1 139 3 -264 -135
4621 -135 191 -11 51 32 121 -112 -55 10 -82 90 243 120 -165 -74 9 -111 16 106 -133 -131 -181 87 -128 -158
4645a58K90j50j17K91j52j60J45K65j52l04L34j32p5J83k5q1M3l2Qq1J39j60J14
4668C3M9j17J24j46J81L1p8j31R4O6j78J18r6l9L8L8p8P4j4N3q0J38r8l5J02k28
4694a79J09J17O7p9j40R2Q7k43L01j64pN4Q6k15K61k12J69j19RQ1p3O0Rn7k1P2
4720F5j14l9j54M28r5j14J55j8k00K99l40j0J19J93j19k85L50qj40J1p8J25m8
4743a7k6K76l61k6K04j01P3rj20n8K55M2k34n2K67j33j5P0Rjj05K83j14m7K30
4768B90k61j10J51M4n6j12J59k39l8K21j46N3K01k03L7lj2q8J33J60k10n3J17
4791C5L0N5k55K41q9J6J62j53K0j60J28Kj60J50j24J18j83K33J9j46J37n9j2M6
4815E1J25k11K1j6J34o0j69J30j0P0J13l4j30J7R5q8m5l3o4j70M14k30l8M6K21
$$ plain form
4645 -158 132 -18 -135 156 4 -156 -11 254 102 -202 132 0 -75 108 83 2 45 13 21 -60 79 -81 33
4668 33 82 -35 89 -57 124 155 77 -54 40 106 -72 46 -50 -89 -51 -13 -91 -17 -31 22 -58 80 -18 -53 49 -179
4694 -179 -70 47 114 35 -105 -13 74 -169 132 -32 -39 15 101 -114 147 -65 104 -15 -6 75 2 62 71 14 -7 65
4720 65 -49 -88 -242 186 91 -23 132 114 -86 213 -127 -137 -18 175 56 -229 121 113 -27 -16 -94 31 -17
4743 -17 -43 233 -128 -154 50 -51 22 13 -107 -165 90 132 -102 -154 113 -20 -35 35 44 43 -62 221 107 60 290
4768 290 29 -81 70 114 58 -54 105 -134 -172 49 -97 -44 157 -46 -9 -12 -24 -112 21 181 -29 -82 35
4791 35 65 120 -135 106 17 33 195 42 62 -98 30 32 -128 22 -102 16 -167 66 85 -61 76 17 5 51
4815 51 176 -35 -14 -30 104 44 -125 5 -5 65 178 144 14 31 126 38 -7 -40 -104 -274 140 -90 -128 -82 139
4840A39j38M9K9j31q7L96k01j85L59k62J20j69K69j46j76K21j35j68K56J14k26
4861g2JJ91n1P4Lj56j60L03J0l07J3K23l0j49J98J1k52Q5J95J18l30P3J45k06
4885g0K3J80j74r5K01o0j8r0J29k16j22J91P2j9J16J44k36j08K93k22Q9j09kN4
4909d9j56L01qk05J46j09J83N5j72j19J23J79J03l81R6K15j37q1Q0m2k6J4Pk45
4933b28J43N5j18M5J11Mj74J56j7R7j15J6K3k2J98o1k58K26m9j42j42K87J57q5
4957A07Knj84J13J04k30n7K95l3k85L19p2j84R8L18j74k86J15J91j17j12J26j44
4980i5JJ75j69j20K13J38j62L1O2m9k44L09l9o2j03K26M8k89K36k75J27oL0q1
5004i8J52Q6o1j54n4K10j41m7J07l1j91J78j4l5J06r1O6qR9k25J46Q3J13k95J63
$$ plain form
4840 139 1 50 79 -52 -139 257 56 -129 230 -32 88 -81 188 42 -134 87 -48 -216 40 154 -72
4861 -72 -71 120 69 143 146 -10 -170 133 143 -164 -151 72 42 -107 91 102 -150 -65 130 248 -82 -9 136 -70
4885 -70 -47 133 -41 -136 65 5 -13 -103 26 -190 -312 -121 -49 -68 48 192 -44 -152 141 -81 8 -101 -103 -49
4909 -49 -205 96 88 -117 29 -80 103 158 -14 -133 -10 169 272 -109 -13 202 65 -16 64 22 -4 10 17 -228
4933 -228 -85 -30 -148 -103 8 12 -162 -6 -23 74 -41 -25 -2 -24 174 113 -145 81 32 -110 -252 35 192 107
4957 107 109 104 -80 33 137 -93 -150 145 112 -173 146 74 -110 -12 306 132 -154 -39 152 35 -77 49 -95
4980 -95 -94 81 -88 -208 5 143 -19 12 74 25 -219 90 51 -11 -114 112 160 -129 107 -168 -41 -47 -17 -98
5004 -98 54 140 79 -75 -129 81 -60 -107 0 -31 -222 -44 -58 -93 13 -78 -12 -20 79 -146 0 83 196 -99 64
5029F4QJ33j70p8K56j96Q6k7Pm7J11j71j68K59k04n8K41r1oLl1J6m4J06q1L0J51
5056I9J02j41q9M2p3j0j9K01j94K19k55L69j44q6J43l58k7L02l06J69J15j13j11
5079a65K55k7j08n6J32J3N0k11J35r5J9J85j5k84K47k5j33J02J11k83p0K62j35
5102i6N7J06j10j97J96J38k16m3L49k48j7J37K3j59j7J21m0Nn4K12j67O7j1Qp4
5127c0J83j42j06J56j22p9J98K09k03j91p9K47q4k3K05k41J67m2K2j98K6L35k65
5150e7J45K27k76j3M5K13l90J25J77p1r6J15J8k91J68K14l98l1K83J9l35L77J02
5173B70l34N6K09k07j85J50J42j93K4J83l13J57K93j49l41K10J5j73kK72j79K3
5195g2Pj0L3P2J23n4j98K76l7k32J22J60l06J70K6k05LJ9O2K0Q3q4j14j82L76
$$ plain form
5029 64 72 205 35 -43 213 17 103 76 83 36 147 -24 -192 67 -137 -195 46 -45 -51 -48 -79 -63 -107 -1 -82 -52 99
5056 99 201 60 -29 13 -60 -70 -89 112 -82 137 -118 251 107 21 164 -194 -221 81 -225 -56 59 -54 -165
5079 -165 90 63 -45 -101 31 44 94 -117 18 -77 -58 127 112 -172 75 50 -83 19 130 -153 -223 39 -96
5102 -96 -39 67 -43 -240 -44 94 -122 -165 184 -64 -81 56 79 -80 -97 24 -16 -11 -65 147 -20 47 36 44 -30
5127 -30 153 11 -95 61 -61 -140 58 267 64 -127 -206 41 -43 -66 139 -102 65 23 45 -153 -127 208 -57
5150 -57 88 315 39 26 71 284 -106 19 196 125 29 144 162 -129 39 253 -145 -176 107 126 -209 168 270
5173 270 -64 -8 201 -6 -191 -41 101 -92 -68 115 -198 -41 252 103 -238 -28 -13 -186 -188 84 -95 -72
5195 -72 -65 -75 -42 30 153 99 -99 177 140 -92 30 190 -116 54 80 -125 -122 -103 -41 -21 62 -22 -136 -318 58
5220E8k7j18J38P8j48N4Q6o0j14K33k42j19J07J08j01j42L77k53Q2M6Pj16k5K02
5244A11j53P8Q8J9k65J92K6j03l9J64j53p6N7J25r1K7J04j26J61j9n7j31Q1j1
5268Ij87J02J36o9J24k8K3l29J87M36n78L6K10q8j15J56qO4j92J87J8j63J3P1
5292A5o9r1P7j52R3K69j11j93J31m8q0J72J71j42j11J31n3r0J72j03Q4n9J86j79
5316B0j89J63L1j20M5J79k27m3J17r2m8J42J19j99J09K06j65l7P0J11l39Q7J69
5339A09j77n7J61M3j8j54R0m1n1J18p2j7J48R5l26J07Q2j73o7K01L11l70O8J0
5363B0j67Q8Q1%j56J07J88l36J08K21j50j17R6J43l58K17Q2k6j15K13r5j88J75
5386C1n3m3J6R9%k9J65r1k7k5j8lN5n7j34L5l1J75l76K96R6k78J01Q3R0j61j4
$$ plain form
5220 58 31 -87 51 129 -19 35 121 61 -53 180 -62 -181 -74 34 -67 -209 168 -85 -3 43 50 -66 -91 111
5244 111 -42 36 124 143 -122 70 96 -7 -46 118 -35 -111 -54 71 -20 7 111 -15 146 127 70 -61 20 9
5268 9 -178 -76 60 -9 115 87 110 -219 -32 404 -174 -138 72 -16 -131 25 17 81 -111 76 94 -69 -56 15
5292 15 -54 -145 -68 -220 -127 142 31 -162 -31 -79 -159 13 184 42 -69 62 9 -81 91 -12 72 13 199 20
5316 20 -169 -6 25 -95 -50 129 -98 -141 -24 -116 -164 -22 97 -102 7 213 48 11 81 192 -147 -60 109
5339 109 -68 -125 36 79 61 -93 -3 -44 -95 23 -49 -66 82 177 -149 -42 40 -133 -200 1 312 -58 10 20
5363 20 -147 -59 22 22 -134 -27 161 -175 -67 154 4 -113 -17 126 -232 -15 67 41 -74 139 44 -144 31
5386 31 -22 -65 -49 50 50 21 186 95 68 43 25 22 77 20 -114 -79 -110 65 -311 -15 81 -197 -96 -13 77 -84 -98
5413i8J22M1qO5qj82L7J37k04j54L88k49Q1Q4J05j57l7J55j08j11M2k9M0j9K09
5438A42j81l1K61k31O4O8j14RK1P7j83KJ40N8k60K66j42j79M0O7RJ41o4Mj89L41
5464A36j03J26k67K89j36J8J33j09j33J36j07P4k42L10j45j02jJ8J43j19l9N2
5486f8j27K64j17j40J75N0K2q8J23j6j46P5J61j83J3oR6k29O1J48j45R4J57k18
5510d4k04K55k8p8oJ87j44R7nj02j69J24J06O6O0m3j35N4K19l33PJ05K21k49Q5
5535D6p0j14o9K64J08j98m3K47k09j18K39j65n1J31J12k02p0K05l8k31J77R9j38
5558h8l9J59j1n5J8L8k46L11m4j06J24J05k02j23OL56l8r0J5n6m8O3K04l95J0
5583a32J53l7k6J14p2L9Rm4p7j00P4J30k03J11k3j3K24r1j26J6K06k48Q7J26j15
$$ plain form
5413 -98 24 65 57 122 114 -68 -31 106 -98 -252 136 -113 -32 52 157 0 -37 118 10 -101 -59 -88 -48 -67 142
5438 142 -39 -70 191 -40 24 92 -22 -13 8 85 -98 -96 44 102 -158 108 -34 -213 -173 -106 -97 44 -20 -16 -205 136
5464 136 33 159 -108 181 45 63 196 87 -46 90 -17 57 -185 125 -20 -122 -123 -105 38 -81 -120 -68
5486 -68 -195 69 -48 -188 -13 37 59 -29 94 78 -68 7 168 -15 -2 -8 88 -141 -80 68 -77 17 174 -44
5510 -44 -248 7 -21 -99 -105 82 -62 35 30 -72 -241 -117 -11 55 115 72 -63 -9 210 -123 -116 -11 210 -39 46
5535 46 -24 -138 -207 57 165 -33 -76 171 -38 -156 83 -82 -133 -2 110 -92 -162 43 5 -226 -49 50 -88
5558 -88 -127 32 21 -34 -16 22 -224 87 43 -63 61 166 -36 -159 -153 203 165 75 90 34 -14 49 253 -142 -132
5583 -132 21 -16 -42 72 0 39 48 4 -73 -173 -99 31 -172 -61 -84 -97 127 36 -90 -74 132 -116 -29 97 -18
5608a8O4oPj21r5J76L2m2P9k5k29J25J09l9q5K10pk25k2K54j73p8K13j16q0J10
5634A8j1j6j95K39N7k62K46j49j0l0J89j2k29L2P6J46j62j7R7M7k01K28j22J09
$$ plain form
5608 -18 46 40 47 -74 -169 7 39 -3 76 51 -178 -53 56 17 -68 142 135 -90 -112 142 -31 -109 104 -12 -92 18
5634 18 7 -9 -204 35 92 -170 76 -73 -83 -113 76 64 -165 -133 -57 89 -73 -90 7 54 -147 81 -41 68
$$ [...]
8191c8
##END NTUPLES=NMR FID
##END=
